1. 0.21 s $ /nix/store/9ypz3flqsrl5xl495mm8h645gadjsxi1-coreutils-9.11/bin/timeout --kill-after=15s 7200s /nix/store/23zk8sgzamrbmj1fday15szf7f2279s8-nix-2.34.7/bin/nix --extra-experimental-features nix-command --extra-experimental-features flakes --log-format internal-json build --no-link --print-out-paths git+https://github.com/alphal00p/gammaloop?ref=feynkit&rev=e9981d2c63b660b3266d76a303cd6402a434139b&shallow=1#packages.x86_64-linux.crate-test-dependencies-feynkit-generator --print-build-logs
  2. 0.99 s error (ignored): SQLite database '/var/cache/nix-ci-worker/eval-cache-v6/e19994902db26c000449ad5a1652acb592a94287570fdc1b256e2dc6139a3953.sqlite' is busy
  3. 5.49 s
  4. 6.63 s Downloading cached gammaloop-ci-test-binary-dependencies-4f00f4b0073ce06e-Cargo.toml from https://cache.nix-ci.com
  5. 6.66 s Downloaded cached gammaloop-ci-test-binary-dependencies-4f00f4b0073ce06e-Cargo.toml (808 B) in 27ms
  6. 6.73 s Building /nix/store/ymz99csnmzyg0rn8jhhdffb0vr01gjsw-gammaloop-ci-test-dependencies-4f00f4b0073ce06e-Cargo.toml.drv
  7. 6.75 s Downloading cached gammaloop-ci-test-binary-dependencies-97f75f61c6abf108-Cargo.toml from https://cache.nix-ci.com
  8. 6.77 s Downloaded cached gammaloop-ci-test-binary-dependencies-97f75f61c6abf108-Cargo.toml (280 B) in 17ms
  9. 6.79 s Downloading cached gammaloop-ci-test-binary-dependencies-dd93152a31ddbf22-Cargo.toml from https://cache.nix-ci.com
  10. 6.82 s Downloaded cached gammaloop-ci-test-binary-dependencies-dd93152a31ddbf22-Cargo.toml (704 B) in 25ms
  11. 6.86 s Building /nix/store/4r5ib20qnw4yxvw5s370b7f7k72fmvfj-gammaloop-ci-test-dependencies-97f75f61c6abf108-Cargo.toml.drv
  12. 6.91 s Building /nix/store/bqy8qj93xx7lsh6rv6gzap1hlk8sybp6-gammaloop-ci-test-dependencies-dd93152a31ddbf22-Cargo.toml.drv
  13. 8.22 s Building /nix/store/pfyl5ixadb5d21wjfpac9vs6sgl29jcj-gammaloop-crate-test-dependencies-97f75f61c6abf108-inputs.drv
  14. 8.50 s Downloading cached gammaloop-ci-test-binary-dependencies-d918b893a0af9b1a-Cargo.toml from https://cache.nix-ci.com
  15. 8.51 s Downloaded cached gammaloop-ci-test-binary-dependencies-d918b893a0af9b1a-Cargo.toml (632 B) in 11ms
  16. 8.59 s Building /nix/store/spranw7kn0zzxjrkvbk509d4nskl23ij-gammaloop-ci-test-dependencies-d918b893a0af9b1a-Cargo.toml.drv
  17. 8.75 s Building /nix/store/6jzpffzqw5afzrb20ry2vdjy1cdqyy4f-gammaloop-crate-test-dependencies-d918b893a0af9b1a-inputs.drv
  18. 8.75 s Progress: 0 of 17 built (6 building), 1 of 4 downloaded from cache (3 downloading)
  19. 8.75 s Progress: 0 of 17 built (6 building), 2 of 4 downloaded from cache (2 downloading)
  20. 8.75 s Progress: 0 of 17 built (6 building), 3 of 4 downloaded from cache (1 downloading)
  21. 8.75 s Progress: 0 of 17 built (6 building), 4 of 4 downloaded from cache
  22. 8.88 s [gammaloop-ci-test-dependencies-4f00f4b0073ce06e-Cargo.toml:post-build] Uploading to the NixCI cache: /nix/store/nknj9kv2p0516wwcqvrrqsjxqf09ic4v-gammaloop-ci-test-dependencies-4f00f4b0073ce06e-Cargo.toml
  23. 9.67 s [gammaloop-ci-test-dependencies-4f00f4b0073ce06e-Cargo.toml:post-build] warning: 'warn-short-path-literals' is deprecated, use 'lint-short-path-literals = ignore' instead
  24. 9.78 s [gammaloop-ci-test-dependencies-4f00f4b0073ce06e-Cargo.toml:post-build] copying 0 paths...
  25. 10.47 s [gammaloop-ci-test-dependencies-4f00f4b0073ce06e-Cargo.toml:post-build] warning: 'warn-short-path-literals' is deprecated, use 'lint-short-path-literals = ignore' instead
  26. 10.68 s [gammaloop-ci-test-dependencies-4f00f4b0073ce06e-Cargo.toml:post-build] copying 0 paths...
  27. 10.96 s Uploaded gammaloop-ci-test-dependencies-4f00f4b0073ce06e-Cargo.toml in 2.1s
  28. 10.96 s Progress: 1 of 18 built (5 building), 4 of 4 downloaded from cache
  29. 10.96 s Built gammaloop-ci-test-dependencies-4f00f4b0073ce06e-Cargo.toml in 4.2s
  30. 11.10 s [gammaloop-ci-test-dependencies-97f75f61c6abf108-Cargo.toml:post-build] Uploading to the NixCI cache: /nix/store/d8k2q2h0skkwi4lp7mpg71dmxhn091n7-gammaloop-ci-test-dependencies-97f75f61c6abf108-Cargo.toml
  31. 11.52 s [gammaloop-ci-test-dependencies-97f75f61c6abf108-Cargo.toml:post-build] warning: 'warn-short-path-literals' is deprecated, use 'lint-short-path-literals = ignore' instead
  32. 11.63 s [gammaloop-ci-test-dependencies-97f75f61c6abf108-Cargo.toml:post-build] copying 0 paths...
  33. 12.17 s [gammaloop-ci-test-dependencies-97f75f61c6abf108-Cargo.toml:post-build] warning: 'warn-short-path-literals' is deprecated, use 'lint-short-path-literals = ignore' instead
  34. 12.38 s [gammaloop-ci-test-dependencies-97f75f61c6abf108-Cargo.toml:post-build] copying 0 paths...
  35. 12.63 s Uploaded gammaloop-ci-test-dependencies-97f75f61c6abf108-Cargo.toml in 1.6s
  36. 12.63 s Progress: 2 of 19 built (4 building), 4 of 4 downloaded from cache
  37. 12.64 s Built gammaloop-ci-test-dependencies-97f75f61c6abf108-Cargo.toml in 5.7s
  38. 12.79 s [gammaloop-ci-test-dependencies-d918b893a0af9b1a-Cargo.toml:post-build] Uploading to the NixCI cache: /nix/store/jizy95lkcbrlys36yzwvw3y4j8jvic04-gammaloop-ci-test-dependencies-d918b893a0af9b1a-Cargo.toml
  39. 13.43 s [gammaloop-ci-test-dependencies-d918b893a0af9b1a-Cargo.toml:post-build] warning: 'warn-short-path-literals' is deprecated, use 'lint-short-path-literals = ignore' instead
  40. 13.54 s [gammaloop-ci-test-dependencies-d918b893a0af9b1a-Cargo.toml:post-build] copying 0 paths...
  41. 14.18 s [gammaloop-ci-test-dependencies-d918b893a0af9b1a-Cargo.toml:post-build] warning: 'warn-short-path-literals' is deprecated, use 'lint-short-path-literals = ignore' instead
  42. 14.36 s [gammaloop-ci-test-dependencies-d918b893a0af9b1a-Cargo.toml:post-build] copying 0 paths...
  43. 14.60 s Uploaded gammaloop-ci-test-dependencies-d918b893a0af9b1a-Cargo.toml in 1.9s
  44. 14.61 s Progress: 3 of 20 built (3 building), 4 of 4 downloaded from cache
  45. 14.61 s Built gammaloop-ci-test-dependencies-d918b893a0af9b1a-Cargo.toml in 6.0s
  46. 14.77 s [gammaloop-ci-test-dependencies-dd93152a31ddbf22-Cargo.toml:post-build] Uploading to the NixCI cache: /nix/store/8fakv6gkhcdd86hr25ig634lwvgd72n0-gammaloop-ci-test-dependencies-dd93152a31ddbf22-Cargo.toml
  47. 15.48 s [gammaloop-ci-test-dependencies-dd93152a31ddbf22-Cargo.toml:post-build] warning: 'warn-short-path-literals' is deprecated, use 'lint-short-path-literals = ignore' instead
  48. 15.68 s [gammaloop-ci-test-dependencies-dd93152a31ddbf22-Cargo.toml:post-build] copying 0 paths...
  49. 16.48 s [gammaloop-ci-test-dependencies-dd93152a31ddbf22-Cargo.toml:post-build] warning: 'warn-short-path-literals' is deprecated, use 'lint-short-path-literals = ignore' instead
  50. 16.70 s [gammaloop-ci-test-dependencies-dd93152a31ddbf22-Cargo.toml:post-build] copying 0 paths...
  51. 17.03 s Uploaded gammaloop-ci-test-dependencies-dd93152a31ddbf22-Cargo.toml in 2.3s
  52. 17.05 s Progress: 4 of 21 built (2 building), 4 of 4 downloaded from cache
  53. 17.05 s Built gammaloop-ci-test-dependencies-dd93152a31ddbf22-Cargo.toml in 10.1s
  54. 19.15 s [gammaloop-crate-test-dependencies-97f75f61c6abf108-inputs:post-build] Uploading to the NixCI cache: /nix/store/xbf3azpg9cp80zcl7pvs9zl6p4wv8zv1-gammaloop-crate-test-dependencies-97f75f61c6abf108-inputs
  55. 19.90 s [gammaloop-crate-test-dependencies-97f75f61c6abf108-inputs:post-build] warning: 'warn-short-path-literals' is deprecated, use 'lint-short-path-literals = ignore' instead
  56. 20.04 s [gammaloop-crate-test-dependencies-97f75f61c6abf108-inputs:post-build] copying 1 paths...
  57. 20.04 s [gammaloop-crate-test-dependencies-97f75f61c6abf108-inputs:post-build] copying path '/nix/store/xbf3azpg9cp80zcl7pvs9zl6p4wv8zv1-gammaloop-crate-test-dependencies-97f75f61c6abf108-inputs' to 'https://cache.nix-ci.com'...
  58. 101.56 s [gammaloop-crate-test-dependencies-97f75f61c6abf108-inputs:post-build] warning: 'warn-short-path-literals' is deprecated, use 'lint-short-path-literals = ignore' instead
  59. 101.75 s [gammaloop-crate-test-dependencies-97f75f61c6abf108-inputs:post-build] copying 0 paths...
  60. 101.79 s Uploaded gammaloop-crate-test-dependencies-97f75f61c6abf108-inputs in 1m22s
  61. 101.79 s Progress: 5 of 14 built (1 building), 4 of 4 downloaded from cache
  62. 101.79 s Built gammaloop-crate-test-dependencies-97f75f61c6abf108-inputs in 1m33s
  63. 101.88 s Building /nix/store/m6jx8q1w331ga4cdnvca0rvbrlglhsid-gammaloop-crate-test-dependencies-97f75f61c6abf108-deps-0.1.0.drv
  64. 104.06 s [gammaloop-crate-test-dependencies-d918b893a0af9b1a-inputs:post-build] Uploading to the NixCI cache: /nix/store/4lbwk5q08mwpj6j4l5yd467b3r9hnjdr-gammaloop-crate-test-dependencies-d918b893a0af9b1a-inputs
  65. 104.12 s [gammaloop-crate-test-dependencies-d918b893a0af9b1a-inputs:post-build] warning: 'warn-short-path-literals' is deprecated, use 'lint-short-path-literals = ignore' instead
  66. 104.17 s [gammaloop-crate-test-dependencies-d918b893a0af9b1a-inputs:post-build] copying 1 paths...
  67. 104.17 s [gammaloop-crate-test-dependencies-d918b893a0af9b1a-inputs:post-build] copying path '/nix/store/4lbwk5q08mwpj6j4l5yd467b3r9hnjdr-gammaloop-crate-test-dependencies-d918b893a0af9b1a-inputs' to 'https://cache.nix-ci.com'...
  68. 162.84 s [gammaloop-crate-test-dependencies-d918b893a0af9b1a-inputs:post-build] warning: 'warn-short-path-literals' is deprecated, use 'lint-short-path-literals = ignore' instead
  69. 162.95 s [gammaloop-crate-test-dependencies-d918b893a0af9b1a-inputs:post-build] copying 0 paths...
  70. 162.97 s Uploaded gammaloop-crate-test-dependencies-d918b893a0af9b1a-inputs in 58.9s
  71. 162.97 s Progress: 6 of 14 built (1 building), 4 of 4 downloaded from cache
  72. 162.97 s Built gammaloop-crate-test-dependencies-d918b893a0af9b1a-inputs in 2m34s
  73. 163.04 s Building /nix/store/inwcjllhs7lifr8rqmsrvpdnafc3j2ww-gammaloop-crate-test-dependencies-d918b893a0af9b1a-deps-0.1.0.drv
  74. 163.04 s [gammaloop-crate-test-dependencies-97f75f61c6abf108-deps] Phase: unpackPhase
  75. 163.04 s [gammaloop-crate-test-dependencies-97f75f61c6abf108-deps] unpacking source archive /nix/store/6mc50b6h7mszh84bqzyl305zvar9gdph-source
  76. 163.04 s [gammaloop-crate-test-dependencies-97f75f61c6abf108-deps] source root is source
  77. 163.04 s [gammaloop-crate-test-dependencies-97f75f61c6abf108-deps] Phase: patchPhase
  78. 163.04 s [gammaloop-crate-test-dependencies-97f75f61c6abf108-deps] Executing configureCargoCommonVars
  79. 163.04 s [gammaloop-crate-test-dependencies-97f75f61c6abf108-deps] copying cargo artifacts from /nix/store/xbf3azpg9cp80zcl7pvs9zl6p4wv8zv1-gammaloop-crate-test-dependencies-97f75f61c6abf108-inputs/target to target
  80. 163.04 s [gammaloop-crate-test-dependencies-97f75f61c6abf108-deps] will deep copy artifacts (instead of symlinking) as requested
  81. 163.04 s [gammaloop-crate-test-dependencies-97f75f61c6abf108-deps] Phase: updateAutotoolsGnuConfigScriptsPhase
  82. 163.04 s [gammaloop-crate-test-dependencies-97f75f61c6abf108-deps] Phase: configurePhase
  83. 163.04 s [gammaloop-crate-test-dependencies-97f75f61c6abf108-deps] will append /build/source/.cargo-home/config.toml with contents of /nix/store/1sigmg52bb61pfngmk9k8wq5fz9r7bf1-vendor-cargo-deps/config.toml
  84. 163.04 s [gammaloop-crate-test-dependencies-97f75f61c6abf108-deps] default configurePhase, nothing to do
  85. 163.04 s [gammaloop-crate-test-dependencies-97f75f61c6abf108-deps] Phase: buildPhase
  86. 163.04 s [gammaloop-crate-test-dependencies-97f75f61c6abf108-deps] +++ command cargo --version
  87. 163.04 s [gammaloop-crate-test-dependencies-97f75f61c6abf108-deps] cargo 1.97.0 (c980f4866 2026-06-30)
  88. 163.04 s [gammaloop-crate-test-dependencies-97f75f61c6abf108-deps] +++ command cargo build --profile ci-optim --offline -p gammaloop-ci-test-dependencies-97f75f61c6abf108 --lib
  89. 163.04 s [gammaloop-crate-test-dependencies-97f75f61c6abf108-deps] Compiling serde_core v1.0.228
  90. 163.04 s [gammaloop-crate-test-dependencies-97f75f61c6abf108-deps] Compiling serde v1.0.228
  91. 163.04 s [gammaloop-crate-test-dependencies-97f75f61c6abf108-deps] Compiling serde_json v1.0.149
  92. 163.04 s [gammaloop-crate-test-dependencies-97f75f61c6abf108-deps] Compiling memchr v2.8.0
  93. 163.04 s [gammaloop-crate-test-dependencies-97f75f61c6abf108-deps] Compiling syn v2.0.117
  94. 163.04 s [gammaloop-crate-test-dependencies-97f75f61c6abf108-deps] Compiling serde_derive v1.0.228
  95. 163.04 s [gammaloop-crate-test-dependencies-97f75f61c6abf108-deps] Compiling thiserror-impl v2.0.18
  96. 163.04 s [gammaloop-crate-test-dependencies-97f75f61c6abf108-deps] Compiling thiserror v2.0.18
  97. 163.04 s [gammaloop-crate-test-dependencies-97f75f61c6abf108-deps] Compiling vectorize v0.2.0
  98. 163.04 s [gammaloop-crate-test-dependencies-97f75f61c6abf108-deps] Compiling feynkit-model v0.1.0 (/build/source/crates/feynkit-model)
  99. 163.04 s [gammaloop-crate-test-dependencies-97f75f61c6abf108-deps] Compiling gammaloop-ci-test-dependencies-97f75f61c6abf108 v0.1.0 (/build/source/crates/gammaloop-ci-test-dependencies-97f75f61c6abf108)
  100. 163.04 s [gammaloop-crate-test-dependencies-97f75f61c6abf108-deps] Finished `ci-optim` profile [optimized] target(s) in 17.27s
  101. 163.04 s [gammaloop-crate-test-dependencies-97f75f61c6abf108-deps] +++ command cargo build --profile ci-optim --offline -p feynkit-model -p gammaloop-ci-test-binary-dependencies-97f75f61c6abf108 --lib
  102. 163.04 s [gammaloop-crate-test-dependencies-97f75f61c6abf108-deps] Compiling gammaloop-ci-test-binary-dependencies-97f75f61c6abf108 v0.1.0 (/build/source/crates/gammaloop-ci-test-binary-dependencies-97f75f61c6abf108)
  103. 163.04 s [gammaloop-crate-test-dependencies-97f75f61c6abf108-deps] Finished `ci-optim` profile [optimized] target(s) in 0.37s
  104. 163.04 s [gammaloop-crate-test-dependencies-97f75f61c6abf108-deps] Phase: installPhase
  105. 163.04 s [gammaloop-crate-test-dependencies-97f75f61c6abf108-deps] linking previous artifacts /nix/store/xbf3azpg9cp80zcl7pvs9zl6p4wv8zv1-gammaloop-crate-test-dependencies-97f75f61c6abf108-inputs to /nix/store/cclrzimln4w2iqr0441hir909l5pgbaf-gammaloop-crate-test-dependencies-97f75f61c6abf108-deps-0.1.0/target.tar.zst
  106. 163.04 s [gammaloop-crate-test-dependencies-97f75f61c6abf108-deps] /*stdin*\ : 29.20% ( 36.6 MiB => 10.7 MiB, /nix/store/cclrzimln4w2iqr0441hir909l5pgbaf-gammaloop-crate-test-dependencies-97f75f61c6abf108-deps-0.1.0/target.tar.zst)
  107. 163.04 s [gammaloop-crate-test-dependencies-97f75f61c6abf108-deps] Phase: fixupPhase
  108. 163.04 s [gammaloop-crate-test-dependencies-97f75f61c6abf108-deps] shrinking RPATHs of ELF executables and libraries in /nix/store/cclrzimln4w2iqr0441hir909l5pgbaf-gammaloop-crate-test-dependencies-97f75f61c6abf108-deps-0.1.0
  109. 163.04 s [gammaloop-crate-test-dependencies-97f75f61c6abf108-deps] checking for references to /build/ in /nix/store/cclrzimln4w2iqr0441hir909l5pgbaf-gammaloop-crate-test-dependencies-97f75f61c6abf108-deps-0.1.0...
  110. 163.04 s [gammaloop-crate-test-dependencies-97f75f61c6abf108-deps] patching script interpreter paths in /nix/store/cclrzimln4w2iqr0441hir909l5pgbaf-gammaloop-crate-test-dependencies-97f75f61c6abf108-deps-0.1.0
  111. 163.26 s [gammaloop-crate-test-dependencies-97f75f61c6abf108-deps:post-build] Uploading to the NixCI cache: /nix/store/cclrzimln4w2iqr0441hir909l5pgbaf-gammaloop-crate-test-dependencies-97f75f61c6abf108-deps-0.1.0
  112. 163.31 s [gammaloop-crate-test-dependencies-97f75f61c6abf108-deps:post-build] warning: 'warn-short-path-literals' is deprecated, use 'lint-short-path-literals = ignore' instead
  113. 163.33 s [gammaloop-crate-test-dependencies-97f75f61c6abf108-deps:post-build] copying 0 paths...
  114. 163.39 s [gammaloop-crate-test-dependencies-97f75f61c6abf108-deps:post-build] warning: 'warn-short-path-literals' is deprecated, use 'lint-short-path-literals = ignore' instead
  115. 163.51 s [gammaloop-crate-test-dependencies-97f75f61c6abf108-deps:post-build] copying 0 paths...
  116. 163.54 s Uploaded gammaloop-crate-test-dependencies-97f75f61c6abf108-deps in 280ms
  117. 163.54 s Progress: 7 of 14 built (1 building), 4 of 4 downloaded from cache
  118. 163.54 s Built gammaloop-crate-test-dependencies-97f75f61c6abf108-deps in 1m01s
  119. 163.54 s [gammaloop-crate-test-dependencies-d918b893a0af9b1a-deps] Phase: unpackPhase
  120. 163.54 s [gammaloop-crate-test-dependencies-d918b893a0af9b1a-deps] unpacking source archive /nix/store/y1yrbah9gq9z163s0bqhd4cnm8qn03z0-source
  121. 163.54 s [gammaloop-crate-test-dependencies-d918b893a0af9b1a-deps] source root is source
  122. 163.54 s [gammaloop-crate-test-dependencies-d918b893a0af9b1a-deps] Phase: patchPhase
  123. 163.54 s [gammaloop-crate-test-dependencies-d918b893a0af9b1a-deps] Executing configureCargoCommonVars
  124. 163.54 s [gammaloop-crate-test-dependencies-d918b893a0af9b1a-deps] copying cargo artifacts from /nix/store/4lbwk5q08mwpj6j4l5yd467b3r9hnjdr-gammaloop-crate-test-dependencies-d918b893a0af9b1a-inputs/target to target
  125. 163.54 s [gammaloop-crate-test-dependencies-d918b893a0af9b1a-deps] will deep copy artifacts (instead of symlinking) as requested
  126. 164.16 s [gammaloop-crate-test-dependencies-d918b893a0af9b1a-deps] Phase: updateAutotoolsGnuConfigScriptsPhase
  127. 164.31 s [gammaloop-crate-test-dependencies-d918b893a0af9b1a-deps] Phase: configurePhase
  128. 164.31 s [gammaloop-crate-test-dependencies-d918b893a0af9b1a-deps] will append /build/source/.cargo-home/config.toml with contents of /nix/store/1sigmg52bb61pfngmk9k8wq5fz9r7bf1-vendor-cargo-deps/config.toml
  129. 164.37 s [gammaloop-crate-test-dependencies-d918b893a0af9b1a-deps] default configurePhase, nothing to do
  130. 164.37 s [gammaloop-crate-test-dependencies-d918b893a0af9b1a-deps] Phase: buildPhase
  131. 164.38 s [gammaloop-crate-test-dependencies-d918b893a0af9b1a-deps] +++ command cargo --version
  132. 164.38 s [gammaloop-crate-test-dependencies-d918b893a0af9b1a-deps] cargo 1.97.0 (c980f4866 2026-06-30)
  133. 164.38 s [gammaloop-crate-test-dependencies-d918b893a0af9b1a-deps] +++ command cargo build --profile ci-optim --offline -p gammaloop-ci-test-dependencies-d918b893a0af9b1a -p gammaloop-workspace-hack --features linnet/bincode,linnet/drawing,linnet/serde,linnet/symbolica,symbolica/tracing_max_level_info --lib
  134. 164.82 s [gammaloop-crate-test-dependencies-d918b893a0af9b1a-deps] Compiling linnet v0.17.0 (/build/source/crates/linnet)
  135. 169.78 s [gammaloop-crate-test-dependencies-d918b893a0af9b1a-deps] Compiling feynkit-kinematics v0.1.0 (/build/source/crates/feynkit-kinematics)
  136. 170.73 s [gammaloop-crate-test-dependencies-d918b893a0af9b1a-deps] Compiling gammaloop-ci-test-dependencies-d918b893a0af9b1a v0.1.0 (/build/source/crates/gammaloop-ci-test-dependencies-d918b893a0af9b1a)
  137. 171.37 s [gammaloop-crate-test-dependencies-d918b893a0af9b1a-deps] Finished `ci-optim` profile [optimized] target(s) in 6.97s
  138. 171.52 s [gammaloop-crate-test-dependencies-d918b893a0af9b1a-deps] warning: the following packages contain code that will be rejected by a future version of Rust: proc-macro-error2 v2.0.1
  139. 171.52 s [gammaloop-crate-test-dependencies-d918b893a0af9b1a-deps] note: to see what the problems were, use the option `--future-incompat-report`, or run `cargo report future-incompatibilities --id 1`
  140. 171.57 s [gammaloop-crate-test-dependencies-d918b893a0af9b1a-deps] +++ command cargo build --profile ci-optim --offline -p feynkit-kinematics -p gammaloop-ci-test-binary-dependencies-d918b893a0af9b1a --features linnet/bincode,linnet/drawing,linnet/serde,linnet/symbolica,symbolica/tracing_max_level_info --lib
  141. 171.81 s [gammaloop-crate-test-dependencies-d918b893a0af9b1a-deps] Compiling linnet v0.17.0 (/build/source/crates/linnet)
  142. 176.44 s [gammaloop-crate-test-dependencies-d918b893a0af9b1a-deps] Compiling feynkit-kinematics v0.1.0 (/build/source/crates/feynkit-kinematics)
  143. 176.45 s [gammaloop-crate-test-dependencies-d918b893a0af9b1a-deps] Compiling gammaloop-ci-test-binary-dependencies-d918b893a0af9b1a v0.1.0 (/build/source/crates/gammaloop-ci-test-binary-dependencies-d918b893a0af9b1a)
  144. 178.14 s [gammaloop-crate-test-dependencies-d918b893a0af9b1a-deps] Finished `ci-optim` profile [optimized] target(s) in 6.57s
  145. 178.29 s [gammaloop-crate-test-dependencies-d918b893a0af9b1a-deps] warning: the following packages contain code that will be rejected by a future version of Rust: proc-macro-error2 v2.0.1
  146. 178.29 s [gammaloop-crate-test-dependencies-d918b893a0af9b1a-deps] note: to see what the problems were, use the option `--future-incompat-report`, or run `cargo report future-incompatibilities --id 1`
  147. 178.35 s [gammaloop-crate-test-dependencies-d918b893a0af9b1a-deps] Phase: installPhase
  148. 178.39 s [gammaloop-crate-test-dependencies-d918b893a0af9b1a-deps] linking previous artifacts /nix/store/4lbwk5q08mwpj6j4l5yd467b3r9hnjdr-gammaloop-crate-test-dependencies-d918b893a0af9b1a-inputs to /nix/store/l4ln8wv7xbd8nizx59qr5k7h84by7hr9-gammaloop-crate-test-dependencies-d918b893a0af9b1a-deps-0.1.0/target.tar.zst
  149. 178.60 s [gammaloop-crate-test-dependencies-d918b893a0af9b1a-deps] /*stdin*\ : 32.77% ( 44.9 MiB => 14.7 MiB, /nix/store/l4ln8wv7xbd8nizx59qr5k7h84by7hr9-gammaloop-crate-test-dependencies-d918b893a0af9b1a-deps-0.1.0/target.tar.zst)
  150. 178.62 s [gammaloop-crate-test-dependencies-d918b893a0af9b1a-deps] Phase: fixupPhase
  151. 178.63 s [gammaloop-crate-test-dependencies-d918b893a0af9b1a-deps] shrinking RPATHs of ELF executables and libraries in /nix/store/l4ln8wv7xbd8nizx59qr5k7h84by7hr9-gammaloop-crate-test-dependencies-d918b893a0af9b1a-deps-0.1.0
  152. 178.64 s [gammaloop-crate-test-dependencies-d918b893a0af9b1a-deps] checking for references to /build/ in /nix/store/l4ln8wv7xbd8nizx59qr5k7h84by7hr9-gammaloop-crate-test-dependencies-d918b893a0af9b1a-deps-0.1.0...
  153. 178.65 s [gammaloop-crate-test-dependencies-d918b893a0af9b1a-deps] patching script interpreter paths in /nix/store/l4ln8wv7xbd8nizx59qr5k7h84by7hr9-gammaloop-crate-test-dependencies-d918b893a0af9b1a-deps-0.1.0
  154. 179.08 s [gammaloop-crate-test-dependencies-d918b893a0af9b1a-deps:post-build] Uploading to the NixCI cache: /nix/store/l4ln8wv7xbd8nizx59qr5k7h84by7hr9-gammaloop-crate-test-dependencies-d918b893a0af9b1a-deps-0.1.0
  155. 179.52 s [gammaloop-crate-test-dependencies-d918b893a0af9b1a-deps:post-build] warning: 'warn-short-path-literals' is deprecated, use 'lint-short-path-literals = ignore' instead
  156. 179.62 s [gammaloop-crate-test-dependencies-d918b893a0af9b1a-deps:post-build] copying 0 paths...
  157. 180.34 s [gammaloop-crate-test-dependencies-d918b893a0af9b1a-deps:post-build] warning: 'warn-short-path-literals' is deprecated, use 'lint-short-path-literals = ignore' instead
  158. 180.58 s [gammaloop-crate-test-dependencies-d918b893a0af9b1a-deps:post-build] copying 0 paths...
  159. 180.80 s Uploaded gammaloop-crate-test-dependencies-d918b893a0af9b1a-deps in 1.7s
  160. 180.80 s Progress: 8 of 14 built, 4 of 4 downloaded from cache
  161. 180.80 s Built gammaloop-crate-test-dependencies-d918b893a0af9b1a-deps in 17.7s
  162. 180.90 s Building /nix/store/dyihzd338780a7xy1jgqfm3hlrzf99jr-gammaloop-crate-test-dependencies-dd93152a31ddbf22-inputs.drv
  163. 193.36 s [gammaloop-crate-test-dependencies-dd93152a31ddbf22-inputs:post-build] Uploading to the NixCI cache: /nix/store/7ffyy3pa7g1xny0v3wp0q69816g0bk00-gammaloop-crate-test-dependencies-dd93152a31ddbf22-inputs
  164. 194.08 s [gammaloop-crate-test-dependencies-dd93152a31ddbf22-inputs:post-build] warning: 'warn-short-path-literals' is deprecated, use 'lint-short-path-literals = ignore' instead
  165. 194.20 s [gammaloop-crate-test-dependencies-dd93152a31ddbf22-inputs:post-build] copying 0 paths...
  166. 195.06 s [gammaloop-crate-test-dependencies-dd93152a31ddbf22-inputs:post-build] warning: 'warn-short-path-literals' is deprecated, use 'lint-short-path-literals = ignore' instead
  167. 195.46 s [gammaloop-crate-test-dependencies-dd93152a31ddbf22-inputs:post-build] copying 0 paths...
  168. 195.63 s Uploaded gammaloop-crate-test-dependencies-dd93152a31ddbf22-inputs in 2.5s
  169. 195.63 s Progress: 9 of 14 built, 4 of 4 downloaded from cache
  170. 195.63 s Built gammaloop-crate-test-dependencies-dd93152a31ddbf22-inputs in 14.7s
  171. 195.75 s Building /nix/store/5vzrxgmsx67qvjmh6ahinm1nsv95nnr1-gammaloop-crate-test-dependencies-dd93152a31ddbf22-deps-0.1.0.drv
  172. 195.99 s [gammaloop-crate-test-dependencies-dd93152a31ddbf22-deps] Phase: unpackPhase
  173. 196.01 s [gammaloop-crate-test-dependencies-dd93152a31ddbf22-deps] unpacking source archive /nix/store/z3449fcmcpjp2jx1z45ahqbz6v23wd99-source
  174. 196.05 s [gammaloop-crate-test-dependencies-dd93152a31ddbf22-deps] source root is source
  175. 196.10 s [gammaloop-crate-test-dependencies-dd93152a31ddbf22-deps] Phase: patchPhase
  176. 196.57 s [gammaloop-crate-test-dependencies-dd93152a31ddbf22-deps] Executing configureCargoCommonVars
  177. 196.58 s [gammaloop-crate-test-dependencies-dd93152a31ddbf22-deps] copying cargo artifacts from /nix/store/7ffyy3pa7g1xny0v3wp0q69816g0bk00-gammaloop-crate-test-dependencies-dd93152a31ddbf22-inputs/target to target
  178. 196.58 s [gammaloop-crate-test-dependencies-dd93152a31ddbf22-deps] will deep copy artifacts (instead of symlinking) as requested
  179. 200.11 s [gammaloop-crate-test-dependencies-dd93152a31ddbf22-deps] Phase: updateAutotoolsGnuConfigScriptsPhase
  180. 200.16 s [gammaloop-crate-test-dependencies-dd93152a31ddbf22-deps] Phase: configurePhase
  181. 200.17 s [gammaloop-crate-test-dependencies-dd93152a31ddbf22-deps] will append /build/source/.cargo-home/config.toml with contents of /nix/store/1sigmg52bb61pfngmk9k8wq5fz9r7bf1-vendor-cargo-deps/config.toml
  182. 200.17 s [gammaloop-crate-test-dependencies-dd93152a31ddbf22-deps] default configurePhase, nothing to do
  183. 200.17 s [gammaloop-crate-test-dependencies-dd93152a31ddbf22-deps] Phase: buildPhase
  184. 200.18 s [gammaloop-crate-test-dependencies-dd93152a31ddbf22-deps] +++ command cargo --version
  185. 200.19 s [gammaloop-crate-test-dependencies-dd93152a31ddbf22-deps] cargo 1.97.0 (c980f4866 2026-06-30)
  186. 200.19 s [gammaloop-crate-test-dependencies-dd93152a31ddbf22-deps] +++ command cargo build --profile ci-optim --offline -p gammaloop-ci-test-dependencies-dd93152a31ddbf22 -p gammaloop-workspace-hack --features linnet/bincode,linnet/drawing,linnet/serde,linnet/symbolica,symbolica/tracing_max_level_info --lib
  187. 200.87 s [gammaloop-crate-test-dependencies-dd93152a31ddbf22-deps] Compiling feynkit-model v0.1.0 (/build/source/crates/feynkit-model)
  188. 202.10 s [gammaloop-crate-test-dependencies-dd93152a31ddbf22-deps] Compiling feynkit-graph v0.1.0 (/build/source/crates/feynkit-graph)
  189. 204.88 s [gammaloop-crate-test-dependencies-dd93152a31ddbf22-deps] Compiling gammaloop-ci-test-dependencies-dd93152a31ddbf22 v0.1.0 (/build/source/crates/gammaloop-ci-test-dependencies-dd93152a31ddbf22)
  190. 211.88 s [gammaloop-crate-test-dependencies-dd93152a31ddbf22-deps] Finished `ci-optim` profile [optimized] target(s) in 11.68s
  191. 212.19 s [gammaloop-crate-test-dependencies-dd93152a31ddbf22-deps] warning: the following packages contain code that will be rejected by a future version of Rust: proc-macro-error2 v2.0.1
  192. 212.19 s [gammaloop-crate-test-dependencies-dd93152a31ddbf22-deps] note: to see what the problems were, use the option `--future-incompat-report`, or run `cargo report future-incompatibilities --id 1`
  193. 212.29 s [gammaloop-crate-test-dependencies-dd93152a31ddbf22-deps] +++ command cargo build --profile ci-optim --offline -p feynkit-graph -p gammaloop-ci-test-binary-dependencies-dd93152a31ddbf22 --features linnet/bincode,linnet/drawing,linnet/serde,linnet/symbolica,symbolica/tracing_max_level_info --lib
  194. 212.85 s [gammaloop-crate-test-dependencies-dd93152a31ddbf22-deps] Compiling gammaloop-ci-test-binary-dependencies-dd93152a31ddbf22 v0.1.0 (/build/source/crates/gammaloop-ci-test-binary-dependencies-dd93152a31ddbf22)
  195. 212.85 s [gammaloop-crate-test-dependencies-dd93152a31ddbf22-deps] Compiling feynkit-graph v0.1.0 (/build/source/crates/feynkit-graph)
  196. 222.16 s [gammaloop-crate-test-dependencies-dd93152a31ddbf22-deps] Finished `ci-optim` profile [optimized] target(s) in 9.85s
  197. 222.37 s [gammaloop-crate-test-dependencies-dd93152a31ddbf22-deps] warning: the following packages contain code that will be rejected by a future version of Rust: proc-macro-error2 v2.0.1
  198. 222.37 s [gammaloop-crate-test-dependencies-dd93152a31ddbf22-deps] note: to see what the problems were, use the option `--future-incompat-report`, or run `cargo report future-incompatibilities --id 1`
  199. 222.47 s [gammaloop-crate-test-dependencies-dd93152a31ddbf22-deps] Phase: installPhase
  200. 222.52 s [gammaloop-crate-test-dependencies-dd93152a31ddbf22-deps] linking previous artifacts /nix/store/7ffyy3pa7g1xny0v3wp0q69816g0bk00-gammaloop-crate-test-dependencies-dd93152a31ddbf22-inputs to /nix/store/8h93csyrgaqxlvndp86ih8d38jr309md-gammaloop-crate-test-dependencies-dd93152a31ddbf22-deps-0.1.0/target.tar.zst
  201. 222.77 s [gammaloop-crate-test-dependencies-dd93152a31ddbf22-deps] /*stdin*\ : 22.31% ( 12.6 MiB => 2.81 MiB, /nix/store/8h93csyrgaqxlvndp86ih8d38jr309md-gammaloop-crate-test-dependencies-dd93152a31ddbf22-deps-0.1.0/target.tar.zst)
  202. 222.80 s [gammaloop-crate-test-dependencies-dd93152a31ddbf22-deps] Phase: fixupPhase
  203. 222.87 s [gammaloop-crate-test-dependencies-dd93152a31ddbf22-deps] shrinking RPATHs of ELF executables and libraries in /nix/store/8h93csyrgaqxlvndp86ih8d38jr309md-gammaloop-crate-test-dependencies-dd93152a31ddbf22-deps-0.1.0
  204. 222.87 s [gammaloop-crate-test-dependencies-dd93152a31ddbf22-deps] checking for references to /build/ in /nix/store/8h93csyrgaqxlvndp86ih8d38jr309md-gammaloop-crate-test-dependencies-dd93152a31ddbf22-deps-0.1.0...
  205. 222.91 s [gammaloop-crate-test-dependencies-dd93152a31ddbf22-deps] patching script interpreter paths in /nix/store/8h93csyrgaqxlvndp86ih8d38jr309md-gammaloop-crate-test-dependencies-dd93152a31ddbf22-deps-0.1.0
  206. 223.47 s [gammaloop-crate-test-dependencies-dd93152a31ddbf22-deps:post-build] Uploading to the NixCI cache: /nix/store/8h93csyrgaqxlvndp86ih8d38jr309md-gammaloop-crate-test-dependencies-dd93152a31ddbf22-deps-0.1.0
  207. 224.19 s [gammaloop-crate-test-dependencies-dd93152a31ddbf22-deps:post-build] warning: 'warn-short-path-literals' is deprecated, use 'lint-short-path-literals = ignore' instead
  208. 224.32 s [gammaloop-crate-test-dependencies-dd93152a31ddbf22-deps:post-build] copying 0 paths...
  209. 225.26 s [gammaloop-crate-test-dependencies-dd93152a31ddbf22-deps:post-build] warning: 'warn-short-path-literals' is deprecated, use 'lint-short-path-literals = ignore' instead
  210. 225.82 s [gammaloop-crate-test-dependencies-dd93152a31ddbf22-deps:post-build] copying 0 paths...
  211. 226.12 s Uploaded gammaloop-crate-test-dependencies-dd93152a31ddbf22-deps in 2.6s
  212. 226.12 s Progress: 10 of 14 built, 4 of 4 downloaded from cache
  213. 226.13 s Built gammaloop-crate-test-dependencies-dd93152a31ddbf22-deps in 30.3s
  214. 226.26 s Building /nix/store/sx5yxc2ksbdwbpqsxkpwld82hr5k4097-gammaloop-crate-test-dependencies-4f00f4b0073ce06e-inputs.drv
  215. 245.92 s [gammaloop-crate-test-dependencies-4f00f4b0073ce06e-inputs:post-build] Uploading to the NixCI cache: /nix/store/9lzcc2sbpwvfgjg5j0wjiinvhakhaa3j-gammaloop-crate-test-dependencies-4f00f4b0073ce06e-inputs
  216. 246.71 s [gammaloop-crate-test-dependencies-4f00f4b0073ce06e-inputs:post-build] warning: 'warn-short-path-literals' is deprecated, use 'lint-short-path-literals = ignore' instead
  217. 246.86 s [gammaloop-crate-test-dependencies-4f00f4b0073ce06e-inputs:post-build] copying 1 paths...
  218. 246.86 s [gammaloop-crate-test-dependencies-4f00f4b0073ce06e-inputs:post-build] copying path '/nix/store/9lzcc2sbpwvfgjg5j0wjiinvhakhaa3j-gammaloop-crate-test-dependencies-4f00f4b0073ce06e-inputs' to 'https://cache.nix-ci.com'...
  219. 429.81 s [gammaloop-crate-test-dependencies-4f00f4b0073ce06e-inputs:post-build] warning: 'warn-short-path-literals' is deprecated, use 'lint-short-path-literals = ignore' instead
  220. 430.24 s [gammaloop-crate-test-dependencies-4f00f4b0073ce06e-inputs:post-build] copying 0 paths...
  221. 430.55 s Uploaded gammaloop-crate-test-dependencies-4f00f4b0073ce06e-inputs in 3m04s
  222. 430.56 s Progress: 11 of 14 built, 4 of 4 downloaded from cache
  223. 430.56 s Built gammaloop-crate-test-dependencies-4f00f4b0073ce06e-inputs in 3m24s
  224. 430.67 s Building /nix/store/hi9dlkfda2h9qsb9sgy84a17r66rvrxn-gammaloop-crate-test-dependencies-4f00f4b0073ce06e-deps-0.1.0.drv
  225. 430.85 s [gammaloop-crate-test-dependencies-4f00f4b0073ce06e-deps] Phase: unpackPhase
  226. 430.87 s [gammaloop-crate-test-dependencies-4f00f4b0073ce06e-deps] unpacking source archive /nix/store/vksqb783ssfkbr0smqy8im6c2r1fpqhf-source
  227. 430.88 s [gammaloop-crate-test-dependencies-4f00f4b0073ce06e-deps] source root is source
  228. 430.91 s [gammaloop-crate-test-dependencies-4f00f4b0073ce06e-deps] Phase: patchPhase
  229. 431.47 s [gammaloop-crate-test-dependencies-4f00f4b0073ce06e-deps] Executing configureCargoCommonVars
  230. 431.49 s [gammaloop-crate-test-dependencies-4f00f4b0073ce06e-deps] copying cargo artifacts from /nix/store/9lzcc2sbpwvfgjg5j0wjiinvhakhaa3j-gammaloop-crate-test-dependencies-4f00f4b0073ce06e-inputs/target to target
  231. 431.49 s [gammaloop-crate-test-dependencies-4f00f4b0073ce06e-deps] will deep copy artifacts (instead of symlinking) as requested
  232. 434.00 s [gammaloop-crate-test-dependencies-4f00f4b0073ce06e-deps] Phase: updateAutotoolsGnuConfigScriptsPhase
  233. 434.05 s [gammaloop-crate-test-dependencies-4f00f4b0073ce06e-deps] Phase: configurePhase
  234. 434.56 s [gammaloop-crate-test-dependencies-4f00f4b0073ce06e-deps] will append /build/source/.cargo-home/config.toml with contents of /nix/store/1sigmg52bb61pfngmk9k8wq5fz9r7bf1-vendor-cargo-deps/config.toml
  235. 434.67 s [gammaloop-crate-test-dependencies-4f00f4b0073ce06e-deps] default configurePhase, nothing to do
  236. 434.68 s [gammaloop-crate-test-dependencies-4f00f4b0073ce06e-deps] Phase: buildPhase
  237. 435.75 s [gammaloop-crate-test-dependencies-4f00f4b0073ce06e-deps] +++ command cargo --version
  238. 435.78 s [gammaloop-crate-test-dependencies-4f00f4b0073ce06e-deps] cargo 1.97.0 (c980f4866 2026-06-30)
  239. 435.78 s [gammaloop-crate-test-dependencies-4f00f4b0073ce06e-deps] +++ command cargo build --profile ci-optim --offline -p gammaloop-ci-test-dependencies-4f00f4b0073ce06e -p gammaloop-workspace-hack --features linnet/bincode,linnet/drawing,linnet/serde,linnet/symbolica,symbolica/tracing_max_level_info --lib
  240. 438.20 s [gammaloop-crate-test-dependencies-4f00f4b0073ce06e-deps] Compiling spenso-macros v0.3.2 (/build/source/crates/spenso-macros)
  241. 438.51 s [gammaloop-crate-test-dependencies-4f00f4b0073ce06e-deps] Compiling spenso v0.6.0 (/build/source/crates/spenso)
  242. 438.55 s [gammaloop-crate-test-dependencies-4f00f4b0073ce06e-deps] Compiling idenso v0.3.0 (/build/source/crates/idenso)
  243. 438.60 s [gammaloop-crate-test-dependencies-4f00f4b0073ce06e-deps] Compiling feynkit-generator v0.1.0 (/build/source/crates/feynkit-generator)
  244. 438.93 s [gammaloop-crate-test-dependencies-4f00f4b0073ce06e-deps] error[E0433]: cannot find `network` in `spenso`
  245. 438.93 s [gammaloop-crate-test-dependencies-4f00f4b0073ce06e-deps] --> crates/feynkit-generator/src/generation.rs:27:5
  246. 438.93 s [gammaloop-crate-test-dependencies-4f00f4b0073ce06e-deps] |
  247. 438.93 s [gammaloop-crate-test-dependencies-4f00f4b0073ce06e-deps] 27 | network::library::symbolic::ETS,
  248. 438.93 s [gammaloop-crate-test-dependencies-4f00f4b0073ce06e-deps] | ^^^^^^^ could not find `network` in `spenso`
  249. 438.93 s [gammaloop-crate-test-dependencies-4f00f4b0073ce06e-deps]
  250. 438.93 s [gammaloop-crate-test-dependencies-4f00f4b0073ce06e-deps] error[E0433]: cannot find `structure` in `spenso`
  251. 438.93 s [gammaloop-crate-test-dependencies-4f00f4b0073ce06e-deps] --> crates/feynkit-generator/src/generation.rs:28:5
  252. 438.93 s [gammaloop-crate-test-dependencies-4f00f4b0073ce06e-deps] |
  253. 438.93 s [gammaloop-crate-test-dependencies-4f00f4b0073ce06e-deps] 28 | structure::representation::{Minkowski, RepName},
  254. 438.93 s [gammaloop-crate-test-dependencies-4f00f4b0073ce06e-deps] | ^^^^^^^^^ could not find `structure` in `spenso`
  255. 438.93 s [gammaloop-crate-test-dependencies-4f00f4b0073ce06e-deps]
  256. 438.93 s [gammaloop-crate-test-dependencies-4f00f4b0073ce06e-deps] error[E0432]: unresolved imports `idenso::color`, `idenso::dirac`, `idenso::epsilon`, `idenso::representations`
  257. 438.93 s [gammaloop-crate-test-dependencies-4f00f4b0073ce06e-deps] --> crates/feynkit-generator/src/generation.rs:16:5
  258. 438.93 s [gammaloop-crate-test-dependencies-4f00f4b0073ce06e-deps] |
  259. 438.93 s [gammaloop-crate-test-dependencies-4f00f4b0073ce06e-deps] 16 | color::CS,
  260. 438.93 s [gammaloop-crate-test-dependencies-4f00f4b0073ce06e-deps] | ^^^^^ could not find `color` in `idenso`
  261. 438.93 s [gammaloop-crate-test-dependencies-4f00f4b0073ce06e-deps] 17 | dirac::AGS,
  262. 438.93 s [gammaloop-crate-test-dependencies-4f00f4b0073ce06e-deps] | ^^^^^ could not find `dirac` in `idenso`
  263. 438.93 s [gammaloop-crate-test-dependencies-4f00f4b0073ce06e-deps] 18 | epsilon::EPSILON_SYMBOL,
  264. 438.93 s [gammaloop-crate-test-dependencies-4f00f4b0073ce06e-deps] | ^^^^^^^ could not find `epsilon` in `idenso`
  265. 438.93 s [gammaloop-crate-test-dependencies-4f00f4b0073ce06e-deps] 19 | representations::{Bispinor, ColorAdjoint, ColorFundamental, ColorSextet},
  266. 438.93 s [gammaloop-crate-test-dependencies-4f00f4b0073ce06e-deps] | ^^^^^^^^^^^^^^^ could not find `representations` in `idenso`
  267. 438.93 s [gammaloop-crate-test-dependencies-4f00f4b0073ce06e-deps]
  268. 440.24 s [gammaloop-crate-test-dependencies-4f00f4b0073ce06e-deps] Some errors have detailed explanations: E0432, E0433.
  269. 440.24 s [gammaloop-crate-test-dependencies-4f00f4b0073ce06e-deps] For more information about an error, try `rustc --explain E0432`.
  270. 440.27 s [gammaloop-crate-test-dependencies-4f00f4b0073ce06e-deps] error: could not compile `feynkit-generator` (lib) due to 3 previous errors
  271. 440.89 s Progress: 11 of 13 built (1 failed), 4 of 4 downloaded from cache
  272. 440.92 s Failed to build gammaloop-crate-test-dependencies-4f00f4b0073ce06e-deps after 10.2s
  273. 440.92 s error: Cannot build '/nix/store/hi9dlkfda2h9qsb9sgy84a17r66rvrxn-gammaloop-crate-test-dependencies-4f00f4b0073ce06e-deps-0.1.0.drv'.
  274. 440.92 s Reason: builder failed with exit code 101.
  275. 440.92 s Output paths:
  276. 440.92 s /nix/store/v9ic4wza465r8y439mjkallk6cnkinx1-gammaloop-crate-test-dependencies-4f00f4b0073ce06e-deps-0.1.0
  277. 440.92 s Last 46 log lines:
  278. 440.92 s > Running phase: unpackPhase
  279. 440.92 s > unpacking source archive /nix/store/vksqb783ssfkbr0smqy8im6c2r1fpqhf-source
  280. 440.92 s > source root is source
  281. 440.92 s > Running phase: patchPhase
  282. 440.92 s > Executing configureCargoCommonVars
  283. 440.92 s > copying cargo artifacts from /nix/store/9lzcc2sbpwvfgjg5j0wjiinvhakhaa3j-gammaloop-crate-test-dependencies-4f00f4b0073ce06e-inputs/target to target
  284. 440.92 s > will deep copy artifacts (instead of symlinking) as requested
  285. 440.92 s > Running phase: updateAutotoolsGnuConfigScriptsPhase
  286. 440.92 s > Running phase: configurePhase
  287. 440.92 s > will append /build/source/.cargo-home/config.toml with contents of /nix/store/1sigmg52bb61pfngmk9k8wq5fz9r7bf1-vendor-cargo-deps/config.toml
  288. 440.92 s > default configurePhase, nothing to do
  289. 440.92 s > Running phase: buildPhase
  290. 440.92 s > +++ command cargo --version
  291. 440.92 s > cargo 1.97.0 (c980f4866 2026-06-30)
  292. 440.92 s > +++ command cargo build --profile ci-optim --offline -p gammaloop-ci-test-dependencies-4f00f4b0073ce06e -p gammaloop-workspace-hack --features linnet/bincode,linnet/drawing,linnet/serde,linnet/symbolica,symbolica/tracing_max_level_info --lib
  293. 440.92 s > Compiling spenso-macros v0.3.2 (/build/source/crates/spenso-macros)
  294. 440.92 s > Compiling spenso v0.6.0 (/build/source/crates/spenso)
  295. 440.92 s > Compiling idenso v0.3.0 (/build/source/crates/idenso)
  296. 440.92 s > Compiling feynkit-generator v0.1.0 (/build/source/crates/feynkit-generator)
  297. 440.92 s > error[E0433]: cannot find `network` in `spenso`
  298. 440.92 s > --> crates/feynkit-generator/src/generation.rs:27:5
  299. 440.92 s > |
  300. 440.92 s > 27 | network::library::symbolic::ETS,
  301. 440.92 s > | ^^^^^^^ could not find `network` in `spenso`
  302. 440.92 s >
  303. 440.92 s > error[E0433]: cannot find `structure` in `spenso`
  304. 440.92 s > --> crates/feynkit-generator/src/generation.rs:28:5
  305. 440.92 s > |
  306. 440.92 s > 28 | structure::representation::{Minkowski, RepName},
  307. 440.92 s > | ^^^^^^^^^ could not find `structure` in `spenso`
  308. 440.92 s >
  309. 440.92 s > error[E0432]: unresolved imports `idenso::color`, `idenso::dirac`, `idenso::epsilon`, `idenso::representations`
  310. 440.92 s > --> crates/feynkit-generator/src/generation.rs:16:5
  311. 440.92 s > |
  312. 440.92 s > 16 | color::CS,
  313. 440.92 s > | ^^^^^ could not find `color` in `idenso`
  314. 440.92 s > 17 | dirac::AGS,
  315. 440.92 s > | ^^^^^ could not find `dirac` in `idenso`
  316. 440.92 s > 18 | epsilon::EPSILON_SYMBOL,
  317. 440.92 s > | ^^^^^^^ could not find `epsilon` in `idenso`
  318. 440.92 s > 19 | representations::{Bispinor, ColorAdjoint, ColorFundamental, ColorSextet},
  319. 440.92 s > | ^^^^^^^^^^^^^^^ could not find `representations` in `idenso`
  320. 440.92 s >
  321. 440.92 s > Some errors have detailed explanations: E0432, E0433.
  322. 440.92 s > For more information about an error, try `rustc --explain E0432`.
  323. 440.92 s > error: could not compile `feynkit-generator` (lib) due to 3 previous errors
  324. 440.92 s For full logs, run:
  325. 440.92 s nix log /nix/store/hi9dlkfda2h9qsb9sgy84a17r66rvrxn-gammaloop-crate-test-dependencies-4f00f4b0073ce06e-deps-0.1.0.drv
  326. 440.92 s error: Cannot build '/nix/store/ynbqqinqg92w77alhigqiwm8l784m0f1-nix-ci-artifact-barrier-crate-test-dependencies-feynkit-generator.drv'.
  327. 440.92 s Reason: 1 dependency failed.
  328. 440.92 s Output paths:
  329. 440.92 s /nix/store/rfi9d3qy9vyssmxkrjsrag35vi2kcpkd-nix-ci-artifact-barrier-crate-test-dependencies-feynkit-generator
  330. 440.92 s Build failed due to failed dependency
  331. 441.08 s Build failed.