test packages.x86_64-linux.nix-ci-check-gammaloop-nextest-docs
0.00 s
$ /nix/store/61685rbaxmpigwi3z23i33sv3jyfl70q-coreutils-9.11/bin/timeout --kill-after=15s 7200s /nix/store/wknkybkzrc16r11vk5vrykh4wmw7a353-nix-2.34.8/bin/nix --extra-experimental-features nix-command --extra-experimental-features flakes flake clone git+https://github.com/alphal00p/gammaloop --dest /tmp/nix-ci-worker/stable-pwd/repo/
0.09 s
Cloning into '/tmp/nix-ci-worker/stable-pwd/repo'...
0.84 s
remote: Enumerating objects: 108237, done.
0.96 s
remote: Counting objects: 0% (1/11633)
remote: Counting objects: 1% (117/11633)
remote: Counting objects: 2% (233/11633)
remote: Counting objects: 3% (349/11633)
remote: Counting objects: 4% (466/11633)
remote: Counting objects: 5% (582/11633)
remote: Counting objects: 6% (698/11633)
remote: Counting objects: 7% (815/11633)
remote: Counting objects: 8% (931/11633)
remote: Counting objects: 9% (1047/11633)
remote: Counting objects: 10% (1164/11633)
remote: Counting objects: 11% (1280/11633)
remote: Counting objects: 12% (1396/11633)
remote: Counting objects: 13% (1513/11633)
remote: Counting objects: 14% (1629/11633)
remote: Counting objects: 15% (1745/11633)
remote: Counting objects: 16% (1862/11633)
remote: Counting objects: 17% (1978/11633)
remote: Counting objects: 18% (2094/11633)
remote: Counting objects: 19% (2211/11633)
remote: Counting objects: 20% (2327/11633)
remote: Counting objects: 21% (2443/11633)
remote: Counting objects: 22% (2560/11633)
remote: Counting objects: 23% (2676/11633)
remote: Counting objects: 24% (2792/11633)
remote: Counting objects: 25% (2909/11633)
remote: Counting objects: 26% (3025/11633)
remote: Counting objects: 27% (3141/11633)
remote: Counting objects: 28% (3258/11633)
remote: Counting objects: 29% (3374/11633)
remote: Counting objects: 30% (3490/11633)
remote: Counting objects: 31% (3607/11633)
remote: Counting objects: 32% (3723/11633)
remote: Counting objects: 33% (3839/11633)
remote: Counting objects: 34% (3956/11633)
remote: Counting objects: 35% (4072/11633)
remote: Counting objects: 36% (4188/11633)
remote: Counting objects: 37% (4305/11633)
remote: Counting objects: 38% (4421/11633)
remote: Counting objects: 39% (4537/11633)
remote: Counting objects: 40% (4654/11633)
remote: Counting objects: 41% (4770/11633)
remote: Counting objects: 42% (4886/11633)
remote: Counting objects: 43% (5003/11633)
remote: Counting objects: 44% (5119/11633)
remote: Counting objects: 45% (5235/11633)
remote: Counting objects: 46% (5352/11633)
remote: Counting objects: 47% (5468/11633)
remote: Counting objects: 48% (5584/11633)
remote: Counting objects: 49% (5701/11633)
remote: Counting objects: 50% (5817/11633)
remote: Counting objects: 51% (5933/11633)
remote: Counting objects: 52% (6050/11633)
remote: Counting objects: 53% (6166/11633)
remote: Counting objects: 54% (6282/11633)
remote: Counting objects: 55% (6399/11633)
remote: Counting objects: 56% (6515/11633)
remote: Counting objects: 57% (6631/11633)
remote: Counting objects: 58% (6748/11633)
remote: Counting objects: 59% (6864/11633)
remote: Counting objects: 60% (6980/11633)
remote: Counting objects: 61% (7097/11633)
remote: Counting objects: 62% (7213/11633)
remote: Counting objects: 63% (7329/11633)
remote: Counting objects: 64% (7446/11633)
remote: Counting objects: 65% (7562/11633)
remote: Counting objects: 66% (7678/11633)
remote: Counting objects: 67% (7795/11633)
remote: Counting objects: 68% (7911/11633)
remote: Counting objects: 69% (8027/11633)
remote: Counting objects: 70% (8144/11633)
remote: Counting objects: 71% (8260/11633)
remote: Counting objects: 72% (8376/11633)
remote: Counting objects: 73% (8493/11633)
remote: Counting objects: 74% (8609/11633)
remote: Counting objects: 75% (8725/11633)
remote: Counting objects: 76% (8842/11633)
remote: Counting objects: 77% (8958/11633)
remote: Counting objects: 78% (9074/11633)
remote: Counting objects: 79% (9191/11633)
remote: Counting objects: 80% (9307/11633)
remote: Counting objects: 81% (9423/11633)
remote: Counting objects: 82% (9540/11633)
remote: Counting objects: 83% (9656/11633)
remote: Counting objects: 84% (9772/11633)
remote: Counting objects: 85% (9889/11633)
remote: Counting objects: 86% (10005/11633)
remote: Counting objects: 87% (10121/11633)
remote: Counting objects: 88% (10238/11633)
remote: Counting objects: 89% (10354/11633)
remote: Counting objects: 90% (10470/11633)
remote: Counting objects: 91% (10587/11633)
remote: Counting objects: 92% (10703/11633)
remote: Counting objects: 93% (10819/11633)
remote: Counting objects: 94% (10936/11633)
remote: Counting objects: 95% (11052/11633)
remote: Counting objects: 96% (11168/11633)
remote: Counting objects: 97% (11285/11633)
remote: Counting objects: 98% (11401/11633)
remote: Counting objects: 99% (11517/11633)
remote: Counting objects: 100% (11633/11633)
remote: Counting objects: 100% (11633/11633), done.
3.54 s
remote: Compressing objects: 0% (1/2152)
remote: Compressing objects: 1% (22/2152)
remote: Compressing objects: 2% (44/2152)
remote: Compressing objects: 3% (65/2152)
remote: Compressing objects: 4% (87/2152)
remote: Compressing objects: 5% (108/2152)
remote: Compressing objects: 6% (130/2152)
remote: Compressing objects: 6% (139/2152)
remote: Compressing objects: 7% (151/2152)
remote: Compressing objects: 8% (173/2152)
remote: Compressing objects: 9% (194/2152)
remote: Compressing objects: 10% (216/2152)
remote: Compressing objects: 11% (237/2152)
remote: Compressing objects: 12% (259/2152)
remote: Compressing objects: 13% (280/2152)
remote: Compressing objects: 14% (302/2152)
remote: Compressing objects: 15% (323/2152)
remote: Compressing objects: 15% (336/2152)
remote: Compressing objects: 16% (345/2152)
remote: Compressing objects: 17% (366/2152)
remote: Compressing objects: 18% (388/2152)
remote: Compressing objects: 19% (409/2152)
remote: Compressing objects: 20% (431/2152)
remote: Compressing objects: 21% (452/2152)
remote: Compressing objects: 22% (474/2152)
remote: Compressing objects: 23% (495/2152)
remote: Compressing objects: 24% (517/2152)
remote: Compressing objects: 25% (538/2152)
remote: Compressing objects: 26% (560/2152)
remote: Compressing objects: 27% (582/2152)
remote: Compressing objects: 28% (603/2152)
remote: Compressing objects: 29% (625/2152)
remote: Compressing objects: 30% (646/2152)
remote: Compressing objects: 31% (668/2152)
remote: Compressing objects: 32% (689/2152)
remote: Compressing objects: 33% (711/2152)
remote: Compressing objects: 34% (732/2152)
remote: Compressing objects: 35% (754/2152)
remote: Compressing objects: 36% (775/2152)
remote: Compressing objects: 37% (797/2152)
remote: Compressing objects: 38% (818/2152)
remote: Compressing objects: 39% (840/2152)
remote: Compressing objects: 40% (861/2152)
remote: Compressing objects: 41% (883/2152)
remote: Compressing objects: 42% (904/2152)
remote: Compressing objects: 43% (926/2152)
remote: Compressing objects: 44% (947/2152)
remote: Compressing objects: 45% (969/2152)
remote: Compressing objects: 46% (990/2152)
remote: Compressing objects: 47% (1012/2152)
remote: Compressing objects: 48% (1033/2152)
remote: Compressing objects: 49% (1055/2152)
remote: Compressing objects: 50% (1076/2152)
remote: Compressing objects: 51% (1098/2152)
remote: Compressing objects: 52% (1120/2152)
remote: Compressing objects: 53% (1141/2152)
remote: Compressing objects: 54% (1163/2152)
remote: Compressing objects: 55% (1184/2152)
remote: Compressing objects: 56% (1206/2152)
remote: Compressing objects: 57% (1227/2152)
remote: Compressing objects: 58% (1249/2152)
remote: Compressing objects: 59% (1270/2152)
remote: Compressing objects: 60% (1292/2152)
remote: Compressing objects: 61% (1313/2152)
remote: Compressing objects: 62% (1335/2152)
remote: Compressing objects: 63% (1356/2152)
remote: Compressing objects: 64% (1378/2152)
remote: Compressing objects: 65% (1399/2152)
remote: Compressing objects: 66% (1421/2152)
remote: Compressing objects: 67% (1442/2152)
remote: Compressing objects: 68% (1464/2152)
remote: Compressing objects: 69% (1485/2152)
remote: Compressing objects: 70% (1507/2152)
remote: Compressing objects: 71% (1528/2152)
remote: Compressing objects: 72% (1550/2152)
remote: Compressing objects: 73% (1571/2152)
remote: Compressing objects: 74% (1593/2152)
remote: Compressing objects: 75% (1614/2152)
remote: Compressing objects: 76% (1636/2152)
remote: Compressing objects: 77% (1658/2152)
remote: Compressing objects: 78% (1679/2152)
remote: Compressing objects: 79% (1701/2152)
remote: Compressing objects: 80% (1722/2152)
remote: Compressing objects: 81% (1744/2152)
remote: Compressing objects: 82% (1765/2152)
remote: Compressing objects: 83% (1787/2152)
remote: Compressing objects: 84% (1808/2152)
remote: Compressing objects: 85% (1830/2152)
remote: Compressing objects: 86% (1851/2152)
remote: Compressing objects: 87% (1873/2152)
remote: Compressing objects: 88% (1894/2152)
remote: Compressing objects: 89% (1916/2152)
remote: Compressing objects: 90% (1937/2152)
remote: Compressing objects: 91% (1959/2152)
remote: Compressing objects: 92% (1980/2152)
remote: Compressing objects: 93% (2002/2152)
remote: Compressing objects: 94% (2023/2152)
remote: Compressing objects: 95% (2045/2152)
remote: Compressing objects: 96% (2066/2152)
remote: Compressing objects: 97% (2088/2152)
remote: Compressing objects: 98% (2109/2152)
remote: Compressing objects: 99% (2131/2152)
remote: Compressing objects: 100% (2152/2152)
remote: Compressing objects: 100% (2152/2152), done.
16.65 s
Receiving objects: 0% (1/108237)
Receiving objects: 1% (1083/108237)
Receiving objects: 2% (2165/108237)
Receiving objects: 3% (3248/108237)
Receiving objects: 4% (4330/108237), 16.49 MiB | 32.96 MiB/s
Receiving objects: 5% (5412/108237), 16.49 MiB | 32.96 MiB/s
Receiving objects: 6% (6495/108237), 16.49 MiB | 32.96 MiB/s
Receiving objects: 7% (7577/108237), 16.49 MiB | 32.96 MiB/s
Receiving objects: 8% (8659/108237), 16.49 MiB | 32.96 MiB/s
Receiving objects: 9% (9742/108237), 16.49 MiB | 32.96 MiB/s
Receiving objects: 9% (10655/108237), 32.06 MiB | 32.05 MiB/s
Receiving objects: 10% (10824/108237), 32.06 MiB | 32.05 MiB/s
Receiving objects: 11% (11907/108237), 32.06 MiB | 32.05 MiB/s
Receiving objects: 12% (12989/108237), 32.06 MiB | 32.05 MiB/s
Receiving objects: 13% (14071/108237), 32.06 MiB | 32.05 MiB/s
Receiving objects: 14% (15154/108237), 32.06 MiB | 32.05 MiB/s
Receiving objects: 15% (16236/108237), 32.06 MiB | 32.05 MiB/s
Receiving objects: 16% (17318/108237), 32.06 MiB | 32.05 MiB/s
Receiving objects: 17% (18401/108237), 32.06 MiB | 32.05 MiB/s
Receiving objects: 18% (19483/108237), 32.06 MiB | 32.05 MiB/s
Receiving objects: 19% (20566/108237), 32.06 MiB | 32.05 MiB/s
Receiving objects: 20% (21648/108237), 32.06 MiB | 32.05 MiB/s
Receiving objects: 21% (22730/108237), 32.06 MiB | 32.05 MiB/s
Receiving objects: 22% (23813/108237), 32.06 MiB | 32.05 MiB/s
Receiving objects: 23% (24895/108237), 32.06 MiB | 32.05 MiB/s
Receiving objects: 24% (25977/108237), 32.06 MiB | 32.05 MiB/s
Receiving objects: 25% (27060/108237), 32.06 MiB | 32.05 MiB/s
Receiving objects: 26% (28142/108237), 47.11 MiB | 31.40 MiB/s
Receiving objects: 27% (29224/108237), 47.11 MiB | 31.40 MiB/s
Receiving objects: 28% (30307/108237), 47.11 MiB | 31.40 MiB/s
Receiving objects: 29% (31389/108237), 47.11 MiB | 31.40 MiB/s
Receiving objects: 30% (32472/108237), 47.11 MiB | 31.40 MiB/s
Receiving objects: 31% (33554/108237), 47.11 MiB | 31.40 MiB/s
Receiving objects: 32% (34636/108237), 47.11 MiB | 31.40 MiB/s
Receiving objects: 33% (35719/108237), 47.11 MiB | 31.40 MiB/s
Receiving objects: 34% (36801/108237), 47.11 MiB | 31.40 MiB/s
Receiving objects: 35% (37883/108237), 47.11 MiB | 31.40 MiB/s
Receiving objects: 36% (38966/108237), 47.11 MiB | 31.40 MiB/s
Receiving objects: 37% (40048/108237), 47.11 MiB | 31.40 MiB/s
Receiving objects: 38% (41131/108237), 47.11 MiB | 31.40 MiB/s
Receiving objects: 39% (42213/108237), 47.11 MiB | 31.40 MiB/s
Receiving objects: 39% (42672/108237), 63.52 MiB | 31.77 MiB/s
Receiving objects: 40% (43295/108237), 63.52 MiB | 31.77 MiB/s
Receiving objects: 41% (44378/108237), 63.52 MiB | 31.77 MiB/s
Receiving objects: 42% (45460/108237), 63.52 MiB | 31.77 MiB/s
Receiving objects: 43% (46542/108237), 63.52 MiB | 31.77 MiB/s
Receiving objects: 44% (47625/108237), 63.52 MiB | 31.77 MiB/s
Receiving objects: 45% (48707/108237), 63.52 MiB | 31.77 MiB/s
Receiving objects: 46% (49790/108237), 63.52 MiB | 31.77 MiB/s
Receiving objects: 47% (50872/108237), 63.52 MiB | 31.77 MiB/s
Receiving objects: 48% (51954/108237), 78.54 MiB | 30.40 MiB/s
Receiving objects: 49% (53037/108237), 78.54 MiB | 30.40 MiB/s
Receiving objects: 50% (54119/108237), 78.54 MiB | 30.40 MiB/s
Receiving objects: 51% (55201/108237), 78.54 MiB | 30.40 MiB/s
Receiving objects: 51% (55223/108237), 78.54 MiB | 30.40 MiB/s
Receiving objects: 52% (56284/108237), 93.44 MiB | 30.32 MiB/s
Receiving objects: 53% (57366/108237), 93.44 MiB | 30.32 MiB/s
Receiving objects: 54% (58448/108237), 93.44 MiB | 30.32 MiB/s
Receiving objects: 55% (59531/108237), 93.44 MiB | 30.32 MiB/s
Receiving objects: 56% (60613/108237), 93.44 MiB | 30.32 MiB/s
Receiving objects: 57% (61696/108237), 93.44 MiB | 30.32 MiB/s
Receiving objects: 58% (62778/108237), 108.68 MiB | 30.34 MiB/s
Receiving objects: 59% (63860/108237), 108.68 MiB | 30.34 MiB/s
Receiving objects: 60% (64943/108237), 108.68 MiB | 30.34 MiB/s
Receiving objects: 60% (65219/108237), 108.68 MiB | 30.34 MiB/s
Receiving objects: 61% (66025/108237), 124.84 MiB | 30.38 MiB/s
Receiving objects: 62% (67107/108237), 124.84 MiB | 30.38 MiB/s
Receiving objects: 63% (68190/108237), 124.84 MiB | 30.38 MiB/s
Receiving objects: 63% (68373/108237), 141.35 MiB | 30.68 MiB/s
Receiving objects: 64% (69272/108237), 157.97 MiB | 30.71 MiB/s
Receiving objects: 64% (70317/108237), 191.39 MiB | 31.13 MiB/s
Receiving objects: 65% (70355/108237), 191.39 MiB | 31.13 MiB/s
Receiving objects: 65% (70415/108237), 208.67 MiB | 31.31 MiB/s
Receiving objects: 65% (70648/108237), 241.27 MiB | 32.28 MiB/s
Receiving objects: 66% (71437/108237), 258.81 MiB | 32.79 MiB/s
Receiving objects: 67% (72519/108237), 258.81 MiB | 32.79 MiB/s
Receiving objects: 68% (73602/108237), 258.81 MiB | 32.79 MiB/s
Receiving objects: 69% (74684/108237), 258.81 MiB | 32.79 MiB/s
Receiving objects: 70% (75766/108237), 274.64 MiB | 32.70 MiB/s
Receiving objects: 71% (76849/108237), 274.64 MiB | 32.70 MiB/s
Receiving objects: 71% (77710/108237), 274.64 MiB | 32.70 MiB/s
Receiving objects: 72% (77931/108237), 274.64 MiB | 32.70 MiB/s
Receiving objects: 73% (79014/108237), 274.64 MiB | 32.70 MiB/s
Receiving objects: 74% (80096/108237), 274.64 MiB | 32.70 MiB/s
Receiving objects: 75% (81178/108237), 274.64 MiB | 32.70 MiB/s
Receiving objects: 76% (82261/108237), 274.64 MiB | 32.70 MiB/s
Receiving objects: 77% (83343/108237), 274.64 MiB | 32.70 MiB/s
Receiving objects: 78% (84425/108237), 291.70 MiB | 32.81 MiB/s
Receiving objects: 79% (85508/108237), 291.70 MiB | 32.81 MiB/s
Receiving objects: 80% (86590/108237), 291.70 MiB | 32.81 MiB/s
Receiving objects: 81% (87672/108237), 291.70 MiB | 32.81 MiB/s
Receiving objects: 82% (88755/108237), 291.70 MiB | 32.81 MiB/s
Receiving objects: 82% (89121/108237), 308.87 MiB | 32.93 MiB/s
Receiving objects: 83% (89837/108237), 320.36 MiB | 31.63 MiB/s
Receiving objects: 84% (90920/108237), 320.36 MiB | 31.63 MiB/s
Receiving objects: 85% (92002/108237), 320.36 MiB | 31.63 MiB/s
Receiving objects: 86% (93084/108237), 335.87 MiB | 31.32 MiB/s
Receiving objects: 87% (94167/108237), 335.87 MiB | 31.32 MiB/s
Receiving objects: 87% (95226/108237), 335.87 MiB | 31.32 MiB/s
Receiving objects: 88% (95249/108237), 335.87 MiB | 31.32 MiB/s
Receiving objects: 88% (95713/108237), 367.37 MiB | 30.75 MiB/s
Receiving objects: 89% (96331/108237), 382.29 MiB | 30.01 MiB/s
Receiving objects: 90% (97414/108237), 382.29 MiB | 30.01 MiB/s
Receiving objects: 91% (98496/108237), 382.29 MiB | 30.01 MiB/s
Receiving objects: 92% (99579/108237), 382.29 MiB | 30.01 MiB/s
Receiving objects: 93% (100661/108237), 382.29 MiB | 30.01 MiB/s
Receiving objects: 94% (101743/108237), 382.29 MiB | 30.01 MiB/s
Receiving objects: 95% (102826/108237), 396.98 MiB | 29.40 MiB/s
Receiving objects: 96% (103908/108237), 396.98 MiB | 29.40 MiB/s
Receiving objects: 97% (104990/108237), 396.98 MiB | 29.40 MiB/s
Receiving objects: 98% (106073/108237), 396.98 MiB | 29.40 MiB/s
Receiving objects: 98% (106237/108237), 396.98 MiB | 29.40 MiB/s
Receiving objects: 99% (107155/108237), 396.98 MiB | 29.40 MiB/s
remote: Total 108237 (delta 10287), reused 9528 (delta 9476), pack-reused 96604 (from 1)
16.65 s
Receiving objects: 100% (108237/108237), 396.98 MiB | 29.40 MiB/s
Receiving objects: 100% (108237/108237), 404.46 MiB | 30.86 MiB/s, done.
19.81 s
Resolving deltas: 0% (0/72030)
Resolving deltas: 1% (721/72030)
Resolving deltas: 2% (1441/72030)
Resolving deltas: 3% (2161/72030)
Resolving deltas: 4% (2882/72030)
Resolving deltas: 5% (3602/72030)
Resolving deltas: 6% (4322/72030)
Resolving deltas: 7% (5043/72030)
Resolving deltas: 8% (5763/72030)
Resolving deltas: 9% (6483/72030)
Resolving deltas: 10% (7203/72030)
Resolving deltas: 11% (7924/72030)
Resolving deltas: 12% (8644/72030)
Resolving deltas: 13% (9364/72030)
Resolving deltas: 14% (10085/72030)
Resolving deltas: 15% (10805/72030)
Resolving deltas: 16% (11525/72030)
Resolving deltas: 17% (12246/72030)
Resolving deltas: 18% (12967/72030)
Resolving deltas: 19% (13686/72030)
Resolving deltas: 20% (14406/72030)
Resolving deltas: 21% (15127/72030)
Resolving deltas: 22% (15847/72030)
Resolving deltas: 23% (16567/72030)
Resolving deltas: 24% (17288/72030)
Resolving deltas: 25% (18009/72030)
Resolving deltas: 26% (18728/72030)
Resolving deltas: 27% (19453/72030)
Resolving deltas: 28% (20169/72030)
Resolving deltas: 29% (20889/72030)
Resolving deltas: 29% (21188/72030)
Resolving deltas: 30% (21610/72030)
Resolving deltas: 31% (22330/72030)
Resolving deltas: 32% (23050/72030)
Resolving deltas: 33% (23770/72030)
Resolving deltas: 34% (24491/72030)
Resolving deltas: 35% (25211/72030)
Resolving deltas: 36% (25931/72030)
Resolving deltas: 37% (26652/72030)
Resolving deltas: 38% (27372/72030)
Resolving deltas: 39% (28092/72030)
Resolving deltas: 40% (28812/72030)
Resolving deltas: 41% (29533/72030)
Resolving deltas: 42% (30253/72030)
Resolving deltas: 43% (30973/72030)
Resolving deltas: 44% (31694/72030)
Resolving deltas: 45% (32414/72030)
Resolving deltas: 46% (33134/72030)
Resolving deltas: 47% (33855/72030)
Resolving deltas: 48% (34575/72030)
Resolving deltas: 49% (35295/72030)
Resolving deltas: 50% (36015/72030)
Resolving deltas: 51% (36736/72030)
Resolving deltas: 52% (37456/72030)
Resolving deltas: 53% (38176/72030)
Resolving deltas: 54% (38897/72030)
Resolving deltas: 55% (39617/72030)
Resolving deltas: 56% (40337/72030)
Resolving deltas: 57% (41058/72030)
Resolving deltas: 58% (41778/72030)
Resolving deltas: 59% (42498/72030)
Resolving deltas: 60% (43218/72030)
Resolving deltas: 61% (43939/72030)
Resolving deltas: 62% (44659/72030)
Resolving deltas: 63% (45379/72030)
Resolving deltas: 64% (46100/72030)
Resolving deltas: 65% (46820/72030)
Resolving deltas: 65% (47159/72030)
Resolving deltas: 66% (47540/72030)
Resolving deltas: 67% (48261/72030)
Resolving deltas: 68% (48981/72030)
Resolving deltas: 69% (49701/72030)
Resolving deltas: 70% (50421/72030)
Resolving deltas: 71% (51142/72030)
Resolving deltas: 72% (51862/72030)
Resolving deltas: 73% (52582/72030)
Resolving deltas: 74% (53303/72030)
Resolving deltas: 75% (54023/72030)
Resolving deltas: 76% (54743/72030)
Resolving deltas: 77% (55464/72030)
Resolving deltas: 78% (56184/72030)
Resolving deltas: 79% (56904/72030)
Resolving deltas: 80% (57624/72030)
Resolving deltas: 81% (58345/72030)
Resolving deltas: 82% (59065/72030)
Resolving deltas: 83% (59785/72030)
Resolving deltas: 84% (60506/72030)
Resolving deltas: 85% (61226/72030)
Resolving deltas: 86% (61946/72030)
Resolving deltas: 87% (62667/72030)
Resolving deltas: 88% (63390/72030)
Resolving deltas: 89% (64107/72030)
Resolving deltas: 90% (64827/72030)
Resolving deltas: 91% (65548/72030)
Resolving deltas: 92% (66268/72030)
Resolving deltas: 93% (66988/72030)
Resolving deltas: 94% (67709/72030)
Resolving deltas: 95% (68429/72030)
Resolving deltas: 96% (69149/72030)
Resolving deltas: 97% (69870/72030)
Resolving deltas: 97% (70411/72030)
Resolving deltas: 98% (70590/72030)
Resolving deltas: 99% (71310/72030)
Resolving deltas: 100% (72030/72030)
Resolving deltas: 100% (72030/72030), done.
20.57 s
Fetching commit 44d1b86627a99f25ed3d9d1f88a3043a5575680c for finite_T_and_mu ...
20.57 s
$ /nix/store/5vpcfsdx1lcnlb2y4k7xyc74shp5qwbh-git-2.54.0/bin/git fetch origin 44d1b86627a99f25ed3d9d1f88a3043a5575680c
21.17 s
From https://github.com/alphal00p/gammaloop
21.17 s
* branch 44d1b86627a99f25ed3d9d1f88a3043a5575680c -> FETCH_HEAD
21.22 s
$ /nix/store/61685rbaxmpigwi3z23i33sv3jyfl70q-coreutils-9.11/bin/timeout --kill-after=15s 7200s /nix/store/5vpcfsdx1lcnlb2y4k7xyc74shp5qwbh-git-2.54.0/bin/git -c advice.detachedHead=false checkout 44d1b86627a99f25ed3d9d1f88a3043a5575680c
21.53 s
HEAD is now at 44d1b8662 adapt thermal test fixtures to graph validation
21.53 s
$ /nix/store/61685rbaxmpigwi3z23i33sv3jyfl70q-coreutils-9.11/bin/timeout --kill-after=15s 7200s /nix/store/wknkybkzrc16r11vk5vrykh4wmw7a353-nix-2.34.8/bin/nix --extra-experimental-features nix-command --extra-experimental-features flakes --log-format internal-json run .#packages.x86_64-linux.nix-ci-check-gammaloop-nextest-docs --print-build-logs
21.75 s
warning: ignoring untrusted flake configuration setting 'extra-substituters'.
21.75 s
Pass '--accept-flake-config' to trust it
21.75 s
warning: ignoring untrusted flake configuration setting 'extra-trusted-public-keys'.
21.75 s
Pass '--accept-flake-config' to trust it
28.05 s
28.31 s
do you want to allow configuration setting 'extra-substituters' to be set to 'https://cache.nix-ci.com ' (y/N)? do you want to permanently mark this value as untrusted (y/N)? warning: ignoring untrusted flake configuration setting 'extra-substituters'.
28.31 s
Pass '--accept-flake-config' to trust it
28.31 s
evaluating derivation 'gdo you want to allow configuration setting 'extra-trusted-public-keys' to be set to 'nix-ci:g3xV5BDTLtIBZr/A00IU1x0EtKKlb7YLgBN2SgYgM6A= ' (y/N)? do you want to permanently mark this value as untrusted (y/N)? warning: ignoring untrusted flake configuration setting 'extra-trusted-public-keys'.
28.31 s
Pass '--accept-flake-config' to trust it
42.57 s
copying '/nix/store/b5zm
evaluating derivation 'g
copying '/nix/store/b5zm
evaluating derivation 'g
copying '/nix/store/b5zm
evaluating derivation 'g
copying '/nix/store/b5zm
evaluating derivation 'g
copying '/nix/store/b5zm
evaluating derivation 'g
copying '/nix/store/b5zm
evaluating derivation 'g
copying '/nix/store/b5zm
evaluating derivation 'g
copying '/nix/store/b5zm
evaluating derivation 'g
querying source on https
[1 /0 /1 copied (368.0 KiB
[1 /0 /1 copied (3.6 /201.4
[1 /0 /1 copied (7.3 /201.4
[1 /0 /1 copied (10.9 /201.
[1 /0 /1 copied (14.5 /201.
[1 /0 /1 copied (19.1 /201.
[1 /0 /1 copied (22.6 /201.
[1 /0 /1 copied (25.5 /201.
[1 /0 /1 copied (32.9 /201.
[1 /0 /1 copied (35.3 /201.
[1 /0 /1 copied (37.2 /201.
[1 /0 /1 copied (38.7 /201.
[1 /0 /1 copied (40.5 /201.
[1 /0 /1 copied (42.3 /201.
[1 /0 /1 copied (43.8 /201.
[1 /0 /1 copied (46.4 /201.
[1 /0 /1 copied (47.4 /201.
[1 /0 /1 copied (49.1 /201.
[1 /0 /1 copied (50.3 /201.
[1 /0 /1 copied (51.5 /201.
[1 /0 /1 copied (53.3 /201.
[1 /0 /1 copied (54.4 /201.
[1 /0 /1 copied (56.1 /201.
[1 /0 /1 copied (58.1 /201.
[1 /0 /1 copied (60.1 /201.
[1 /0 /1 copied (61.8 /201.
[1 /0 /1 copied (63.2 /201.
[1 /0 /1 copied (64.4 /201.
[1 /0 /1 copied (65.3 /201.
[1 /0 /1 copied (66.7 /201.
[1 /0 /1 copied (68.4 /201.
[1 /0 /1 copied (70.4 /201.
[1 /0 /1 copied (72.1 /201.
[1 /0 /1 copied (73.3 /201.
[1 /0 /1 copied (74.1 /201.
[1 /0 /1 copied (74.9 /201.
[1 /0 /1 copied (75.9 /201.
[1 /0 /1 copied (77.6 /201.
[1 /0 /1 copied (79.8 /201.
[1 /0 /1 copied (81.9 /201.
[1 /0 /1 copied (84.4 /201.
[1 /0 /1 copied (86.3 /201.
[1 /0 /1 copied (87.7 /201.
[1 /0 /1 copied (89.1 /201.
[1 /0 /1 copied (90.8 /201.
[1 /0 /1 copied (92.6 /201.
[1 /0 /1 copied (95.8 /201.
[1 /0 /1 copied (97.2 /201.
[1 /0 /1 copied (99.1 /201.
[1 /0 /1 copied (101.4 /201
[1 /0 /1 copied (103.7 /201
[1 /0 /1 copied (105.6 /201
[1 /0 /1 copied (107.3 /201
[1 /0 /1 copied (108.6 /201
[1 /0 /1 copied (111.4 /201
[1 /0 /1 copied (114.2 /201
[1 /0 /1 copied (115.8 /201
[1 /0 /1 copied (117.3 /201
[1 /0 /1 copied (118.8 /201
[1 /0 /1 copied (130.2 /201
[1 /0 /1 copied (132.8 /201
[1 /0 /1 copied (145.2 /201
[1 /0 /1 copied (152.2 /201
[1 /0 /1 copied (157.9 /201
[1 /0 /1 copied (158.8 /201
[1 /0 /1 copied (160.3 /201
[1 /0 /1 copied (161.2 /201
[1 /0 /1 copied (162.0 /201
[1 /0 /1 copied (163.1 /201
[1 /0 /1 copied (164.0 /201
[1 /0 /1 copied (164.8 /201
[1 /0 /1 copied (165.6 /201
[1 /0 /1 copied (166.4 /201
[1 /0 /1 copied (167.3 /201
[1 /0 /1 copied (168.1 /201
[1 /0 /1 copied (169.1 /201
[1 /0 /1 copied (170.1 /201
[1 /0 /1 copied (170.9 /201
[1 /0 /1 copied (171.8 /201
[1 /0 /1 copied (172.8 /201
[1 /0 /1 copied (173.8 /201
[1 /0 /1 copied (174.7 /201
[1 /0 /1 copied (175.6 /201
[1 /0 /1 copied (176.6 /201
[1 /0 /1 copied (180.2 /201
[1 /0 /1 copied (187.5 /201
[1 /0 /1 copied (189.0 /201
[1 /0 /1 copied (190.6 /201
[1 /0 /1 copied (193.3 /201
[1 /0 /1 copied (199.6 /201
[1 /0 /1 copied (201.4 MiB
[1 copied (201.4 MiB), 4
48.99 s
[0 /14 built, 16 /1 /66 cop
[0 /14 built, 16 /14 /103 c
[0 /13 built, 16 /28 /103 c
[0 /10 built, 12 /40 /103 c
[0 /10 built, 10 /47 /103 c
[0 /10 built, 5 /53 /103 co
[0 /10 built, 5 /54 /103 co
[0 /10 built, 4 /56 /103 co
[0 /10 built, 16 /58 /103 c
[0 /10 built, 14 /66 /103 c
[0 /9 built, 14 /73 /103 co
[0 /9 built, 9 /80 /103 cop
[0 /9 built, 7 /86 /103 cop
[0 /9 built, 6 /89 /103 cop
[0 /9 built, 8 /90 /103 cop
[0 /9 built, 7 /92 /103 cop
[0 /8 built, 6 /93 /103 cop
[1 /0 /8 built, 6 /93 /103 cbuilder.pl> Running phase: patchPhase
49.00 s
builder.pl> Running phase: updateAutotoolsGnuConfigScriptsPhase
49.00 s
builder.pl> Running phase: configurePhase
49.01 s
builder.pl> no configure script, doing nothing
49.02 s
builder.pl> Running phase: buildPhase
49.02 s
builder.pl> Running phase: checkPhase
49.03 s
builder.pl> Running phase: installPhase
49.03 s
builder.pl> no Makefile or custom installPhase, doing nothing
49.04 s
builder.pl> Running phase: fixupPhase
49.05 s
builder.pl> shrinking RPATHs of ELF executables and libraries in /nix/store/zzmspl8wdn2a3ancrz8dg3kci887nw6d-builder.pl
49.05 s
builder.pl> checking for references to /build/ in /nix/store/zzmspl8wdn2a3ancrz8dg3kci887nw6d-builder.pl...
49.06 s
builder.pl> patching script interpreter paths in /nix/store/zzmspl8wdn2a3ancrz8dg3kci887nw6d-builder.pl
49.11 s
[1 /0 /8 built, 6 /94 /103 cbuilder.pl (post)> Uploading to the NixCI cache: /nix/store/zzmspl8wdn2a3ancrz8dg3kci887nw6d-builder.pl
49.17 s
builder.pl (post)> warning: 'warn-short-path-literals' is deprecated, use 'lint-short-path-literals = ignore' instead
49.21 s
builder.pl (post)> copying 0 paths...
49.29 s
builder.pl (post)> warning: 'warn-short-path-literals' is deprecated, use 'lint-short-path-literals = ignore' instead
49.42 s
builder.pl (post)> copying 0 paths...
50.96 s
[1 /6 built, 3 /97 /103 cop
[1 /6 built, 3 /98 /103 cop
[1 /5 built, 2 /99 /103 cop
[1 /5 built, 2 /100 /103 co
[1 /4 built, 1 /102 /103 co
[1 /3 built, 103 copied (typst> structuredAttrs is enabled
51.05 s
[1 /1 /3 built, 103 copiedtypst> created 4 symlinks in user environment
51.19 s
typst (post)> Uploading to the NixCI cache: /nix/store/yc93gbspdkf53nwjsf1mbydbsaq9snxl-typst-0.15.1-env
51.24 s
typst (post)> warning: 'warn-short-path-literals' is deprecated, use 'lint-short-path-literals = ignore' instead
51.27 s
typst (post)> copying 0 paths...
51.34 s
typst (post)> warning: 'warn-short-path-literals' is deprecated, use 'lint-short-path-literals = ignore' instead
51.60 s
typst (post)> copying 0 paths...
52.13 s
[2 /4 built, 103 copied (
[1 /2 /3 built, 103 copiedgammaloop-nextest-docs> Extracting 2 binaries to /build/source
52.18 s
gammaloop-nextest-docs> Extracted 5 files to /build/source in 0.05s
52.19 s
gammaloop-nextest-docs> ------------
52.19 s
gammaloop-nextest-docs> Nextest run ID e8090b7c-6764-4ba5-acc2-992b843cf876 with nextest profile: ci_gammaloop
52.19 s
gammaloop-nextest-docs> Starting 129 tests across 2 binaries
52.22 s
gammaloop-nextest-docs> FAIL [ 0.021s] ( 14/129) alphal00p-docs-builder tests :: checked_in_registry_is_valid
52.22 s
gammaloop-nextest-docs> stdout ---
52.22 s
gammaloop-nextest-docs>
52.22 s
gammaloop-nextest-docs> running 1 test
52.22 s
gammaloop-nextest-docs> test tests::checked_in_registry_is_valid ... FAILED
52.22 s
gammaloop-nextest-docs>
52.22 s
gammaloop-nextest-docs> failures:
52.22 s
gammaloop-nextest-docs>
52.22 s
gammaloop-nextest-docs> failures:
52.22 s
gammaloop-nextest-docs> tests::checked_in_registry_is_valid
52.22 s
gammaloop-nextest-docs>
52.22 s
gammaloop-nextest-docs> test result: FAILED. 0 passed; 1 failed; 0 ignored; 0 measured; 128 filtered out; finished in 0.01s
52.22 s
gammaloop-nextest-docs>
52.22 s
gammaloop-nextest-docs> stderr ---
52.22 s
gammaloop-nextest-docs>
52.22 s
gammaloop-nextest-docs> thread 'tests::checked_in_registry_is_valid' (194) panicked at crates/alphal00p-docs-builder/src/lib.rs:12178:50:
52.22 s
gammaloop-nextest-docs> called `Result::unwrap()` on an `Err` value: developer note gammaloop-architecture verified scope crates/gammaloop-api/src/commands/integrate.rs changed (expected 0cce8b9517824d09e6199882611aec7d213b638d, found 2d30848b04c82fa24ded354176ba9651792c6bcc); owner review or an explicit no-impact attestation is required
52.22 s
gammaloop-nextest-docs>
52.22 s
gammaloop-nextest-docs> Location:
52.22 s
gammaloop-nextest-docs> crates/alphal00p-docs-builder/src/lib.rs:992:29
52.22 s
gammaloop-nextest-docs> stack backtrace:
52.22 s
gammaloop-nextest-docs> 0: __rustc::rust_begin_unwind
52.22 s
gammaloop-nextest-docs> 1: core::panicking::panic_fmt
52.22 s
gammaloop-nextest-docs> 2: core::result::unwrap_failed
52.22 s
gammaloop-nextest-docs> 3: alphal00p_docs_builder::tests::checked_in_registry_is_valid
52.22 s
gammaloop-nextest-docs> 4: <alphal00p_docs_builder::tests::checked_in_registry_is_valid::{closure#0} as core::ops::function::FnOnce<()>>::call_once
52.22 s
gammaloop-nextest-docs> note: Some details are omitted, run with `RUST_BACKTRACE=full` for a verbose backtrace.
52.22 s
gammaloop-nextest-docs>
52.24 s
gammaloop-nextest-docs> FAIL [ 0.018s] ( 26/129) alphal00p-docs-builder tests :: developer_scope_ranges_ignore_unrelated_edits_and_warn_only_while_watching
52.24 s
gammaloop-nextest-docs> stdout ---
52.24 s
gammaloop-nextest-docs>
52.24 s
gammaloop-nextest-docs> running 1 test
52.24 s
gammaloop-nextest-docs> test tests::developer_scope_ranges_ignore_unrelated_edits_and_warn_only_while_watching ... FAILED
52.24 s
gammaloop-nextest-docs>
52.24 s
gammaloop-nextest-docs> failures:
52.24 s
gammaloop-nextest-docs>
52.24 s
gammaloop-nextest-docs> failures:
52.24 s
gammaloop-nextest-docs> tests::developer_scope_ranges_ignore_unrelated_edits_and_warn_only_while_watching
52.24 s
gammaloop-nextest-docs>
52.24 s
gammaloop-nextest-docs> test result: FAILED. 0 passed; 1 failed; 0 ignored; 0 measured; 128 filtered out; finished in 0.01s
52.24 s
gammaloop-nextest-docs>
52.24 s
gammaloop-nextest-docs> stderr ---
52.24 s
gammaloop-nextest-docs>
52.24 s
gammaloop-nextest-docs> thread 'tests::developer_scope_ranges_ignore_unrelated_edits_and_warn_only_while_watching' (278) panicked at crates/alphal00p-docs-builder/src/lib.rs:12263:29:
52.24 s
gammaloop-nextest-docs> called `Result::unwrap()` on an `Err` value: developer note gammaloop-architecture verified scope crates/gammaloop-api/src/commands/integrate.rs changed (expected 0cce8b9517824d09e6199882611aec7d213b638d, found 2d30848b04c82fa24ded354176ba9651792c6bcc); owner review or an explicit no-impact attestation is required
52.24 s
gammaloop-nextest-docs>
52.24 s
gammaloop-nextest-docs> Location:
52.24 s
gammaloop-nextest-docs> crates/alphal00p-docs-builder/src/lib.rs:992:29
52.24 s
gammaloop-nextest-docs> stack backtrace:
52.24 s
gammaloop-nextest-docs> 0: __rustc::rust_begin_unwind
52.24 s
gammaloop-nextest-docs> 1: core::panicking::panic_fmt
52.24 s
gammaloop-nextest-docs> 2: core::result::unwrap_failed
52.24 s
gammaloop-nextest-docs> 3: alphal00p_docs_builder::tests::developer_scope_ranges_ignore_unrelated_edits_and_warn_only_while_watching
52.24 s
gammaloop-nextest-docs> 4: <alphal00p_docs_builder::tests::developer_scope_ranges_ignore_unrelated_edits_and_warn_only_while_watching::{closure#0} as core::ops::function::FnOnce<()>>::call_once
52.24 s
gammaloop-nextest-docs> note: Some details are omitted, run with `RUST_BACKTRACE=full` for a verbose backtrace.
52.24 s
gammaloop-nextest-docs>
52.24 s
gammaloop-nextest-docs> FAIL [ 0.041s] ( 27/129) alphal00p-docs-builder provenance_tests :: each_build_captures_one_revision_before_rendering
52.24 s
gammaloop-nextest-docs> stdout ---
52.24 s
gammaloop-nextest-docs>
52.24 s
gammaloop-nextest-docs> running 1 test
52.24 s
gammaloop-nextest-docs>
52.24 s
gammaloop-nextest-docs> running 1 test
52.24 s
gammaloop-nextest-docs> test provenance_tests::each_build_captures_one_revision_before_rendering ... FAILED
52.24 s
gammaloop-nextest-docs>
52.24 s
gammaloop-nextest-docs> failures:
52.24 s
gammaloop-nextest-docs>
52.24 s
gammaloop-nextest-docs> failures:
52.24 s
gammaloop-nextest-docs> provenance_tests::each_build_captures_one_revision_before_rendering
52.24 s
gammaloop-nextest-docs>
52.24 s
gammaloop-nextest-docs> test result: FAILED. 0 passed; 1 failed; 0 ignored; 0 measured; 128 filtered out; finished in 0.02s
52.24 s
gammaloop-nextest-docs>
52.24 s
gammaloop-nextest-docs> test provenance_tests::each_build_captures_one_revision_before_rendering ... FAILED
52.24 s
gammaloop-nextest-docs>
52.24 s
gammaloop-nextest-docs> failures:
52.24 s
gammaloop-nextest-docs>
52.24 s
gammaloop-nextest-docs> failures:
52.24 s
gammaloop-nextest-docs> provenance_tests::each_build_captures_one_revision_before_rendering
52.24 s
gammaloop-nextest-docs>
52.24 s
gammaloop-nextest-docs> test result: FAILED. 0 passed; 1 failed; 0 ignored; 0 measured; 128 filtered out; finished in 0.03s
52.24 s
gammaloop-nextest-docs>
52.24 s
gammaloop-nextest-docs> stderr ---
52.24 s
gammaloop-nextest-docs>
52.24 s
gammaloop-nextest-docs> thread 'provenance_tests::each_build_captures_one_revision_before_rendering' (234) panicked at crates/alphal00p-docs-builder/src/provenance_tests.rs:297:14:
52.24 s
gammaloop-nextest-docs> called `Result::unwrap()` on an `Err` value: developer note gammaloop-architecture verified scope crates/gammaloop-api/src/commands/integrate.rs changed (expected 0cce8b9517824d09e6199882611aec7d213b638d, found 2d30848b04c82fa24ded354176ba9651792c6bcc); owner review or an explicit no-impact attestation is required
52.24 s
gammaloop-nextest-docs>
52.24 s
gammaloop-nextest-docs> Location:
52.24 s
gammaloop-nextest-docs> crates/alphal00p-docs-builder/src/lib.rs:992:29
52.24 s
gammaloop-nextest-docs> stack backtrace:
52.24 s
gammaloop-nextest-docs> 0: __rustc::rust_begin_unwind
52.24 s
gammaloop-nextest-docs> 1: core::panicking::panic_fmt
52.24 s
gammaloop-nextest-docs> 2: core::result::unwrap_failed
52.24 s
gammaloop-nextest-docs> 3: alphal00p_docs_builder::provenance_tests::each_build_captures_one_revision_before_rendering
52.24 s
gammaloop-nextest-docs> 4: <alphal00p_docs_builder::provenance_tests::each_build_captures_one_revision_before_rendering::{closure#0} as core::ops::function::FnOnce<()>>::call_once
52.24 s
gammaloop-nextest-docs> note: Some details are omitted, run with `RUST_BACKTRACE=full` for a verbose backtrace.
52.24 s
gammaloop-nextest-docs>
52.24 s
gammaloop-nextest-docs> thread 'provenance_tests::each_build_captures_one_revision_before_rendering' (168) panicked at crates/alphal00p-docs-builder/src/provenance_tests.rs:274:9:
52.24 s
gammaloop-nextest-docs> assertion failed: command.status().unwrap().success()
52.24 s
gammaloop-nextest-docs> stack backtrace:
52.24 s
gammaloop-nextest-docs> 0: __rustc::rust_begin_unwind
52.24 s
gammaloop-nextest-docs> 1: core::panicking::panic_fmt
52.24 s
gammaloop-nextest-docs> 2: core::panicking::panic
52.24 s
gammaloop-nextest-docs> 3: alphal00p_docs_builder::provenance_tests::each_build_captures_one_revision_before_rendering
52.24 s
gammaloop-nextest-docs> 4: <alphal00p_docs_builder::provenance_tests::each_build_captures_one_revision_before_rendering::{closure#0} as core::ops::function::FnOnce<()>>::call_once
52.24 s
gammaloop-nextest-docs> note: Some details are omitted, run with `RUST_BACKTRACE=full` for a verbose backtrace.
52.24 s
gammaloop-nextest-docs>
52.26 s
gammaloop-nextest-docs> FAIL [ 0.023s] ( 37/129) alphal00p-docs-builder tests :: every_product_requires_a_task_chooser_and_each_supported_interface
52.26 s
gammaloop-nextest-docs> stdout ---
52.26 s
gammaloop-nextest-docs>
52.26 s
gammaloop-nextest-docs> running 1 test
52.26 s
gammaloop-nextest-docs> test tests::every_product_requires_a_task_chooser_and_each_supported_interface ... FAILED
52.26 s
gammaloop-nextest-docs>
52.26 s
gammaloop-nextest-docs> failures:
52.26 s
gammaloop-nextest-docs>
52.26 s
gammaloop-nextest-docs> failures:
52.26 s
gammaloop-nextest-docs> tests::every_product_requires_a_task_chooser_and_each_supported_interface
52.26 s
gammaloop-nextest-docs>
52.26 s
gammaloop-nextest-docs> test result: FAILED. 0 passed; 1 failed; 0 ignored; 0 measured; 128 filtered out; finished in 0.02s
52.26 s
gammaloop-nextest-docs>
52.26 s
gammaloop-nextest-docs> stderr ---
52.26 s
gammaloop-nextest-docs>
52.26 s
gammaloop-nextest-docs> thread 'tests::every_product_requires_a_task_chooser_and_each_supported_interface' (301) panicked at crates/alphal00p-docs-builder/src/lib.rs:12192:9:
52.26 s
gammaloop-nextest-docs> assertion failed: format!("{error:#}").contains("has no quickstart page")
52.26 s
gammaloop-nextest-docs> stack backtrace:
52.26 s
gammaloop-nextest-docs> 0: __rustc::rust_begin_unwind
52.26 s
gammaloop-nextest-docs> 1: core::panicking::panic_fmt
52.26 s
gammaloop-nextest-docs> 2: core::panicking::panic
52.26 s
gammaloop-nextest-docs> 3: alphal00p_docs_builder::tests::every_product_requires_a_task_chooser_and_each_supported_interface
52.26 s
gammaloop-nextest-docs> 4: <alphal00p_docs_builder::tests::every_product_requires_a_task_chooser_and_each_supported_interface::{closure#0} as core::ops::function::FnOnce<()>>::call_once
52.26 s
gammaloop-nextest-docs> note: Some details are omitted, run with `RUST_BACKTRACE=full` for a verbose backtrace.
52.26 s
gammaloop-nextest-docs>
52.30 s
gammaloop-nextest-docs> FAIL [ 0.029s] ( 59/129) alphal00p-docs-builder tests :: pdf_manual_chapter_order_must_match_the_page_registry
52.30 s
gammaloop-nextest-docs> stdout ---
52.30 s
gammaloop-nextest-docs>
52.30 s
gammaloop-nextest-docs> running 1 test
52.30 s
gammaloop-nextest-docs> test tests::pdf_manual_chapter_order_must_match_the_page_registry ... FAILED
52.30 s
gammaloop-nextest-docs>
52.30 s
gammaloop-nextest-docs> failures:
52.30 s
gammaloop-nextest-docs>
52.30 s
gammaloop-nextest-docs> failures:
52.30 s
gammaloop-nextest-docs> tests::pdf_manual_chapter_order_must_match_the_page_registry
52.30 s
gammaloop-nextest-docs>
52.30 s
gammaloop-nextest-docs> test result: FAILED. 0 passed; 1 failed; 0 ignored; 0 measured; 128 filtered out; finished in 0.02s
52.30 s
gammaloop-nextest-docs>
52.30 s
gammaloop-nextest-docs> stderr ---
52.30 s
gammaloop-nextest-docs>
52.30 s
gammaloop-nextest-docs> thread 'tests::pdf_manual_chapter_order_must_match_the_page_registry' (353) panicked at crates/alphal00p-docs-builder/src/lib.rs:12243:9:
52.30 s
gammaloop-nextest-docs> assertion failed: format!("{error:#}").contains("PDF manual chapter order differs")
52.30 s
gammaloop-nextest-docs> stack backtrace:
52.30 s
gammaloop-nextest-docs> 0: __rustc::rust_begin_unwind
52.30 s
gammaloop-nextest-docs> 1: core::panicking::panic_fmt
52.30 s
gammaloop-nextest-docs> 2: core::panicking::panic
52.30 s
gammaloop-nextest-docs> 3: alphal00p_docs_builder::tests::pdf_manual_chapter_order_must_match_the_page_registry
52.30 s
gammaloop-nextest-docs> 4: <alphal00p_docs_builder::tests::pdf_manual_chapter_order_must_match_the_page_registry::{closure#0} as core::ops::function::FnOnce<()>>::call_once
52.30 s
gammaloop-nextest-docs> note: Some details are omitted, run with `RUST_BACKTRACE=full` for a verbose backtrace.
52.30 s
gammaloop-nextest-docs>
75.02 s
gammaloop-nextest-docs> ------------
75.02 s
gammaloop-nextest-docs> Summary [ 22.824s] 129 tests run: 124 passed , 5 failed , 0 skipped
75.02 s
gammaloop-nextest-docs> FAIL [ 0.021s] ( 14/129) alphal00p-docs-builder tests :: checked_in_registry_is_valid
75.02 s
gammaloop-nextest-docs> stdout ---
75.02 s
gammaloop-nextest-docs>
75.02 s
gammaloop-nextest-docs> running 1 test
75.02 s
gammaloop-nextest-docs> test tests::checked_in_registry_is_valid ... FAILED
75.02 s
gammaloop-nextest-docs>
75.02 s
gammaloop-nextest-docs> failures:
75.02 s
gammaloop-nextest-docs>
75.02 s
gammaloop-nextest-docs> failures:
75.02 s
gammaloop-nextest-docs> tests::checked_in_registry_is_valid
75.02 s
gammaloop-nextest-docs>
75.02 s
gammaloop-nextest-docs> test result: FAILED. 0 passed; 1 failed; 0 ignored; 0 measured; 128 filtered out; finished in 0.01s
75.02 s
gammaloop-nextest-docs>
75.02 s
gammaloop-nextest-docs> stderr ---
75.02 s
gammaloop-nextest-docs>
75.02 s
gammaloop-nextest-docs> thread 'tests::checked_in_registry_is_valid' (194) panicked at crates/alphal00p-docs-builder/src/lib.rs:12178:50:
75.02 s
gammaloop-nextest-docs> called `Result::unwrap()` on an `Err` value: developer note gammaloop-architecture verified scope crates/gammaloop-api/src/commands/integrate.rs changed (expected 0cce8b9517824d09e6199882611aec7d213b638d, found 2d30848b04c82fa24ded354176ba9651792c6bcc); owner review or an explicit no-impact attestation is required
75.02 s
gammaloop-nextest-docs>
75.02 s
gammaloop-nextest-docs> Location:
75.02 s
gammaloop-nextest-docs> crates/alphal00p-docs-builder/src/lib.rs:992:29
75.02 s
gammaloop-nextest-docs> stack backtrace:
75.02 s
gammaloop-nextest-docs> 0: __rustc::rust_begin_unwind
75.02 s
gammaloop-nextest-docs> 1: core::panicking::panic_fmt
75.02 s
gammaloop-nextest-docs> 2: core::result::unwrap_failed
75.02 s
gammaloop-nextest-docs> 3: alphal00p_docs_builder::tests::checked_in_registry_is_valid
75.02 s
gammaloop-nextest-docs> 4: <alphal00p_docs_builder::tests::checked_in_registry_is_valid::{closure#0} as core::ops::function::FnOnce<()>>::call_once
75.02 s
gammaloop-nextest-docs> note: Some details are omitted, run with `RUST_BACKTRACE=full` for a verbose backtrace.
75.02 s
gammaloop-nextest-docs>
75.02 s
gammaloop-nextest-docs> FAIL [ 0.018s] ( 26/129) alphal00p-docs-builder tests :: developer_scope_ranges_ignore_unrelated_edits_and_warn_only_while_watching
75.02 s
gammaloop-nextest-docs> stdout ---
75.02 s
gammaloop-nextest-docs>
75.02 s
gammaloop-nextest-docs> running 1 test
75.02 s
gammaloop-nextest-docs> test tests::developer_scope_ranges_ignore_unrelated_edits_and_warn_only_while_watching ... FAILED
75.02 s
gammaloop-nextest-docs>
75.02 s
gammaloop-nextest-docs> failures:
75.02 s
gammaloop-nextest-docs>
75.02 s
gammaloop-nextest-docs> failures:
75.02 s
gammaloop-nextest-docs> tests::developer_scope_ranges_ignore_unrelated_edits_and_warn_only_while_watching
75.02 s
gammaloop-nextest-docs>
75.02 s
gammaloop-nextest-docs> test result: FAILED. 0 passed; 1 failed; 0 ignored; 0 measured; 128 filtered out; finished in 0.01s
75.02 s
gammaloop-nextest-docs>
75.02 s
gammaloop-nextest-docs> stderr ---
75.02 s
gammaloop-nextest-docs>
75.02 s
gammaloop-nextest-docs> thread 'tests::developer_scope_ranges_ignore_unrelated_edits_and_warn_only_while_watching' (278) panicked at crates/alphal00p-docs-builder/src/lib.rs:12263:29:
75.02 s
gammaloop-nextest-docs> called `Result::unwrap()` on an `Err` value: developer note gammaloop-architecture verified scope crates/gammaloop-api/src/commands/integrate.rs changed (expected 0cce8b9517824d09e6199882611aec7d213b638d, found 2d30848b04c82fa24ded354176ba9651792c6bcc); owner review or an explicit no-impact attestation is required
75.02 s
gammaloop-nextest-docs>
75.02 s
gammaloop-nextest-docs> Location:
75.02 s
gammaloop-nextest-docs> crates/alphal00p-docs-builder/src/lib.rs:992:29
75.02 s
gammaloop-nextest-docs> stack backtrace:
75.02 s
gammaloop-nextest-docs> 0: __rustc::rust_begin_unwind
75.02 s
gammaloop-nextest-docs> 1: core::panicking::panic_fmt
75.02 s
gammaloop-nextest-docs> 2: core::result::unwrap_failed
75.02 s
gammaloop-nextest-docs> 3: alphal00p_docs_builder::tests::developer_scope_ranges_ignore_unrelated_edits_and_warn_only_while_watching
75.02 s
gammaloop-nextest-docs> 4: <alphal00p_docs_builder::tests::developer_scope_ranges_ignore_unrelated_edits_and_warn_only_while_watching::{closure#0} as core::ops::function::FnOnce<()>>::call_once
75.02 s
gammaloop-nextest-docs> note: Some details are omitted, run with `RUST_BACKTRACE=full` for a verbose backtrace.
75.02 s
gammaloop-nextest-docs>
75.02 s
gammaloop-nextest-docs> FAIL [ 0.041s] ( 27/129) alphal00p-docs-builder provenance_tests :: each_build_captures_one_revision_before_rendering
75.02 s
gammaloop-nextest-docs> stdout ---
75.02 s
gammaloop-nextest-docs>
75.02 s
gammaloop-nextest-docs> running 1 test
75.02 s
gammaloop-nextest-docs>
75.02 s
gammaloop-nextest-docs> running 1 test
75.02 s
gammaloop-nextest-docs> test provenance_tests::each_build_captures_one_revision_before_rendering ... FAILED
75.02 s
gammaloop-nextest-docs>
75.02 s
gammaloop-nextest-docs> failures:
75.02 s
gammaloop-nextest-docs>
75.02 s
gammaloop-nextest-docs> failures:
75.02 s
gammaloop-nextest-docs> provenance_tests::each_build_captures_one_revision_before_rendering
75.02 s
gammaloop-nextest-docs>
75.02 s
gammaloop-nextest-docs> test result: FAILED. 0 passed; 1 failed; 0 ignored; 0 measured; 128 filtered out; finished in 0.02s
75.02 s
gammaloop-nextest-docs>
75.02 s
gammaloop-nextest-docs> test provenance_tests::each_build_captures_one_revision_before_rendering ... FAILED
75.02 s
gammaloop-nextest-docs>
75.02 s
gammaloop-nextest-docs> failures:
75.02 s
gammaloop-nextest-docs>
75.02 s
gammaloop-nextest-docs> failures:
75.02 s
gammaloop-nextest-docs> provenance_tests::each_build_captures_one_revision_before_rendering
75.02 s
gammaloop-nextest-docs>
75.02 s
gammaloop-nextest-docs> test result: FAILED. 0 passed; 1 failed; 0 ignored; 0 measured; 128 filtered out; finished in 0.03s
75.02 s
gammaloop-nextest-docs>
75.02 s
gammaloop-nextest-docs> stderr ---
75.02 s
gammaloop-nextest-docs>
75.02 s
gammaloop-nextest-docs> thread 'provenance_tests::each_build_captures_one_revision_before_rendering' (234) panicked at crates/alphal00p-docs-builder/src/provenance_tests.rs:297:14:
75.02 s
gammaloop-nextest-docs> called `Result::unwrap()` on an `Err` value: developer note gammaloop-architecture verified scope crates/gammaloop-api/src/commands/integrate.rs changed (expected 0cce8b9517824d09e6199882611aec7d213b638d, found 2d30848b04c82fa24ded354176ba9651792c6bcc); owner review or an explicit no-impact attestation is required
75.02 s
gammaloop-nextest-docs>
75.02 s
gammaloop-nextest-docs> Location:
75.02 s
gammaloop-nextest-docs> crates/alphal00p-docs-builder/src/lib.rs:992:29
75.02 s
gammaloop-nextest-docs> stack backtrace:
75.02 s
gammaloop-nextest-docs> 0: __rustc::rust_begin_unwind
75.02 s
gammaloop-nextest-docs> 1: core::panicking::panic_fmt
75.02 s
gammaloop-nextest-docs> 2: core::result::unwrap_failed
75.02 s
gammaloop-nextest-docs> 3: alphal00p_docs_builder::provenance_tests::each_build_captures_one_revision_before_rendering
75.02 s
gammaloop-nextest-docs> 4: <alphal00p_docs_builder::provenance_tests::each_build_captures_one_revision_before_rendering::{closure#0} as core::ops::function::FnOnce<()>>::call_once
75.02 s
gammaloop-nextest-docs> note: Some details are omitted, run with `RUST_BACKTRACE=full` for a verbose backtrace.
75.02 s
gammaloop-nextest-docs>
75.02 s
gammaloop-nextest-docs> thread 'provenance_tests::each_build_captures_one_revision_before_rendering' (168) panicked at crates/alphal00p-docs-builder/src/provenance_tests.rs:274:9:
75.02 s
gammaloop-nextest-docs> assertion failed: command.status().unwrap().success()
75.02 s
gammaloop-nextest-docs> stack backtrace:
75.02 s
gammaloop-nextest-docs> 0: __rustc::rust_begin_unwind
75.02 s
gammaloop-nextest-docs> 1: core::panicking::panic_fmt
75.02 s
gammaloop-nextest-docs> 2: core::panicking::panic
75.02 s
gammaloop-nextest-docs> 3: alphal00p_docs_builder::provenance_tests::each_build_captures_one_revision_before_rendering
75.02 s
gammaloop-nextest-docs> 4: <alphal00p_docs_builder::provenance_tests::each_build_captures_one_revision_before_rendering::{closure#0} as core::ops::function::FnOnce<()>>::call_once
75.02 s
gammaloop-nextest-docs> note: Some details are omitted, run with `RUST_BACKTRACE=full` for a verbose backtrace.
75.02 s
gammaloop-nextest-docs>
75.02 s
gammaloop-nextest-docs> FAIL [ 0.023s] ( 37/129) alphal00p-docs-builder tests :: every_product_requires_a_task_chooser_and_each_supported_interface
75.02 s
gammaloop-nextest-docs> stdout ---
75.02 s
gammaloop-nextest-docs>
75.02 s
gammaloop-nextest-docs> running 1 test
75.02 s
gammaloop-nextest-docs> test tests::every_product_requires_a_task_chooser_and_each_supported_interface ... FAILED
75.02 s
gammaloop-nextest-docs>
75.02 s
gammaloop-nextest-docs> failures:
75.02 s
gammaloop-nextest-docs>
75.02 s
gammaloop-nextest-docs> failures:
75.02 s
gammaloop-nextest-docs> tests::every_product_requires_a_task_chooser_and_each_supported_interface
75.02 s
gammaloop-nextest-docs>
75.02 s
gammaloop-nextest-docs> test result: FAILED. 0 passed; 1 failed; 0 ignored; 0 measured; 128 filtered out; finished in 0.02s
75.02 s
gammaloop-nextest-docs>
75.02 s
gammaloop-nextest-docs> stderr ---
75.02 s
gammaloop-nextest-docs>
75.02 s
gammaloop-nextest-docs> thread 'tests::every_product_requires_a_task_chooser_and_each_supported_interface' (301) panicked at crates/alphal00p-docs-builder/src/lib.rs:12192:9:
75.02 s
gammaloop-nextest-docs> assertion failed: format!("{error:#}").contains("has no quickstart page")
75.02 s
gammaloop-nextest-docs> stack backtrace:
75.02 s
gammaloop-nextest-docs> 0: __rustc::rust_begin_unwind
75.02 s
gammaloop-nextest-docs> 1: core::panicking::panic_fmt
75.02 s
gammaloop-nextest-docs> 2: core::panicking::panic
75.02 s
gammaloop-nextest-docs> 3: alphal00p_docs_builder::tests::every_product_requires_a_task_chooser_and_each_supported_interface
75.02 s
gammaloop-nextest-docs> 4: <alphal00p_docs_builder::tests::every_product_requires_a_task_chooser_and_each_supported_interface::{closure#0} as core::ops::function::FnOnce<()>>::call_once
75.02 s
gammaloop-nextest-docs> note: Some details are omitted, run with `RUST_BACKTRACE=full` for a verbose backtrace.
75.02 s
gammaloop-nextest-docs>
75.02 s
gammaloop-nextest-docs> FAIL [ 0.029s] ( 59/129) alphal00p-docs-builder tests :: pdf_manual_chapter_order_must_match_the_page_registry
75.02 s
gammaloop-nextest-docs> stdout ---
75.02 s
gammaloop-nextest-docs>
75.02 s
gammaloop-nextest-docs> running 1 test
75.02 s
gammaloop-nextest-docs> test tests::pdf_manual_chapter_order_must_match_the_page_registry ... FAILED
75.02 s
gammaloop-nextest-docs>
75.02 s
gammaloop-nextest-docs> failures:
75.02 s
gammaloop-nextest-docs>
75.02 s
gammaloop-nextest-docs> failures:
75.02 s
gammaloop-nextest-docs> tests::pdf_manual_chapter_order_must_match_the_page_registry
75.02 s
gammaloop-nextest-docs>
75.02 s
gammaloop-nextest-docs> test result: FAILED. 0 passed; 1 failed; 0 ignored; 0 measured; 128 filtered out; finished in 0.02s
75.02 s
gammaloop-nextest-docs>
75.02 s
gammaloop-nextest-docs> stderr ---
75.02 s
gammaloop-nextest-docs>
75.02 s
gammaloop-nextest-docs> thread 'tests::pdf_manual_chapter_order_must_match_the_page_registry' (353) panicked at crates/alphal00p-docs-builder/src/lib.rs:12243:9:
75.02 s
gammaloop-nextest-docs> assertion failed: format!("{error:#}").contains("PDF manual chapter order differs")
75.02 s
gammaloop-nextest-docs> stack backtrace:
75.02 s
gammaloop-nextest-docs> 0: __rustc::rust_begin_unwind
75.02 s
gammaloop-nextest-docs> 1: core::panicking::panic_fmt
75.02 s
gammaloop-nextest-docs> 2: core::panicking::panic
75.02 s
gammaloop-nextest-docs> 3: alphal00p_docs_builder::tests::pdf_manual_chapter_order_must_match_the_page_registry
75.02 s
gammaloop-nextest-docs> 4: <alphal00p_docs_builder::tests::pdf_manual_chapter_order_must_match_the_page_registry::{closure#0} as core::ops::function::FnOnce<()>>::call_once
75.02 s
gammaloop-nextest-docs> note: Some details are omitted, run with `RUST_BACKTRACE=full` for a verbose backtrace.
75.02 s
gammaloop-nextest-docs>
75.03 s
gammaloop-nextest-docs> error : test run failed
75.06 s
gammaloop-nextest-docs>
75.06 s
gammaloop-nextest-docs> ========== nextest test summary ==========
75.06 s
gammaloop-nextest-docs> report: target/nextest/ci_gammaloop/junit.xml
75.06 s
gammaloop-nextest-docs> tests: 129, failures: 5, errors: 0
75.06 s
gammaloop-nextest-docs>
75.06 s
gammaloop-nextest-docs> 1. alphal00p-docs-builder::tests::checked_in_registry_is_valid
75.06 s
gammaloop-nextest-docs> failure: test failure with exit code 101
75.06 s
gammaloop-nextest-docs> thread 'tests::checked_in_registry_is_valid' (194) panicked at crates/alphal00p-docs-builder/src/lib.rs:12178:50:
75.06 s
gammaloop-nextest-docs> called `Result::unwrap()` on an `Err` value: developer note gammaloop-architecture verified scope crates/gammaloop-api/src/commands/integrate.rs changed (expected 0cce8b9517824d09e6199882611aec7d213b638d, found 2d30848b04c82fa24ded354176ba9651792c6bcc); owner review or an explicit no-impact attestation is required
75.06 s
gammaloop-nextest-docs>
75.06 s
gammaloop-nextest-docs> Location:
75.06 s
gammaloop-nextest-docs> crates/alphal00p-docs-builder/src/lib.rs:992:29
75.06 s
gammaloop-nextest-docs> stack backtrace:
75.06 s
gammaloop-nextest-docs> 0: __rustc::rust_begin_unwind
75.06 s
gammaloop-nextest-docs> 1: core::panicking::panic_fmt
75.06 s
gammaloop-nextest-docs> 2: core::result::unwrap_failed
75.06 s
gammaloop-nextest-docs> 3: alphal00p_docs_builder::tests::checked_in_registry_is_valid
75.06 s
gammaloop-nextest-docs> 4: <alphal00p_docs_builder::tests::checked_in_registry_is_valid::{closure#0} as core::ops::function::FnOnce<()>>::call_once
75.06 s
gammaloop-nextest-docs> note: Some details are omitted, run with `RUST_BACKTRACE=full` for a verbose backtrace.
75.06 s
gammaloop-nextest-docs> system-out
75.06 s
gammaloop-nextest-docs> running 1 test
75.06 s
gammaloop-nextest-docs> test tests::checked_in_registry_is_valid ... FAILED
75.06 s
gammaloop-nextest-docs>
75.06 s
gammaloop-nextest-docs> failures:
75.06 s
gammaloop-nextest-docs>
75.06 s
gammaloop-nextest-docs> failures:
75.06 s
gammaloop-nextest-docs> tests::checked_in_registry_is_valid
75.06 s
gammaloop-nextest-docs>
75.06 s
gammaloop-nextest-docs> test result: FAILED. 0 passed; 1 failed; 0 ignored; 0 measured; 128 filtered out; finished in 0.01s
75.06 s
gammaloop-nextest-docs> system-err
75.06 s
gammaloop-nextest-docs> thread 'tests::checked_in_registry_is_valid' (194) panicked at crates/alphal00p-docs-builder/src/lib.rs:12178:50:
75.06 s
gammaloop-nextest-docs> called `Result::unwrap()` on an `Err` value: developer note gammaloop-architecture verified scope crates/gammaloop-api/src/commands/integrate.rs changed (expected 0cce8b9517824d09e6199882611aec7d213b638d, found 2d30848b04c82fa24ded354176ba9651792c6bcc); owner review or an explicit no-impact attestation is required
75.06 s
gammaloop-nextest-docs>
75.06 s
gammaloop-nextest-docs> Location:
75.06 s
gammaloop-nextest-docs> crates/alphal00p-docs-builder/src/lib.rs:992:29
75.06 s
gammaloop-nextest-docs> stack backtrace:
75.06 s
gammaloop-nextest-docs> 0: __rustc::rust_begin_unwind
75.06 s
gammaloop-nextest-docs> 1: core::panicking::panic_fmt
75.06 s
gammaloop-nextest-docs> 2: core::result::unwrap_failed
75.06 s
gammaloop-nextest-docs> 3: alphal00p_docs_builder::tests::checked_in_registry_is_valid
75.06 s
gammaloop-nextest-docs> 4: <alphal00p_docs_builder::tests::checked_in_registry_is_valid::{closure#0} as core::ops::function::FnOnce<()>>::call_once
75.06 s
gammaloop-nextest-docs> note: Some details are omitted, run with `RUST_BACKTRACE=full` for a verbose backtrace.
75.06 s
gammaloop-nextest-docs>
75.06 s
gammaloop-nextest-docs> 2. alphal00p-docs-builder::tests::developer_scope_ranges_ignore_unrelated_edits_and_warn_only_while_watching
75.06 s
gammaloop-nextest-docs> failure: test failure with exit code 101
75.06 s
gammaloop-nextest-docs> thread 'tests::developer_scope_ranges_ignore_unrelated_edits_and_warn_only_while_watching' (278) panicked at crates/alphal00p-docs-builder/src/lib.rs:12263:29:
75.06 s
gammaloop-nextest-docs> called `Result::unwrap()` on an `Err` value: developer note gammaloop-architecture verified scope crates/gammaloop-api/src/commands/integrate.rs changed (expected 0cce8b9517824d09e6199882611aec7d213b638d, found 2d30848b04c82fa24ded354176ba9651792c6bcc); owner review or an explicit no-impact attestation is required
75.06 s
gammaloop-nextest-docs>
75.06 s
gammaloop-nextest-docs> Location:
75.06 s
gammaloop-nextest-docs> crates/alphal00p-docs-builder/src/lib.rs:992:29
75.06 s
gammaloop-nextest-docs> stack backtrace:
75.06 s
gammaloop-nextest-docs> 0: __rustc::rust_begin_unwind
75.06 s
gammaloop-nextest-docs> 1: core::panicking::panic_fmt
75.06 s
gammaloop-nextest-docs> 2: core::result::unwrap_failed
75.06 s
gammaloop-nextest-docs> 3: alphal00p_docs_builder::tests::developer_scope_ranges_ignore_unrelated_edits_and_warn_only_while_watching
75.06 s
gammaloop-nextest-docs> 4: <alphal00p_docs_builder::tests::developer_scope_ranges_ignore_unrelated_edits_and_warn_only_while_watching::{closure#0} as core::ops::function::FnOnce<()>>::call_once
75.06 s
gammaloop-nextest-docs> note: Some details are omitted, run with `RUST_BACKTRACE=full` for a verbose backtrace.
75.06 s
gammaloop-nextest-docs> system-out
75.06 s
gammaloop-nextest-docs> running 1 test
75.06 s
gammaloop-nextest-docs> test tests::developer_scope_ranges_ignore_unrelated_edits_and_warn_only_while_watching ... FAILED
75.06 s
gammaloop-nextest-docs>
75.06 s
gammaloop-nextest-docs> failures:
75.06 s
gammaloop-nextest-docs>
75.06 s
gammaloop-nextest-docs> failures:
75.06 s
gammaloop-nextest-docs> tests::developer_scope_ranges_ignore_unrelated_edits_and_warn_only_while_watching
75.06 s
gammaloop-nextest-docs>
75.06 s
gammaloop-nextest-docs> test result: FAILED. 0 passed; 1 failed; 0 ignored; 0 measured; 128 filtered out; finished in 0.01s
75.06 s
gammaloop-nextest-docs> system-err
75.06 s
gammaloop-nextest-docs> thread 'tests::developer_scope_ranges_ignore_unrelated_edits_and_warn_only_while_watching' (278) panicked at crates/alphal00p-docs-builder/src/lib.rs:12263:29:
75.06 s
gammaloop-nextest-docs> called `Result::unwrap()` on an `Err` value: developer note gammaloop-architecture verified scope crates/gammaloop-api/src/commands/integrate.rs changed (expected 0cce8b9517824d09e6199882611aec7d213b638d, found 2d30848b04c82fa24ded354176ba9651792c6bcc); owner review or an explicit no-impact attestation is required
75.06 s
gammaloop-nextest-docs>
75.06 s
gammaloop-nextest-docs> Location:
75.06 s
gammaloop-nextest-docs> crates/alphal00p-docs-builder/src/lib.rs:992:29
75.06 s
gammaloop-nextest-docs> stack backtrace:
75.06 s
gammaloop-nextest-docs> 0: __rustc::rust_begin_unwind
75.06 s
gammaloop-nextest-docs> 1: core::panicking::panic_fmt
75.06 s
gammaloop-nextest-docs> 2: core::result::unwrap_failed
75.06 s
gammaloop-nextest-docs> 3: alphal00p_docs_builder::tests::developer_scope_ranges_ignore_unrelated_edits_and_warn_only_while_watching
75.06 s
gammaloop-nextest-docs> 4: <alphal00p_docs_builder::tests::developer_scope_ranges_ignore_unrelated_edits_and_warn_only_while_watching::{closure#0} as core::ops::function::FnOnce<()>>::call_once
75.06 s
gammaloop-nextest-docs> note: Some details are omitted, run with `RUST_BACKTRACE=full` for a verbose backtrace.
75.06 s
gammaloop-nextest-docs>
75.06 s
gammaloop-nextest-docs> 3. alphal00p-docs-builder::provenance_tests::each_build_captures_one_revision_before_rendering
75.06 s
gammaloop-nextest-docs> failure: test failure with exit code 101
75.06 s
gammaloop-nextest-docs> thread 'provenance_tests::each_build_captures_one_revision_before_rendering' (168) panicked at crates/alphal00p-docs-builder/src/provenance_tests.rs:274:9:
75.06 s
gammaloop-nextest-docs> assertion failed: command.status().unwrap().success()
75.06 s
gammaloop-nextest-docs> stack backtrace:
75.06 s
gammaloop-nextest-docs> 0: __rustc::rust_begin_unwind
75.06 s
gammaloop-nextest-docs> 1: core::panicking::panic_fmt
75.06 s
gammaloop-nextest-docs> 2: core::panicking::panic
75.06 s
gammaloop-nextest-docs> 3: alphal00p_docs_builder::provenance_tests::each_build_captures_one_revision_before_rendering
75.06 s
gammaloop-nextest-docs> 4: <alphal00p_docs_builder::provenance_tests::each_build_captures_one_revision_before_rendering::{closure#0} as core::ops::function::FnOnce<()>>::call_once
75.06 s
gammaloop-nextest-docs> note: Some details are omitted, run with `RUST_BACKTRACE=full` for a verbose backtrace.
75.06 s
gammaloop-nextest-docs> system-out
75.06 s
gammaloop-nextest-docs> running 1 test
75.06 s
gammaloop-nextest-docs>
75.06 s
gammaloop-nextest-docs> running 1 test
75.06 s
gammaloop-nextest-docs> test provenance_tests::each_build_captures_one_revision_before_rendering ... FAILED
75.06 s
gammaloop-nextest-docs>
75.06 s
gammaloop-nextest-docs> failures:
75.06 s
gammaloop-nextest-docs>
75.06 s
gammaloop-nextest-docs> failures:
75.06 s
gammaloop-nextest-docs> provenance_tests::each_build_captures_one_revision_before_rendering
75.06 s
gammaloop-nextest-docs>
75.06 s
gammaloop-nextest-docs> test result: FAILED. 0 passed; 1 failed; 0 ignored; 0 measured; 128 filtered out; finished in 0.02s
75.06 s
gammaloop-nextest-docs>
75.06 s
gammaloop-nextest-docs> test provenance_tests::each_build_captures_one_revision_before_rendering ... FAILED
75.06 s
gammaloop-nextest-docs>
75.06 s
gammaloop-nextest-docs> failures:
75.06 s
gammaloop-nextest-docs>
75.06 s
gammaloop-nextest-docs> failures:
75.06 s
gammaloop-nextest-docs> provenance_tests::each_build_captures_one_revision_before_rendering
75.06 s
gammaloop-nextest-docs>
75.06 s
gammaloop-nextest-docs> test result: FAILED. 0 passed; 1 failed; 0 ignored; 0 measured; 128 filtered out; finished in 0.03s
75.06 s
gammaloop-nextest-docs> system-err
75.06 s
gammaloop-nextest-docs> thread 'provenance_tests::each_build_captures_one_revision_before_rendering' (234) panicked at crates/alphal00p-docs-builder/src/provenance_tests.rs:297:14:
75.06 s
gammaloop-nextest-docs> called `Result::unwrap()` on an `Err` value: developer note gammaloop-architecture verified scope crates/gammaloop-api/src/commands/integrate.rs changed (expected 0cce8b9517824d09e6199882611aec7d213b638d, found 2d30848b04c82fa24ded354176ba9651792c6bcc); owner review or an explicit no-impact attestation is required
75.06 s
gammaloop-nextest-docs>
75.06 s
gammaloop-nextest-docs> Location:
75.06 s
gammaloop-nextest-docs> crates/alphal00p-docs-builder/src/lib.rs:992:29
75.06 s
gammaloop-nextest-docs> stack backtrace:
75.06 s
gammaloop-nextest-docs> 0: __rustc::rust_begin_unwind
75.06 s
gammaloop-nextest-docs> 1: core::panicking::panic_fmt
75.06 s
gammaloop-nextest-docs> 2: core::result::unwrap_failed
75.06 s
gammaloop-nextest-docs> 3: alphal00p_docs_builder::provenance_tests::each_build_captures_one_revision_before_rendering
75.06 s
gammaloop-nextest-docs> 4: <alphal00p_docs_builder::provenance_tests::each_build_captures_one_revision_before_rendering::{closure#0} as core::ops::function::FnOnce<()>>::call_once
75.06 s
gammaloop-nextest-docs> note: Some details are omitted, run with `RUST_BACKTRACE=full` for a verbose backtrace.
75.06 s
gammaloop-nextest-docs>
75.06 s
gammaloop-nextest-docs> thread 'provenance_tests::each_build_captures_one_revision_before_rendering' (168) panicked at crates/alphal00p-docs-builder/src/provenance_tests.rs:274:9:
75.06 s
gammaloop-nextest-docs> assertion failed: command.status().unwrap().success()
75.06 s
gammaloop-nextest-docs> stack backtrace:
75.06 s
gammaloop-nextest-docs> 0: __rustc::rust_begin_unwind
75.06 s
gammaloop-nextest-docs> 1: core::panicking::panic_fmt
75.06 s
gammaloop-nextest-docs> 2: core::panicking::panic
75.06 s
gammaloop-nextest-docs> 3: alphal00p_docs_builder::provenance_tests::each_build_captures_one_revision_before_rendering
75.06 s
gammaloop-nextest-docs> 4: <alphal00p_docs_builder::provenance_tests::each_build_captures_one_revision_before_rendering::{closure#0} as core::ops::function::FnOnce<()>>::call_once
75.06 s
gammaloop-nextest-docs> note: Some details are omitted, run with `RUST_BACKTRACE=full` for a verbose backtrace.
75.06 s
gammaloop-nextest-docs>
75.06 s
gammaloop-nextest-docs> 4. alphal00p-docs-builder::tests::every_product_requires_a_task_chooser_and_each_supported_interface
75.06 s
gammaloop-nextest-docs> failure: test failure with exit code 101
75.06 s
gammaloop-nextest-docs> thread 'tests::every_product_requires_a_task_chooser_and_each_supported_interface' (301) panicked at crates/alphal00p-docs-builder/src/lib.rs:12192:9:
75.06 s
gammaloop-nextest-docs> assertion failed: format!("{error:#}").contains("has no quickstart page")
75.06 s
gammaloop-nextest-docs> stack backtrace:
75.06 s
gammaloop-nextest-docs> 0: __rustc::rust_begin_unwind
75.06 s
gammaloop-nextest-docs> 1: core::panicking::panic_fmt
75.06 s
gammaloop-nextest-docs> 2: core::panicking::panic
75.06 s
gammaloop-nextest-docs> 3: alphal00p_docs_builder::tests::every_product_requires_a_task_chooser_and_each_supported_interface
75.06 s
gammaloop-nextest-docs> 4: <alphal00p_docs_builder::tests::every_product_requires_a_task_chooser_and_each_supported_interface::{closure#0} as core::ops::function::FnOnce<()>>::call_once
75.06 s
gammaloop-nextest-docs> note: Some details are omitted, run with `RUST_BACKTRACE=full` for a verbose backtrace.
75.06 s
gammaloop-nextest-docs> system-out
75.06 s
gammaloop-nextest-docs> running 1 test
75.06 s
gammaloop-nextest-docs> test tests::every_product_requires_a_task_chooser_and_each_supported_interface ... FAILED
75.06 s
gammaloop-nextest-docs>
75.06 s
gammaloop-nextest-docs> failures:
75.06 s
gammaloop-nextest-docs>
75.06 s
gammaloop-nextest-docs> failures:
75.06 s
gammaloop-nextest-docs> tests::every_product_requires_a_task_chooser_and_each_supported_interface
75.06 s
gammaloop-nextest-docs>
75.06 s
gammaloop-nextest-docs> test result: FAILED. 0 passed; 1 failed; 0 ignored; 0 measured; 128 filtered out; finished in 0.02s
75.06 s
gammaloop-nextest-docs> system-err
75.06 s
gammaloop-nextest-docs> thread 'tests::every_product_requires_a_task_chooser_and_each_supported_interface' (301) panicked at crates/alphal00p-docs-builder/src/lib.rs:12192:9:
75.06 s
gammaloop-nextest-docs> assertion failed: format!("{error:#}").contains("has no quickstart page")
75.06 s
gammaloop-nextest-docs> stack backtrace:
75.06 s
gammaloop-nextest-docs> 0: __rustc::rust_begin_unwind
75.06 s
gammaloop-nextest-docs> 1: core::panicking::panic_fmt
75.06 s
gammaloop-nextest-docs> 2: core::panicking::panic
75.06 s
gammaloop-nextest-docs> 3: alphal00p_docs_builder::tests::every_product_requires_a_task_chooser_and_each_supported_interface
75.06 s
gammaloop-nextest-docs> 4: <alphal00p_docs_builder::tests::every_product_requires_a_task_chooser_and_each_supported_interface::{closure#0} as core::ops::function::FnOnce<()>>::call_once
75.06 s
gammaloop-nextest-docs> note: Some details are omitted, run with `RUST_BACKTRACE=full` for a verbose backtrace.
75.06 s
gammaloop-nextest-docs>
75.06 s
gammaloop-nextest-docs> 5. alphal00p-docs-builder::tests::pdf_manual_chapter_order_must_match_the_page_registry
75.06 s
gammaloop-nextest-docs> failure: test failure with exit code 101
75.06 s
gammaloop-nextest-docs> thread 'tests::pdf_manual_chapter_order_must_match_the_page_registry' (353) panicked at crates/alphal00p-docs-builder/src/lib.rs:12243:9:
75.06 s
gammaloop-nextest-docs> assertion failed: format!("{error:#}").contains("PDF manual chapter order differs")
75.06 s
gammaloop-nextest-docs> stack backtrace:
75.06 s
gammaloop-nextest-docs> 0: __rustc::rust_begin_unwind
75.06 s
gammaloop-nextest-docs> 1: core::panicking::panic_fmt
75.06 s
gammaloop-nextest-docs> 2: core::panicking::panic
75.06 s
gammaloop-nextest-docs> 3: alphal00p_docs_builder::tests::pdf_manual_chapter_order_must_match_the_page_registry
75.06 s
gammaloop-nextest-docs> 4: <alphal00p_docs_builder::tests::pdf_manual_chapter_order_must_match_the_page_registry::{closure#0} as core::ops::function::FnOnce<()>>::call_once
75.06 s
gammaloop-nextest-docs> note: Some details are omitted, run with `RUST_BACKTRACE=full` for a verbose backtrace.
75.06 s
gammaloop-nextest-docs> system-out
75.06 s
gammaloop-nextest-docs> running 1 test
75.06 s
gammaloop-nextest-docs> test tests::pdf_manual_chapter_order_must_match_the_page_registry ... FAILED
75.06 s
gammaloop-nextest-docs>
75.06 s
gammaloop-nextest-docs> failures:
75.06 s
gammaloop-nextest-docs>
75.06 s
gammaloop-nextest-docs> failures:
75.06 s
gammaloop-nextest-docs> tests::pdf_manual_chapter_order_must_match_the_page_registry
75.06 s
gammaloop-nextest-docs>
75.06 s
gammaloop-nextest-docs> test result: FAILED. 0 passed; 1 failed; 0 ignored; 0 measured; 128 filtered out; finished in 0.02s
75.06 s
gammaloop-nextest-docs> system-err
75.06 s
gammaloop-nextest-docs> thread 'tests::pdf_manual_chapter_order_must_match_the_page_registry' (353) panicked at crates/alphal00p-docs-builder/src/lib.rs:12243:9:
75.06 s
gammaloop-nextest-docs> assertion failed: format!("{error:#}").contains("PDF manual chapter order differs")
75.06 s
gammaloop-nextest-docs> stack backtrace:
75.06 s
gammaloop-nextest-docs> 0: __rustc::rust_begin_unwind
75.06 s
gammaloop-nextest-docs> 1: core::panicking::panic_fmt
75.06 s
gammaloop-nextest-docs> 2: core::panicking::panic
75.06 s
gammaloop-nextest-docs> 3: alphal00p_docs_builder::tests::pdf_manual_chapter_order_must_match_the_page_registry
75.06 s
gammaloop-nextest-docs> 4: <alphal00p_docs_builder::tests::pdf_manual_chapter_order_must_match_the_page_registry::{closure#0} as core::ops::function::FnOnce<()>>::call_once
75.06 s
gammaloop-nextest-docs> note: Some details are omitted, run with `RUST_BACKTRACE=full` for a verbose backtrace.
75.06 s
gammaloop-nextest-docs> =========================================
75.08 s
gammaloop-nextest-docs> Extracting 2 binaries to /build/source
75.12 s
gammaloop-nextest-docs> Extracted 5 files to /build/source in 0.04s
75.14 s
gammaloop-nextest-docs> ------------
75.14 s
gammaloop-nextest-docs> Nextest run ID fdb7f154-ee8a-46c2-b82f-bd9ed37c12e2 with nextest profile: ci_gammaloop
75.14 s
gammaloop-nextest-docs> Starting 22 tests across 2 binaries
75.22 s
gammaloop-nextest-docs> ------------
75.22 s
gammaloop-nextest-docs> Summary [ 0.081s] 22 tests run: 22 passed , 0 skipped
75.27 s
gammaloop-nextest-docs>
75.27 s
gammaloop-nextest-docs> ========== nextest test summary ==========
75.27 s
gammaloop-nextest-docs> report: target/nextest/ci_gammaloop/junit.xml
75.27 s
gammaloop-nextest-docs> tests: 22, failures: 0, errors: 0
75.27 s
gammaloop-nextest-docs> No failing testcases found.
75.27 s
gammaloop-nextest-docs> =========================================
75.29 s
gammaloop-nextest-docs> Extracting 3 binaries (including 2 non-test binaries), 1 build script output directory, and 2 linked paths to /build/source
75.63 s
gammaloop-nextest-docs> Extracted 22 files to /build/source in 0.35s
75.66 s
gammaloop-nextest-docs> ------------
75.66 s
gammaloop-nextest-docs> Nextest run ID 6d1261e6-4850-4d09-9602-030ce1995e10 with nextest profile: ci_gammaloop
75.66 s
gammaloop-nextest-docs> Starting 89 tests across 1 binary
75.79 s
gammaloop-nextest-docs> ------------
75.79 s
gammaloop-nextest-docs> Summary [ 0.131s] 89 tests run: 89 passed , 0 skipped
75.82 s
gammaloop-nextest-docs>
75.82 s
gammaloop-nextest-docs> ========== nextest test summary ==========
75.82 s
gammaloop-nextest-docs> report: target/nextest/ci_gammaloop/junit.xml
75.82 s
gammaloop-nextest-docs> tests: 89, failures: 0, errors: 0
75.82 s
gammaloop-nextest-docs> No failing testcases found.
75.82 s
gammaloop-nextest-docs> =========================================
75.84 s
gammaloop-nextest-docs> Extracting 2 binaries to /build/source
75.91 s
gammaloop-nextest-docs> Extracted 5 files to /build/source in 0.07s
75.93 s
gammaloop-nextest-docs> ------------
75.93 s
gammaloop-nextest-docs> Nextest run ID 66be2362-347d-41e2-9211-a150a78ad05c with nextest profile: ci_gammaloop
75.93 s
gammaloop-nextest-docs> Starting 10 tests across 2 binaries
91.42 s
gammaloop-nextest-docs> ------------
91.42 s
gammaloop-nextest-docs> Summary [ 15.495s] 10 tests run: 10 passed , 0 skipped
91.46 s
gammaloop-nextest-docs>
91.46 s
gammaloop-nextest-docs> ========== nextest test summary ==========
91.46 s
gammaloop-nextest-docs> report: target/nextest/ci_gammaloop/junit.xml
91.46 s
gammaloop-nextest-docs> tests: 10, failures: 0, errors: 0
91.46 s
gammaloop-nextest-docs> No failing testcases found.
91.46 s
gammaloop-nextest-docs> =========================================
91.47 s
gammaloop-nextest-docs> Extracting 1 binary to /build/source
91.51 s
gammaloop-nextest-docs> Extracted 4 files to /build/source in 0.04s
91.52 s
gammaloop-nextest-docs> ------------
91.52 s
gammaloop-nextest-docs> Nextest run ID edd731d1-4c48-47e7-90ac-e6d7b791c4be with nextest profile: ci_gammaloop
91.52 s
gammaloop-nextest-docs> Starting 0 tests across 1 binary
91.52 s
gammaloop-nextest-docs> ------------
91.52 s
gammaloop-nextest-docs> Summary [ 0.000s] 0 tests run: 0 passed , 0 skipped
91.55 s
gammaloop-nextest-docs>
91.55 s
gammaloop-nextest-docs> ========== nextest test summary ==========
91.55 s
gammaloop-nextest-docs> report: target/nextest/ci_gammaloop/junit.xml
91.56 s
gammaloop-nextest-docs> tests: 0, failures: 0, errors: 0
91.56 s
gammaloop-nextest-docs> No failing testcases found.
91.56 s
gammaloop-nextest-docs> =========================================
91.57 s
gammaloop-nextest-docs> Extracting 1 binary to /build/source
91.61 s
gammaloop-nextest-docs> Extracted 4 files to /build/source in 0.04s
91.62 s
gammaloop-nextest-docs> ------------
91.62 s
gammaloop-nextest-docs> Nextest run ID 7c10e4ce-3aa6-460d-a3c9-6bed1ac9e0a2 with nextest profile: ci_gammaloop
91.62 s
gammaloop-nextest-docs> Starting 5 tests across 1 binary
91.63 s
gammaloop-nextest-docs> ------------
91.63 s
gammaloop-nextest-docs> Summary [ 0.004s] 5 tests run: 5 passed , 0 skipped
91.66 s
gammaloop-nextest-docs>
91.66 s
gammaloop-nextest-docs> ========== nextest test summary ==========
91.66 s
gammaloop-nextest-docs> report: target/nextest/ci_gammaloop/junit.xml
91.66 s
gammaloop-nextest-docs> tests: 5, failures: 0, errors: 0
91.66 s
gammaloop-nextest-docs> No failing testcases found.
91.66 s
gammaloop-nextest-docs> =========================================
91.88 s
error: Cannot build '/nix/store/yjk1y7kxjjry446ij49xzficzijvkxpq-gammaloop-nextest-docs.drv '.
91.88 s
Reason: builder failed with exit code 100 .
91.88 s
Output paths:
91.88 s
/nix/store/pklph5dw6r7zldkbm0rsc6h72mf238c0-gammaloop-nextest-docs
91.88 s
Last 584 log lines:
91.88 s
> Extracting 2 binaries to /build/source
91.88 s
> Extracted 5 files to /build/source in 0.05s
91.88 s
> ------------
91.88 s
> Nextest run ID e8090b7c-6764-4ba5-acc2-992b843cf876 with nextest profile: ci_gammaloop
91.88 s
> Starting 129 tests across 2 binaries
91.88 s
> FAIL [ 0.021s] ( 14/129) alphal00p-docs-builder tests :: checked_in_registry_is_valid
91.88 s
> stdout ---
91.88 s
>
91.88 s
> running 1 test
91.88 s
> test tests::checked_in_registry_is_valid ... FAILED
91.88 s
>
91.88 s
> failures:
91.88 s
>
91.88 s
> failures:
91.88 s
> tests::checked_in_registry_is_valid
91.88 s
>
91.88 s
> test result: FAILED. 0 passed; 1 failed; 0 ignored; 0 measured; 128 filtered out; finished in 0.01s
91.88 s
>
91.88 s
> stderr ---
91.88 s
>
91.88 s
> thread 'tests::checked_in_registry_is_valid' (194) panicked at crates/alphal00p-docs-builder/src/lib.rs:12178:50:
91.88 s
> called `Result::unwrap()` on an `Err` value: developer note gammaloop-architecture verified scope crates/gammaloop-api/src/commands/integrate.rs changed (expected 0cce8b9517824d09e6199882611aec7d213b638d, found 2d30848b04c82fa24ded354176ba9651792c6bcc); owner review or an explicit no-impact attestation is required
91.88 s
>
91.88 s
> Location:
91.88 s
> crates/alphal00p-docs-builder/src/lib.rs:992:29
91.88 s
> stack backtrace:
91.88 s
> 0: __rustc::rust_begin_unwind
91.88 s
> 1: core::panicking::panic_fmt
91.88 s
> 2: core::result::unwrap_failed
91.88 s
> 3: alphal00p_docs_builder::tests::checked_in_registry_is_valid
91.88 s
> 4: <alphal00p_docs_builder::tests::checked_in_registry_is_valid::{closure#0} as core::ops::function::FnOnce<()>>::call_once
91.88 s
> note: Some details are omitted, run with `RUST_BACKTRACE=full` for a verbose backtrace.
91.88 s
>
91.88 s
> FAIL [ 0.018s] ( 26/129) alphal00p-docs-builder tests :: developer_scope_ranges_ignore_unrelated_edits_and_warn_only_while_watching
91.88 s
> stdout ---
91.88 s
>
91.88 s
> running 1 test
91.88 s
> test tests::developer_scope_ranges_ignore_unrelated_edits_and_warn_only_while_watching ... FAILED
91.88 s
>
91.88 s
> failures:
91.88 s
>
91.88 s
> failures:
91.88 s
> tests::developer_scope_ranges_ignore_unrelated_edits_and_warn_only_while_watching
91.88 s
>
91.88 s
> test result: FAILED. 0 passed; 1 failed; 0 ignored; 0 measured; 128 filtered out; finished in 0.01s
91.88 s
>
91.88 s
> stderr ---
91.88 s
>
91.88 s
> thread 'tests::developer_scope_ranges_ignore_unrelated_edits_and_warn_only_while_watching' (278) panicked at crates/alphal00p-docs-builder/src/lib.rs:12263:29:
91.88 s
> called `Result::unwrap()` on an `Err` value: developer note gammaloop-architecture verified scope crates/gammaloop-api/src/commands/integrate.rs changed (expected 0cce8b9517824d09e6199882611aec7d213b638d, found 2d30848b04c82fa24ded354176ba9651792c6bcc); owner review or an explicit no-impact attestation is required
91.88 s
>
91.88 s
> Location:
91.88 s
> crates/alphal00p-docs-builder/src/lib.rs:992:29
91.88 s
> stack backtrace:
91.88 s
> 0: __rustc::rust_begin_unwind
91.88 s
> 1: core::panicking::panic_fmt
91.88 s
> 2: core::result::unwrap_failed
91.88 s
> 3: alphal00p_docs_builder::tests::developer_scope_ranges_ignore_unrelated_edits_and_warn_only_while_watching
91.88 s
> 4: <alphal00p_docs_builder::tests::developer_scope_ranges_ignore_unrelated_edits_and_warn_only_while_watching::{closure#0} as core::ops::function::FnOnce<()>>::call_once
91.88 s
> note: Some details are omitted, run with `RUST_BACKTRACE=full` for a verbose backtrace.
91.88 s
>
91.88 s
> FAIL [ 0.041s] ( 27/129) alphal00p-docs-builder provenance_tests :: each_build_captures_one_revision_before_rendering
91.88 s
> stdout ---
91.88 s
>
91.88 s
> running 1 test
91.88 s
>
91.88 s
> running 1 test
91.88 s
> test provenance_tests::each_build_captures_one_revision_before_rendering ... FAILED
91.88 s
>
91.88 s
> failures:
91.88 s
>
91.88 s
> failures:
91.88 s
> provenance_tests::each_build_captures_one_revision_before_rendering
91.88 s
>
91.88 s
> test result: FAILED. 0 passed; 1 failed; 0 ignored; 0 measured; 128 filtered out; finished in 0.02s
91.88 s
>
91.88 s
> test provenance_tests::each_build_captures_one_revision_before_rendering ... FAILED
91.88 s
>
91.88 s
> failures:
91.88 s
>
91.88 s
> failures:
91.88 s
> provenance_tests::each_build_captures_one_revision_before_rendering
91.88 s
>
91.88 s
> test result: FAILED. 0 passed; 1 failed; 0 ignored; 0 measured; 128 filtered out; finished in 0.03s
91.88 s
>
91.88 s
> stderr ---
91.88 s
>
91.88 s
> thread 'provenance_tests::each_build_captures_one_revision_before_rendering' (234) panicked at crates/alphal00p-docs-builder/src/provenance_tests.rs:297:14:
91.88 s
> called `Result::unwrap()` on an `Err` value: developer note gammaloop-architecture verified scope crates/gammaloop-api/src/commands/integrate.rs changed (expected 0cce8b9517824d09e6199882611aec7d213b638d, found 2d30848b04c82fa24ded354176ba9651792c6bcc); owner review or an explicit no-impact attestation is required
91.88 s
>
91.88 s
> Location:
91.88 s
> crates/alphal00p-docs-builder/src/lib.rs:992:29
91.88 s
> stack backtrace:
91.88 s
> 0: __rustc::rust_begin_unwind
91.88 s
> 1: core::panicking::panic_fmt
91.88 s
> 2: core::result::unwrap_failed
91.88 s
> 3: alphal00p_docs_builder::provenance_tests::each_build_captures_one_revision_before_rendering
91.88 s
> 4: <alphal00p_docs_builder::provenance_tests::each_build_captures_one_revision_before_rendering::{closure#0} as core::ops::function::FnOnce<()>>::call_once
91.88 s
> note: Some details are omitted, run with `RUST_BACKTRACE=full` for a verbose backtrace.
91.88 s
>
91.88 s
> thread 'provenance_tests::each_build_captures_one_revision_before_rendering' (168) panicked at crates/alphal00p-docs-builder/src/provenance_tests.rs:274:9:
91.88 s
> assertion failed: command.status().unwrap().success()
91.88 s
> stack backtrace:
91.88 s
> 0: __rustc::rust_begin_unwind
91.88 s
> 1: core::panicking::panic_fmt
91.88 s
> 2: core::panicking::panic
91.88 s
> 3: alphal00p_docs_builder::provenance_tests::each_build_captures_one_revision_before_rendering
91.88 s
> 4: <alphal00p_docs_builder::provenance_tests::each_build_captures_one_revision_before_rendering::{closure#0} as core::ops::function::FnOnce<()>>::call_once
91.88 s
> note: Some details are omitted, run with `RUST_BACKTRACE=full` for a verbose backtrace.
91.88 s
>
91.88 s
> FAIL [ 0.023s] ( 37/129) alphal00p-docs-builder tests :: every_product_requires_a_task_chooser_and_each_supported_interface
91.88 s
> stdout ---
91.88 s
>
91.88 s
> running 1 test
91.88 s
> test tests::every_product_requires_a_task_chooser_and_each_supported_interface ... FAILED
91.88 s
>
91.88 s
> failures:
91.88 s
>
91.88 s
> failures:
91.88 s
> tests::every_product_requires_a_task_chooser_and_each_supported_interface
91.88 s
>
91.88 s
> test result: FAILED. 0 passed; 1 failed; 0 ignored; 0 measured; 128 filtered out; finished in 0.02s
91.88 s
>
91.88 s
> stderr ---
91.88 s
>
91.88 s
> thread 'tests::every_product_requires_a_task_chooser_and_each_supported_interface' (301) panicked at crates/alphal00p-docs-builder/src/lib.rs:12192:9:
91.88 s
> assertion failed: format!("{error:#}").contains("has no quickstart page")
91.88 s
> stack backtrace:
91.88 s
> 0: __rustc::rust_begin_unwind
91.88 s
> 1: core::panicking::panic_fmt
91.88 s
> 2: core::panicking::panic
91.88 s
> 3: alphal00p_docs_builder::tests::every_product_requires_a_task_chooser_and_each_supported_interface
91.88 s
> 4: <alphal00p_docs_builder::tests::every_product_requires_a_task_chooser_and_each_supported_interface::{closure#0} as core::ops::function::FnOnce<()>>::call_once
91.88 s
> note: Some details are omitted, run with `RUST_BACKTRACE=full` for a verbose backtrace.
91.88 s
>
91.88 s
> FAIL [ 0.029s] ( 59/129) alphal00p-docs-builder tests :: pdf_manual_chapter_order_must_match_the_page_registry
91.88 s
> stdout ---
91.88 s
>
91.88 s
> running 1 test
91.88 s
> test tests::pdf_manual_chapter_order_must_match_the_page_registry ... FAILED
91.88 s
>
91.88 s
> failures:
91.88 s
>
91.88 s
> failures:
91.88 s
> tests::pdf_manual_chapter_order_must_match_the_page_registry
91.88 s
>
91.88 s
> test result: FAILED. 0 passed; 1 failed; 0 ignored; 0 measured; 128 filtered out; finished in 0.02s
91.88 s
>
91.88 s
> stderr ---
91.88 s
>
91.88 s
> thread 'tests::pdf_manual_chapter_order_must_match_the_page_registry' (353) panicked at crates/alphal00p-docs-builder/src/lib.rs:12243:9:
91.88 s
> assertion failed: format!("{error:#}").contains("PDF manual chapter order differs")
91.88 s
> stack backtrace:
91.88 s
> 0: __rustc::rust_begin_unwind
91.88 s
> 1: core::panicking::panic_fmt
91.88 s
> 2: core::panicking::panic
91.88 s
> 3: alphal00p_docs_builder::tests::pdf_manual_chapter_order_must_match_the_page_registry
91.88 s
> 4: <alphal00p_docs_builder::tests::pdf_manual_chapter_order_must_match_the_page_registry::{closure#0} as core::ops::function::FnOnce<()>>::call_once
91.88 s
> note: Some details are omitted, run with `RUST_BACKTRACE=full` for a verbose backtrace.
91.88 s
>
91.88 s
> ------------
91.88 s
> Summary [ 22.824s] 129 tests run: 124 passed , 5 failed , 0 skipped
91.88 s
> FAIL [ 0.021s] ( 14/129) alphal00p-docs-builder tests :: checked_in_registry_is_valid
91.88 s
> stdout ---
91.88 s
>
91.88 s
> running 1 test
91.88 s
> test tests::checked_in_registry_is_valid ... FAILED
91.88 s
>
91.88 s
> failures:
91.88 s
>
91.88 s
> failures:
91.88 s
> tests::checked_in_registry_is_valid
91.88 s
>
91.88 s
> test result: FAILED. 0 passed; 1 failed; 0 ignored; 0 measured; 128 filtered out; finished in 0.01s
91.88 s
>
91.88 s
> stderr ---
91.88 s
>
91.88 s
> thread 'tests::checked_in_registry_is_valid' (194) panicked at crates/alphal00p-docs-builder/src/lib.rs:12178:50:
91.88 s
> called `Result::unwrap()` on an `Err` value: developer note gammaloop-architecture verified scope crates/gammaloop-api/src/commands/integrate.rs changed (expected 0cce8b9517824d09e6199882611aec7d213b638d, found 2d30848b04c82fa24ded354176ba9651792c6bcc); owner review or an explicit no-impact attestation is required
91.88 s
>
91.88 s
> Location:
91.88 s
> crates/alphal00p-docs-builder/src/lib.rs:992:29
91.88 s
> stack backtrace:
91.88 s
> 0: __rustc::rust_begin_unwind
91.88 s
> 1: core::panicking::panic_fmt
91.88 s
> 2: core::result::unwrap_failed
91.88 s
> 3: alphal00p_docs_builder::tests::checked_in_registry_is_valid
91.88 s
> 4: <alphal00p_docs_builder::tests::checked_in_registry_is_valid::{closure#0} as core::ops::function::FnOnce<()>>::call_once
91.88 s
> note: Some details are omitted, run with `RUST_BACKTRACE=full` for a verbose backtrace.
91.88 s
>
91.88 s
> FAIL [ 0.018s] ( 26/129) alphal00p-docs-builder tests :: developer_scope_ranges_ignore_unrelated_edits_and_warn_only_while_watching
91.88 s
> stdout ---
91.88 s
>
91.88 s
> running 1 test
91.88 s
> test tests::developer_scope_ranges_ignore_unrelated_edits_and_warn_only_while_watching ... FAILED
91.88 s
>
91.88 s
> failures:
91.88 s
>
91.88 s
> failures:
91.88 s
> tests::developer_scope_ranges_ignore_unrelated_edits_and_warn_only_while_watching
91.88 s
>
91.88 s
> test result: FAILED. 0 passed; 1 failed; 0 ignored; 0 measured; 128 filtered out; finished in 0.01s
91.88 s
>
91.88 s
> stderr ---
91.88 s
>
91.88 s
> thread 'tests::developer_scope_ranges_ignore_unrelated_edits_and_warn_only_while_watching' (278) panicked at crates/alphal00p-docs-builder/src/lib.rs:12263:29:
91.88 s
> called `Result::unwrap()` on an `Err` value: developer note gammaloop-architecture verified scope crates/gammaloop-api/src/commands/integrate.rs changed (expected 0cce8b9517824d09e6199882611aec7d213b638d, found 2d30848b04c82fa24ded354176ba9651792c6bcc); owner review or an explicit no-impact attestation is required
91.88 s
>
91.88 s
> Location:
91.88 s
> crates/alphal00p-docs-builder/src/lib.rs:992:29
91.88 s
> stack backtrace:
91.88 s
> 0: __rustc::rust_begin_unwind
91.88 s
> 1: core::panicking::panic_fmt
91.88 s
> 2: core::result::unwrap_failed
91.88 s
> 3: alphal00p_docs_builder::tests::developer_scope_ranges_ignore_unrelated_edits_and_warn_only_while_watching
91.88 s
> 4: <alphal00p_docs_builder::tests::developer_scope_ranges_ignore_unrelated_edits_and_warn_only_while_watching::{closure#0} as core::ops::function::FnOnce<()>>::call_once
91.88 s
> note: Some details are omitted, run with `RUST_BACKTRACE=full` for a verbose backtrace.
91.88 s
>
91.88 s
> FAIL [ 0.041s] ( 27/129) alphal00p-docs-builder provenance_tests :: each_build_captures_one_revision_before_rendering
91.88 s
> stdout ---
91.88 s
>
91.88 s
> running 1 test
91.88 s
>
91.88 s
> running 1 test
91.88 s
> test provenance_tests::each_build_captures_one_revision_before_rendering ... FAILED
91.88 s
>
91.88 s
> failures:
91.88 s
>
91.88 s
> failures:
91.88 s
> provenance_tests::each_build_captures_one_revision_before_rendering
91.88 s
>
91.88 s
> test result: FAILED. 0 passed; 1 failed; 0 ignored; 0 measured; 128 filtered out; finished in 0.02s
91.88 s
>
91.88 s
> test provenance_tests::each_build_captures_one_revision_before_rendering ... FAILED
91.88 s
>
91.88 s
> failures:
91.88 s
>
91.88 s
> failures:
91.88 s
> provenance_tests::each_build_captures_one_revision_before_rendering
91.88 s
>
91.88 s
> test result: FAILED. 0 passed; 1 failed; 0 ignored; 0 measured; 128 filtered out; finished in 0.03s
91.88 s
>
91.88 s
> stderr ---
91.88 s
>
91.88 s
> thread 'provenance_tests::each_build_captures_one_revision_before_rendering' (234) panicked at crates/alphal00p-docs-builder/src/provenance_tests.rs:297:14:
91.88 s
> called `Result::unwrap()` on an `Err` value: developer note gammaloop-architecture verified scope crates/gammaloop-api/src/commands/integrate.rs changed (expected 0cce8b9517824d09e6199882611aec7d213b638d, found 2d30848b04c82fa24ded354176ba9651792c6bcc); owner review or an explicit no-impact attestation is required
91.88 s
>
91.88 s
> Location:
91.88 s
> crates/alphal00p-docs-builder/src/lib.rs:992:29
91.88 s
> stack backtrace:
91.88 s
> 0: __rustc::rust_begin_unwind
91.88 s
> 1: core::panicking::panic_fmt
91.88 s
> 2: core::result::unwrap_failed
91.88 s
> 3: alphal00p_docs_builder::provenance_tests::each_build_captures_one_revision_before_rendering
91.88 s
> 4: <alphal00p_docs_builder::provenance_tests::each_build_captures_one_revision_before_rendering::{closure#0} as core::ops::function::FnOnce<()>>::call_once
91.88 s
> note: Some details are omitted, run with `RUST_BACKTRACE=full` for a verbose backtrace.
91.88 s
>
91.88 s
> thread 'provenance_tests::each_build_captures_one_revision_before_rendering' (168) panicked at crates/alphal00p-docs-builder/src/provenance_tests.rs:274:9:
91.88 s
> assertion failed: command.status().unwrap().success()
91.88 s
> stack backtrace:
91.88 s
> 0: __rustc::rust_begin_unwind
91.88 s
> 1: core::panicking::panic_fmt
91.88 s
> 2: core::panicking::panic
91.88 s
> 3: alphal00p_docs_builder::provenance_tests::each_build_captures_one_revision_before_rendering
91.88 s
> 4: <alphal00p_docs_builder::provenance_tests::each_build_captures_one_revision_before_rendering::{closure#0} as core::ops::function::FnOnce<()>>::call_once
91.88 s
> note: Some details are omitted, run with `RUST_BACKTRACE=full` for a verbose backtrace.
91.88 s
>
91.88 s
> FAIL [ 0.023s] ( 37/129) alphal00p-docs-builder tests :: every_product_requires_a_task_chooser_and_each_supported_interface
91.88 s
> stdout ---
91.88 s
>
91.88 s
> running 1 test
91.88 s
> test tests::every_product_requires_a_task_chooser_and_each_supported_interface ... FAILED
91.88 s
>
91.88 s
> failures:
91.88 s
>
91.88 s
> failures:
91.88 s
> tests::every_product_requires_a_task_chooser_and_each_supported_interface
91.88 s
>
91.88 s
> test result: FAILED. 0 passed; 1 failed; 0 ignored; 0 measured; 128 filtered out; finished in 0.02s
91.88 s
>
91.88 s
> stderr ---
91.88 s
>
91.88 s
> thread 'tests::every_product_requires_a_task_chooser_and_each_supported_interface' (301) panicked at crates/alphal00p-docs-builder/src/lib.rs:12192:9:
91.88 s
> assertion failed: format!("{error:#}").contains("has no quickstart page")
91.88 s
> stack backtrace:
91.88 s
> 0: __rustc::rust_begin_unwind
91.88 s
> 1: core::panicking::panic_fmt
91.88 s
> 2: core::panicking::panic
91.88 s
> 3: alphal00p_docs_builder::tests::every_product_requires_a_task_chooser_and_each_supported_interface
91.88 s
> 4: <alphal00p_docs_builder::tests::every_product_requires_a_task_chooser_and_each_supported_interface::{closure#0} as core::ops::function::FnOnce<()>>::call_once
91.88 s
> note: Some details are omitted, run with `RUST_BACKTRACE=full` for a verbose backtrace.
91.88 s
>
91.88 s
> FAIL [ 0.029s] ( 59/129) alphal00p-docs-builder tests :: pdf_manual_chapter_order_must_match_the_page_registry
91.88 s
> stdout ---
91.88 s
>
91.88 s
> running 1 test
91.88 s
> test tests::pdf_manual_chapter_order_must_match_the_page_registry ... FAILED
91.88 s
>
91.88 s
> failures:
91.88 s
>
91.88 s
> failures:
91.88 s
> tests::pdf_manual_chapter_order_must_match_the_page_registry
91.88 s
>
91.88 s
> test result: FAILED. 0 passed; 1 failed; 0 ignored; 0 measured; 128 filtered out; finished in 0.02s
91.88 s
>
91.88 s
> stderr ---
91.88 s
>
91.88 s
> thread 'tests::pdf_manual_chapter_order_must_match_the_page_registry' (353) panicked at crates/alphal00p-docs-builder/src/lib.rs:12243:9:
91.88 s
> assertion failed: format!("{error:#}").contains("PDF manual chapter order differs")
91.88 s
> stack backtrace:
91.88 s
> 0: __rustc::rust_begin_unwind
91.88 s
> 1: core::panicking::panic_fmt
91.88 s
> 2: core::panicking::panic
91.88 s
> 3: alphal00p_docs_builder::tests::pdf_manual_chapter_order_must_match_the_page_registry
91.88 s
> 4: <alphal00p_docs_builder::tests::pdf_manual_chapter_order_must_match_the_page_registry::{closure#0} as core::ops::function::FnOnce<()>>::call_once
91.88 s
> note: Some details are omitted, run with `RUST_BACKTRACE=full` for a verbose backtrace.
91.88 s
>
91.88 s
> error : test run failed
91.88 s
>
91.88 s
> ========== nextest test summary ==========
91.88 s
> report: target/nextest/ci_gammaloop/junit.xml
91.88 s
> tests: 129, failures: 5, errors: 0
91.88 s
>
91.88 s
> 1. alphal00p-docs-builder::tests::checked_in_registry_is_valid
91.88 s
> failure: test failure with exit code 101
91.88 s
> thread 'tests::checked_in_registry_is_valid' (194) panicked at crates/alphal00p-docs-builder/src/lib.rs:12178:50:
91.88 s
> called `Result::unwrap()` on an `Err` value: developer note gammaloop-architecture verified scope crates/gammaloop-api/src/commands/integrate.rs changed (expected 0cce8b9517824d09e6199882611aec7d213b638d, found 2d30848b04c82fa24ded354176ba9651792c6bcc); owner review or an explicit no-impact attestation is required
91.88 s
>
91.88 s
> Location:
91.88 s
> crates/alphal00p-docs-builder/src/lib.rs:992:29
91.88 s
> stack backtrace:
91.88 s
> 0: __rustc::rust_begin_unwind
91.88 s
> 1: core::panicking::panic_fmt
91.88 s
> 2: core::result::unwrap_failed
91.88 s
> 3: alphal00p_docs_builder::tests::checked_in_registry_is_valid
91.88 s
> 4: <alphal00p_docs_builder::tests::checked_in_registry_is_valid::{closure#0} as core::ops::function::FnOnce<()>>::call_once
91.88 s
> note: Some details are omitted, run with `RUST_BACKTRACE=full` for a verbose backtrace.
91.88 s
> system-out
91.88 s
> running 1 test
91.88 s
> test tests::checked_in_registry_is_valid ... FAILED
91.88 s
>
91.88 s
> failures:
91.88 s
>
91.88 s
> failures:
91.88 s
> tests::checked_in_registry_is_valid
91.88 s
>
91.88 s
> test result: FAILED. 0 passed; 1 failed; 0 ignored; 0 measured; 128 filtered out; finished in 0.01s
91.88 s
> system-err
91.88 s
> thread 'tests::checked_in_registry_is_valid' (194) panicked at crates/alphal00p-docs-builder/src/lib.rs:12178:50:
91.88 s
> called `Result::unwrap()` on an `Err` value: developer note gammaloop-architecture verified scope crates/gammaloop-api/src/commands/integrate.rs changed (expected 0cce8b9517824d09e6199882611aec7d213b638d, found 2d30848b04c82fa24ded354176ba9651792c6bcc); owner review or an explicit no-impact attestation is required
91.88 s
>
91.88 s
> Location:
91.88 s
> crates/alphal00p-docs-builder/src/lib.rs:992:29
91.88 s
> stack backtrace:
91.88 s
> 0: __rustc::rust_begin_unwind
91.88 s
> 1: core::panicking::panic_fmt
91.88 s
> 2: core::result::unwrap_failed
91.88 s
> 3: alphal00p_docs_builder::tests::checked_in_registry_is_valid
91.88 s
> 4: <alphal00p_docs_builder::tests::checked_in_registry_is_valid::{closure#0} as core::ops::function::FnOnce<()>>::call_once
91.88 s
> note: Some details are omitted, run with `RUST_BACKTRACE=full` for a verbose backtrace.
91.88 s
>
91.88 s
> 2. alphal00p-docs-builder::tests::developer_scope_ranges_ignore_unrelated_edits_and_warn_only_while_watching
91.88 s
> failure: test failure with exit code 101
91.88 s
> thread 'tests::developer_scope_ranges_ignore_unrelated_edits_and_warn_only_while_watching' (278) panicked at crates/alphal00p-docs-builder/src/lib.rs:12263:29:
91.88 s
> called `Result::unwrap()` on an `Err` value: developer note gammaloop-architecture verified scope crates/gammaloop-api/src/commands/integrate.rs changed (expected 0cce8b9517824d09e6199882611aec7d213b638d, found 2d30848b04c82fa24ded354176ba9651792c6bcc); owner review or an explicit no-impact attestation is required
91.88 s
>
91.88 s
> Location:
91.88 s
> crates/alphal00p-docs-builder/src/lib.rs:992:29
91.88 s
> stack backtrace:
91.88 s
> 0: __rustc::rust_begin_unwind
91.88 s
> 1: core::panicking::panic_fmt
91.88 s
> 2: core::result::unwrap_failed
91.88 s
> 3: alphal00p_docs_builder::tests::developer_scope_ranges_ignore_unrelated_edits_and_warn_only_while_watching
91.88 s
> 4: <alphal00p_docs_builder::tests::developer_scope_ranges_ignore_unrelated_edits_and_warn_only_while_watching::{closure#0} as core::ops::function::FnOnce<()>>::call_once
91.88 s
> note: Some details are omitted, run with `RUST_BACKTRACE=full` for a verbose backtrace.
91.88 s
> system-out
91.88 s
> running 1 test
91.88 s
> test tests::developer_scope_ranges_ignore_unrelated_edits_and_warn_only_while_watching ... FAILED
91.88 s
>
91.88 s
> failures:
91.88 s
>
91.88 s
> failures:
91.88 s
> tests::developer_scope_ranges_ignore_unrelated_edits_and_warn_only_while_watching
91.88 s
>
91.88 s
> test result: FAILED. 0 passed; 1 failed; 0 ignored; 0 measured; 128 filtered out; finished in 0.01s
91.88 s
> system-err
91.88 s
> thread 'tests::developer_scope_ranges_ignore_unrelated_edits_and_warn_only_while_watching' (278) panicked at crates/alphal00p-docs-builder/src/lib.rs:12263:29:
91.88 s
> called `Result::unwrap()` on an `Err` value: developer note gammaloop-architecture verified scope crates/gammaloop-api/src/commands/integrate.rs changed (expected 0cce8b9517824d09e6199882611aec7d213b638d, found 2d30848b04c82fa24ded354176ba9651792c6bcc); owner review or an explicit no-impact attestation is required
91.88 s
>
91.88 s
> Location:
91.88 s
> crates/alphal00p-docs-builder/src/lib.rs:992:29
91.88 s
> stack backtrace:
91.88 s
> 0: __rustc::rust_begin_unwind
91.88 s
> 1: core::panicking::panic_fmt
91.88 s
> 2: core::result::unwrap_failed
91.88 s
> 3: alphal00p_docs_builder::tests::developer_scope_ranges_ignore_unrelated_edits_and_warn_only_while_watching
91.88 s
> 4: <alphal00p_docs_builder::tests::developer_scope_ranges_ignore_unrelated_edits_and_warn_only_while_watching::{closure#0} as core::ops::function::FnOnce<()>>::call_once
91.88 s
> note: Some details are omitted, run with `RUST_BACKTRACE=full` for a verbose backtrace.
91.88 s
>
91.88 s
> 3. alphal00p-docs-builder::provenance_tests::each_build_captures_one_revision_before_rendering
91.88 s
> failure: test failure with exit code 101
91.88 s
> thread 'provenance_tests::each_build_captures_one_revision_before_rendering' (168) panicked at crates/alphal00p-docs-builder/src/provenance_tests.rs:274:9:
91.88 s
> assertion failed: command.status().unwrap().success()
91.88 s
> stack backtrace:
91.88 s
> 0: __rustc::rust_begin_unwind
91.88 s
> 1: core::panicking::panic_fmt
91.88 s
> 2: core::panicking::panic
91.88 s
> 3: alphal00p_docs_builder::provenance_tests::each_build_captures_one_revision_before_rendering
91.88 s
> 4: <alphal00p_docs_builder::provenance_tests::each_build_captures_one_revision_before_rendering::{closure#0} as core::ops::function::FnOnce<()>>::call_once
91.88 s
> note: Some details are omitted, run with `RUST_BACKTRACE=full` for a verbose backtrace.
91.88 s
> system-out
91.88 s
> running 1 test
91.88 s
>
91.88 s
> running 1 test
91.88 s
> test provenance_tests::each_build_captures_one_revision_before_rendering ... FAILED
91.88 s
>
91.88 s
> failures:
91.88 s
>
91.88 s
> failures:
91.88 s
> provenance_tests::each_build_captures_one_revision_before_rendering
91.88 s
>
91.88 s
> test result: FAILED. 0 passed; 1 failed; 0 ignored; 0 measured; 128 filtered out; finished in 0.02s
91.88 s
>
91.88 s
> test provenance_tests::each_build_captures_one_revision_before_rendering ... FAILED
91.88 s
>
91.88 s
> failures:
91.88 s
>
91.88 s
> failures:
91.88 s
> provenance_tests::each_build_captures_one_revision_before_rendering
91.88 s
>
91.88 s
> test result: FAILED. 0 passed; 1 failed; 0 ignored; 0 measured; 128 filtered out; finished in 0.03s
91.88 s
> system-err
91.88 s
> thread 'provenance_tests::each_build_captures_one_revision_before_rendering' (234) panicked at crates/alphal00p-docs-builder/src/provenance_tests.rs:297:14:
91.88 s
> called `Result::unwrap()` on an `Err` value: developer note gammaloop-architecture verified scope crates/gammaloop-api/src/commands/integrate.rs changed (expected 0cce8b9517824d09e6199882611aec7d213b638d, found 2d30848b04c82fa24ded354176ba9651792c6bcc); owner review or an explicit no-impact attestation is required
91.88 s
>
91.88 s
> Location:
91.88 s
> crates/alphal00p-docs-builder/src/lib.rs:992:29
91.88 s
> stack backtrace:
91.88 s
> 0: __rustc::rust_begin_unwind
91.88 s
> 1: core::panicking::panic_fmt
91.88 s
> 2: core::result::unwrap_failed
91.88 s
> 3: alphal00p_docs_builder::provenance_tests::each_build_captures_one_revision_before_rendering
91.88 s
> 4: <alphal00p_docs_builder::provenance_tests::each_build_captures_one_revision_before_rendering::{closure#0} as core::ops::function::FnOnce<()>>::call_once
91.88 s
> note: Some details are omitted, run with `RUST_BACKTRACE=full` for a verbose backtrace.
91.88 s
>
91.88 s
> thread 'provenance_tests::each_build_captures_one_revision_before_rendering' (168) panicked at crates/alphal00p-docs-builder/src/provenance_tests.rs:274:9:
91.88 s
> assertion failed: command.status().unwrap().success()
91.88 s
> stack backtrace:
91.88 s
> 0: __rustc::rust_begin_unwind
91.88 s
> 1: core::panicking::panic_fmt
91.88 s
> 2: core::panicking::panic
91.88 s
> 3: alphal00p_docs_builder::provenance_tests::each_build_captures_one_revision_before_rendering
91.88 s
> 4: <alphal00p_docs_builder::provenance_tests::each_build_captures_one_revision_before_rendering::{closure#0} as core::ops::function::FnOnce<()>>::call_once
91.88 s
> note: Some details are omitted, run with `RUST_BACKTRACE=full` for a verbose backtrace.
91.88 s
>
91.88 s
> 4. alphal00p-docs-builder::tests::every_product_requires_a_task_chooser_and_each_supported_interface
91.88 s
> failure: test failure with exit code 101
91.88 s
> thread 'tests::every_product_requires_a_task_chooser_and_each_supported_interface' (301) panicked at crates/alphal00p-docs-builder/src/lib.rs:12192:9:
91.88 s
> assertion failed: format!("{error:#}").contains("has no quickstart page")
91.88 s
> stack backtrace:
91.88 s
> 0: __rustc::rust_begin_unwind
91.88 s
> 1: core::panicking::panic_fmt
91.88 s
> 2: core::panicking::panic
91.88 s
> 3: alphal00p_docs_builder::tests::every_product_requires_a_task_chooser_and_each_supported_interface
91.88 s
> 4: <alphal00p_docs_builder::tests::every_product_requires_a_task_chooser_and_each_supported_interface::{closure#0} as core::ops::function::FnOnce<()>>::call_once
91.88 s
> note: Some details are omitted, run with `RUST_BACKTRACE=full` for a verbose backtrace.
91.88 s
> system-out
91.88 s
> running 1 test
91.88 s
> test tests::every_product_requires_a_task_chooser_and_each_supported_interface ... FAILED
91.88 s
>
91.88 s
> failures:
91.88 s
>
91.88 s
> failures:
91.88 s
> tests::every_product_requires_a_task_chooser_and_each_supported_interface
91.88 s
>
91.88 s
> test result: FAILED. 0 passed; 1 failed; 0 ignored; 0 measured; 128 filtered out; finished in 0.02s
91.88 s
> system-err
91.88 s
> thread 'tests::every_product_requires_a_task_chooser_and_each_supported_interface' (301) panicked at crates/alphal00p-docs-builder/src/lib.rs:12192:9:
91.88 s
> assertion failed: format!("{error:#}").contains("has no quickstart page")
91.88 s
> stack backtrace:
91.88 s
> 0: __rustc::rust_begin_unwind
91.88 s
> 1: core::panicking::panic_fmt
91.88 s
> 2: core::panicking::panic
91.88 s
> 3: alphal00p_docs_builder::tests::every_product_requires_a_task_chooser_and_each_supported_interface
91.88 s
> 4: <alphal00p_docs_builder::tests::every_product_requires_a_task_chooser_and_each_supported_interface::{closure#0} as core::ops::function::FnOnce<()>>::call_once
91.88 s
> note: Some details are omitted, run with `RUST_BACKTRACE=full` for a verbose backtrace.
91.88 s
>
91.88 s
> 5. alphal00p-docs-builder::tests::pdf_manual_chapter_order_must_match_the_page_registry
91.88 s
> failure: test failure with exit code 101
91.88 s
> thread 'tests::pdf_manual_chapter_order_must_match_the_page_registry' (353) panicked at crates/alphal00p-docs-builder/src/lib.rs:12243:9:
91.88 s
> assertion failed: format!("{error:#}").contains("PDF manual chapter order differs")
91.88 s
> stack backtrace:
91.88 s
> 0: __rustc::rust_begin_unwind
91.88 s
> 1: core::panicking::panic_fmt
91.88 s
> 2: core::panicking::panic
91.88 s
> 3: alphal00p_docs_builder::tests::pdf_manual_chapter_order_must_match_the_page_registry
91.88 s
> 4: <alphal00p_docs_builder::tests::pdf_manual_chapter_order_must_match_the_page_registry::{closure#0} as core::ops::function::FnOnce<()>>::call_once
91.88 s
> note: Some details are omitted, run with `RUST_BACKTRACE=full` for a verbose backtrace.
91.88 s
> system-out
91.88 s
> running 1 test
91.88 s
> test tests::pdf_manual_chapter_order_must_match_the_page_registry ... FAILED
91.88 s
>
91.88 s
> failures:
91.88 s
>
91.88 s
> failures:
91.88 s
> tests::pdf_manual_chapter_order_must_match_the_page_registry
91.88 s
>
91.88 s
> test result: FAILED. 0 passed; 1 failed; 0 ignored; 0 measured; 128 filtered out; finished in 0.02s
91.88 s
> system-err
91.88 s
> thread 'tests::pdf_manual_chapter_order_must_match_the_page_registry' (353) panicked at crates/alphal00p-docs-builder/src/lib.rs:12243:9:
91.88 s
> assertion failed: format!("{error:#}").contains("PDF manual chapter order differs")
91.88 s
> stack backtrace:
91.88 s
> 0: __rustc::rust_begin_unwind
91.88 s
> 1: core::panicking::panic_fmt
91.88 s
> 2: core::panicking::panic
91.88 s
> 3: alphal00p_docs_builder::tests::pdf_manual_chapter_order_must_match_the_page_registry
91.88 s
> 4: <alphal00p_docs_builder::tests::pdf_manual_chapter_order_must_match_the_page_registry::{closure#0} as core::ops::function::FnOnce<()>>::call_once
91.88 s
> note: Some details are omitted, run with `RUST_BACKTRACE=full` for a verbose backtrace.
91.88 s
> =========================================
91.88 s
> Extracting 2 binaries to /build/source
91.88 s
> Extracted 5 files to /build/source in 0.04s
91.88 s
> ------------
91.88 s
> Nextest run ID fdb7f154-ee8a-46c2-b82f-bd9ed37c12e2 with nextest profile: ci_gammaloop
91.88 s
> Starting 22 tests across 2 binaries
91.88 s
> ------------
91.88 s
> Summary [ 0.081s] 22 tests run: 22 passed , 0 skipped
91.88 s
>
91.88 s
> ========== nextest test summary ==========
91.88 s
> report: target/nextest/ci_gammaloop/junit.xml
91.88 s
> tests: 22, failures: 0, errors: 0
91.88 s
> No failing testcases found.
91.88 s
> =========================================
91.88 s
> Extracting 3 binaries (including 2 non-test binaries), 1 build script output directory, and 2 linked paths to /build/source
91.88 s
> Extracted 22 files to /build/source in 0.35s
91.88 s
> ------------
91.88 s
> Nextest run ID 6d1261e6-4850-4d09-9602-030ce1995e10 with nextest profile: ci_gammaloop
91.88 s
> Starting 89 tests across 1 binary
91.88 s
> ------------
91.88 s
> Summary [ 0.131s] 89 tests run: 89 passed , 0 skipped
91.88 s
>
91.88 s
> ========== nextest test summary ==========
91.88 s
> report: target/nextest/ci_gammaloop/junit.xml
91.88 s
> tests: 89, failures: 0, errors: 0
91.88 s
> No failing testcases found.
91.88 s
> =========================================
91.88 s
> Extracting 2 binaries to /build/source
91.88 s
> Extracted 5 files to /build/source in 0.07s
91.88 s
> ------------
91.88 s
> Nextest run ID 66be2362-347d-41e2-9211-a150a78ad05c with nextest profile: ci_gammaloop
91.88 s
> Starting 10 tests across 2 binaries
91.88 s
> ------------
91.88 s
> Summary [ 15.495s] 10 tests run: 10 passed , 0 skipped
91.88 s
>
91.88 s
> ========== nextest test summary ==========
91.88 s
> report: target/nextest/ci_gammaloop/junit.xml
91.88 s
> tests: 10, failures: 0, errors: 0
91.88 s
> No failing testcases found.
91.88 s
> =========================================
91.88 s
> Extracting 1 binary to /build/source
91.88 s
> Extracted 4 files to /build/source in 0.04s
91.88 s
> ------------
91.88 s
> Nextest run ID edd731d1-4c48-47e7-90ac-e6d7b791c4be with nextest profile: ci_gammaloop
91.88 s
> Starting 0 tests across 1 binary
91.88 s
> ------------
91.88 s
> Summary [ 0.000s] 0 tests run: 0 passed , 0 skipped
91.88 s
>
91.88 s
> ========== nextest test summary ==========
91.88 s
> report: target/nextest/ci_gammaloop/junit.xml
91.88 s
> tests: 0, failures: 0, errors: 0
91.88 s
> No failing testcases found.
91.88 s
> =========================================
91.88 s
> Extracting 1 binary to /build/source
91.88 s
> Extracted 4 files to /build/source in 0.04s
91.88 s
> ------------
91.88 s
> Nextest run ID 7c10e4ce-3aa6-460d-a3c9-6bed1ac9e0a2 with nextest profile: ci_gammaloop
91.88 s
> Starting 5 tests across 1 binary
91.88 s
> ------------
91.88 s
> Summary [ 0.004s] 5 tests run: 5 passed , 0 skipped
91.88 s
>
91.88 s
> ========== nextest test summary ==========
91.88 s
> report: target/nextest/ci_gammaloop/junit.xml
91.88 s
> tests: 5, failures: 0, errors: 0
91.88 s
> No failing testcases found.
91.88 s
> =========================================
91.88 s
For full logs, run:
91.88 s
nix log /nix/store/yjk1y7kxjjry446ij49xzficzijvkxpq-gammaloop-nextest-docs.drv
92.10 s
[2 built (1 failed ), 103 Run failed.