0.00 s
$ /nix/store/61685rbaxmpigwi3z23i33sv3jyfl70q-coreutils-9.11/bin/timeout --kill-after=15s 7200s /nix/store/wknkybkzrc16r11vk5vrykh4wmw7a353-nix-2.34.8/bin/nix --extra-experimental-features nix-command --extra-experimental-features flakes flake clone git+https://github.com/alphal00p/gammaloop --dest /tmp/nix-ci-worker/stable-pwd/repo/
0.09 s
Cloning into '/tmp/nix-ci-worker/stable-pwd/repo'...
0.84 s
remote: Enumerating objects: 108237, done.
0.96 s
remote: Counting objects: 0% (1/11633)
remote: Counting objects: 1% (117/11633)
remote: Counting objects: 2% (233/11633)
remote: Counting objects: 3% (349/11633)
remote: Counting objects: 4% (466/11633)
remote: Counting objects: 5% (582/11633)
remote: Counting objects: 6% (698/11633)
remote: Counting objects: 7% (815/11633)
remote: Counting objects: 8% (931/11633)
remote: Counting objects: 9% (1047/11633)
remote: Counting objects: 10% (1164/11633)
remote: Counting objects: 11% (1280/11633)
remote: Counting objects: 12% (1396/11633)
remote: Counting objects: 13% (1513/11633)
remote: Counting objects: 14% (1629/11633)
remote: Counting objects: 15% (1745/11633)
remote: Counting objects: 16% (1862/11633)
remote: Counting objects: 17% (1978/11633)
remote: Counting objects: 18% (2094/11633)
remote: Counting objects: 19% (2211/11633)
remote: Counting objects: 20% (2327/11633)
remote: Counting objects: 21% (2443/11633)
remote: Counting objects: 22% (2560/11633)
remote: Counting objects: 23% (2676/11633)
remote: Counting objects: 24% (2792/11633)
remote: Counting objects: 25% (2909/11633)
remote: Counting objects: 26% (3025/11633)
remote: Counting objects: 27% (3141/11633)
remote: Counting objects: 28% (3258/11633)
remote: Counting objects: 29% (3374/11633)
remote: Counting objects: 30% (3490/11633)
remote: Counting objects: 31% (3607/11633)
remote: Counting objects: 32% (3723/11633)
remote: Counting objects: 33% (3839/11633)
remote: Counting objects: 34% (3956/11633)
remote: Counting objects: 35% (4072/11633)
remote: Counting objects: 36% (4188/11633)
remote: Counting objects: 37% (4305/11633)
remote: Counting objects: 38% (4421/11633)
remote: Counting objects: 39% (4537/11633)
remote: Counting objects: 40% (4654/11633)
remote: Counting objects: 41% (4770/11633)
remote: Counting objects: 42% (4886/11633)
remote: Counting objects: 43% (5003/11633)
remote: Counting objects: 44% (5119/11633)
remote: Counting objects: 45% (5235/11633)
remote: Counting objects: 46% (5352/11633)
remote: Counting objects: 47% (5468/11633)
remote: Counting objects: 48% (5584/11633)
remote: Counting objects: 49% (5701/11633)
remote: Counting objects: 50% (5817/11633)
remote: Counting objects: 51% (5933/11633)
remote: Counting objects: 52% (6050/11633)
remote: Counting objects: 53% (6166/11633)
remote: Counting objects: 54% (6282/11633)
remote: Counting objects: 55% (6399/11633)
remote: Counting objects: 56% (6515/11633)
remote: Counting objects: 57% (6631/11633)
remote: Counting objects: 58% (6748/11633)
remote: Counting objects: 59% (6864/11633)
remote: Counting objects: 60% (6980/11633)
remote: Counting objects: 61% (7097/11633)
remote: Counting objects: 62% (7213/11633)
remote: Counting objects: 63% (7329/11633)
remote: Counting objects: 64% (7446/11633)
remote: Counting objects: 65% (7562/11633)
remote: Counting objects: 66% (7678/11633)
remote: Counting objects: 67% (7795/11633)
remote: Counting objects: 68% (7911/11633)
remote: Counting objects: 69% (8027/11633)
remote: Counting objects: 70% (8144/11633)
remote: Counting objects: 71% (8260/11633)
remote: Counting objects: 72% (8376/11633)
remote: Counting objects: 73% (8493/11633)
remote: Counting objects: 74% (8609/11633)
remote: Counting objects: 75% (8725/11633)
remote: Counting objects: 76% (8842/11633)
remote: Counting objects: 77% (8958/11633)
remote: Counting objects: 78% (9074/11633)
remote: Counting objects: 79% (9191/11633)
remote: Counting objects: 80% (9307/11633)
remote: Counting objects: 81% (9423/11633)
remote: Counting objects: 82% (9540/11633)
remote: Counting objects: 83% (9656/11633)
remote: Counting objects: 84% (9772/11633)
remote: Counting objects: 85% (9889/11633)
remote: Counting objects: 86% (10005/11633)
remote: Counting objects: 87% (10121/11633)
remote: Counting objects: 88% (10238/11633)
remote: Counting objects: 89% (10354/11633)
remote: Counting objects: 90% (10470/11633)
remote: Counting objects: 91% (10587/11633)
remote: Counting objects: 92% (10703/11633)
remote: Counting objects: 93% (10819/11633)
remote: Counting objects: 94% (10936/11633)
remote: Counting objects: 95% (11052/11633)
remote: Counting objects: 96% (11168/11633)
remote: Counting objects: 97% (11285/11633)
remote: Counting objects: 98% (11401/11633)
remote: Counting objects: 99% (11517/11633)
remote: Counting objects: 100% (11633/11633)
remote: Counting objects: 100% (11633/11633), done.
3.60 s
remote: Compressing objects: 0% (1/2152)
remote: Compressing objects: 1% (22/2152)
remote: Compressing objects: 2% (44/2152)
remote: Compressing objects: 3% (65/2152)
remote: Compressing objects: 4% (87/2152)
remote: Compressing objects: 5% (108/2152)
remote: Compressing objects: 6% (130/2152)
remote: Compressing objects: 7% (151/2152)
remote: Compressing objects: 8% (173/2152)
remote: Compressing objects: 9% (194/2152)
remote: Compressing objects: 10% (216/2152)
remote: Compressing objects: 11% (237/2152)
remote: Compressing objects: 12% (259/2152)
remote: Compressing objects: 13% (280/2152)
remote: Compressing objects: 14% (302/2152)
remote: Compressing objects: 14% (308/2152)
remote: Compressing objects: 15% (323/2152)
remote: Compressing objects: 16% (345/2152)
remote: Compressing objects: 17% (366/2152)
remote: Compressing objects: 18% (388/2152)
remote: Compressing objects: 19% (409/2152)
remote: Compressing objects: 20% (431/2152)
remote: Compressing objects: 21% (452/2152)
remote: Compressing objects: 22% (474/2152)
remote: Compressing objects: 23% (495/2152)
remote: Compressing objects: 24% (517/2152)
remote: Compressing objects: 25% (538/2152)
remote: Compressing objects: 26% (560/2152)
remote: Compressing objects: 27% (582/2152)
remote: Compressing objects: 28% (603/2152)
remote: Compressing objects: 29% (625/2152)
remote: Compressing objects: 30% (646/2152)
remote: Compressing objects: 31% (668/2152)
remote: Compressing objects: 32% (689/2152)
remote: Compressing objects: 33% (711/2152)
remote: Compressing objects: 34% (732/2152)
remote: Compressing objects: 35% (754/2152)
remote: Compressing objects: 36% (775/2152)
remote: Compressing objects: 37% (797/2152)
remote: Compressing objects: 38% (818/2152)
remote: Compressing objects: 39% (840/2152)
remote: Compressing objects: 40% (861/2152)
remote: Compressing objects: 41% (883/2152)
remote: Compressing objects: 42% (904/2152)
remote: Compressing objects: 43% (926/2152)
remote: Compressing objects: 44% (947/2152)
remote: Compressing objects: 45% (969/2152)
remote: Compressing objects: 46% (990/2152)
remote: Compressing objects: 47% (1012/2152)
remote: Compressing objects: 48% (1033/2152)
remote: Compressing objects: 49% (1055/2152)
remote: Compressing objects: 50% (1076/2152)
remote: Compressing objects: 51% (1098/2152)
remote: Compressing objects: 52% (1120/2152)
remote: Compressing objects: 53% (1141/2152)
remote: Compressing objects: 54% (1163/2152)
remote: Compressing objects: 55% (1184/2152)
remote: Compressing objects: 56% (1206/2152)
remote: Compressing objects: 57% (1227/2152)
remote: Compressing objects: 58% (1249/2152)
remote: Compressing objects: 59% (1270/2152)
remote: Compressing objects: 60% (1292/2152)
remote: Compressing objects: 61% (1313/2152)
remote: Compressing objects: 62% (1335/2152)
remote: Compressing objects: 63% (1356/2152)
remote: Compressing objects: 64% (1378/2152)
remote: Compressing objects: 65% (1399/2152)
remote: Compressing objects: 66% (1421/2152)
remote: Compressing objects: 67% (1442/2152)
remote: Compressing objects: 68% (1464/2152)
remote: Compressing objects: 69% (1485/2152)
remote: Compressing objects: 70% (1507/2152)
remote: Compressing objects: 71% (1528/2152)
remote: Compressing objects: 72% (1550/2152)
remote: Compressing objects: 73% (1571/2152)
remote: Compressing objects: 74% (1593/2152)
remote: Compressing objects: 75% (1614/2152)
remote: Compressing objects: 76% (1636/2152)
remote: Compressing objects: 77% (1658/2152)
remote: Compressing objects: 78% (1679/2152)
remote: Compressing objects: 79% (1701/2152)
remote: Compressing objects: 80% (1722/2152)
remote: Compressing objects: 81% (1744/2152)
remote: Compressing objects: 82% (1765/2152)
remote: Compressing objects: 83% (1787/2152)
remote: Compressing objects: 84% (1808/2152)
remote: Compressing objects: 85% (1830/2152)
remote: Compressing objects: 86% (1851/2152)
remote: Compressing objects: 87% (1873/2152)
remote: Compressing objects: 88% (1894/2152)
remote: Compressing objects: 89% (1916/2152)
remote: Compressing objects: 90% (1937/2152)
remote: Compressing objects: 91% (1959/2152)
remote: Compressing objects: 92% (1980/2152)
remote: Compressing objects: 93% (2002/2152)
remote: Compressing objects: 94% (2023/2152)
remote: Compressing objects: 95% (2045/2152)
remote: Compressing objects: 96% (2066/2152)
remote: Compressing objects: 97% (2088/2152)
remote: Compressing objects: 98% (2109/2152)
remote: Compressing objects: 99% (2131/2152)
remote: Compressing objects: 100% (2152/2152)
remote: Compressing objects: 100% (2152/2152), done.
17.63 s
Receiving objects: 0% (1/108237)
Receiving objects: 1% (1083/108237)
Receiving objects: 2% (2165/108237)
Receiving objects: 3% (3248/108237), 11.15 MiB | 21.78 MiB/s
Receiving objects: 4% (4330/108237), 11.15 MiB | 21.78 MiB/s
Receiving objects: 5% (5412/108237), 11.15 MiB | 21.78 MiB/s
Receiving objects: 5% (5488/108237), 11.15 MiB | 21.78 MiB/s
Receiving objects: 6% (6495/108237), 22.55 MiB | 22.28 MiB/s
Receiving objects: 7% (7577/108237), 22.55 MiB | 22.28 MiB/s
Receiving objects: 8% (8659/108237), 22.55 MiB | 22.28 MiB/s
Receiving objects: 9% (9742/108237), 22.55 MiB | 22.28 MiB/s
Receiving objects: 10% (10824/108237), 32.63 MiB | 21.58 MiB/s
Receiving objects: 11% (11907/108237), 32.63 MiB | 21.58 MiB/s
Receiving objects: 12% (12989/108237), 32.63 MiB | 21.58 MiB/s
Receiving objects: 13% (14071/108237), 32.63 MiB | 21.58 MiB/s
Receiving objects: 14% (15154/108237), 32.63 MiB | 21.58 MiB/s
Receiving objects: 15% (16236/108237), 32.63 MiB | 21.58 MiB/s
Receiving objects: 16% (17318/108237), 32.63 MiB | 21.58 MiB/s
Receiving objects: 17% (18401/108237), 32.63 MiB | 21.58 MiB/s
Receiving objects: 18% (19483/108237), 32.63 MiB | 21.58 MiB/s
Receiving objects: 19% (20566/108237), 32.63 MiB | 21.58 MiB/s
Receiving objects: 20% (21648/108237), 32.63 MiB | 21.58 MiB/s
Receiving objects: 21% (22730/108237), 32.63 MiB | 21.58 MiB/s
Receiving objects: 22% (23813/108237), 32.63 MiB | 21.58 MiB/s
Receiving objects: 23% (24895/108237), 32.63 MiB | 21.58 MiB/s
Receiving objects: 24% (25977/108237), 32.63 MiB | 21.58 MiB/s
Receiving objects: 25% (27060/108237), 32.63 MiB | 21.58 MiB/s
Receiving objects: 25% (27859/108237), 32.63 MiB | 21.58 MiB/s
Receiving objects: 26% (28142/108237), 47.07 MiB | 23.40 MiB/s
Receiving objects: 27% (29224/108237), 47.07 MiB | 23.40 MiB/s
Receiving objects: 28% (30307/108237), 47.07 MiB | 23.40 MiB/s
Receiving objects: 29% (31389/108237), 47.07 MiB | 23.40 MiB/s
Receiving objects: 30% (32472/108237), 47.07 MiB | 23.40 MiB/s
Receiving objects: 31% (33554/108237), 47.07 MiB | 23.40 MiB/s
Receiving objects: 32% (34636/108237), 47.07 MiB | 23.40 MiB/s
Receiving objects: 33% (35719/108237), 47.07 MiB | 23.40 MiB/s
Receiving objects: 34% (36801/108237), 47.07 MiB | 23.40 MiB/s
Receiving objects: 35% (37883/108237), 47.07 MiB | 23.40 MiB/s
Receiving objects: 36% (38966/108237), 47.07 MiB | 23.40 MiB/s
Receiving objects: 37% (40048/108237), 47.07 MiB | 23.40 MiB/s
Receiving objects: 38% (41131/108237), 47.07 MiB | 23.40 MiB/s
Receiving objects: 39% (42213/108237), 60.25 MiB | 23.98 MiB/s
Receiving objects: 40% (43295/108237), 60.25 MiB | 23.98 MiB/s
Receiving objects: 41% (44378/108237), 60.25 MiB | 23.98 MiB/s
Receiving objects: 42% (45460/108237), 60.25 MiB | 23.98 MiB/s
Receiving objects: 43% (46542/108237), 60.25 MiB | 23.98 MiB/s
Receiving objects: 43% (47126/108237), 60.25 MiB | 23.98 MiB/s
Receiving objects: 44% (47625/108237), 60.25 MiB | 23.98 MiB/s
Receiving objects: 45% (48707/108237), 73.34 MiB | 24.35 MiB/s
Receiving objects: 46% (49790/108237), 73.34 MiB | 24.35 MiB/s
Receiving objects: 47% (50872/108237), 73.34 MiB | 24.35 MiB/s
Receiving objects: 48% (51954/108237), 73.34 MiB | 24.35 MiB/s
Receiving objects: 49% (53037/108237), 73.34 MiB | 24.35 MiB/s
Receiving objects: 50% (54119/108237), 85.61 MiB | 24.38 MiB/s
Receiving objects: 51% (55201/108237), 85.61 MiB | 24.38 MiB/s
Receiving objects: 52% (56284/108237), 85.61 MiB | 24.38 MiB/s
Receiving objects: 53% (57366/108237), 85.61 MiB | 24.38 MiB/s
Receiving objects: 54% (58448/108237), 85.61 MiB | 24.38 MiB/s
Receiving objects: 54% (58913/108237), 99.81 MiB | 24.44 MiB/s
Receiving objects: 55% (59531/108237), 99.81 MiB | 24.44 MiB/s
Receiving objects: 56% (60613/108237), 99.81 MiB | 24.44 MiB/s
Receiving objects: 57% (61696/108237), 99.81 MiB | 24.44 MiB/s
Receiving objects: 58% (62778/108237), 99.81 MiB | 24.44 MiB/s
Receiving objects: 59% (63860/108237), 99.81 MiB | 24.44 MiB/s
Receiving objects: 60% (64943/108237), 114.31 MiB | 24.94 MiB/s
Receiving objects: 61% (66025/108237), 114.31 MiB | 24.94 MiB/s
Receiving objects: 62% (67107/108237), 114.31 MiB | 24.94 MiB/s
Receiving objects: 62% (67506/108237), 114.31 MiB | 24.94 MiB/s
Receiving objects: 63% (68190/108237), 129.02 MiB | 25.78 MiB/s
Receiving objects: 63% (68383/108237), 144.40 MiB | 26.66 MiB/s
Receiving objects: 64% (69272/108237), 159.77 MiB | 27.81 MiB/s
Receiving objects: 64% (70317/108237), 189.68 MiB | 27.88 MiB/s
Receiving objects: 65% (70355/108237), 205.27 MiB | 28.42 MiB/s
Receiving objects: 65% (70389/108237), 205.27 MiB | 28.42 MiB/s
Receiving objects: 65% (70478/108237), 237.18 MiB | 30.04 MiB/s
Receiving objects: 66% (71437/108237), 267.61 MiB | 30.30 MiB/s
Receiving objects: 67% (72519/108237), 267.61 MiB | 30.30 MiB/s
Receiving objects: 68% (73602/108237), 267.61 MiB | 30.30 MiB/s
Receiving objects: 69% (74684/108237), 267.61 MiB | 30.30 MiB/s
Receiving objects: 70% (75766/108237), 267.61 MiB | 30.30 MiB/s
Receiving objects: 71% (76849/108237), 267.61 MiB | 30.30 MiB/s
Receiving objects: 71% (77189/108237), 267.61 MiB | 30.30 MiB/s
Receiving objects: 72% (77931/108237), 284.22 MiB | 30.44 MiB/s
Receiving objects: 73% (79014/108237), 284.22 MiB | 30.44 MiB/s
Receiving objects: 74% (80096/108237), 284.22 MiB | 30.44 MiB/s
Receiving objects: 75% (81178/108237), 284.22 MiB | 30.44 MiB/s
Receiving objects: 76% (82261/108237), 284.22 MiB | 30.44 MiB/s
Receiving objects: 77% (83343/108237), 284.22 MiB | 30.44 MiB/s
Receiving objects: 78% (84425/108237), 284.22 MiB | 30.44 MiB/s
Receiving objects: 79% (85508/108237), 284.22 MiB | 30.44 MiB/s
Receiving objects: 80% (86590/108237), 284.22 MiB | 30.44 MiB/s
Receiving objects: 81% (87672/108237), 284.22 MiB | 30.44 MiB/s
Receiving objects: 82% (88755/108237), 300.38 MiB | 30.38 MiB/s
Receiving objects: 82% (89010/108237), 300.38 MiB | 30.38 MiB/s
Receiving objects: 83% (89837/108237), 316.16 MiB | 30.77 MiB/s
Receiving objects: 84% (90920/108237), 316.16 MiB | 30.77 MiB/s
Receiving objects: 85% (92002/108237), 332.05 MiB | 31.23 MiB/s
Receiving objects: 86% (93084/108237), 332.05 MiB | 31.23 MiB/s
Receiving objects: 87% (94167/108237), 332.05 MiB | 31.23 MiB/s
Receiving objects: 87% (95169/108237), 332.05 MiB | 31.23 MiB/s
Receiving objects: 88% (95249/108237), 332.05 MiB | 31.23 MiB/s
Receiving objects: 88% (95713/108237), 363.89 MiB | 31.30 MiB/s
Receiving objects: 89% (96331/108237), 379.96 MiB | 31.33 MiB/s
Receiving objects: 90% (97414/108237), 395.98 MiB | 31.40 MiB/s
Receiving objects: 91% (98496/108237), 395.98 MiB | 31.40 MiB/s
Receiving objects: 92% (99579/108237), 395.98 MiB | 31.40 MiB/s
Receiving objects: 93% (100661/108237), 395.98 MiB | 31.40 MiB/s
Receiving objects: 94% (101743/108237), 395.98 MiB | 31.40 MiB/s
Receiving objects: 95% (102826/108237), 395.98 MiB | 31.40 MiB/s
Receiving objects: 96% (103908/108237), 395.98 MiB | 31.40 MiB/s
Receiving objects: 97% (104990/108237), 395.98 MiB | 31.40 MiB/s
Receiving objects: 98% (106073/108237), 395.98 MiB | 31.40 MiB/s
Receiving objects: 99% (107155/108237), 395.98 MiB | 31.40 MiB/s
Receiving objects: 99% (107938/108237), 395.98 MiB | 31.40 MiB/s
remote: Total 108237 (delta 10287), reused 9528 (delta 9476), pack-reused 96604 (from 1)
17.64 s
Receiving objects: 100% (108237/108237), 395.98 MiB | 31.40 MiB/s
Receiving objects: 100% (108237/108237), 404.46 MiB | 28.81 MiB/s, done.
19.09 s
Resolving deltas: 0% (0/72030)
Resolving deltas: 1% (721/72030)
Resolving deltas: 2% (1441/72030)
Resolving deltas: 3% (2161/72030)
Resolving deltas: 4% (2882/72030)
Resolving deltas: 5% (3602/72030)
Resolving deltas: 6% (4322/72030)
Resolving deltas: 7% (5043/72030)
Resolving deltas: 8% (5763/72030)
Resolving deltas: 9% (6483/72030)
Resolving deltas: 10% (7203/72030)
Resolving deltas: 11% (7924/72030)
Resolving deltas: 12% (8644/72030)
Resolving deltas: 13% (9364/72030)
Resolving deltas: 14% (10085/72030)
Resolving deltas: 15% (10805/72030)
Resolving deltas: 16% (11525/72030)
Resolving deltas: 17% (12246/72030)
Resolving deltas: 18% (12966/72030)
Resolving deltas: 19% (13688/72030)
Resolving deltas: 20% (14406/72030)
Resolving deltas: 21% (15127/72030)
Resolving deltas: 22% (15847/72030)
Resolving deltas: 23% (16568/72030)
Resolving deltas: 24% (17288/72030)
Resolving deltas: 25% (18008/72030)
Resolving deltas: 26% (18728/72030)
Resolving deltas: 27% (19449/72030)
Resolving deltas: 28% (20169/72030)
Resolving deltas: 29% (20889/72030)
Resolving deltas: 30% (21610/72030)
Resolving deltas: 31% (22330/72030)
Resolving deltas: 32% (23051/72030)
Resolving deltas: 33% (23773/72030)
Resolving deltas: 34% (24491/72030)
Resolving deltas: 35% (25211/72030)
Resolving deltas: 36% (25931/72030)
Resolving deltas: 37% (26652/72030)
Resolving deltas: 38% (27372/72030)
Resolving deltas: 39% (28092/72030)
Resolving deltas: 40% (28812/72030)
Resolving deltas: 41% (29533/72030)
Resolving deltas: 42% (30253/72030)
Resolving deltas: 43% (30976/72030)
Resolving deltas: 44% (31694/72030)
Resolving deltas: 45% (32414/72030)
Resolving deltas: 46% (33134/72030)
Resolving deltas: 47% (33856/72030)
Resolving deltas: 48% (34575/72030)
Resolving deltas: 49% (35295/72030)
Resolving deltas: 50% (36016/72030)
Resolving deltas: 51% (36736/72030)
Resolving deltas: 52% (37456/72030)
Resolving deltas: 53% (38176/72030)
Resolving deltas: 54% (38897/72030)
Resolving deltas: 55% (39617/72030)
Resolving deltas: 56% (40337/72030)
Resolving deltas: 57% (41058/72030)
Resolving deltas: 58% (41780/72030)
Resolving deltas: 59% (42498/72030)
Resolving deltas: 60% (43218/72030)
Resolving deltas: 61% (43939/72030)
Resolving deltas: 62% (44659/72030)
Resolving deltas: 63% (45379/72030)
Resolving deltas: 64% (46100/72030)
Resolving deltas: 65% (46820/72030)
Resolving deltas: 65% (47103/72030)
Resolving deltas: 66% (47540/72030)
Resolving deltas: 67% (48261/72030)
Resolving deltas: 68% (48981/72030)
Resolving deltas: 69% (49701/72030)
Resolving deltas: 70% (50421/72030)
Resolving deltas: 71% (51142/72030)
Resolving deltas: 72% (51862/72030)
Resolving deltas: 73% (52582/72030)
Resolving deltas: 74% (53303/72030)
Resolving deltas: 75% (54023/72030)
Resolving deltas: 76% (54743/72030)
Resolving deltas: 77% (55464/72030)
Resolving deltas: 78% (56185/72030)
Resolving deltas: 79% (56904/72030)
Resolving deltas: 80% (57624/72030)
Resolving deltas: 81% (58347/72030)
Resolving deltas: 82% (59065/72030)
Resolving deltas: 83% (59785/72030)
Resolving deltas: 84% (60506/72030)
Resolving deltas: 85% (61226/72030)
Resolving deltas: 86% (61946/72030)
Resolving deltas: 87% (62667/72030)
Resolving deltas: 88% (63387/72030)
Resolving deltas: 89% (64107/72030)
Resolving deltas: 90% (64827/72030)
Resolving deltas: 91% (65548/72030)
Resolving deltas: 92% (66270/72030)
Resolving deltas: 93% (66988/72030)
Resolving deltas: 94% (67710/72030)
Resolving deltas: 95% (68429/72030)
Resolving deltas: 96% (69149/72030)
Resolving deltas: 97% (69870/72030)
Resolving deltas: 98% (70591/72030)
Resolving deltas: 99% (71310/72030)
Resolving deltas: 100% (72030/72030)
Resolving deltas: 100% (72030/72030), done.
19.89 s
Fetching commit 44d1b86627a99f25ed3d9d1f88a3043a5575680c for finite_T_and_mu ...
19.89 s
$ /nix/store/5vpcfsdx1lcnlb2y4k7xyc74shp5qwbh-git-2.54.0/bin/git fetch origin 44d1b86627a99f25ed3d9d1f88a3043a5575680c
20.34 s
From https://github.com/alphal00p/gammaloop
20.34 s
* branch 44d1b86627a99f25ed3d9d1f88a3043a5575680c -> FETCH_HEAD
20.35 s
$ /nix/store/61685rbaxmpigwi3z23i33sv3jyfl70q-coreutils-9.11/bin/timeout --kill-after=15s 7200s /nix/store/5vpcfsdx1lcnlb2y4k7xyc74shp5qwbh-git-2.54.0/bin/git -c advice.detachedHead=false checkout 44d1b86627a99f25ed3d9d1f88a3043a5575680c
20.64 s
HEAD is now at 44d1b8662 adapt thermal test fixtures to graph validation
20.64 s
$ /nix/store/61685rbaxmpigwi3z23i33sv3jyfl70q-coreutils-9.11/bin/timeout --kill-after=15s 7200s /nix/store/wknkybkzrc16r11vk5vrykh4wmw7a353-nix-2.34.8/bin/nix --extra-experimental-features nix-command --extra-experimental-features flakes --log-format internal-json run .#packages.x86_64-linux.nix-ci-check-gammaloop-nextest-docs --print-build-logs
20.77 s
warning: ignoring untrusted flake configuration setting 'extra-substituters'.
20.77 s
Pass '--accept-flake-config' to trust it
20.77 s
warning: ignoring untrusted flake configuration setting 'extra-trusted-public-keys'.
20.77 s
Pass '--accept-flake-config' to trust it
20.77 s
20.98 s
do you want to allow configuration setting 'extra-substituters' to be set to 'https://cache.nix-ci.com ' (y/N)? do you want to permanently mark this value as untrusted (y/N)? warning: ignoring untrusted flake configuration setting 'extra-substituters'.
20.98 s
Pass '--accept-flake-config' to trust it
20.98 s
evaluating derivation 'gdo you want to allow configuration setting 'extra-trusted-public-keys' to be set to 'nix-ci:g3xV5BDTLtIBZr/A00IU1x0EtKKlb7YLgBN2SgYgM6A= ' (y/N)? do you want to permanently mark this value as untrusted (y/N)? warning: ignoring untrusted flake configuration setting 'extra-trusted-public-keys'.
20.98 s
Pass '--accept-flake-config' to trust it
30.55 s
copying '/nix/store/b5zm
evaluating derivation 'g
copying '/nix/store/b5zm
evaluating derivation 'g
copying '/nix/store/b5zm
evaluating derivation 'g
copying '/nix/store/b5zm
evaluating derivation 'g
copying '/nix/store/b5zm
evaluating derivation 'g
copying '/nix/store/b5zm
evaluating derivation 'g
copying '/nix/store/b5zm
evaluating derivation 'g
copying '/nix/store/b5zm
evaluating derivation 'g
copying '/nix/store/b5zm
evaluating derivation 'g
[0 /16 built]
[0 /1 built]
[1 /0 /1 built] building g gammaloop-nextest-docs> Extracting 2 binaries to /build/source
30.65 s
gammaloop-nextest-docs> Extracted 5 files to /build/source in 0.10s
30.66 s
gammaloop-nextest-docs> ------------
30.66 s
gammaloop-nextest-docs> Nextest run ID b598a16a-ec0b-4331-9661-26ab9e4ef96f with nextest profile: ci_gammaloop
30.66 s
gammaloop-nextest-docs> Starting 129 tests across 2 binaries
30.72 s
gammaloop-nextest-docs> FAIL [ 0.060s] ( 7/129) alphal00p-docs-builder tests :: checked_in_registry_is_valid
30.72 s
gammaloop-nextest-docs> stdout ---
30.72 s
gammaloop-nextest-docs>
30.72 s
gammaloop-nextest-docs> running 1 test
30.72 s
gammaloop-nextest-docs> test tests::checked_in_registry_is_valid ... FAILED
30.72 s
gammaloop-nextest-docs>
30.73 s
gammaloop-nextest-docs> failures:
30.73 s
gammaloop-nextest-docs>
30.73 s
gammaloop-nextest-docs> failures:
30.73 s
gammaloop-nextest-docs> tests::checked_in_registry_is_valid
30.73 s
gammaloop-nextest-docs>
30.73 s
gammaloop-nextest-docs> test result: FAILED. 0 passed; 1 failed; 0 ignored; 0 measured; 128 filtered out; finished in 0.02s
30.73 s
gammaloop-nextest-docs>
30.73 s
gammaloop-nextest-docs> stderr ---
30.73 s
gammaloop-nextest-docs>
30.73 s
gammaloop-nextest-docs> thread 'tests::checked_in_registry_is_valid' (170) panicked at crates/alphal00p-docs-builder/src/lib.rs:12178:50:
30.73 s
gammaloop-nextest-docs> called `Result::unwrap()` on an `Err` value: developer note gammaloop-architecture verified scope crates/gammaloop-api/src/commands/integrate.rs changed (expected 0cce8b9517824d09e6199882611aec7d213b638d, found 2d30848b04c82fa24ded354176ba9651792c6bcc); owner review or an explicit no-impact attestation is required
30.73 s
gammaloop-nextest-docs>
30.73 s
gammaloop-nextest-docs> Location:
30.73 s
gammaloop-nextest-docs> crates/alphal00p-docs-builder/src/lib.rs:992:29
30.73 s
gammaloop-nextest-docs> stack backtrace:
30.73 s
gammaloop-nextest-docs> 0: __rustc::rust_begin_unwind
30.73 s
gammaloop-nextest-docs> 1: core::panicking::panic_fmt
30.73 s
gammaloop-nextest-docs> 2: core::result::unwrap_failed
30.73 s
gammaloop-nextest-docs> 3: alphal00p_docs_builder::tests::checked_in_registry_is_valid
30.73 s
gammaloop-nextest-docs> 4: <alphal00p_docs_builder::tests::checked_in_registry_is_valid::{closure#0} as core::ops::function::FnOnce<()>>::call_once
30.73 s
gammaloop-nextest-docs> note: Some details are omitted, run with `RUST_BACKTRACE=full` for a verbose backtrace.
30.73 s
gammaloop-nextest-docs>
30.75 s
gammaloop-nextest-docs> FAIL [ 0.083s] ( 20/129) alphal00p-docs-builder provenance_tests :: each_build_captures_one_revision_before_rendering
30.75 s
gammaloop-nextest-docs> stdout ---
30.75 s
gammaloop-nextest-docs>
30.75 s
gammaloop-nextest-docs> running 1 test
30.75 s
gammaloop-nextest-docs>
30.75 s
gammaloop-nextest-docs> running 1 test
30.75 s
gammaloop-nextest-docs> test provenance_tests::each_build_captures_one_revision_before_rendering ... FAILED
30.75 s
gammaloop-nextest-docs>
30.75 s
gammaloop-nextest-docs> failures:
30.75 s
gammaloop-nextest-docs>
30.75 s
gammaloop-nextest-docs> failures:
30.75 s
gammaloop-nextest-docs> provenance_tests::each_build_captures_one_revision_before_rendering
30.75 s
gammaloop-nextest-docs>
30.75 s
gammaloop-nextest-docs> test result: FAILED. 0 passed; 1 failed; 0 ignored; 0 measured; 128 filtered out; finished in 0.02s
30.75 s
gammaloop-nextest-docs>
30.75 s
gammaloop-nextest-docs> test provenance_tests::each_build_captures_one_revision_before_rendering ... FAILED
30.75 s
gammaloop-nextest-docs>
30.75 s
gammaloop-nextest-docs> failures:
30.75 s
gammaloop-nextest-docs>
30.75 s
gammaloop-nextest-docs> failures:
30.75 s
gammaloop-nextest-docs> provenance_tests::each_build_captures_one_revision_before_rendering
30.75 s
gammaloop-nextest-docs>
30.75 s
gammaloop-nextest-docs> test result: FAILED. 0 passed; 1 failed; 0 ignored; 0 measured; 128 filtered out; finished in 0.03s
30.75 s
gammaloop-nextest-docs>
30.75 s
gammaloop-nextest-docs> stderr ---
30.75 s
gammaloop-nextest-docs>
30.75 s
gammaloop-nextest-docs> thread 'provenance_tests::each_build_captures_one_revision_before_rendering' (223) panicked at crates/alphal00p-docs-builder/src/provenance_tests.rs:297:14:
30.75 s
gammaloop-nextest-docs> called `Result::unwrap()` on an `Err` value: developer note gammaloop-architecture verified scope crates/gammaloop-api/src/commands/integrate.rs changed (expected 0cce8b9517824d09e6199882611aec7d213b638d, found 2d30848b04c82fa24ded354176ba9651792c6bcc); owner review or an explicit no-impact attestation is required
30.75 s
gammaloop-nextest-docs>
30.75 s
gammaloop-nextest-docs> Location:
30.75 s
gammaloop-nextest-docs> crates/alphal00p-docs-builder/src/lib.rs:992:29
30.75 s
gammaloop-nextest-docs> stack backtrace:
30.75 s
gammaloop-nextest-docs> 0: __rustc::rust_begin_unwind
30.75 s
gammaloop-nextest-docs> 1: core::panicking::panic_fmt
30.75 s
gammaloop-nextest-docs> 2: core::result::unwrap_failed
30.75 s
gammaloop-nextest-docs> 3: alphal00p_docs_builder::provenance_tests::each_build_captures_one_revision_before_rendering
30.75 s
gammaloop-nextest-docs> 4: <alphal00p_docs_builder::provenance_tests::each_build_captures_one_revision_before_rendering::{closure#0} as core::ops::function::FnOnce<()>>::call_once
30.75 s
gammaloop-nextest-docs> note: Some details are omitted, run with `RUST_BACKTRACE=full` for a verbose backtrace.
30.75 s
gammaloop-nextest-docs>
30.75 s
gammaloop-nextest-docs> thread 'provenance_tests::each_build_captures_one_revision_before_rendering' (187) panicked at crates/alphal00p-docs-builder/src/provenance_tests.rs:274:9:
30.75 s
gammaloop-nextest-docs> assertion failed: command.status().unwrap().success()
30.75 s
gammaloop-nextest-docs> stack backtrace:
30.75 s
gammaloop-nextest-docs> 0: __rustc::rust_begin_unwind
30.75 s
gammaloop-nextest-docs> 1: core::panicking::panic_fmt
30.75 s
gammaloop-nextest-docs> 2: core::panicking::panic
30.75 s
gammaloop-nextest-docs> 3: alphal00p_docs_builder::provenance_tests::each_build_captures_one_revision_before_rendering
30.75 s
gammaloop-nextest-docs> 4: <alphal00p_docs_builder::provenance_tests::each_build_captures_one_revision_before_rendering::{closure#0} as core::ops::function::FnOnce<()>>::call_once
30.75 s
gammaloop-nextest-docs> note: Some details are omitted, run with `RUST_BACKTRACE=full` for a verbose backtrace.
30.75 s
gammaloop-nextest-docs>
30.78 s
gammaloop-nextest-docs> FAIL [ 0.031s] ( 32/129) alphal00p-docs-builder tests :: developer_scope_ranges_ignore_unrelated_edits_and_warn_only_while_watching
30.78 s
gammaloop-nextest-docs> stdout ---
30.78 s
gammaloop-nextest-docs>
30.78 s
gammaloop-nextest-docs> running 1 test
30.78 s
gammaloop-nextest-docs> test tests::developer_scope_ranges_ignore_unrelated_edits_and_warn_only_while_watching ... FAILED
30.78 s
gammaloop-nextest-docs>
30.78 s
gammaloop-nextest-docs> failures:
30.78 s
gammaloop-nextest-docs>
30.78 s
gammaloop-nextest-docs> failures:
30.78 s
gammaloop-nextest-docs> tests::developer_scope_ranges_ignore_unrelated_edits_and_warn_only_while_watching
30.78 s
gammaloop-nextest-docs>
30.78 s
gammaloop-nextest-docs> test result: FAILED. 0 passed; 1 failed; 0 ignored; 0 measured; 128 filtered out; finished in 0.02s
30.78 s
gammaloop-nextest-docs>
30.78 s
gammaloop-nextest-docs> stderr ---
30.78 s
gammaloop-nextest-docs>
30.78 s
gammaloop-nextest-docs> thread 'tests::developer_scope_ranges_ignore_unrelated_edits_and_warn_only_while_watching' (293) panicked at crates/alphal00p-docs-builder/src/lib.rs:12263:29:
30.78 s
gammaloop-nextest-docs> called `Result::unwrap()` on an `Err` value: developer note gammaloop-architecture verified scope crates/gammaloop-api/src/commands/integrate.rs changed (expected 0cce8b9517824d09e6199882611aec7d213b638d, found 2d30848b04c82fa24ded354176ba9651792c6bcc); owner review or an explicit no-impact attestation is required
30.78 s
gammaloop-nextest-docs>
30.78 s
gammaloop-nextest-docs> Location:
30.78 s
gammaloop-nextest-docs> crates/alphal00p-docs-builder/src/lib.rs:992:29
30.78 s
gammaloop-nextest-docs> stack backtrace:
30.78 s
gammaloop-nextest-docs> 0: __rustc::rust_begin_unwind
30.78 s
gammaloop-nextest-docs> 1: core::panicking::panic_fmt
30.78 s
gammaloop-nextest-docs> 2: core::result::unwrap_failed
30.78 s
gammaloop-nextest-docs> 3: alphal00p_docs_builder::tests::developer_scope_ranges_ignore_unrelated_edits_and_warn_only_while_watching
30.78 s
gammaloop-nextest-docs> 4: <alphal00p_docs_builder::tests::developer_scope_ranges_ignore_unrelated_edits_and_warn_only_while_watching::{closure#0} as core::ops::function::FnOnce<()>>::call_once
30.78 s
gammaloop-nextest-docs> note: Some details are omitted, run with `RUST_BACKTRACE=full` for a verbose backtrace.
30.78 s
gammaloop-nextest-docs>
30.80 s
gammaloop-nextest-docs> FAIL [ 0.051s] ( 49/129) alphal00p-docs-builder tests :: every_product_requires_a_task_chooser_and_each_supported_interface
30.80 s
gammaloop-nextest-docs> stdout ---
30.80 s
gammaloop-nextest-docs>
30.80 s
gammaloop-nextest-docs> running 1 test
30.80 s
gammaloop-nextest-docs> test tests::every_product_requires_a_task_chooser_and_each_supported_interface ... FAILED
30.80 s
gammaloop-nextest-docs>
30.80 s
gammaloop-nextest-docs> failures:
30.80 s
gammaloop-nextest-docs>
30.80 s
gammaloop-nextest-docs> failures:
30.80 s
gammaloop-nextest-docs> tests::every_product_requires_a_task_chooser_and_each_supported_interface
30.80 s
gammaloop-nextest-docs>
30.80 s
gammaloop-nextest-docs> test result: FAILED. 0 passed; 1 failed; 0 ignored; 0 measured; 128 filtered out; finished in 0.03s
30.80 s
gammaloop-nextest-docs>
30.80 s
gammaloop-nextest-docs> stderr ---
30.80 s
gammaloop-nextest-docs>
30.80 s
gammaloop-nextest-docs> thread 'tests::every_product_requires_a_task_chooser_and_each_supported_interface' (313) panicked at crates/alphal00p-docs-builder/src/lib.rs:12192:9:
30.80 s
gammaloop-nextest-docs> assertion failed: format!("{error:#}").contains("has no quickstart page")
30.80 s
gammaloop-nextest-docs> stack backtrace:
30.80 s
gammaloop-nextest-docs> 0: __rustc::rust_begin_unwind
30.80 s
gammaloop-nextest-docs> 1: core::panicking::panic_fmt
30.80 s
gammaloop-nextest-docs> 2: core::panicking::panic
30.80 s
gammaloop-nextest-docs> 3: alphal00p_docs_builder::tests::every_product_requires_a_task_chooser_and_each_supported_interface
30.80 s
gammaloop-nextest-docs> 4: <alphal00p_docs_builder::tests::every_product_requires_a_task_chooser_and_each_supported_interface::{closure#0} as core::ops::function::FnOnce<()>>::call_once
30.80 s
gammaloop-nextest-docs> note: Some details are omitted, run with `RUST_BACKTRACE=full` for a verbose backtrace.
30.80 s
gammaloop-nextest-docs>
30.83 s
gammaloop-nextest-docs> FAIL [ 0.034s] ( 59/129) alphal00p-docs-builder tests :: pdf_manual_chapter_order_must_match_the_page_registry
30.83 s
gammaloop-nextest-docs> stdout ---
30.83 s
gammaloop-nextest-docs>
30.83 s
gammaloop-nextest-docs> running 1 test
30.83 s
gammaloop-nextest-docs> test tests::pdf_manual_chapter_order_must_match_the_page_registry ... FAILED
30.83 s
gammaloop-nextest-docs>
30.83 s
gammaloop-nextest-docs> failures:
30.83 s
gammaloop-nextest-docs>
30.83 s
gammaloop-nextest-docs> failures:
30.83 s
gammaloop-nextest-docs> tests::pdf_manual_chapter_order_must_match_the_page_registry
30.83 s
gammaloop-nextest-docs>
30.83 s
gammaloop-nextest-docs> test result: FAILED. 0 passed; 1 failed; 0 ignored; 0 measured; 128 filtered out; finished in 0.02s
30.83 s
gammaloop-nextest-docs>
30.83 s
gammaloop-nextest-docs> stderr ---
30.83 s
gammaloop-nextest-docs>
30.83 s
gammaloop-nextest-docs> thread 'tests::pdf_manual_chapter_order_must_match_the_page_registry' (353) panicked at crates/alphal00p-docs-builder/src/lib.rs:12243:9:
30.83 s
gammaloop-nextest-docs> assertion failed: format!("{error:#}").contains("PDF manual chapter order differs")
30.83 s
gammaloop-nextest-docs> stack backtrace:
30.83 s
gammaloop-nextest-docs> 0: __rustc::rust_begin_unwind
30.83 s
gammaloop-nextest-docs> 1: core::panicking::panic_fmt
30.83 s
gammaloop-nextest-docs> 2: core::panicking::panic
30.83 s
gammaloop-nextest-docs> 3: alphal00p_docs_builder::tests::pdf_manual_chapter_order_must_match_the_page_registry
30.83 s
gammaloop-nextest-docs> 4: <alphal00p_docs_builder::tests::pdf_manual_chapter_order_must_match_the_page_registry::{closure#0} as core::ops::function::FnOnce<()>>::call_once
30.83 s
gammaloop-nextest-docs> note: Some details are omitted, run with `RUST_BACKTRACE=full` for a verbose backtrace.
30.83 s
gammaloop-nextest-docs>
54.27 s
gammaloop-nextest-docs> ------------
54.27 s
gammaloop-nextest-docs> Summary [ 23.606s] 129 tests run: 124 passed , 5 failed , 0 skipped
54.27 s
gammaloop-nextest-docs> FAIL [ 0.060s] ( 7/129) alphal00p-docs-builder tests :: checked_in_registry_is_valid
54.27 s
gammaloop-nextest-docs> stdout ---
54.27 s
gammaloop-nextest-docs>
54.27 s
gammaloop-nextest-docs> running 1 test
54.27 s
gammaloop-nextest-docs> test tests::checked_in_registry_is_valid ... FAILED
54.27 s
gammaloop-nextest-docs>
54.27 s
gammaloop-nextest-docs> failures:
54.27 s
gammaloop-nextest-docs>
54.27 s
gammaloop-nextest-docs> failures:
54.27 s
gammaloop-nextest-docs> tests::checked_in_registry_is_valid
54.27 s
gammaloop-nextest-docs>
54.27 s
gammaloop-nextest-docs> test result: FAILED. 0 passed; 1 failed; 0 ignored; 0 measured; 128 filtered out; finished in 0.02s
54.27 s
gammaloop-nextest-docs>
54.27 s
gammaloop-nextest-docs> stderr ---
54.27 s
gammaloop-nextest-docs>
54.27 s
gammaloop-nextest-docs> thread 'tests::checked_in_registry_is_valid' (170) panicked at crates/alphal00p-docs-builder/src/lib.rs:12178:50:
54.27 s
gammaloop-nextest-docs> called `Result::unwrap()` on an `Err` value: developer note gammaloop-architecture verified scope crates/gammaloop-api/src/commands/integrate.rs changed (expected 0cce8b9517824d09e6199882611aec7d213b638d, found 2d30848b04c82fa24ded354176ba9651792c6bcc); owner review or an explicit no-impact attestation is required
54.27 s
gammaloop-nextest-docs>
54.27 s
gammaloop-nextest-docs> Location:
54.27 s
gammaloop-nextest-docs> crates/alphal00p-docs-builder/src/lib.rs:992:29
54.27 s
gammaloop-nextest-docs> stack backtrace:
54.27 s
gammaloop-nextest-docs> 0: __rustc::rust_begin_unwind
54.27 s
gammaloop-nextest-docs> 1: core::panicking::panic_fmt
54.27 s
gammaloop-nextest-docs> 2: core::result::unwrap_failed
54.27 s
gammaloop-nextest-docs> 3: alphal00p_docs_builder::tests::checked_in_registry_is_valid
54.27 s
gammaloop-nextest-docs> 4: <alphal00p_docs_builder::tests::checked_in_registry_is_valid::{closure#0} as core::ops::function::FnOnce<()>>::call_once
54.27 s
gammaloop-nextest-docs> note: Some details are omitted, run with `RUST_BACKTRACE=full` for a verbose backtrace.
54.27 s
gammaloop-nextest-docs>
54.27 s
gammaloop-nextest-docs> FAIL [ 0.083s] ( 20/129) alphal00p-docs-builder provenance_tests :: each_build_captures_one_revision_before_rendering
54.27 s
gammaloop-nextest-docs> stdout ---
54.27 s
gammaloop-nextest-docs>
54.27 s
gammaloop-nextest-docs> running 1 test
54.27 s
gammaloop-nextest-docs>
54.27 s
gammaloop-nextest-docs> running 1 test
54.27 s
gammaloop-nextest-docs> test provenance_tests::each_build_captures_one_revision_before_rendering ... FAILED
54.27 s
gammaloop-nextest-docs>
54.27 s
gammaloop-nextest-docs> failures:
54.27 s
gammaloop-nextest-docs>
54.27 s
gammaloop-nextest-docs> failures:
54.27 s
gammaloop-nextest-docs> provenance_tests::each_build_captures_one_revision_before_rendering
54.27 s
gammaloop-nextest-docs>
54.27 s
gammaloop-nextest-docs> test result: FAILED. 0 passed; 1 failed; 0 ignored; 0 measured; 128 filtered out; finished in 0.02s
54.27 s
gammaloop-nextest-docs>
54.27 s
gammaloop-nextest-docs> test provenance_tests::each_build_captures_one_revision_before_rendering ... FAILED
54.27 s
gammaloop-nextest-docs>
54.27 s
gammaloop-nextest-docs> failures:
54.27 s
gammaloop-nextest-docs>
54.27 s
gammaloop-nextest-docs> failures:
54.27 s
gammaloop-nextest-docs> provenance_tests::each_build_captures_one_revision_before_rendering
54.27 s
gammaloop-nextest-docs>
54.27 s
gammaloop-nextest-docs> test result: FAILED. 0 passed; 1 failed; 0 ignored; 0 measured; 128 filtered out; finished in 0.03s
54.27 s
gammaloop-nextest-docs>
54.27 s
gammaloop-nextest-docs> stderr ---
54.27 s
gammaloop-nextest-docs>
54.27 s
gammaloop-nextest-docs> thread 'provenance_tests::each_build_captures_one_revision_before_rendering' (223) panicked at crates/alphal00p-docs-builder/src/provenance_tests.rs:297:14:
54.27 s
gammaloop-nextest-docs> called `Result::unwrap()` on an `Err` value: developer note gammaloop-architecture verified scope crates/gammaloop-api/src/commands/integrate.rs changed (expected 0cce8b9517824d09e6199882611aec7d213b638d, found 2d30848b04c82fa24ded354176ba9651792c6bcc); owner review or an explicit no-impact attestation is required
54.27 s
gammaloop-nextest-docs>
54.27 s
gammaloop-nextest-docs> Location:
54.27 s
gammaloop-nextest-docs> crates/alphal00p-docs-builder/src/lib.rs:992:29
54.27 s
gammaloop-nextest-docs> stack backtrace:
54.27 s
gammaloop-nextest-docs> 0: __rustc::rust_begin_unwind
54.27 s
gammaloop-nextest-docs> 1: core::panicking::panic_fmt
54.27 s
gammaloop-nextest-docs> 2: core::result::unwrap_failed
54.27 s
gammaloop-nextest-docs> 3: alphal00p_docs_builder::provenance_tests::each_build_captures_one_revision_before_rendering
54.27 s
gammaloop-nextest-docs> 4: <alphal00p_docs_builder::provenance_tests::each_build_captures_one_revision_before_rendering::{closure#0} as core::ops::function::FnOnce<()>>::call_once
54.27 s
gammaloop-nextest-docs> note: Some details are omitted, run with `RUST_BACKTRACE=full` for a verbose backtrace.
54.27 s
gammaloop-nextest-docs>
54.27 s
gammaloop-nextest-docs> thread 'provenance_tests::each_build_captures_one_revision_before_rendering' (187) panicked at crates/alphal00p-docs-builder/src/provenance_tests.rs:274:9:
54.27 s
gammaloop-nextest-docs> assertion failed: command.status().unwrap().success()
54.27 s
gammaloop-nextest-docs> stack backtrace:
54.27 s
gammaloop-nextest-docs> 0: __rustc::rust_begin_unwind
54.27 s
gammaloop-nextest-docs> 1: core::panicking::panic_fmt
54.27 s
gammaloop-nextest-docs> 2: core::panicking::panic
54.27 s
gammaloop-nextest-docs> 3: alphal00p_docs_builder::provenance_tests::each_build_captures_one_revision_before_rendering
54.27 s
gammaloop-nextest-docs> 4: <alphal00p_docs_builder::provenance_tests::each_build_captures_one_revision_before_rendering::{closure#0} as core::ops::function::FnOnce<()>>::call_once
54.27 s
gammaloop-nextest-docs> note: Some details are omitted, run with `RUST_BACKTRACE=full` for a verbose backtrace.
54.27 s
gammaloop-nextest-docs>
54.27 s
gammaloop-nextest-docs> FAIL [ 0.031s] ( 32/129) alphal00p-docs-builder tests :: developer_scope_ranges_ignore_unrelated_edits_and_warn_only_while_watching
54.27 s
gammaloop-nextest-docs> stdout ---
54.27 s
gammaloop-nextest-docs>
54.27 s
gammaloop-nextest-docs> running 1 test
54.27 s
gammaloop-nextest-docs> test tests::developer_scope_ranges_ignore_unrelated_edits_and_warn_only_while_watching ... FAILED
54.27 s
gammaloop-nextest-docs>
54.27 s
gammaloop-nextest-docs> failures:
54.27 s
gammaloop-nextest-docs>
54.27 s
gammaloop-nextest-docs> failures:
54.27 s
gammaloop-nextest-docs> tests::developer_scope_ranges_ignore_unrelated_edits_and_warn_only_while_watching
54.27 s
gammaloop-nextest-docs>
54.27 s
gammaloop-nextest-docs> test result: FAILED. 0 passed; 1 failed; 0 ignored; 0 measured; 128 filtered out; finished in 0.02s
54.27 s
gammaloop-nextest-docs>
54.27 s
gammaloop-nextest-docs> stderr ---
54.27 s
gammaloop-nextest-docs>
54.27 s
gammaloop-nextest-docs> thread 'tests::developer_scope_ranges_ignore_unrelated_edits_and_warn_only_while_watching' (293) panicked at crates/alphal00p-docs-builder/src/lib.rs:12263:29:
54.27 s
gammaloop-nextest-docs> called `Result::unwrap()` on an `Err` value: developer note gammaloop-architecture verified scope crates/gammaloop-api/src/commands/integrate.rs changed (expected 0cce8b9517824d09e6199882611aec7d213b638d, found 2d30848b04c82fa24ded354176ba9651792c6bcc); owner review or an explicit no-impact attestation is required
54.27 s
gammaloop-nextest-docs>
54.27 s
gammaloop-nextest-docs> Location:
54.27 s
gammaloop-nextest-docs> crates/alphal00p-docs-builder/src/lib.rs:992:29
54.27 s
gammaloop-nextest-docs> stack backtrace:
54.27 s
gammaloop-nextest-docs> 0: __rustc::rust_begin_unwind
54.27 s
gammaloop-nextest-docs> 1: core::panicking::panic_fmt
54.27 s
gammaloop-nextest-docs> 2: core::result::unwrap_failed
54.27 s
gammaloop-nextest-docs> 3: alphal00p_docs_builder::tests::developer_scope_ranges_ignore_unrelated_edits_and_warn_only_while_watching
54.27 s
gammaloop-nextest-docs> 4: <alphal00p_docs_builder::tests::developer_scope_ranges_ignore_unrelated_edits_and_warn_only_while_watching::{closure#0} as core::ops::function::FnOnce<()>>::call_once
54.27 s
gammaloop-nextest-docs> note: Some details are omitted, run with `RUST_BACKTRACE=full` for a verbose backtrace.
54.27 s
gammaloop-nextest-docs>
54.27 s
gammaloop-nextest-docs> FAIL [ 0.051s] ( 49/129) alphal00p-docs-builder tests :: every_product_requires_a_task_chooser_and_each_supported_interface
54.27 s
gammaloop-nextest-docs> stdout ---
54.27 s
gammaloop-nextest-docs>
54.27 s
gammaloop-nextest-docs> running 1 test
54.27 s
gammaloop-nextest-docs> test tests::every_product_requires_a_task_chooser_and_each_supported_interface ... FAILED
54.27 s
gammaloop-nextest-docs>
54.27 s
gammaloop-nextest-docs> failures:
54.27 s
gammaloop-nextest-docs>
54.27 s
gammaloop-nextest-docs> failures:
54.27 s
gammaloop-nextest-docs> tests::every_product_requires_a_task_chooser_and_each_supported_interface
54.27 s
gammaloop-nextest-docs>
54.27 s
gammaloop-nextest-docs> test result: FAILED. 0 passed; 1 failed; 0 ignored; 0 measured; 128 filtered out; finished in 0.03s
54.27 s
gammaloop-nextest-docs>
54.27 s
gammaloop-nextest-docs> stderr ---
54.27 s
gammaloop-nextest-docs>
54.27 s
gammaloop-nextest-docs> thread 'tests::every_product_requires_a_task_chooser_and_each_supported_interface' (313) panicked at crates/alphal00p-docs-builder/src/lib.rs:12192:9:
54.27 s
gammaloop-nextest-docs> assertion failed: format!("{error:#}").contains("has no quickstart page")
54.27 s
gammaloop-nextest-docs> stack backtrace:
54.27 s
gammaloop-nextest-docs> 0: __rustc::rust_begin_unwind
54.27 s
gammaloop-nextest-docs> 1: core::panicking::panic_fmt
54.27 s
gammaloop-nextest-docs> 2: core::panicking::panic
54.27 s
gammaloop-nextest-docs> 3: alphal00p_docs_builder::tests::every_product_requires_a_task_chooser_and_each_supported_interface
54.27 s
gammaloop-nextest-docs> 4: <alphal00p_docs_builder::tests::every_product_requires_a_task_chooser_and_each_supported_interface::{closure#0} as core::ops::function::FnOnce<()>>::call_once
54.27 s
gammaloop-nextest-docs> note: Some details are omitted, run with `RUST_BACKTRACE=full` for a verbose backtrace.
54.27 s
gammaloop-nextest-docs>
54.27 s
gammaloop-nextest-docs> FAIL [ 0.034s] ( 59/129) alphal00p-docs-builder tests :: pdf_manual_chapter_order_must_match_the_page_registry
54.27 s
gammaloop-nextest-docs> stdout ---
54.27 s
gammaloop-nextest-docs>
54.27 s
gammaloop-nextest-docs> running 1 test
54.27 s
gammaloop-nextest-docs> test tests::pdf_manual_chapter_order_must_match_the_page_registry ... FAILED
54.27 s
gammaloop-nextest-docs>
54.27 s
gammaloop-nextest-docs> failures:
54.27 s
gammaloop-nextest-docs>
54.27 s
gammaloop-nextest-docs> failures:
54.27 s
gammaloop-nextest-docs> tests::pdf_manual_chapter_order_must_match_the_page_registry
54.27 s
gammaloop-nextest-docs>
54.27 s
gammaloop-nextest-docs> test result: FAILED. 0 passed; 1 failed; 0 ignored; 0 measured; 128 filtered out; finished in 0.02s
54.27 s
gammaloop-nextest-docs>
54.27 s
gammaloop-nextest-docs> stderr ---
54.27 s
gammaloop-nextest-docs>
54.27 s
gammaloop-nextest-docs> thread 'tests::pdf_manual_chapter_order_must_match_the_page_registry' (353) panicked at crates/alphal00p-docs-builder/src/lib.rs:12243:9:
54.27 s
gammaloop-nextest-docs> assertion failed: format!("{error:#}").contains("PDF manual chapter order differs")
54.27 s
gammaloop-nextest-docs> stack backtrace:
54.27 s
gammaloop-nextest-docs> 0: __rustc::rust_begin_unwind
54.27 s
gammaloop-nextest-docs> 1: core::panicking::panic_fmt
54.27 s
gammaloop-nextest-docs> 2: core::panicking::panic
54.27 s
gammaloop-nextest-docs> 3: alphal00p_docs_builder::tests::pdf_manual_chapter_order_must_match_the_page_registry
54.27 s
gammaloop-nextest-docs> 4: <alphal00p_docs_builder::tests::pdf_manual_chapter_order_must_match_the_page_registry::{closure#0} as core::ops::function::FnOnce<()>>::call_once
54.27 s
gammaloop-nextest-docs> note: Some details are omitted, run with `RUST_BACKTRACE=full` for a verbose backtrace.
54.27 s
gammaloop-nextest-docs>
54.28 s
gammaloop-nextest-docs> error : test run failed
54.31 s
gammaloop-nextest-docs>
54.31 s
gammaloop-nextest-docs> ========== nextest test summary ==========
54.31 s
gammaloop-nextest-docs> report: target/nextest/ci_gammaloop/junit.xml
54.31 s
gammaloop-nextest-docs> tests: 129, failures: 5, errors: 0
54.31 s
gammaloop-nextest-docs>
54.31 s
gammaloop-nextest-docs> 1. alphal00p-docs-builder::tests::checked_in_registry_is_valid
54.31 s
gammaloop-nextest-docs> failure: test failure with exit code 101
54.31 s
gammaloop-nextest-docs> thread 'tests::checked_in_registry_is_valid' (170) panicked at crates/alphal00p-docs-builder/src/lib.rs:12178:50:
54.31 s
gammaloop-nextest-docs> called `Result::unwrap()` on an `Err` value: developer note gammaloop-architecture verified scope crates/gammaloop-api/src/commands/integrate.rs changed (expected 0cce8b9517824d09e6199882611aec7d213b638d, found 2d30848b04c82fa24ded354176ba9651792c6bcc); owner review or an explicit no-impact attestation is required
54.31 s
gammaloop-nextest-docs>
54.31 s
gammaloop-nextest-docs> Location:
54.31 s
gammaloop-nextest-docs> crates/alphal00p-docs-builder/src/lib.rs:992:29
54.31 s
gammaloop-nextest-docs> stack backtrace:
54.31 s
gammaloop-nextest-docs> 0: __rustc::rust_begin_unwind
54.31 s
gammaloop-nextest-docs> 1: core::panicking::panic_fmt
54.31 s
gammaloop-nextest-docs> 2: core::result::unwrap_failed
54.31 s
gammaloop-nextest-docs> 3: alphal00p_docs_builder::tests::checked_in_registry_is_valid
54.31 s
gammaloop-nextest-docs> 4: <alphal00p_docs_builder::tests::checked_in_registry_is_valid::{closure#0} as core::ops::function::FnOnce<()>>::call_once
54.31 s
gammaloop-nextest-docs> note: Some details are omitted, run with `RUST_BACKTRACE=full` for a verbose backtrace.
54.31 s
gammaloop-nextest-docs> system-out
54.31 s
gammaloop-nextest-docs> running 1 test
54.31 s
gammaloop-nextest-docs> test tests::checked_in_registry_is_valid ... FAILED
54.31 s
gammaloop-nextest-docs>
54.31 s
gammaloop-nextest-docs> failures:
54.31 s
gammaloop-nextest-docs>
54.31 s
gammaloop-nextest-docs> failures:
54.31 s
gammaloop-nextest-docs> tests::checked_in_registry_is_valid
54.31 s
gammaloop-nextest-docs>
54.31 s
gammaloop-nextest-docs> test result: FAILED. 0 passed; 1 failed; 0 ignored; 0 measured; 128 filtered out; finished in 0.02s
54.31 s
gammaloop-nextest-docs> system-err
54.31 s
gammaloop-nextest-docs> thread 'tests::checked_in_registry_is_valid' (170) panicked at crates/alphal00p-docs-builder/src/lib.rs:12178:50:
54.31 s
gammaloop-nextest-docs> called `Result::unwrap()` on an `Err` value: developer note gammaloop-architecture verified scope crates/gammaloop-api/src/commands/integrate.rs changed (expected 0cce8b9517824d09e6199882611aec7d213b638d, found 2d30848b04c82fa24ded354176ba9651792c6bcc); owner review or an explicit no-impact attestation is required
54.31 s
gammaloop-nextest-docs>
54.31 s
gammaloop-nextest-docs> Location:
54.31 s
gammaloop-nextest-docs> crates/alphal00p-docs-builder/src/lib.rs:992:29
54.31 s
gammaloop-nextest-docs> stack backtrace:
54.31 s
gammaloop-nextest-docs> 0: __rustc::rust_begin_unwind
54.31 s
gammaloop-nextest-docs> 1: core::panicking::panic_fmt
54.31 s
gammaloop-nextest-docs> 2: core::result::unwrap_failed
54.31 s
gammaloop-nextest-docs> 3: alphal00p_docs_builder::tests::checked_in_registry_is_valid
54.31 s
gammaloop-nextest-docs> 4: <alphal00p_docs_builder::tests::checked_in_registry_is_valid::{closure#0} as core::ops::function::FnOnce<()>>::call_once
54.31 s
gammaloop-nextest-docs> note: Some details are omitted, run with `RUST_BACKTRACE=full` for a verbose backtrace.
54.31 s
gammaloop-nextest-docs>
54.31 s
gammaloop-nextest-docs> 2. alphal00p-docs-builder::provenance_tests::each_build_captures_one_revision_before_rendering
54.31 s
gammaloop-nextest-docs> failure: test failure with exit code 101
54.31 s
gammaloop-nextest-docs> thread 'provenance_tests::each_build_captures_one_revision_before_rendering' (187) panicked at crates/alphal00p-docs-builder/src/provenance_tests.rs:274:9:
54.31 s
gammaloop-nextest-docs> assertion failed: command.status().unwrap().success()
54.31 s
gammaloop-nextest-docs> stack backtrace:
54.31 s
gammaloop-nextest-docs> 0: __rustc::rust_begin_unwind
54.31 s
gammaloop-nextest-docs> 1: core::panicking::panic_fmt
54.31 s
gammaloop-nextest-docs> 2: core::panicking::panic
54.31 s
gammaloop-nextest-docs> 3: alphal00p_docs_builder::provenance_tests::each_build_captures_one_revision_before_rendering
54.31 s
gammaloop-nextest-docs> 4: <alphal00p_docs_builder::provenance_tests::each_build_captures_one_revision_before_rendering::{closure#0} as core::ops::function::FnOnce<()>>::call_once
54.31 s
gammaloop-nextest-docs> note: Some details are omitted, run with `RUST_BACKTRACE=full` for a verbose backtrace.
54.31 s
gammaloop-nextest-docs> system-out
54.31 s
gammaloop-nextest-docs> running 1 test
54.31 s
gammaloop-nextest-docs>
54.31 s
gammaloop-nextest-docs> running 1 test
54.31 s
gammaloop-nextest-docs> test provenance_tests::each_build_captures_one_revision_before_rendering ... FAILED
54.31 s
gammaloop-nextest-docs>
54.31 s
gammaloop-nextest-docs> failures:
54.31 s
gammaloop-nextest-docs>
54.31 s
gammaloop-nextest-docs> failures:
54.31 s
gammaloop-nextest-docs> provenance_tests::each_build_captures_one_revision_before_rendering
54.31 s
gammaloop-nextest-docs>
54.31 s
gammaloop-nextest-docs> test result: FAILED. 0 passed; 1 failed; 0 ignored; 0 measured; 128 filtered out; finished in 0.02s
54.31 s
gammaloop-nextest-docs>
54.31 s
gammaloop-nextest-docs> test provenance_tests::each_build_captures_one_revision_before_rendering ... FAILED
54.31 s
gammaloop-nextest-docs>
54.31 s
gammaloop-nextest-docs> failures:
54.31 s
gammaloop-nextest-docs>
54.31 s
gammaloop-nextest-docs> failures:
54.31 s
gammaloop-nextest-docs> provenance_tests::each_build_captures_one_revision_before_rendering
54.31 s
gammaloop-nextest-docs>
54.31 s
gammaloop-nextest-docs> test result: FAILED. 0 passed; 1 failed; 0 ignored; 0 measured; 128 filtered out; finished in 0.03s
54.31 s
gammaloop-nextest-docs> system-err
54.31 s
gammaloop-nextest-docs> thread 'provenance_tests::each_build_captures_one_revision_before_rendering' (223) panicked at crates/alphal00p-docs-builder/src/provenance_tests.rs:297:14:
54.31 s
gammaloop-nextest-docs> called `Result::unwrap()` on an `Err` value: developer note gammaloop-architecture verified scope crates/gammaloop-api/src/commands/integrate.rs changed (expected 0cce8b9517824d09e6199882611aec7d213b638d, found 2d30848b04c82fa24ded354176ba9651792c6bcc); owner review or an explicit no-impact attestation is required
54.31 s
gammaloop-nextest-docs>
54.31 s
gammaloop-nextest-docs> Location:
54.31 s
gammaloop-nextest-docs> crates/alphal00p-docs-builder/src/lib.rs:992:29
54.31 s
gammaloop-nextest-docs> stack backtrace:
54.31 s
gammaloop-nextest-docs> 0: __rustc::rust_begin_unwind
54.31 s
gammaloop-nextest-docs> 1: core::panicking::panic_fmt
54.31 s
gammaloop-nextest-docs> 2: core::result::unwrap_failed
54.31 s
gammaloop-nextest-docs> 3: alphal00p_docs_builder::provenance_tests::each_build_captures_one_revision_before_rendering
54.31 s
gammaloop-nextest-docs> 4: <alphal00p_docs_builder::provenance_tests::each_build_captures_one_revision_before_rendering::{closure#0} as core::ops::function::FnOnce<()>>::call_once
54.31 s
gammaloop-nextest-docs> note: Some details are omitted, run with `RUST_BACKTRACE=full` for a verbose backtrace.
54.31 s
gammaloop-nextest-docs>
54.31 s
gammaloop-nextest-docs> thread 'provenance_tests::each_build_captures_one_revision_before_rendering' (187) panicked at crates/alphal00p-docs-builder/src/provenance_tests.rs:274:9:
54.31 s
gammaloop-nextest-docs> assertion failed: command.status().unwrap().success()
54.31 s
gammaloop-nextest-docs> stack backtrace:
54.31 s
gammaloop-nextest-docs> 0: __rustc::rust_begin_unwind
54.31 s
gammaloop-nextest-docs> 1: core::panicking::panic_fmt
54.31 s
gammaloop-nextest-docs> 2: core::panicking::panic
54.31 s
gammaloop-nextest-docs> 3: alphal00p_docs_builder::provenance_tests::each_build_captures_one_revision_before_rendering
54.31 s
gammaloop-nextest-docs> 4: <alphal00p_docs_builder::provenance_tests::each_build_captures_one_revision_before_rendering::{closure#0} as core::ops::function::FnOnce<()>>::call_once
54.32 s
gammaloop-nextest-docs> note: Some details are omitted, run with `RUST_BACKTRACE=full` for a verbose backtrace.
54.32 s
gammaloop-nextest-docs>
54.32 s
gammaloop-nextest-docs> 3. alphal00p-docs-builder::tests::developer_scope_ranges_ignore_unrelated_edits_and_warn_only_while_watching
54.32 s
gammaloop-nextest-docs> failure: test failure with exit code 101
54.32 s
gammaloop-nextest-docs> thread 'tests::developer_scope_ranges_ignore_unrelated_edits_and_warn_only_while_watching' (293) panicked at crates/alphal00p-docs-builder/src/lib.rs:12263:29:
54.32 s
gammaloop-nextest-docs> called `Result::unwrap()` on an `Err` value: developer note gammaloop-architecture verified scope crates/gammaloop-api/src/commands/integrate.rs changed (expected 0cce8b9517824d09e6199882611aec7d213b638d, found 2d30848b04c82fa24ded354176ba9651792c6bcc); owner review or an explicit no-impact attestation is required
54.32 s
gammaloop-nextest-docs>
54.32 s
gammaloop-nextest-docs> Location:
54.32 s
gammaloop-nextest-docs> crates/alphal00p-docs-builder/src/lib.rs:992:29
54.32 s
gammaloop-nextest-docs> stack backtrace:
54.32 s
gammaloop-nextest-docs> 0: __rustc::rust_begin_unwind
54.32 s
gammaloop-nextest-docs> 1: core::panicking::panic_fmt
54.32 s
gammaloop-nextest-docs> 2: core::result::unwrap_failed
54.32 s
gammaloop-nextest-docs> 3: alphal00p_docs_builder::tests::developer_scope_ranges_ignore_unrelated_edits_and_warn_only_while_watching
54.32 s
gammaloop-nextest-docs> 4: <alphal00p_docs_builder::tests::developer_scope_ranges_ignore_unrelated_edits_and_warn_only_while_watching::{closure#0} as core::ops::function::FnOnce<()>>::call_once
54.32 s
gammaloop-nextest-docs> note: Some details are omitted, run with `RUST_BACKTRACE=full` for a verbose backtrace.
54.32 s
gammaloop-nextest-docs> system-out
54.32 s
gammaloop-nextest-docs> running 1 test
54.32 s
gammaloop-nextest-docs> test tests::developer_scope_ranges_ignore_unrelated_edits_and_warn_only_while_watching ... FAILED
54.32 s
gammaloop-nextest-docs>
54.32 s
gammaloop-nextest-docs> failures:
54.32 s
gammaloop-nextest-docs>
54.32 s
gammaloop-nextest-docs> failures:
54.32 s
gammaloop-nextest-docs> tests::developer_scope_ranges_ignore_unrelated_edits_and_warn_only_while_watching
54.32 s
gammaloop-nextest-docs>
54.32 s
gammaloop-nextest-docs> test result: FAILED. 0 passed; 1 failed; 0 ignored; 0 measured; 128 filtered out; finished in 0.02s
54.32 s
gammaloop-nextest-docs> system-err
54.32 s
gammaloop-nextest-docs> thread 'tests::developer_scope_ranges_ignore_unrelated_edits_and_warn_only_while_watching' (293) panicked at crates/alphal00p-docs-builder/src/lib.rs:12263:29:
54.32 s
gammaloop-nextest-docs> called `Result::unwrap()` on an `Err` value: developer note gammaloop-architecture verified scope crates/gammaloop-api/src/commands/integrate.rs changed (expected 0cce8b9517824d09e6199882611aec7d213b638d, found 2d30848b04c82fa24ded354176ba9651792c6bcc); owner review or an explicit no-impact attestation is required
54.32 s
gammaloop-nextest-docs>
54.32 s
gammaloop-nextest-docs> Location:
54.32 s
gammaloop-nextest-docs> crates/alphal00p-docs-builder/src/lib.rs:992:29
54.32 s
gammaloop-nextest-docs> stack backtrace:
54.32 s
gammaloop-nextest-docs> 0: __rustc::rust_begin_unwind
54.32 s
gammaloop-nextest-docs> 1: core::panicking::panic_fmt
54.32 s
gammaloop-nextest-docs> 2: core::result::unwrap_failed
54.32 s
gammaloop-nextest-docs> 3: alphal00p_docs_builder::tests::developer_scope_ranges_ignore_unrelated_edits_and_warn_only_while_watching
54.32 s
gammaloop-nextest-docs> 4: <alphal00p_docs_builder::tests::developer_scope_ranges_ignore_unrelated_edits_and_warn_only_while_watching::{closure#0} as core::ops::function::FnOnce<()>>::call_once
54.32 s
gammaloop-nextest-docs> note: Some details are omitted, run with `RUST_BACKTRACE=full` for a verbose backtrace.
54.32 s
gammaloop-nextest-docs>
54.32 s
gammaloop-nextest-docs> 4. alphal00p-docs-builder::tests::every_product_requires_a_task_chooser_and_each_supported_interface
54.32 s
gammaloop-nextest-docs> failure: test failure with exit code 101
54.32 s
gammaloop-nextest-docs> thread 'tests::every_product_requires_a_task_chooser_and_each_supported_interface' (313) panicked at crates/alphal00p-docs-builder/src/lib.rs:12192:9:
54.32 s
gammaloop-nextest-docs> assertion failed: format!("{error:#}").contains("has no quickstart page")
54.32 s
gammaloop-nextest-docs> stack backtrace:
54.32 s
gammaloop-nextest-docs> 0: __rustc::rust_begin_unwind
54.32 s
gammaloop-nextest-docs> 1: core::panicking::panic_fmt
54.32 s
gammaloop-nextest-docs> 2: core::panicking::panic
54.32 s
gammaloop-nextest-docs> 3: alphal00p_docs_builder::tests::every_product_requires_a_task_chooser_and_each_supported_interface
54.32 s
gammaloop-nextest-docs> 4: <alphal00p_docs_builder::tests::every_product_requires_a_task_chooser_and_each_supported_interface::{closure#0} as core::ops::function::FnOnce<()>>::call_once
54.32 s
gammaloop-nextest-docs> note: Some details are omitted, run with `RUST_BACKTRACE=full` for a verbose backtrace.
54.32 s
gammaloop-nextest-docs> system-out
54.32 s
gammaloop-nextest-docs> running 1 test
54.32 s
gammaloop-nextest-docs> test tests::every_product_requires_a_task_chooser_and_each_supported_interface ... FAILED
54.32 s
gammaloop-nextest-docs>
54.32 s
gammaloop-nextest-docs> failures:
54.32 s
gammaloop-nextest-docs>
54.32 s
gammaloop-nextest-docs> failures:
54.32 s
gammaloop-nextest-docs> tests::every_product_requires_a_task_chooser_and_each_supported_interface
54.32 s
gammaloop-nextest-docs>
54.32 s
gammaloop-nextest-docs> test result: FAILED. 0 passed; 1 failed; 0 ignored; 0 measured; 128 filtered out; finished in 0.03s
54.32 s
gammaloop-nextest-docs> system-err
54.32 s
gammaloop-nextest-docs> thread 'tests::every_product_requires_a_task_chooser_and_each_supported_interface' (313) panicked at crates/alphal00p-docs-builder/src/lib.rs:12192:9:
54.32 s
gammaloop-nextest-docs> assertion failed: format!("{error:#}").contains("has no quickstart page")
54.32 s
gammaloop-nextest-docs> stack backtrace:
54.32 s
gammaloop-nextest-docs> 0: __rustc::rust_begin_unwind
54.32 s
gammaloop-nextest-docs> 1: core::panicking::panic_fmt
54.32 s
gammaloop-nextest-docs> 2: core::panicking::panic
54.32 s
gammaloop-nextest-docs> 3: alphal00p_docs_builder::tests::every_product_requires_a_task_chooser_and_each_supported_interface
54.32 s
gammaloop-nextest-docs> 4: <alphal00p_docs_builder::tests::every_product_requires_a_task_chooser_and_each_supported_interface::{closure#0} as core::ops::function::FnOnce<()>>::call_once
54.32 s
gammaloop-nextest-docs> note: Some details are omitted, run with `RUST_BACKTRACE=full` for a verbose backtrace.
54.32 s
gammaloop-nextest-docs>
54.32 s
gammaloop-nextest-docs> 5. alphal00p-docs-builder::tests::pdf_manual_chapter_order_must_match_the_page_registry
54.32 s
gammaloop-nextest-docs> failure: test failure with exit code 101
54.32 s
gammaloop-nextest-docs> thread 'tests::pdf_manual_chapter_order_must_match_the_page_registry' (353) panicked at crates/alphal00p-docs-builder/src/lib.rs:12243:9:
54.32 s
gammaloop-nextest-docs> assertion failed: format!("{error:#}").contains("PDF manual chapter order differs")
54.32 s
gammaloop-nextest-docs> stack backtrace:
54.32 s
gammaloop-nextest-docs> 0: __rustc::rust_begin_unwind
54.32 s
gammaloop-nextest-docs> 1: core::panicking::panic_fmt
54.32 s
gammaloop-nextest-docs> 2: core::panicking::panic
54.32 s
gammaloop-nextest-docs> 3: alphal00p_docs_builder::tests::pdf_manual_chapter_order_must_match_the_page_registry
54.32 s
gammaloop-nextest-docs> 4: <alphal00p_docs_builder::tests::pdf_manual_chapter_order_must_match_the_page_registry::{closure#0} as core::ops::function::FnOnce<()>>::call_once
54.32 s
gammaloop-nextest-docs> note: Some details are omitted, run with `RUST_BACKTRACE=full` for a verbose backtrace.
54.32 s
gammaloop-nextest-docs> system-out
54.32 s
gammaloop-nextest-docs> running 1 test
54.32 s
gammaloop-nextest-docs> test tests::pdf_manual_chapter_order_must_match_the_page_registry ... FAILED
54.32 s
gammaloop-nextest-docs>
54.32 s
gammaloop-nextest-docs> failures:
54.32 s
gammaloop-nextest-docs>
54.32 s
gammaloop-nextest-docs> failures:
54.32 s
gammaloop-nextest-docs> tests::pdf_manual_chapter_order_must_match_the_page_registry
54.32 s
gammaloop-nextest-docs>
54.32 s
gammaloop-nextest-docs> test result: FAILED. 0 passed; 1 failed; 0 ignored; 0 measured; 128 filtered out; finished in 0.02s
54.32 s
gammaloop-nextest-docs> system-err
54.32 s
gammaloop-nextest-docs> thread 'tests::pdf_manual_chapter_order_must_match_the_page_registry' (353) panicked at crates/alphal00p-docs-builder/src/lib.rs:12243:9:
54.32 s
gammaloop-nextest-docs> assertion failed: format!("{error:#}").contains("PDF manual chapter order differs")
54.32 s
gammaloop-nextest-docs> stack backtrace:
54.32 s
gammaloop-nextest-docs> 0: __rustc::rust_begin_unwind
54.32 s
gammaloop-nextest-docs> 1: core::panicking::panic_fmt
54.32 s
gammaloop-nextest-docs> 2: core::panicking::panic
54.32 s
gammaloop-nextest-docs> 3: alphal00p_docs_builder::tests::pdf_manual_chapter_order_must_match_the_page_registry
54.32 s
gammaloop-nextest-docs> 4: <alphal00p_docs_builder::tests::pdf_manual_chapter_order_must_match_the_page_registry::{closure#0} as core::ops::function::FnOnce<()>>::call_once
54.32 s
gammaloop-nextest-docs> note: Some details are omitted, run with `RUST_BACKTRACE=full` for a verbose backtrace.
54.32 s
gammaloop-nextest-docs> =========================================
54.33 s
gammaloop-nextest-docs> Extracting 2 binaries to /build/source
54.38 s
gammaloop-nextest-docs> Extracted 5 files to /build/source in 0.05s
54.40 s
gammaloop-nextest-docs> ------------
54.40 s
gammaloop-nextest-docs> Nextest run ID a1fa36b1-b352-488f-add2-ac17d7e9b8dd with nextest profile: ci_gammaloop
54.40 s
gammaloop-nextest-docs> Starting 22 tests across 2 binaries
54.42 s
gammaloop-nextest-docs> ------------
54.42 s
gammaloop-nextest-docs> Summary [ 0.021s] 22 tests run: 22 passed , 0 skipped
54.46 s
gammaloop-nextest-docs>
54.46 s
gammaloop-nextest-docs> ========== nextest test summary ==========
54.46 s
gammaloop-nextest-docs> report: target/nextest/ci_gammaloop/junit.xml
54.46 s
gammaloop-nextest-docs> tests: 22, failures: 0, errors: 0
54.46 s
gammaloop-nextest-docs> No failing testcases found.
54.46 s
gammaloop-nextest-docs> =========================================
54.48 s
gammaloop-nextest-docs> Extracting 3 binaries (including 2 non-test binaries), 1 build script output directory, and 2 linked paths to /build/source
54.82 s
gammaloop-nextest-docs> Extracted 22 files to /build/source in 0.35s
54.84 s
gammaloop-nextest-docs> ------------
54.84 s
gammaloop-nextest-docs> Nextest run ID f24f277f-ce2f-48ab-8503-692917d0d601 with nextest profile: ci_gammaloop
54.84 s
gammaloop-nextest-docs> Starting 89 tests across 1 binary
54.89 s
gammaloop-nextest-docs> ------------
54.89 s
gammaloop-nextest-docs> Summary [ 0.059s] 89 tests run: 89 passed , 0 skipped
54.93 s
gammaloop-nextest-docs>
54.93 s
gammaloop-nextest-docs> ========== nextest test summary ==========
54.93 s
gammaloop-nextest-docs> report: target/nextest/ci_gammaloop/junit.xml
54.93 s
gammaloop-nextest-docs> tests: 89, failures: 0, errors: 0
54.93 s
gammaloop-nextest-docs> No failing testcases found.
54.93 s
gammaloop-nextest-docs> =========================================
54.95 s
gammaloop-nextest-docs> Extracting 2 binaries to /build/source
55.00 s
gammaloop-nextest-docs> Extracted 5 files to /build/source in 0.05s
55.01 s
gammaloop-nextest-docs> ------------
55.01 s
gammaloop-nextest-docs> Nextest run ID 502724b9-e4fc-418f-8f26-aee91daf3240 with nextest profile: ci_gammaloop
55.01 s
gammaloop-nextest-docs> Starting 10 tests across 2 binaries
74.50 s
gammaloop-nextest-docs> ------------
74.50 s
gammaloop-nextest-docs> Summary [ 19.488s] 10 tests run: 10 passed , 0 skipped
74.54 s
gammaloop-nextest-docs>
74.54 s
gammaloop-nextest-docs> ========== nextest test summary ==========
74.54 s
gammaloop-nextest-docs> report: target/nextest/ci_gammaloop/junit.xml
74.54 s
gammaloop-nextest-docs> tests: 10, failures: 0, errors: 0
74.54 s
gammaloop-nextest-docs> No failing testcases found.
74.54 s
gammaloop-nextest-docs> =========================================
74.55 s
gammaloop-nextest-docs> Extracting 1 binary to /build/source
74.60 s
gammaloop-nextest-docs> Extracted 4 files to /build/source in 0.04s
74.61 s
gammaloop-nextest-docs> ------------
74.61 s
gammaloop-nextest-docs> Nextest run ID fcabadad-3964-4bd0-a338-ef9631751e90 with nextest profile: ci_gammaloop
74.61 s
gammaloop-nextest-docs> Starting 0 tests across 1 binary
74.61 s
gammaloop-nextest-docs> ------------
74.61 s
gammaloop-nextest-docs> Summary [ 0.000s] 0 tests run: 0 passed , 0 skipped
74.65 s
gammaloop-nextest-docs>
74.65 s
gammaloop-nextest-docs> ========== nextest test summary ==========
74.65 s
gammaloop-nextest-docs> report: target/nextest/ci_gammaloop/junit.xml
74.65 s
gammaloop-nextest-docs> tests: 0, failures: 0, errors: 0
74.65 s
gammaloop-nextest-docs> No failing testcases found.
74.65 s
gammaloop-nextest-docs> =========================================
74.68 s
gammaloop-nextest-docs> Extracting 1 binary to /build/source
74.73 s
gammaloop-nextest-docs> Extracted 4 files to /build/source in 0.06s
74.75 s
gammaloop-nextest-docs> ------------
74.75 s
gammaloop-nextest-docs> Nextest run ID a5572e7f-a832-4982-be7c-28846e86993d with nextest profile: ci_gammaloop
74.75 s
gammaloop-nextest-docs> Starting 5 tests across 1 binary
74.76 s
gammaloop-nextest-docs> ------------
74.76 s
gammaloop-nextest-docs> Summary [ 0.007s] 5 tests run: 5 passed , 0 skipped
74.80 s
gammaloop-nextest-docs>
74.80 s
gammaloop-nextest-docs> ========== nextest test summary ==========
74.80 s
gammaloop-nextest-docs> report: target/nextest/ci_gammaloop/junit.xml
74.80 s
gammaloop-nextest-docs> tests: 5, failures: 0, errors: 0
74.80 s
gammaloop-nextest-docs> No failing testcases found.
74.80 s
gammaloop-nextest-docs> =========================================
75.05 s
error: Cannot build '/nix/store/yjk1y7kxjjry446ij49xzficzijvkxpq-gammaloop-nextest-docs.drv '.
75.05 s
Reason: builder failed with exit code 100 .
75.05 s
Output paths:
75.05 s
/nix/store/pklph5dw6r7zldkbm0rsc6h72mf238c0-gammaloop-nextest-docs
75.05 s
Last 584 log lines:
75.05 s
> Extracting 2 binaries to /build/source
75.05 s
> Extracted 5 files to /build/source in 0.10s
75.05 s
> ------------
75.05 s
> Nextest run ID b598a16a-ec0b-4331-9661-26ab9e4ef96f with nextest profile: ci_gammaloop
75.05 s
> Starting 129 tests across 2 binaries
75.05 s
> FAIL [ 0.060s] ( 7/129) alphal00p-docs-builder tests :: checked_in_registry_is_valid
75.05 s
> stdout ---
75.05 s
>
75.05 s
> running 1 test
75.05 s
> test tests::checked_in_registry_is_valid ... FAILED
75.05 s
>
75.05 s
> failures:
75.05 s
>
75.05 s
> failures:
75.05 s
> tests::checked_in_registry_is_valid
75.05 s
>
75.05 s
> test result: FAILED. 0 passed; 1 failed; 0 ignored; 0 measured; 128 filtered out; finished in 0.02s
75.05 s
>
75.05 s
> stderr ---
75.05 s
>
75.05 s
> thread 'tests::checked_in_registry_is_valid' (170) panicked at crates/alphal00p-docs-builder/src/lib.rs:12178:50:
75.05 s
> called `Result::unwrap()` on an `Err` value: developer note gammaloop-architecture verified scope crates/gammaloop-api/src/commands/integrate.rs changed (expected 0cce8b9517824d09e6199882611aec7d213b638d, found 2d30848b04c82fa24ded354176ba9651792c6bcc); owner review or an explicit no-impact attestation is required
75.05 s
>
75.05 s
> Location:
75.05 s
> crates/alphal00p-docs-builder/src/lib.rs:992:29
75.05 s
> stack backtrace:
75.05 s
> 0: __rustc::rust_begin_unwind
75.05 s
> 1: core::panicking::panic_fmt
75.05 s
> 2: core::result::unwrap_failed
75.05 s
> 3: alphal00p_docs_builder::tests::checked_in_registry_is_valid
75.05 s
> 4: <alphal00p_docs_builder::tests::checked_in_registry_is_valid::{closure#0} as core::ops::function::FnOnce<()>>::call_once
75.05 s
> note: Some details are omitted, run with `RUST_BACKTRACE=full` for a verbose backtrace.
75.05 s
>
75.05 s
> FAIL [ 0.083s] ( 20/129) alphal00p-docs-builder provenance_tests :: each_build_captures_one_revision_before_rendering
75.05 s
> stdout ---
75.05 s
>
75.05 s
> running 1 test
75.05 s
>
75.05 s
> running 1 test
75.05 s
> test provenance_tests::each_build_captures_one_revision_before_rendering ... FAILED
75.05 s
>
75.05 s
> failures:
75.05 s
>
75.05 s
> failures:
75.05 s
> provenance_tests::each_build_captures_one_revision_before_rendering
75.05 s
>
75.05 s
> test result: FAILED. 0 passed; 1 failed; 0 ignored; 0 measured; 128 filtered out; finished in 0.02s
75.05 s
>
75.05 s
> test provenance_tests::each_build_captures_one_revision_before_rendering ... FAILED
75.05 s
>
75.05 s
> failures:
75.05 s
>
75.05 s
> failures:
75.05 s
> provenance_tests::each_build_captures_one_revision_before_rendering
75.05 s
>
75.05 s
> test result: FAILED. 0 passed; 1 failed; 0 ignored; 0 measured; 128 filtered out; finished in 0.03s
75.05 s
>
75.05 s
> stderr ---
75.05 s
>
75.05 s
> thread 'provenance_tests::each_build_captures_one_revision_before_rendering' (223) panicked at crates/alphal00p-docs-builder/src/provenance_tests.rs:297:14:
75.05 s
> called `Result::unwrap()` on an `Err` value: developer note gammaloop-architecture verified scope crates/gammaloop-api/src/commands/integrate.rs changed (expected 0cce8b9517824d09e6199882611aec7d213b638d, found 2d30848b04c82fa24ded354176ba9651792c6bcc); owner review or an explicit no-impact attestation is required
75.05 s
>
75.05 s
> Location:
75.05 s
> crates/alphal00p-docs-builder/src/lib.rs:992:29
75.05 s
> stack backtrace:
75.05 s
> 0: __rustc::rust_begin_unwind
75.05 s
> 1: core::panicking::panic_fmt
75.05 s
> 2: core::result::unwrap_failed
75.05 s
> 3: alphal00p_docs_builder::provenance_tests::each_build_captures_one_revision_before_rendering
75.05 s
> 4: <alphal00p_docs_builder::provenance_tests::each_build_captures_one_revision_before_rendering::{closure#0} as core::ops::function::FnOnce<()>>::call_once
75.05 s
> note: Some details are omitted, run with `RUST_BACKTRACE=full` for a verbose backtrace.
75.05 s
>
75.05 s
> thread 'provenance_tests::each_build_captures_one_revision_before_rendering' (187) panicked at crates/alphal00p-docs-builder/src/provenance_tests.rs:274:9:
75.05 s
> assertion failed: command.status().unwrap().success()
75.05 s
> stack backtrace:
75.05 s
> 0: __rustc::rust_begin_unwind
75.05 s
> 1: core::panicking::panic_fmt
75.05 s
> 2: core::panicking::panic
75.05 s
> 3: alphal00p_docs_builder::provenance_tests::each_build_captures_one_revision_before_rendering
75.05 s
> 4: <alphal00p_docs_builder::provenance_tests::each_build_captures_one_revision_before_rendering::{closure#0} as core::ops::function::FnOnce<()>>::call_once
75.05 s
> note: Some details are omitted, run with `RUST_BACKTRACE=full` for a verbose backtrace.
75.05 s
>
75.05 s
> FAIL [ 0.031s] ( 32/129) alphal00p-docs-builder tests :: developer_scope_ranges_ignore_unrelated_edits_and_warn_only_while_watching
75.05 s
> stdout ---
75.05 s
>
75.05 s
> running 1 test
75.05 s
> test tests::developer_scope_ranges_ignore_unrelated_edits_and_warn_only_while_watching ... FAILED
75.05 s
>
75.05 s
> failures:
75.05 s
>
75.05 s
> failures:
75.05 s
> tests::developer_scope_ranges_ignore_unrelated_edits_and_warn_only_while_watching
75.05 s
>
75.05 s
> test result: FAILED. 0 passed; 1 failed; 0 ignored; 0 measured; 128 filtered out; finished in 0.02s
75.05 s
>
75.05 s
> stderr ---
75.05 s
>
75.05 s
> thread 'tests::developer_scope_ranges_ignore_unrelated_edits_and_warn_only_while_watching' (293) panicked at crates/alphal00p-docs-builder/src/lib.rs:12263:29:
75.05 s
> called `Result::unwrap()` on an `Err` value: developer note gammaloop-architecture verified scope crates/gammaloop-api/src/commands/integrate.rs changed (expected 0cce8b9517824d09e6199882611aec7d213b638d, found 2d30848b04c82fa24ded354176ba9651792c6bcc); owner review or an explicit no-impact attestation is required
75.05 s
>
75.05 s
> Location:
75.05 s
> crates/alphal00p-docs-builder/src/lib.rs:992:29
75.05 s
> stack backtrace:
75.05 s
> 0: __rustc::rust_begin_unwind
75.05 s
> 1: core::panicking::panic_fmt
75.05 s
> 2: core::result::unwrap_failed
75.05 s
> 3: alphal00p_docs_builder::tests::developer_scope_ranges_ignore_unrelated_edits_and_warn_only_while_watching
75.05 s
> 4: <alphal00p_docs_builder::tests::developer_scope_ranges_ignore_unrelated_edits_and_warn_only_while_watching::{closure#0} as core::ops::function::FnOnce<()>>::call_once
75.05 s
> note: Some details are omitted, run with `RUST_BACKTRACE=full` for a verbose backtrace.
75.05 s
>
75.05 s
> FAIL [ 0.051s] ( 49/129) alphal00p-docs-builder tests :: every_product_requires_a_task_chooser_and_each_supported_interface
75.05 s
> stdout ---
75.05 s
>
75.05 s
> running 1 test
75.05 s
> test tests::every_product_requires_a_task_chooser_and_each_supported_interface ... FAILED
75.05 s
>
75.05 s
> failures:
75.05 s
>
75.05 s
> failures:
75.05 s
> tests::every_product_requires_a_task_chooser_and_each_supported_interface
75.05 s
>
75.05 s
> test result: FAILED. 0 passed; 1 failed; 0 ignored; 0 measured; 128 filtered out; finished in 0.03s
75.05 s
>
75.05 s
> stderr ---
75.05 s
>
75.05 s
> thread 'tests::every_product_requires_a_task_chooser_and_each_supported_interface' (313) panicked at crates/alphal00p-docs-builder/src/lib.rs:12192:9:
75.05 s
> assertion failed: format!("{error:#}").contains("has no quickstart page")
75.05 s
> stack backtrace:
75.05 s
> 0: __rustc::rust_begin_unwind
75.05 s
> 1: core::panicking::panic_fmt
75.05 s
> 2: core::panicking::panic
75.05 s
> 3: alphal00p_docs_builder::tests::every_product_requires_a_task_chooser_and_each_supported_interface
75.05 s
> 4: <alphal00p_docs_builder::tests::every_product_requires_a_task_chooser_and_each_supported_interface::{closure#0} as core::ops::function::FnOnce<()>>::call_once
75.05 s
> note: Some details are omitted, run with `RUST_BACKTRACE=full` for a verbose backtrace.
75.05 s
>
75.05 s
> FAIL [ 0.034s] ( 59/129) alphal00p-docs-builder tests :: pdf_manual_chapter_order_must_match_the_page_registry
75.05 s
> stdout ---
75.05 s
>
75.05 s
> running 1 test
75.05 s
> test tests::pdf_manual_chapter_order_must_match_the_page_registry ... FAILED
75.05 s
>
75.05 s
> failures:
75.05 s
>
75.05 s
> failures:
75.05 s
> tests::pdf_manual_chapter_order_must_match_the_page_registry
75.05 s
>
75.05 s
> test result: FAILED. 0 passed; 1 failed; 0 ignored; 0 measured; 128 filtered out; finished in 0.02s
75.05 s
>
75.05 s
> stderr ---
75.05 s
>
75.05 s
> thread 'tests::pdf_manual_chapter_order_must_match_the_page_registry' (353) panicked at crates/alphal00p-docs-builder/src/lib.rs:12243:9:
75.05 s
> assertion failed: format!("{error:#}").contains("PDF manual chapter order differs")
75.05 s
> stack backtrace:
75.05 s
> 0: __rustc::rust_begin_unwind
75.05 s
> 1: core::panicking::panic_fmt
75.05 s
> 2: core::panicking::panic
75.05 s
> 3: alphal00p_docs_builder::tests::pdf_manual_chapter_order_must_match_the_page_registry
75.05 s
> 4: <alphal00p_docs_builder::tests::pdf_manual_chapter_order_must_match_the_page_registry::{closure#0} as core::ops::function::FnOnce<()>>::call_once
75.05 s
> note: Some details are omitted, run with `RUST_BACKTRACE=full` for a verbose backtrace.
75.05 s
>
75.05 s
> ------------
75.05 s
> Summary [ 23.606s] 129 tests run: 124 passed , 5 failed , 0 skipped
75.05 s
> FAIL [ 0.060s] ( 7/129) alphal00p-docs-builder tests :: checked_in_registry_is_valid
75.05 s
> stdout ---
75.05 s
>
75.05 s
> running 1 test
75.05 s
> test tests::checked_in_registry_is_valid ... FAILED
75.05 s
>
75.05 s
> failures:
75.05 s
>
75.05 s
> failures:
75.05 s
> tests::checked_in_registry_is_valid
75.05 s
>
75.05 s
> test result: FAILED. 0 passed; 1 failed; 0 ignored; 0 measured; 128 filtered out; finished in 0.02s
75.05 s
>
75.05 s
> stderr ---
75.05 s
>
75.05 s
> thread 'tests::checked_in_registry_is_valid' (170) panicked at crates/alphal00p-docs-builder/src/lib.rs:12178:50:
75.05 s
> called `Result::unwrap()` on an `Err` value: developer note gammaloop-architecture verified scope crates/gammaloop-api/src/commands/integrate.rs changed (expected 0cce8b9517824d09e6199882611aec7d213b638d, found 2d30848b04c82fa24ded354176ba9651792c6bcc); owner review or an explicit no-impact attestation is required
75.05 s
>
75.05 s
> Location:
75.05 s
> crates/alphal00p-docs-builder/src/lib.rs:992:29
75.05 s
> stack backtrace:
75.05 s
> 0: __rustc::rust_begin_unwind
75.05 s
> 1: core::panicking::panic_fmt
75.05 s
> 2: core::result::unwrap_failed
75.05 s
> 3: alphal00p_docs_builder::tests::checked_in_registry_is_valid
75.05 s
> 4: <alphal00p_docs_builder::tests::checked_in_registry_is_valid::{closure#0} as core::ops::function::FnOnce<()>>::call_once
75.05 s
> note: Some details are omitted, run with `RUST_BACKTRACE=full` for a verbose backtrace.
75.05 s
>
75.05 s
> FAIL [ 0.083s] ( 20/129) alphal00p-docs-builder provenance_tests :: each_build_captures_one_revision_before_rendering
75.05 s
> stdout ---
75.05 s
>
75.05 s
> running 1 test
75.05 s
>
75.05 s
> running 1 test
75.05 s
> test provenance_tests::each_build_captures_one_revision_before_rendering ... FAILED
75.05 s
>
75.05 s
> failures:
75.05 s
>
75.05 s
> failures:
75.05 s
> provenance_tests::each_build_captures_one_revision_before_rendering
75.05 s
>
75.05 s
> test result: FAILED. 0 passed; 1 failed; 0 ignored; 0 measured; 128 filtered out; finished in 0.02s
75.05 s
>
75.05 s
> test provenance_tests::each_build_captures_one_revision_before_rendering ... FAILED
75.05 s
>
75.05 s
> failures:
75.05 s
>
75.05 s
> failures:
75.05 s
> provenance_tests::each_build_captures_one_revision_before_rendering
75.05 s
>
75.05 s
> test result: FAILED. 0 passed; 1 failed; 0 ignored; 0 measured; 128 filtered out; finished in 0.03s
75.05 s
>
75.05 s
> stderr ---
75.05 s
>
75.05 s
> thread 'provenance_tests::each_build_captures_one_revision_before_rendering' (223) panicked at crates/alphal00p-docs-builder/src/provenance_tests.rs:297:14:
75.05 s
> called `Result::unwrap()` on an `Err` value: developer note gammaloop-architecture verified scope crates/gammaloop-api/src/commands/integrate.rs changed (expected 0cce8b9517824d09e6199882611aec7d213b638d, found 2d30848b04c82fa24ded354176ba9651792c6bcc); owner review or an explicit no-impact attestation is required
75.05 s
>
75.05 s
> Location:
75.05 s
> crates/alphal00p-docs-builder/src/lib.rs:992:29
75.05 s
> stack backtrace:
75.05 s
> 0: __rustc::rust_begin_unwind
75.05 s
> 1: core::panicking::panic_fmt
75.05 s
> 2: core::result::unwrap_failed
75.05 s
> 3: alphal00p_docs_builder::provenance_tests::each_build_captures_one_revision_before_rendering
75.05 s
> 4: <alphal00p_docs_builder::provenance_tests::each_build_captures_one_revision_before_rendering::{closure#0} as core::ops::function::FnOnce<()>>::call_once
75.05 s
> note: Some details are omitted, run with `RUST_BACKTRACE=full` for a verbose backtrace.
75.05 s
>
75.05 s
> thread 'provenance_tests::each_build_captures_one_revision_before_rendering' (187) panicked at crates/alphal00p-docs-builder/src/provenance_tests.rs:274:9:
75.05 s
> assertion failed: command.status().unwrap().success()
75.05 s
> stack backtrace:
75.05 s
> 0: __rustc::rust_begin_unwind
75.05 s
> 1: core::panicking::panic_fmt
75.05 s
> 2: core::panicking::panic
75.05 s
> 3: alphal00p_docs_builder::provenance_tests::each_build_captures_one_revision_before_rendering
75.05 s
> 4: <alphal00p_docs_builder::provenance_tests::each_build_captures_one_revision_before_rendering::{closure#0} as core::ops::function::FnOnce<()>>::call_once
75.05 s
> note: Some details are omitted, run with `RUST_BACKTRACE=full` for a verbose backtrace.
75.05 s
>
75.05 s
> FAIL [ 0.031s] ( 32/129) alphal00p-docs-builder tests :: developer_scope_ranges_ignore_unrelated_edits_and_warn_only_while_watching
75.05 s
> stdout ---
75.05 s
>
75.05 s
> running 1 test
75.05 s
> test tests::developer_scope_ranges_ignore_unrelated_edits_and_warn_only_while_watching ... FAILED
75.05 s
>
75.05 s
> failures:
75.05 s
>
75.05 s
> failures:
75.05 s
> tests::developer_scope_ranges_ignore_unrelated_edits_and_warn_only_while_watching
75.05 s
>
75.05 s
> test result: FAILED. 0 passed; 1 failed; 0 ignored; 0 measured; 128 filtered out; finished in 0.02s
75.05 s
>
75.05 s
> stderr ---
75.05 s
>
75.05 s
> thread 'tests::developer_scope_ranges_ignore_unrelated_edits_and_warn_only_while_watching' (293) panicked at crates/alphal00p-docs-builder/src/lib.rs:12263:29:
75.05 s
> called `Result::unwrap()` on an `Err` value: developer note gammaloop-architecture verified scope crates/gammaloop-api/src/commands/integrate.rs changed (expected 0cce8b9517824d09e6199882611aec7d213b638d, found 2d30848b04c82fa24ded354176ba9651792c6bcc); owner review or an explicit no-impact attestation is required
75.05 s
>
75.05 s
> Location:
75.05 s
> crates/alphal00p-docs-builder/src/lib.rs:992:29
75.05 s
> stack backtrace:
75.05 s
> 0: __rustc::rust_begin_unwind
75.05 s
> 1: core::panicking::panic_fmt
75.05 s
> 2: core::result::unwrap_failed
75.05 s
> 3: alphal00p_docs_builder::tests::developer_scope_ranges_ignore_unrelated_edits_and_warn_only_while_watching
75.05 s
> 4: <alphal00p_docs_builder::tests::developer_scope_ranges_ignore_unrelated_edits_and_warn_only_while_watching::{closure#0} as core::ops::function::FnOnce<()>>::call_once
75.05 s
> note: Some details are omitted, run with `RUST_BACKTRACE=full` for a verbose backtrace.
75.05 s
>
75.05 s
> FAIL [ 0.051s] ( 49/129) alphal00p-docs-builder tests :: every_product_requires_a_task_chooser_and_each_supported_interface
75.05 s
> stdout ---
75.05 s
>
75.05 s
> running 1 test
75.05 s
> test tests::every_product_requires_a_task_chooser_and_each_supported_interface ... FAILED
75.05 s
>
75.05 s
> failures:
75.05 s
>
75.05 s
> failures:
75.05 s
> tests::every_product_requires_a_task_chooser_and_each_supported_interface
75.05 s
>
75.05 s
> test result: FAILED. 0 passed; 1 failed; 0 ignored; 0 measured; 128 filtered out; finished in 0.03s
75.05 s
>
75.05 s
> stderr ---
75.05 s
>
75.05 s
> thread 'tests::every_product_requires_a_task_chooser_and_each_supported_interface' (313) panicked at crates/alphal00p-docs-builder/src/lib.rs:12192:9:
75.05 s
> assertion failed: format!("{error:#}").contains("has no quickstart page")
75.05 s
> stack backtrace:
75.05 s
> 0: __rustc::rust_begin_unwind
75.05 s
> 1: core::panicking::panic_fmt
75.05 s
> 2: core::panicking::panic
75.05 s
> 3: alphal00p_docs_builder::tests::every_product_requires_a_task_chooser_and_each_supported_interface
75.05 s
> 4: <alphal00p_docs_builder::tests::every_product_requires_a_task_chooser_and_each_supported_interface::{closure#0} as core::ops::function::FnOnce<()>>::call_once
75.05 s
> note: Some details are omitted, run with `RUST_BACKTRACE=full` for a verbose backtrace.
75.05 s
>
75.05 s
> FAIL [ 0.034s] ( 59/129) alphal00p-docs-builder tests :: pdf_manual_chapter_order_must_match_the_page_registry
75.05 s
> stdout ---
75.05 s
>
75.05 s
> running 1 test
75.05 s
> test tests::pdf_manual_chapter_order_must_match_the_page_registry ... FAILED
75.05 s
>
75.05 s
> failures:
75.05 s
>
75.05 s
> failures:
75.05 s
> tests::pdf_manual_chapter_order_must_match_the_page_registry
75.05 s
>
75.05 s
> test result: FAILED. 0 passed; 1 failed; 0 ignored; 0 measured; 128 filtered out; finished in 0.02s
75.05 s
>
75.05 s
> stderr ---
75.05 s
>
75.05 s
> thread 'tests::pdf_manual_chapter_order_must_match_the_page_registry' (353) panicked at crates/alphal00p-docs-builder/src/lib.rs:12243:9:
75.05 s
> assertion failed: format!("{error:#}").contains("PDF manual chapter order differs")
75.05 s
> stack backtrace:
75.05 s
> 0: __rustc::rust_begin_unwind
75.05 s
> 1: core::panicking::panic_fmt
75.05 s
> 2: core::panicking::panic
75.05 s
> 3: alphal00p_docs_builder::tests::pdf_manual_chapter_order_must_match_the_page_registry
75.05 s
> 4: <alphal00p_docs_builder::tests::pdf_manual_chapter_order_must_match_the_page_registry::{closure#0} as core::ops::function::FnOnce<()>>::call_once
75.05 s
> note: Some details are omitted, run with `RUST_BACKTRACE=full` for a verbose backtrace.
75.05 s
>
75.05 s
> error : test run failed
75.05 s
>
75.05 s
> ========== nextest test summary ==========
75.05 s
> report: target/nextest/ci_gammaloop/junit.xml
75.05 s
> tests: 129, failures: 5, errors: 0
75.05 s
>
75.05 s
> 1. alphal00p-docs-builder::tests::checked_in_registry_is_valid
75.05 s
> failure: test failure with exit code 101
75.05 s
> thread 'tests::checked_in_registry_is_valid' (170) panicked at crates/alphal00p-docs-builder/src/lib.rs:12178:50:
75.05 s
> called `Result::unwrap()` on an `Err` value: developer note gammaloop-architecture verified scope crates/gammaloop-api/src/commands/integrate.rs changed (expected 0cce8b9517824d09e6199882611aec7d213b638d, found 2d30848b04c82fa24ded354176ba9651792c6bcc); owner review or an explicit no-impact attestation is required
75.05 s
>
75.05 s
> Location:
75.05 s
> crates/alphal00p-docs-builder/src/lib.rs:992:29
75.05 s
> stack backtrace:
75.05 s
> 0: __rustc::rust_begin_unwind
75.05 s
> 1: core::panicking::panic_fmt
75.05 s
> 2: core::result::unwrap_failed
75.05 s
> 3: alphal00p_docs_builder::tests::checked_in_registry_is_valid
75.05 s
> 4: <alphal00p_docs_builder::tests::checked_in_registry_is_valid::{closure#0} as core::ops::function::FnOnce<()>>::call_once
75.05 s
> note: Some details are omitted, run with `RUST_BACKTRACE=full` for a verbose backtrace.
75.05 s
> system-out
75.05 s
> running 1 test
75.05 s
> test tests::checked_in_registry_is_valid ... FAILED
75.05 s
>
75.05 s
> failures:
75.05 s
>
75.05 s
> failures:
75.05 s
> tests::checked_in_registry_is_valid
75.05 s
>
75.05 s
> test result: FAILED. 0 passed; 1 failed; 0 ignored; 0 measured; 128 filtered out; finished in 0.02s
75.05 s
> system-err
75.05 s
> thread 'tests::checked_in_registry_is_valid' (170) panicked at crates/alphal00p-docs-builder/src/lib.rs:12178:50:
75.05 s
> called `Result::unwrap()` on an `Err` value: developer note gammaloop-architecture verified scope crates/gammaloop-api/src/commands/integrate.rs changed (expected 0cce8b9517824d09e6199882611aec7d213b638d, found 2d30848b04c82fa24ded354176ba9651792c6bcc); owner review or an explicit no-impact attestation is required
75.05 s
>
75.05 s
> Location:
75.05 s
> crates/alphal00p-docs-builder/src/lib.rs:992:29
75.05 s
> stack backtrace:
75.05 s
> 0: __rustc::rust_begin_unwind
75.05 s
> 1: core::panicking::panic_fmt
75.05 s
> 2: core::result::unwrap_failed
75.05 s
> 3: alphal00p_docs_builder::tests::checked_in_registry_is_valid
75.05 s
> 4: <alphal00p_docs_builder::tests::checked_in_registry_is_valid::{closure#0} as core::ops::function::FnOnce<()>>::call_once
75.05 s
> note: Some details are omitted, run with `RUST_BACKTRACE=full` for a verbose backtrace.
75.05 s
>
75.05 s
> 2. alphal00p-docs-builder::provenance_tests::each_build_captures_one_revision_before_rendering
75.05 s
> failure: test failure with exit code 101
75.05 s
> thread 'provenance_tests::each_build_captures_one_revision_before_rendering' (187) panicked at crates/alphal00p-docs-builder/src/provenance_tests.rs:274:9:
75.05 s
> assertion failed: command.status().unwrap().success()
75.05 s
> stack backtrace:
75.05 s
> 0: __rustc::rust_begin_unwind
75.05 s
> 1: core::panicking::panic_fmt
75.05 s
> 2: core::panicking::panic
75.05 s
> 3: alphal00p_docs_builder::provenance_tests::each_build_captures_one_revision_before_rendering
75.05 s
> 4: <alphal00p_docs_builder::provenance_tests::each_build_captures_one_revision_before_rendering::{closure#0} as core::ops::function::FnOnce<()>>::call_once
75.05 s
> note: Some details are omitted, run with `RUST_BACKTRACE=full` for a verbose backtrace.
75.05 s
> system-out
75.05 s
> running 1 test
75.05 s
>
75.05 s
> running 1 test
75.05 s
> test provenance_tests::each_build_captures_one_revision_before_rendering ... FAILED
75.05 s
>
75.05 s
> failures:
75.05 s
>
75.05 s
> failures:
75.05 s
> provenance_tests::each_build_captures_one_revision_before_rendering
75.05 s
>
75.05 s
> test result: FAILED. 0 passed; 1 failed; 0 ignored; 0 measured; 128 filtered out; finished in 0.02s
75.05 s
>
75.05 s
> test provenance_tests::each_build_captures_one_revision_before_rendering ... FAILED
75.05 s
>
75.05 s
> failures:
75.05 s
>
75.05 s
> failures:
75.05 s
> provenance_tests::each_build_captures_one_revision_before_rendering
75.05 s
>
75.05 s
> test result: FAILED. 0 passed; 1 failed; 0 ignored; 0 measured; 128 filtered out; finished in 0.03s
75.05 s
> system-err
75.05 s
> thread 'provenance_tests::each_build_captures_one_revision_before_rendering' (223) panicked at crates/alphal00p-docs-builder/src/provenance_tests.rs:297:14:
75.05 s
> called `Result::unwrap()` on an `Err` value: developer note gammaloop-architecture verified scope crates/gammaloop-api/src/commands/integrate.rs changed (expected 0cce8b9517824d09e6199882611aec7d213b638d, found 2d30848b04c82fa24ded354176ba9651792c6bcc); owner review or an explicit no-impact attestation is required
75.05 s
>
75.05 s
> Location:
75.05 s
> crates/alphal00p-docs-builder/src/lib.rs:992:29
75.05 s
> stack backtrace:
75.05 s
> 0: __rustc::rust_begin_unwind
75.05 s
> 1: core::panicking::panic_fmt
75.05 s
> 2: core::result::unwrap_failed
75.05 s
> 3: alphal00p_docs_builder::provenance_tests::each_build_captures_one_revision_before_rendering
75.05 s
> 4: <alphal00p_docs_builder::provenance_tests::each_build_captures_one_revision_before_rendering::{closure#0} as core::ops::function::FnOnce<()>>::call_once
75.05 s
> note: Some details are omitted, run with `RUST_BACKTRACE=full` for a verbose backtrace.
75.05 s
>
75.05 s
> thread 'provenance_tests::each_build_captures_one_revision_before_rendering' (187) panicked at crates/alphal00p-docs-builder/src/provenance_tests.rs:274:9:
75.05 s
> assertion failed: command.status().unwrap().success()
75.05 s
> stack backtrace:
75.05 s
> 0: __rustc::rust_begin_unwind
75.05 s
> 1: core::panicking::panic_fmt
75.05 s
> 2: core::panicking::panic
75.05 s
> 3: alphal00p_docs_builder::provenance_tests::each_build_captures_one_revision_before_rendering
75.05 s
> 4: <alphal00p_docs_builder::provenance_tests::each_build_captures_one_revision_before_rendering::{closure#0} as core::ops::function::FnOnce<()>>::call_once
75.05 s
> note: Some details are omitted, run with `RUST_BACKTRACE=full` for a verbose backtrace.
75.05 s
>
75.05 s
> 3. alphal00p-docs-builder::tests::developer_scope_ranges_ignore_unrelated_edits_and_warn_only_while_watching
75.05 s
> failure: test failure with exit code 101
75.05 s
> thread 'tests::developer_scope_ranges_ignore_unrelated_edits_and_warn_only_while_watching' (293) panicked at crates/alphal00p-docs-builder/src/lib.rs:12263:29:
75.05 s
> called `Result::unwrap()` on an `Err` value: developer note gammaloop-architecture verified scope crates/gammaloop-api/src/commands/integrate.rs changed (expected 0cce8b9517824d09e6199882611aec7d213b638d, found 2d30848b04c82fa24ded354176ba9651792c6bcc); owner review or an explicit no-impact attestation is required
75.05 s
>
75.05 s
> Location:
75.05 s
> crates/alphal00p-docs-builder/src/lib.rs:992:29
75.05 s
> stack backtrace:
75.05 s
> 0: __rustc::rust_begin_unwind
75.05 s
> 1: core::panicking::panic_fmt
75.05 s
> 2: core::result::unwrap_failed
75.05 s
> 3: alphal00p_docs_builder::tests::developer_scope_ranges_ignore_unrelated_edits_and_warn_only_while_watching
75.05 s
> 4: <alphal00p_docs_builder::tests::developer_scope_ranges_ignore_unrelated_edits_and_warn_only_while_watching::{closure#0} as core::ops::function::FnOnce<()>>::call_once
75.05 s
> note: Some details are omitted, run with `RUST_BACKTRACE=full` for a verbose backtrace.
75.05 s
> system-out
75.05 s
> running 1 test
75.05 s
> test tests::developer_scope_ranges_ignore_unrelated_edits_and_warn_only_while_watching ... FAILED
75.05 s
>
75.05 s
> failures:
75.05 s
>
75.05 s
> failures:
75.05 s
> tests::developer_scope_ranges_ignore_unrelated_edits_and_warn_only_while_watching
75.05 s
>
75.05 s
> test result: FAILED. 0 passed; 1 failed; 0 ignored; 0 measured; 128 filtered out; finished in 0.02s
75.05 s
> system-err
75.05 s
> thread 'tests::developer_scope_ranges_ignore_unrelated_edits_and_warn_only_while_watching' (293) panicked at crates/alphal00p-docs-builder/src/lib.rs:12263:29:
75.05 s
> called `Result::unwrap()` on an `Err` value: developer note gammaloop-architecture verified scope crates/gammaloop-api/src/commands/integrate.rs changed (expected 0cce8b9517824d09e6199882611aec7d213b638d, found 2d30848b04c82fa24ded354176ba9651792c6bcc); owner review or an explicit no-impact attestation is required
75.05 s
>
75.05 s
> Location:
75.05 s
> crates/alphal00p-docs-builder/src/lib.rs:992:29
75.05 s
> stack backtrace:
75.05 s
> 0: __rustc::rust_begin_unwind
75.05 s
> 1: core::panicking::panic_fmt
75.05 s
> 2: core::result::unwrap_failed
75.05 s
> 3: alphal00p_docs_builder::tests::developer_scope_ranges_ignore_unrelated_edits_and_warn_only_while_watching
75.05 s
> 4: <alphal00p_docs_builder::tests::developer_scope_ranges_ignore_unrelated_edits_and_warn_only_while_watching::{closure#0} as core::ops::function::FnOnce<()>>::call_once
75.05 s
> note: Some details are omitted, run with `RUST_BACKTRACE=full` for a verbose backtrace.
75.05 s
>
75.05 s
> 4. alphal00p-docs-builder::tests::every_product_requires_a_task_chooser_and_each_supported_interface
75.05 s
> failure: test failure with exit code 101
75.05 s
> thread 'tests::every_product_requires_a_task_chooser_and_each_supported_interface' (313) panicked at crates/alphal00p-docs-builder/src/lib.rs:12192:9:
75.05 s
> assertion failed: format!("{error:#}").contains("has no quickstart page")
75.05 s
> stack backtrace:
75.05 s
> 0: __rustc::rust_begin_unwind
75.05 s
> 1: core::panicking::panic_fmt
75.05 s
> 2: core::panicking::panic
75.05 s
> 3: alphal00p_docs_builder::tests::every_product_requires_a_task_chooser_and_each_supported_interface
75.05 s
> 4: <alphal00p_docs_builder::tests::every_product_requires_a_task_chooser_and_each_supported_interface::{closure#0} as core::ops::function::FnOnce<()>>::call_once
75.05 s
> note: Some details are omitted, run with `RUST_BACKTRACE=full` for a verbose backtrace.
75.05 s
> system-out
75.05 s
> running 1 test
75.05 s
> test tests::every_product_requires_a_task_chooser_and_each_supported_interface ... FAILED
75.05 s
>
75.05 s
> failures:
75.05 s
>
75.05 s
> failures:
75.05 s
> tests::every_product_requires_a_task_chooser_and_each_supported_interface
75.05 s
>
75.05 s
> test result: FAILED. 0 passed; 1 failed; 0 ignored; 0 measured; 128 filtered out; finished in 0.03s
75.05 s
> system-err
75.05 s
> thread 'tests::every_product_requires_a_task_chooser_and_each_supported_interface' (313) panicked at crates/alphal00p-docs-builder/src/lib.rs:12192:9:
75.05 s
> assertion failed: format!("{error:#}").contains("has no quickstart page")
75.05 s
> stack backtrace:
75.05 s
> 0: __rustc::rust_begin_unwind
75.05 s
> 1: core::panicking::panic_fmt
75.05 s
> 2: core::panicking::panic
75.05 s
> 3: alphal00p_docs_builder::tests::every_product_requires_a_task_chooser_and_each_supported_interface
75.05 s
> 4: <alphal00p_docs_builder::tests::every_product_requires_a_task_chooser_and_each_supported_interface::{closure#0} as core::ops::function::FnOnce<()>>::call_once
75.05 s
> note: Some details are omitted, run with `RUST_BACKTRACE=full` for a verbose backtrace.
75.05 s
>
75.05 s
> 5. alphal00p-docs-builder::tests::pdf_manual_chapter_order_must_match_the_page_registry
75.05 s
> failure: test failure with exit code 101
75.05 s
> thread 'tests::pdf_manual_chapter_order_must_match_the_page_registry' (353) panicked at crates/alphal00p-docs-builder/src/lib.rs:12243:9:
75.05 s
> assertion failed: format!("{error:#}").contains("PDF manual chapter order differs")
75.05 s
> stack backtrace:
75.05 s
> 0: __rustc::rust_begin_unwind
75.05 s
> 1: core::panicking::panic_fmt
75.05 s
> 2: core::panicking::panic
75.05 s
> 3: alphal00p_docs_builder::tests::pdf_manual_chapter_order_must_match_the_page_registry
75.05 s
> 4: <alphal00p_docs_builder::tests::pdf_manual_chapter_order_must_match_the_page_registry::{closure#0} as core::ops::function::FnOnce<()>>::call_once
75.05 s
> note: Some details are omitted, run with `RUST_BACKTRACE=full` for a verbose backtrace.
75.05 s
> system-out
75.05 s
> running 1 test
75.05 s
> test tests::pdf_manual_chapter_order_must_match_the_page_registry ... FAILED
75.05 s
>
75.05 s
> failures:
75.05 s
>
75.05 s
> failures:
75.05 s
> tests::pdf_manual_chapter_order_must_match_the_page_registry
75.05 s
>
75.05 s
> test result: FAILED. 0 passed; 1 failed; 0 ignored; 0 measured; 128 filtered out; finished in 0.02s
75.05 s
> system-err
75.05 s
> thread 'tests::pdf_manual_chapter_order_must_match_the_page_registry' (353) panicked at crates/alphal00p-docs-builder/src/lib.rs:12243:9:
75.05 s
> assertion failed: format!("{error:#}").contains("PDF manual chapter order differs")
75.05 s
> stack backtrace:
75.05 s
> 0: __rustc::rust_begin_unwind
75.05 s
> 1: core::panicking::panic_fmt
75.05 s
> 2: core::panicking::panic
75.05 s
> 3: alphal00p_docs_builder::tests::pdf_manual_chapter_order_must_match_the_page_registry
75.05 s
> 4: <alphal00p_docs_builder::tests::pdf_manual_chapter_order_must_match_the_page_registry::{closure#0} as core::ops::function::FnOnce<()>>::call_once
75.05 s
> note: Some details are omitted, run with `RUST_BACKTRACE=full` for a verbose backtrace.
75.05 s
> =========================================
75.05 s
> Extracting 2 binaries to /build/source
75.05 s
> Extracted 5 files to /build/source in 0.05s
75.05 s
> ------------
75.05 s
> Nextest run ID a1fa36b1-b352-488f-add2-ac17d7e9b8dd with nextest profile: ci_gammaloop
75.05 s
> Starting 22 tests across 2 binaries
75.05 s
> ------------
75.05 s
> Summary [ 0.021s] 22 tests run: 22 passed , 0 skipped
75.05 s
>
75.05 s
> ========== nextest test summary ==========
75.05 s
> report: target/nextest/ci_gammaloop/junit.xml
75.05 s
> tests: 22, failures: 0, errors: 0
75.05 s
> No failing testcases found.
75.05 s
> =========================================
75.05 s
> Extracting 3 binaries (including 2 non-test binaries), 1 build script output directory, and 2 linked paths to /build/source
75.05 s
> Extracted 22 files to /build/source in 0.35s
75.05 s
> ------------
75.05 s
> Nextest run ID f24f277f-ce2f-48ab-8503-692917d0d601 with nextest profile: ci_gammaloop
75.05 s
> Starting 89 tests across 1 binary
75.05 s
> ------------
75.05 s
> Summary [ 0.059s] 89 tests run: 89 passed , 0 skipped
75.05 s
>
75.05 s
> ========== nextest test summary ==========
75.05 s
> report: target/nextest/ci_gammaloop/junit.xml
75.05 s
> tests: 89, failures: 0, errors: 0
75.05 s
> No failing testcases found.
75.05 s
> =========================================
75.05 s
> Extracting 2 binaries to /build/source
75.05 s
> Extracted 5 files to /build/source in 0.05s
75.05 s
> ------------
75.05 s
> Nextest run ID 502724b9-e4fc-418f-8f26-aee91daf3240 with nextest profile: ci_gammaloop
75.05 s
> Starting 10 tests across 2 binaries
75.05 s
> ------------
75.05 s
> Summary [ 19.488s] 10 tests run: 10 passed , 0 skipped
75.05 s
>
75.05 s
> ========== nextest test summary ==========
75.05 s
> report: target/nextest/ci_gammaloop/junit.xml
75.05 s
> tests: 10, failures: 0, errors: 0
75.05 s
> No failing testcases found.
75.05 s
> =========================================
75.05 s
> Extracting 1 binary to /build/source
75.05 s
> Extracted 4 files to /build/source in 0.04s
75.05 s
> ------------
75.05 s
> Nextest run ID fcabadad-3964-4bd0-a338-ef9631751e90 with nextest profile: ci_gammaloop
75.05 s
> Starting 0 tests across 1 binary
75.05 s
> ------------
75.05 s
> Summary [ 0.000s] 0 tests run: 0 passed , 0 skipped
75.05 s
>
75.05 s
> ========== nextest test summary ==========
75.05 s
> report: target/nextest/ci_gammaloop/junit.xml
75.05 s
> tests: 0, failures: 0, errors: 0
75.05 s
> No failing testcases found.
75.05 s
> =========================================
75.05 s
> Extracting 1 binary to /build/source
75.05 s
> Extracted 4 files to /build/source in 0.06s
75.05 s
> ------------
75.05 s
> Nextest run ID a5572e7f-a832-4982-be7c-28846e86993d with nextest profile: ci_gammaloop
75.05 s
> Starting 5 tests across 1 binary
75.05 s
> ------------
75.05 s
> Summary [ 0.007s] 5 tests run: 5 passed , 0 skipped
75.05 s
>
75.05 s
> ========== nextest test summary ==========
75.05 s
> report: target/nextest/ci_gammaloop/junit.xml
75.05 s
> tests: 5, failures: 0, errors: 0
75.05 s
> No failing testcases found.
75.05 s
> =========================================
75.05 s
For full logs, run:
75.05 s
nix log /nix/store/yjk1y7kxjjry446ij49xzficzijvkxpq-gammaloop-nextest-docs.drv
75.28 s
[0 built (1 failed )]Run failed.