1. 0.01 s $ /nix/store/61685rbaxmpigwi3z23i33sv3jyfl70q-coreutils-9.11/bin/timeout --kill-after=15s 7200s /nix/store/wknkybkzrc16r11vk5vrykh4wmw7a353-nix-2.34.8/bin/nix --extra-experimental-features nix-command --extra-experimental-features flakes flake clone git+https://github.com/alphal00p/gammaloop --dest /tmp/nix-ci-worker/stable-pwd/repo/
  2. 0.13 s Cloning into '/tmp/nix-ci-worker/stable-pwd/repo'...
  3. 2.75 s remote: Enumerating objects: 96299 remote: Enumerating objects: 108237, done.
  4. 2.98 s remote: Counting objects: 0% (1/11938) remote: Counting objects: 1% (120/11938) remote: Counting objects: 2% (239/11938) remote: Counting objects: 3% (359/11938) remote: Counting objects: 4% (478/11938) remote: Counting objects: 5% (597/11938) remote: Counting objects: 6% (717/11938) remote: Counting objects: 7% (836/11938) remote: Counting objects: 8% (956/11938) remote: Counting objects: 9% (1075/11938) remote: Counting objects: 10% (1194/11938) remote: Counting objects: 11% (1314/11938) remote: Counting objects: 12% (1433/11938) remote: Counting objects: 13% (1552/11938) remote: Counting objects: 14% (1672/11938) remote: Counting objects: 15% (1791/11938) remote: Counting objects: 16% (1911/11938) remote: Counting objects: 17% (2030/11938) remote: Counting objects: 18% (2149/11938) remote: Counting objects: 19% (2269/11938) remote: Counting objects: 20% (2388/11938) remote: Counting objects: 21% (2507/11938) remote: Counting objects: 22% (2627/11938) remote: Counting objects: 23% (2746/11938) remote: Counting objects: 24% (2866/11938) remote: Counting objects: 25% (2985/11938) remote: Counting objects: 26% (3104/11938) remote: Counting objects: 27% (3224/11938) remote: Counting objects: 28% (3343/11938) remote: Counting objects: 29% (3463/11938) remote: Counting objects: 30% (3582/11938) remote: Counting objects: 31% (3701/11938) remote: Counting objects: 32% (3821/11938) remote: Counting objects: 33% (3940/11938) remote: Counting objects: 34% (4059/11938) remote: Counting objects: 35% (4179/11938) remote: Counting objects: 36% (4298/11938) remote: Counting objects: 37% (4418/11938) remote: Counting objects: 38% (4537/11938) remote: Counting objects: 39% (4656/11938) remote: Counting objects: 40% (4776/11938) remote: Counting objects: 41% (4895/11938) remote: Counting objects: 42% (5014/11938) remote: Counting objects: 43% (5134/11938) remote: Counting objects: 44% (5253/11938) remote: Counting objects: 45% (5373/11938) remote: Counting objects: 46% (5492/11938) remote: Counting objects: 47% (5611/11938) remote: Counting objects: 48% (5731/11938) remote: Counting objects: 49% (5850/11938) remote: Counting objects: 50% (5969/11938) remote: Counting objects: 51% (6089/11938) remote: Counting objects: 52% (6208/11938) remote: Counting objects: 53% (6328/11938) remote: Counting objects: 54% (6447/11938) remote: Counting objects: 55% (6566/11938) remote: Counting objects: 56% (6686/11938) remote: Counting objects: 57% (6805/11938) remote: Counting objects: 58% (6925/11938) remote: Counting objects: 59% (7044/11938) remote: Counting objects: 60% (7163/11938) remote: Counting objects: 61% (7283/11938) remote: Counting objects: 62% (7402/11938) remote: Counting objects: 63% (7521/11938) remote: Counting objects: 64% (7641/11938) remote: Counting objects: 65% (7760/11938) remote: Counting objects: 66% (7880/11938) remote: Counting objects: 67% (7999/11938) remote: Counting objects: 68% (8118/11938) remote: Counting objects: 69% (8238/11938) remote: Counting objects: 70% (8357/11938) remote: Counting objects: 71% (8476/11938) remote: Counting objects: 72% (8596/11938) remote: Counting objects: 73% (8715/11938) remote: Counting objects: 74% (8835/11938) remote: Counting objects: 75% (8954/11938) remote: Counting objects: 76% (9073/11938) remote: Counting objects: 77% (9193/11938) remote: Counting objects: 78% (9312/11938) remote: Counting objects: 79% (9432/11938) remote: Counting objects: 80% (9551/11938) remote: Counting objects: 81% (9670/11938) remote: Counting objects: 82% (9790/11938) remote: Counting objects: 83% (9909/11938) remote: Counting objects: 84% (10028/11938) remote: Counting objects: 85% (10148/11938) remote: Counting objects: 86% (10267/11938) remote: Counting objects: 87% (10387/11938) remote: Counting objects: 88% (10506/11938) remote: Counting objects: 89% (10625/11938) remote: Counting objects: 90% (10745/11938) remote: Counting objects: 91% (10864/11938) remote: Counting objects: 92% (10983/11938) remote: Counting objects: 93% (11103/11938) remote: Counting objects: 94% (11222/11938) remote: Counting objects: 95% (11342/11938) remote: Counting objects: 96% (11461/11938) remote: Counting objects: 97% (11580/11938) remote: Counting objects: 98% (11700/11938) remote: Counting objects: 99% (11819/11938) remote: Counting objects: 100% (11938/11938) remote: Counting objects: 100% (11938/11938), done.
  5. 5.52 s remote: Compressing objects: 0% (1/2181) remote: Compressing objects: 1% (22/2181) remote: Compressing objects: 2% (44/2181) remote: Compressing objects: 3% (66/2181) remote: Compressing objects: 4% (88/2181) remote: Compressing objects: 5% (110/2181) remote: Compressing objects: 5% (119/2181) remote: Compressing objects: 6% (131/2181) remote: Compressing objects: 7% (153/2181) remote: Compressing objects: 8% (175/2181) remote: Compressing objects: 9% (197/2181) remote: Compressing objects: 10% (219/2181) remote: Compressing objects: 11% (240/2181) remote: Compressing objects: 12% (262/2181) remote: Compressing objects: 13% (284/2181) remote: Compressing objects: 13% (288/2181) remote: Compressing objects: 14% (306/2181) remote: Compressing objects: 15% (328/2181) remote: Compressing objects: 16% (349/2181) remote: Compressing objects: 17% (371/2181) remote: Compressing objects: 18% (393/2181) remote: Compressing objects: 19% (415/2181) remote: Compressing objects: 20% (437/2181) remote: Compressing objects: 21% (459/2181) remote: Compressing objects: 22% (480/2181) remote: Compressing objects: 23% (502/2181) remote: Compressing objects: 24% (524/2181) remote: Compressing objects: 25% (546/2181) remote: Compressing objects: 26% (568/2181) remote: Compressing objects: 27% (589/2181) remote: Compressing objects: 28% (611/2181) remote: Compressing objects: 29% (633/2181) remote: Compressing objects: 30% (655/2181) remote: Compressing objects: 31% (677/2181) remote: Compressing objects: 32% (698/2181) remote: Compressing objects: 33% (720/2181) remote: Compressing objects: 34% (742/2181) remote: Compressing objects: 35% (764/2181) remote: Compressing objects: 36% (786/2181) remote: Compressing objects: 37% (807/2181) remote: Compressing objects: 38% (829/2181) remote: Compressing objects: 39% (851/2181) remote: Compressing objects: 40% (873/2181) remote: Compressing objects: 41% (895/2181) remote: Compressing objects: 42% (917/2181) remote: Compressing objects: 43% (938/2181) remote: Compressing objects: 44% (960/2181) remote: Compressing objects: 45% (982/2181) remote: Compressing objects: 46% (1004/2181) remote: Compressing objects: 47% (1026/2181) remote: Compressing objects: 48% (1047/2181) remote: Compressing objects: 49% (1069/2181) remote: Compressing objects: 50% (1091/2181) remote: Compressing objects: 51% (1113/2181) remote: Compressing objects: 52% (1135/2181) remote: Compressing objects: 53% (1156/2181) remote: Compressing objects: 54% (1178/2181) remote: Compressing objects: 55% (1200/2181) remote: Compressing objects: 56% (1222/2181) remote: Compressing objects: 57% (1244/2181) remote: Compressing objects: 58% (1265/2181) remote: Compressing objects: 59% (1287/2181) remote: Compressing objects: 60% (1309/2181) remote: Compressing objects: 61% (1331/2181) remote: Compressing objects: 62% (1353/2181) remote: Compressing objects: 63% (1375/2181) remote: Compressing objects: 64% (1396/2181) remote: Compressing objects: 65% (1418/2181) remote: Compressing objects: 66% (1440/2181) remote: Compressing objects: 67% (1462/2181) remote: Compressing objects: 68% (1484/2181) remote: Compressing objects: 69% (1505/2181) remote: Compressing objects: 70% (1527/2181) remote: Compressing objects: 71% (1549/2181) remote: Compressing objects: 72% (1571/2181) remote: Compressing objects: 73% (1593/2181) remote: Compressing objects: 74% (1614/2181) remote: Compressing objects: 75% (1636/2181) remote: Compressing objects: 76% (1658/2181) remote: Compressing objects: 77% (1680/2181) remote: Compressing objects: 78% (1702/2181) remote: Compressing objects: 79% (1723/2181) remote: Compressing objects: 80% (1745/2181) remote: Compressing objects: 81% (1767/2181) remote: Compressing objects: 82% (1789/2181) remote: Compressing objects: 83% (1811/2181) remote: Compressing objects: 84% (1833/2181) remote: Compressing objects: 85% (1854/2181) remote: Compressing objects: 86% (1876/2181) remote: Compressing objects: 87% (1898/2181) remote: Compressing objects: 88% (1920/2181) remote: Compressing objects: 89% (1942/2181) remote: Compressing objects: 90% (1963/2181) remote: Compressing objects: 91% (1985/2181) remote: Compressing objects: 92% (2007/2181) remote: Compressing objects: 93% (2029/2181) remote: Compressing objects: 94% (2051/2181) remote: Compressing objects: 95% (2072/2181) remote: Compressing objects: 96% (2094/2181) remote: Compressing objects: 97% (2116/2181) remote: Compressing objects: 98% (2138/2181) remote: Compressing objects: 99% (2160/2181) remote: Compressing objects: 100% (2181/2181) remote: Compressing objects: 100% (2181/2181), done.
  6. 18.03 s Receiving objects: 0% (1/108237) Receiving objects: 1% (1083/108237) Receiving objects: 2% (2165/108237) Receiving objects: 3% (3248/108237) Receiving objects: 4% (4330/108237), 16.16 MiB | 32.31 MiB/s Receiving objects: 5% (5412/108237), 16.16 MiB | 32.31 MiB/s Receiving objects: 6% (6495/108237), 16.16 MiB | 32.31 MiB/s Receiving objects: 6% (7544/108237), 32.95 MiB | 32.94 MiB/s Receiving objects: 7% (7577/108237), 32.95 MiB | 32.94 MiB/s Receiving objects: 8% (8659/108237), 32.95 MiB | 32.94 MiB/s Receiving objects: 9% (9742/108237), 32.95 MiB | 32.94 MiB/s Receiving objects: 10% (10824/108237), 32.95 MiB | 32.94 MiB/s Receiving objects: 11% (11907/108237), 32.95 MiB | 32.94 MiB/s Receiving objects: 11% (12478/108237), 49.79 MiB | 32.89 MiB/s Receiving objects: 12% (12989/108237), 83.43 MiB | 33.02 MiB/s Receiving objects: 13% (14071/108237), 83.43 MiB | 33.02 MiB/s Receiving objects: 14% (15154/108237), 83.43 MiB | 33.02 MiB/s Receiving objects: 15% (16236/108237), 83.43 MiB | 33.02 MiB/s Receiving objects: 15% (17266/108237), 83.43 MiB | 33.02 MiB/s Receiving objects: 16% (17318/108237), 83.43 MiB | 33.02 MiB/s Receiving objects: 17% (18401/108237), 99.29 MiB | 32.79 MiB/s Receiving objects: 18% (19483/108237), 99.29 MiB | 32.79 MiB/s Receiving objects: 19% (20566/108237), 99.29 MiB | 32.79 MiB/s Receiving objects: 20% (21648/108237), 99.29 MiB | 32.79 MiB/s Receiving objects: 21% (22730/108237), 109.09 MiB | 30.91 MiB/s Receiving objects: 22% (23813/108237), 109.09 MiB | 30.91 MiB/s Receiving objects: 23% (24895/108237), 109.09 MiB | 30.91 MiB/s Receiving objects: 24% (25977/108237), 109.09 MiB | 30.91 MiB/s Receiving objects: 25% (27060/108237), 109.09 MiB | 30.91 MiB/s Receiving objects: 26% (28142/108237), 109.09 MiB | 30.91 MiB/s Receiving objects: 27% (29224/108237), 109.09 MiB | 30.91 MiB/s Receiving objects: 28% (30307/108237), 109.09 MiB | 30.91 MiB/s Receiving objects: 29% (31389/108237), 109.09 MiB | 30.91 MiB/s Receiving objects: 30% (32472/108237), 109.09 MiB | 30.91 MiB/s Receiving objects: 31% (33554/108237), 109.09 MiB | 30.91 MiB/s Receiving objects: 32% (34636/108237), 109.09 MiB | 30.91 MiB/s Receiving objects: 33% (35719/108237), 109.09 MiB | 30.91 MiB/s Receiving objects: 34% (36801/108237), 109.09 MiB | 30.91 MiB/s Receiving objects: 35% (37883/108237), 109.09 MiB | 30.91 MiB/s Receiving objects: 36% (38966/108237), 109.09 MiB | 30.91 MiB/s Receiving objects: 37% (40048/108237), 109.09 MiB | 30.91 MiB/s Receiving objects: 38% (41131/108237), 109.09 MiB | 30.91 MiB/s Receiving objects: 39% (42213/108237), 109.09 MiB | 30.91 MiB/s Receiving objects: 40% (43295/108237), 109.09 MiB | 30.91 MiB/s Receiving objects: 41% (44378/108237), 109.09 MiB | 30.91 MiB/s Receiving objects: 42% (45460/108237), 109.09 MiB | 30.91 MiB/s Receiving objects: 43% (46542/108237), 109.09 MiB | 30.91 MiB/s Receiving objects: 44% (47625/108237), 109.09 MiB | 30.91 MiB/s Receiving objects: 45% (48707/108237), 109.09 MiB | 30.91 MiB/s Receiving objects: 46% (49790/108237), 109.09 MiB | 30.91 MiB/s Receiving objects: 46% (50235/108237), 109.09 MiB | 30.91 MiB/s Receiving objects: 47% (50872/108237), 130.61 MiB | 32.42 MiB/s Receiving objects: 48% (51954/108237), 130.61 MiB | 32.42 MiB/s Receiving objects: 49% (53037/108237), 130.61 MiB | 32.42 MiB/s Receiving objects: 50% (54119/108237), 130.61 MiB | 32.42 MiB/s Receiving objects: 51% (55201/108237), 130.61 MiB | 32.42 MiB/s Receiving objects: 52% (56284/108237), 130.61 MiB | 32.42 MiB/s Receiving objects: 53% (57366/108237), 130.61 MiB | 32.42 MiB/s Receiving objects: 54% (58448/108237), 130.61 MiB | 32.42 MiB/s Receiving objects: 55% (59531/108237), 130.61 MiB | 32.42 MiB/s Receiving objects: 56% (60613/108237), 148.18 MiB | 32.59 MiB/s Receiving objects: 57% (61696/108237), 148.18 MiB | 32.59 MiB/s Receiving objects: 58% (62778/108237), 148.18 MiB | 32.59 MiB/s Receiving objects: 59% (63860/108237), 148.18 MiB | 32.59 MiB/s Receiving objects: 60% (64943/108237), 148.18 MiB | 32.59 MiB/s Receiving objects: 60% (65073/108237), 148.18 MiB | 32.59 MiB/s Receiving objects: 61% (66025/108237), 148.18 MiB | 32.59 MiB/s Receiving objects: 62% (67107/108237), 165.50 MiB | 32.84 MiB/s Receiving objects: 63% (68190/108237), 165.50 MiB | 32.84 MiB/s Receiving objects: 64% (69272/108237), 165.50 MiB | 32.84 MiB/s Receiving objects: 64% (70103/108237), 182.34 MiB | 32.86 MiB/s Receiving objects: 64% (70228/108237), 215.01 MiB | 32.62 MiB/s Receiving objects: 65% (70355/108237), 248.74 MiB | 32.94 MiB/s Receiving objects: 65% (70447/108237), 265.39 MiB | 34.45 MiB/s Receiving objects: 66% (71437/108237), 265.39 MiB | 34.45 MiB/s Receiving objects: 67% (72519/108237), 265.39 MiB | 34.45 MiB/s Receiving objects: 68% (73602/108237), 265.39 MiB | 34.45 MiB/s Receiving objects: 69% (74684/108237), 265.39 MiB | 34.45 MiB/s Receiving objects: 70% (75766/108237), 265.39 MiB | 34.45 MiB/s Receiving objects: 71% (76849/108237), 277.09 MiB | 31.86 MiB/s Receiving objects: 72% (77931/108237), 277.09 MiB | 31.86 MiB/s Receiving objects: 73% (79014/108237), 277.09 MiB | 31.86 MiB/s Receiving objects: 74% (80096/108237), 277.09 MiB | 31.86 MiB/s Receiving objects: 75% (81178/108237), 277.09 MiB | 31.86 MiB/s Receiving objects: 76% (82261/108237), 277.09 MiB | 31.86 MiB/s Receiving objects: 77% (83343/108237), 277.09 MiB | 31.86 MiB/s Receiving objects: 78% (84425/108237), 277.09 MiB | 31.86 MiB/s Receiving objects: 78% (85482/108237), 277.09 MiB | 31.86 MiB/s Receiving objects: 79% (85508/108237), 277.09 MiB | 31.86 MiB/s Receiving objects: 80% (86590/108237), 295.90 MiB | 32.26 MiB/s Receiving objects: 81% (87672/108237), 295.90 MiB | 32.26 MiB/s Receiving objects: 82% (88755/108237), 295.90 MiB | 32.26 MiB/s Receiving objects: 82% (89259/108237), 313.40 MiB | 32.30 MiB/s Receiving objects: 83% (89837/108237), 313.40 MiB | 32.30 MiB/s Receiving objects: 84% (90920/108237), 313.40 MiB | 32.30 MiB/s Receiving objects: 85% (92002/108237), 328.86 MiB | 32.00 MiB/s Receiving objects: 86% (93084/108237), 328.86 MiB | 32.00 MiB/s Receiving objects: 87% (94167/108237), 328.86 MiB | 32.00 MiB/s Receiving objects: 88% (95249/108237), 345.07 MiB | 32.09 MiB/s Receiving objects: 88% (95384/108237), 345.07 MiB | 32.09 MiB/s Receiving objects: 88% (95420/108237), 394.17 MiB | 31.89 MiB/s Receiving objects: 89% (96331/108237), 394.17 MiB | 31.89 MiB/s Receiving objects: 90% (97414/108237), 394.17 MiB | 31.89 MiB/s Receiving objects: 91% (98496/108237), 394.17 MiB | 31.89 MiB/s Receiving objects: 92% (99579/108237), 394.17 MiB | 31.89 MiB/s Receiving objects: 93% (100661/108237), 394.17 MiB | 31.89 MiB/s Receiving objects: 94% (101743/108237), 394.17 MiB | 31.89 MiB/s Receiving objects: 95% (102826/108237), 394.17 MiB | 31.89 MiB/s Receiving objects: 96% (103908/108237), 394.17 MiB | 31.89 MiB/s Receiving objects: 97% (104990/108237), 394.17 MiB | 31.89 MiB/s Receiving objects: 98% (106073/108237), 394.17 MiB | 31.89 MiB/s Receiving objects: 99% (107155/108237), 394.17 MiB | 31.89 MiB/s remote: Total 108237 (delta 10582), reused 9804 (delta 9752), pack-reused 96299 (from 1)
  7. 18.04 s Receiving objects: 100% (108237/108237), 394.17 MiB | 31.89 MiB/s Receiving objects: 100% (108237/108237), 404.45 MiB | 32.33 MiB/s, done.
  8. 23.58 s Resolving deltas: 0% (0/72034) Resolving deltas: 1% (721/72034) Resolving deltas: 2% (1441/72034) Resolving deltas: 3% (2162/72034) Resolving deltas: 4% (2882/72034) Resolving deltas: 5% (3602/72034) Resolving deltas: 6% (4323/72034) Resolving deltas: 7% (5043/72034) Resolving deltas: 8% (5763/72034) Resolving deltas: 9% (6485/72034) Resolving deltas: 10% (7204/72034) Resolving deltas: 11% (7924/72034) Resolving deltas: 12% (8645/72034) Resolving deltas: 13% (9367/72034) Resolving deltas: 14% (10085/72034) Resolving deltas: 15% (10806/72034) Resolving deltas: 16% (11526/72034) Resolving deltas: 17% (12246/72034) Resolving deltas: 17% (12919/72034) Resolving deltas: 18% (12968/72034) Resolving deltas: 19% (13687/72034) Resolving deltas: 20% (14407/72034) Resolving deltas: 21% (15128/72034) Resolving deltas: 22% (15848/72034) Resolving deltas: 23% (16568/72034) Resolving deltas: 24% (17289/72034) Resolving deltas: 25% (18009/72034) Resolving deltas: 26% (18729/72034) Resolving deltas: 27% (19451/72034) Resolving deltas: 28% (20170/72034) Resolving deltas: 29% (20890/72034) Resolving deltas: 30% (21611/72034) Resolving deltas: 30% (21861/72034) Resolving deltas: 31% (22331/72034) Resolving deltas: 32% (23051/72034) Resolving deltas: 33% (23772/72034) Resolving deltas: 34% (24492/72034) Resolving deltas: 35% (25212/72034) Resolving deltas: 36% (25933/72034) Resolving deltas: 37% (26653/72034) Resolving deltas: 38% (27375/72034) Resolving deltas: 38% (28056/72034) Resolving deltas: 39% (28094/72034) Resolving deltas: 40% (28814/72034) Resolving deltas: 41% (29534/72034) Resolving deltas: 42% (30255/72034) Resolving deltas: 43% (30975/72034) Resolving deltas: 44% (31695/72034) Resolving deltas: 45% (32416/72034) Resolving deltas: 46% (33136/72034) Resolving deltas: 47% (33856/72034) Resolving deltas: 48% (34577/72034) Resolving deltas: 49% (35297/72034) Resolving deltas: 50% (36017/72034) Resolving deltas: 51% (36738/72034) Resolving deltas: 52% (37458/72034) Resolving deltas: 53% (38179/72034) Resolving deltas: 54% (38899/72034) Resolving deltas: 54% (39604/72034) Resolving deltas: 55% (39619/72034) Resolving deltas: 56% (40340/72034) Resolving deltas: 57% (41060/72034) Resolving deltas: 58% (41780/72034) Resolving deltas: 59% (42501/72034) Resolving deltas: 60% (43221/72034) Resolving deltas: 61% (43941/72034) Resolving deltas: 62% (44662/72034) Resolving deltas: 63% (45382/72034) Resolving deltas: 64% (46102/72034) Resolving deltas: 65% (46823/72034) Resolving deltas: 66% (47543/72034) Resolving deltas: 67% (48263/72034) Resolving deltas: 68% (48984/72034) Resolving deltas: 69% (49704/72034) Resolving deltas: 70% (50424/72034) Resolving deltas: 71% (51145/72034) Resolving deltas: 72% (51865/72034) Resolving deltas: 73% (52585/72034) Resolving deltas: 74% (53306/72034) Resolving deltas: 75% (54026/72034) Resolving deltas: 76% (54746/72034) Resolving deltas: 77% (55467/72034) Resolving deltas: 78% (56187/72034) Resolving deltas: 79% (56907/72034) Resolving deltas: 80% (57628/72034) Resolving deltas: 81% (58348/72034) Resolving deltas: 82% (59068/72034) Resolving deltas: 83% (59789/72034) Resolving deltas: 84% (60509/72034) Resolving deltas: 84% (60828/72034) Resolving deltas: 85% (61229/72034) Resolving deltas: 86% (61951/72034) Resolving deltas: 87% (62670/72034) Resolving deltas: 88% (63390/72034) Resolving deltas: 89% (64111/72034) Resolving deltas: 90% (64831/72034) Resolving deltas: 91% (65551/72034) Resolving deltas: 92% (66272/72034) Resolving deltas: 93% (66992/72034) Resolving deltas: 94% (67712/72034) Resolving deltas: 95% (68433/72034) Resolving deltas: 96% (69153/72034) Resolving deltas: 97% (69873/72034) Resolving deltas: 98% (70594/72034) Resolving deltas: 99% (71314/72034) Resolving deltas: 100% (72034/72034) Resolving deltas: 100% (72034/72034), done.
  9. 24.20 s Fetching commit 44d1b86627a99f25ed3d9d1f88a3043a5575680c for finite_T_and_mu ...
  10. 24.20 s $ /nix/store/5vpcfsdx1lcnlb2y4k7xyc74shp5qwbh-git-2.54.0/bin/git fetch origin 44d1b86627a99f25ed3d9d1f88a3043a5575680c
  11. 24.75 s From https://github.com/alphal00p/gammaloop
  12. 24.75 s * branch 44d1b86627a99f25ed3d9d1f88a3043a5575680c -> FETCH_HEAD
  13. 24.78 s $ /nix/store/61685rbaxmpigwi3z23i33sv3jyfl70q-coreutils-9.11/bin/timeout --kill-after=15s 7200s /nix/store/5vpcfsdx1lcnlb2y4k7xyc74shp5qwbh-git-2.54.0/bin/git -c advice.detachedHead=false checkout 44d1b86627a99f25ed3d9d1f88a3043a5575680c
  14. 25.16 s HEAD is now at 44d1b8662 adapt thermal test fixtures to graph validation
  15. 25.17 s $ /nix/store/61685rbaxmpigwi3z23i33sv3jyfl70q-coreutils-9.11/bin/timeout --kill-after=15s 7200s /nix/store/wknkybkzrc16r11vk5vrykh4wmw7a353-nix-2.34.8/bin/nix --extra-experimental-features nix-command --extra-experimental-features flakes --log-format internal-json run .#packages.x86_64-linux.nix-ci-check-gammaloop-nextest-integration --print-build-logs
  16. 25.46 s warning: ignoring untrusted flake configuration setting 'extra-substituters'.
  17. 25.46 s Pass '--accept-flake-config' to trust it
  18. 25.46 s warning: ignoring untrusted flake configuration setting 'extra-trusted-public-keys'.
  19. 25.46 s Pass '--accept-flake-config' to trust it
  20. 25.46 s error (ignored): SQLite database '/var/cache/nix-ci-worker/eval-cache-v6/6a19bbbb143948aabfed047789580111c193a0320500378e834d1dcb8e609338.sqlite' is busy
  21. 30.41 s
  22. 30.67 s do you want to allow configuration setting 'extra-substituters' to be set to 'https://cache.nix-ci.com' (y/N)? do you want to permanently mark this value as untrusted (y/N)? warning: ignoring untrusted flake configuration setting 'extra-substituters'.
  23. 30.67 s Pass '--accept-flake-config' to trust it
  24. 30.67 s evaluating derivation 'gdo you want to allow configuration setting 'extra-trusted-public-keys' to be set to 'nix-ci:g3xV5BDTLtIBZr/A00IU1x0EtKKlb7YLgBN2SgYgM6A=' (y/N)? do you want to permanently mark this value as untrusted (y/N)? warning: ignoring untrusted flake configuration setting 'extra-trusted-public-keys'.
  25. 30.67 s Pass '--accept-flake-config' to trust it
  26. 36.15 s copying '/nix/store/b5zm evaluating derivation 'g copying '/nix/store/b5zm evaluating derivation 'g copying '/nix/store/b5zm evaluating derivation 'g copying '/nix/store/b5zm evaluating derivation 'g copying '/nix/store/b5zm evaluating derivation 'g copying '/nix/store/b5zm evaluating derivation 'g copying '/nix/store/b5zm evaluating derivation 'g copying '/nix/store/b5zm evaluating derivation 'g querying gammaloop-nexte [0.0 KiB DL] querying in [0/3 built, 1/0/1 copied
  27. 43.61 s [0/2 built, 1 copied (52 [1/0/2 built, 1 copied (gammaloop-nextest-binaries-integration (post)> Uploading to the NixCI cache: /nix/store/mrq2sif07h573xqh7gjp867jy34b94dn-gammaloop-nextest-binaries-integration
  28. 43.67 s gammaloop-nextest-binaries-integration (post)> warning: 'warn-short-path-literals' is deprecated, use 'lint-short-path-literals = ignore' instead
  29. 43.72 s gammaloop-nextest-binaries-integration (post)> copying 0 paths...
  30. 43.81 s gammaloop-nextest-binaries-integration (post)> warning: 'warn-short-path-literals' is deprecated, use 'lint-short-path-literals = ignore' instead
  31. 43.98 s gammaloop-nextest-binaries-integration (post)> copying 0 paths...
  32. 44.80 s [1/3 built, 1 copied (52 [1/1/2 built, 1 copied (gammaloop-nextest-integration> Extracting 15 binaries (including 2 non-test binaries), 1 build script output directory, and 3 linked paths to /build/source
  33. 48.83 s gammaloop-nextest-integration> Extracted 34 files to /build/source in 4.04s
  34. 48.87 s gammaloop-nextest-integration> ------------
  35. 48.87 s gammaloop-nextest-integration> Nextest run ID 9619fe9d-56d9-4f9c-9ae4-77ab31c45542 with nextest profile: ci_gammaloop
  36. 48.87 s gammaloop-nextest-integration> Starting 179 tests across 13 binaries (212 tests skipped, including 211 tests via profile.ci_gammaloop.default-filter)
  37. 152.12 s gammaloop-nextest-integration> FAIL [ 1.331s] ( 60/179) gammaloop-integration-tests::test_runs aa_aa::important::aa_aa_local_inspect_backend_consistency
  38. 152.12 s gammaloop-nextest-integration> stdout ---
  39. 152.12 s gammaloop-nextest-integration>
  40. 152.12 s gammaloop-nextest-integration> running 1 test
  41. 152.12 s gammaloop-nextest-integration> test aa_aa::important::aa_aa_local_inspect_backend_consistency ... FAILED
  42. 152.12 s gammaloop-nextest-integration>
  43. 152.12 s gammaloop-nextest-integration> failures:
  44. 152.12 s gammaloop-nextest-integration>
  45. 152.12 s gammaloop-nextest-integration> failures:
  46. 152.12 s gammaloop-nextest-integration> aa_aa::important::aa_aa_local_inspect_backend_consistency
  47. 152.12 s gammaloop-nextest-integration>
  48. 152.12 s gammaloop-nextest-integration> test result: FAILED. 0 passed; 1 failed; 0 ignored; 0 measured; 278 filtered out; finished in 1.32s
  49. 152.12 s gammaloop-nextest-integration>
  50. 152.12 s gammaloop-nextest-integration> stderr ---
  51. 152.12 s gammaloop-nextest-integration> [2026-09-23 20:41:33.658] @gammaloop_api::se... INFO : Running command import model sm-default.json
  52. 152.12 s gammaloop-nextest-integration> [2026-09-23 20:41:33.659] @import::model INFO : Loading built-in JSON model sm-default
  53. 152.12 s gammaloop-nextest-integration> [2026-09-23 20:41:33.686] @gammalooprs::model INFO : The following 15 external parameters were forced to zero by the restriction card:
  54. 152.12 s gammaloop-nextest-integration> lamWS, AWS, rhoWS, etaWS, ymc, yme, ymm, MC, Me, MM, WTau, muQ, muLe, muLmu, muLtau
  55. 152.12 s gammaloop-nextest-integration> [2026-09-23 20:41:33.686] @gammalooprs::model INFO : The following 34 vertex rules were removed by the restriction card:
  56. 152.12 s gammaloop-nextest-integration> V_82 -> (c~, d, G+) | V_83 -> (t~, d, G+) | V_84 -> (c~, s, G+) | V_85 -> (t~, s, G+) | V_86 -> (u~, b, G+) | V_87 -> (c~, b, G+) | V_90 -> (c~, d, W+) | V_91 -> (t~, d, W+) | V_92 -> (u~, s, W+) | V_94 -> (t~, s, W+) | V_95 -> (u~, b, W+) | V_96 -> (c~, b, W+) | V_101 -> (e+, e-, G0) | V_102 -> (mu+, mu-, G0) | V_104 -> (e+, e-, H) | V_105 -> (mu+, mu-, H) | V_110 -> (ve~, e-, G+) | V_111 -> (vm~, mu-, G+) | V_116 -> (b~, u, G-) | V_117 -> (d~, c, G-) | V_118 -> (s~, c, G-) | V_119 -> (b~, c, G-) | V_120 -> (d~, t, G-) | V_121 -> (s~, t, G-) | V_124 -> (s~, u, W-) | V_125 -> (b~, u, W-) | V_126 -> (d~, c, W-) | V_128 -> (b~, c, W-) | V_129 -> (d~, t, W-) | V_130 -> (s~, t, W-) | V_138 -> (c~, c, G0) | V_140 -> (c~, c, H) | V_145 -> (e+, ve, G-) | V_146 -> (mu+, vm, G-)
  57. 152.12 s gammaloop-nextest-integration> [2026-09-23 20:41:33.686] @gammalooprs::model INFO : The following 36 couplings were removed by the restriction card:
  58. 152.12 s gammaloop-nextest-integration> GC_13, GC_14, GC_16, GC_17, GC_18, GC_19, GC_20, GC_22, GC_23, GC_24, GC_25, GC_26, GC_28, GC_29, GC_42, GC_43, GC_44, GC_46, GC_47, GC_48, GC_84, GC_85, GC_86, GC_87, GC_88, GC_89, GC_90, GC_91, GC_92, GC_93, GC_101, GC_102, GC_103, GC_105, GC_106, GC_107
  59. 152.12 s gammaloop-nextest-integration> [2026-09-23 20:41:33.687] @gammaloop_api::se... INFO : Running command run set_model_parameters
  60. 152.12 s gammaloop-nextest-integration> [2026-09-23 20:41:33.687] @gammaloop_api::se... INFO : Starting command block set_model_parameters
  61. 152.12 s gammaloop-nextest-integration> [2026-09-23 20:41:33.687] @gammaloop_api::se... INFO : Running command set model MT=173.0
  62. 152.12 s gammaloop-nextest-integration> [2026-09-23 20:41:33.692] @gammaloop_api::se... INFO : Running command set model WT=0.0
  63. 152.12 s gammaloop-nextest-integration> [2026-09-23 20:41:33.698] @gammaloop_api::se... INFO : Running command set model ymt=173.0
  64. 152.12 s gammaloop-nextest-integration> [2026-09-23 20:41:33.703] @gammaloop_api::se... INFO : Running command set model aS=0.118
  65. 152.12 s gammaloop-nextest-integration> [2026-09-23 20:41:33.708] @gammaloop_api::se... INFO : Running command set model aEWM1=137.036
  66. 152.12 s gammaloop-nextest-integration> [2026-09-23 20:41:33.713] @gammaloop_api::se... INFO : Running command set model Gf=1.166390e-05
  67. 152.12 s gammaloop-nextest-integration> [2026-09-23 20:41:33.718] @gammaloop_api::se... INFO : Running command set model MZ=91.188
  68. 152.12 s gammaloop-nextest-integration> [2026-09-23 20:41:33.724] @gammaloop_api::se... INFO : Running command set global string '
  69. 152.12 s gammaloop-nextest-integration> [global.generation.compile]
  70. 152.12 s gammaloop-nextest-integration> compilation_mode = "symjit"
  71. 152.12 s gammaloop-nextest-integration> optimization_level = "O0"
  72. 152.12 s gammaloop-nextest-integration> fast_math = false
  73. 152.12 s gammaloop-nextest-integration> [...]
  74. 152.12 s gammaloop-nextest-integration> [2026-09-23 20:41:33.725] @gammaloop_api::se... INFO : Running command import graphs ./examples/cli/aa_aa/1L/aa_aa_1L.dot -p aa_aa_all_helicities -i 1L_ppmm -o
  75. 152.12 s gammaloop-nextest-integration> [2026-09-23 20:41:33.725] @commands::import INFO : Loading graphs from '/build/source/examples/cli/aa_aa/1L/aa_aa_1L.dot'
  76. 152.12 s gammaloop-nextest-integration> [2026-09-23 20:41:33.739] @gammaloop_api::se... INFO : Running command generate existing -p aa_aa_all_helicities
  77. 152.12 s gammaloop-nextest-integration> The application panicked (crashed).
  78. 152.12 s gammaloop-nextest-integration> Message: label _func_power_ not found
  79. 152.12 s gammaloop-nextest-integration> Location: /nix/store/c7lwckzlfrfsdw1ay0aqz4dpc2j7ry8d-vendor-cargo-deps/c19b7c6f923b580ac259164a89f2577984ad5ab09ee9d583b888f934adbbe8d0/symjit-2.25.6/src/symjit/assembler.rs:77
  80. 152.12 s gammaloop-nextest-integration>
  81. 152.12 s gammaloop-nextest-integration> ━━━━━━━━━━━━━━━━━━━━━━━━━━━━━━━━━━ BACKTRACE ━━━━━━━━━━━━━━━━━━━━━━━━━━━━━━━━━━━
  82. 152.12 s gammaloop-nextest-integration> 1: <color_eyre[17b75cb966c347d1]::config::PanicHook>::panic_report<unknown>
  83. 152.12 s gammaloop-nextest-integration> at <unknown source file>:<unknown line>
  84. 152.12 s gammaloop-nextest-integration> 2: <color_eyre[17b75cb966c347d1]::config::PanicHook>::into_panic_hook::{closure#0}<unknown>
  85. 152.12 s gammaloop-nextest-integration> at <unknown source file>:<unknown line>
  86. 152.12 s gammaloop-nextest-integration> 3: std[6c98fd8553dbae28]::panicking::panic_with_hook<unknown>
  87. 152.12 s gammaloop-nextest-integration> at <unknown source file>:<unknown line>
  88. 152.12 s gammaloop-nextest-integration> 4: std[6c98fd8553dbae28]::panicking::panic_handler::{closure#0}<unknown>
  89. 152.12 s gammaloop-nextest-integration> at <unknown source file>:<unknown line>
  90. 152.12 s gammaloop-nextest-integration> 5: std[6c98fd8553dbae28]::sys::backtrace::__rust_end_short_backtrace::<std[6c98fd8553dbae28]::panicking::panic_handler::{closure#0}, !><unknown>
  91. 152.12 s gammaloop-nextest-integration> at <unknown source file>:<unknown line>
  92. 152.12 s gammaloop-nextest-integration> 6: __rustc[100742bb89c490cb]::rust_begin_unwind<unknown>
  93. 152.12 s gammaloop-nextest-integration> at <unknown source file>:<unknown line>
  94. 152.12 s gammaloop-nextest-integration> 7: core[c0acaeba6ab4c2e0]::panicking::panic_fmt<unknown>
  95. 152.12 s gammaloop-nextest-integration> at <unknown source file>:<unknown line>
  96. 152.12 s gammaloop-nextest-integration> 8: <symjit[1b7c32209dea24bd]::symjit::assembler::Assembler>::apply_jumps<unknown>
  97. 152.12 s gammaloop-nextest-integration> at <unknown source file>:<unknown line>
  98. 152.12 s gammaloop-nextest-integration> 9: <symjit[1b7c32209dea24bd]::symjit::builder::Builder>::compile_from_mir::<symjit[1b7c32209dea24bd]::symjit::amd::complex::AmdComplexGenerator><unknown>
  99. 152.12 s gammaloop-nextest-integration> at <unknown source file>:<unknown line>
  100. 152.12 s gammaloop-nextest-integration> 10: <symjit[1b7c32209dea24bd]::symjit::runnable::Application>::compile_ty<unknown>
  101. 152.12 s gammaloop-nextest-integration> at <unknown source file>:<unknown line>
  102. 152.12 s gammaloop-nextest-integration> 11: <symjit[1b7c32209dea24bd]::symjit::runnable::Application>::with_mir<unknown>
  103. 152.12 s gammaloop-nextest-integration> at <unknown source file>:<unknown line>
  104. 152.12 s gammaloop-nextest-integration> 12: <symjit[1b7c32209dea24bd]::symjit::composer::DirectTranslator as symjit[1b7c32209dea24bd]::symjit::composer::Composer>::compile<unknown>
  105. 152.12 s gammaloop-nextest-integration> at <unknown source file>:<unknown line>
  106. 152.12 s gammaloop-nextest-integration> 13: <symjit[1b7c32209dea24bd]::symjit::compiler::Translator as symjit[1b7c32209dea24bd]::symjit::composer::Composer>::compile<unknown>
  107. 152.12 s gammaloop-nextest-integration> at <unknown source file>:<unknown line>
  108. 152.12 s gammaloop-nextest-integration> 14: <numerica[e7f5e9b3c5815e85]::domains::float::complex::Complex<f64> as symbolica[be89bc9aae529acc]::evaluate::backend::JITCompiledNumber>::jit_compile<unknown>
  109. 152.12 s gammaloop-nextest-integration> at <unknown source file>:<unknown line>
  110. 152.12 s gammaloop-nextest-integration> 15: <symbolica[be89bc9aae529acc]::evaluate::evaluator::ExpressionEvaluator<numerica[e7f5e9b3c5815e85]::domains::float::complex::Complex<f64>>>::jit_compile<unknown>
  111. 152.12 s gammaloop-nextest-integration> at <unknown source file>:<unknown line>
  112. 152.12 s gammaloop-nextest-integration> 16: <gammalooprs[654d7fa3399b1a3a]::integrands::process::evaluators::GenericEvaluator>::activate_symjit<unknown>
  113. 152.12 s gammaloop-nextest-integration> at <unknown source file>:<unknown line>
  114. 152.12 s gammaloop-nextest-integration> 17: <gammalooprs[654d7fa3399b1a3a]::integrands::process::amplitude::AmplitudeGraphTerm>::for_each_generic_evaluator_mut::<<gammalooprs[654d7fa3399b1a3a]::integrands::process::amplitude::AmplitudeIntegrand>::prepare_runtime_backends_after_generation_with_compile_times::{closure#0}><unknown>
  115. 152.12 s gammaloop-nextest-integration> at <unknown source file>:<unknown line>
  116. 152.12 s gammaloop-nextest-integration> 18: <gammalooprs[654d7fa3399b1a3a]::integrands::process::amplitude::AmplitudeIntegrand>::prepare_runtime_backends_after_generation_with_compile_times<unknown>
  117. 152.12 s gammaloop-nextest-integration> at <unknown source file>:<unknown line>
  118. 152.12 s gammaloop-nextest-integration> 19: <gammalooprs[654d7fa3399b1a3a]::processes::amplitude::Amplitude>::build_integrand<unknown>
  119. 152.12 s gammaloop-nextest-integration> at <unknown source file>:<unknown line>
  120. 152.12 s gammaloop-nextest-integration> 20: <gammalooprs[654d7fa3399b1a3a]::processes::process::Process>::generate_integrands<unknown>
  121. 152.12 s gammaloop-nextest-integration> at <unknown source file>:<unknown line>
  122. 152.12 s gammaloop-nextest-integration> 21: <gammaloop_api[1e8c5ecbf0481db6]::state::State>::run_generation_with_monitor::<<gammaloop_api[1e8c5ecbf0481db6]::state::State>::generate_integrand::{closure#0}><unknown>
  123. 152.12 s gammaloop-nextest-integration> at <unknown source file>:<unknown line>
  124. 152.12 s gammaloop-nextest-integration> 22: <gammaloop_api[1e8c5ecbf0481db6]::commands::generate::Generate>::run::<&std[6c98fd8553dbae28]::path::PathBuf><unknown>
  125. 152.12 s gammaloop-nextest-integration> at <unknown source file>:<unknown line>
  126. 152.12 s gammaloop-nextest-integration> 23: <gammaloop_api[1e8c5ecbf0481db6]::commands::Commands>::run<unknown>
  127. 152.12 s gammaloop-nextest-integration> at <unknown source file>:<unknown line>
  128. 152.12 s gammaloop-nextest-integration> 24: <gammaloop_api[1e8c5ecbf0481db6]::session::CliSession>::execute_prepared<unknown>
  129. 152.12 s gammaloop-nextest-integration> at <unknown source file>:<unknown line>
  130. 152.12 s gammaloop-nextest-integration> 25: <gammaloop_api[1e8c5ecbf0481db6]::session::CliSession>::execute_command<unknown>
  131. 152.12 s gammaloop-nextest-integration> at <unknown source file>:<unknown line>
  132. 152.12 s gammaloop-nextest-integration> 26: <gammaloop_integration_tests[524e2ac0cb69ea23]::CLIState>::run_command<unknown>
  133. 152.12 s gammaloop-nextest-integration> at <unknown source file>:<unknown line>
  134. 152.12 s gammaloop-nextest-integration> 27: test_runs[763c2ff637add11c]::aa_aa::generate_aa_aa_helicity_family<unknown>
  135. 152.12 s gammaloop-nextest-integration> at <unknown source file>:<unknown line>
  136. 152.12 s gammaloop-nextest-integration> 28: <test_runs[763c2ff637add11c]::aa_aa::important::aa_aa_local_inspect_backend_consistency::{closure#0} as core[c0acaeba6ab4c2e0]::ops::function::FnOnce<()>>::call_once<unknown>
  137. 152.12 s gammaloop-nextest-integration> at <unknown source file>:<unknown line>
  138. 152.12 s gammaloop-nextest-integration> 29: serial_test[a26e7eca4878125e]::serial_code_lock::local_serial_core_with_return::<(), eyre[cd75025c43f23a9b]::Report><unknown>
  139. 152.12 s gammaloop-nextest-integration> at <unknown source file>:<unknown line>
  140. 152.12 s gammaloop-nextest-integration> 30: test_runs[763c2ff637add11c]::aa_aa::important::aa_aa_local_inspect_backend_consistency<unknown>
  141. 152.12 s gammaloop-nextest-integration> at <unknown source file>:<unknown line>
  142. 152.12 s gammaloop-nextest-integration> 31: <test_runs[763c2ff637add11c]::aa_aa::important::aa_aa_local_inspect_backend_consistency::{closure#0} as core[c0acaeba6ab4c2e0]::ops::function::FnOnce<()>>::call_once<unknown>
  143. 152.12 s gammaloop-nextest-integration> at <unknown source file>:<unknown line>
  144. 152.12 s gammaloop-nextest-integration> 32: test[69f9176bb4e5faed]::__rust_begin_short_backtrace::<core[c0acaeba6ab4c2e0]::result::Result<(), alloc[12e961f32105355]::string::String>, fn() -> core[c0acaeba6ab4c2e0]::result::Result<(), alloc[12e961f32105355]::string::String>><unknown>
  145. 152.12 s gammaloop-nextest-integration> at <unknown source file>:<unknown line>
  146. 152.12 s gammaloop-nextest-integration> 33: test[69f9176bb4e5faed]::run_test::{closure#0}<unknown>
  147. 152.12 s gammaloop-nextest-integration> at <unknown source file>:<unknown line>
  148. 152.12 s gammaloop-nextest-integration> 34: std[6c98fd8553dbae28]::sys::backtrace::__rust_begin_short_backtrace::<test[69f9176bb4e5faed]::run_test::{closure#1}, ()><unknown>
  149. 152.12 s gammaloop-nextest-integration> at <unknown source file>:<unknown line>
  150. 152.12 s gammaloop-nextest-integration> 35: <std[6c98fd8553dbae28]::thread::lifecycle::spawn_unchecked<test[69f9176bb4e5faed]::run_test::{closure#1}, ()>::{closure#1} as core[c0acaeba6ab4c2e0]::ops::function::FnOnce<()>>::call_once::{shim:vtable#0}<unknown>
  151. 152.12 s gammaloop-nextest-integration> at <unknown source file>:<unknown line>
  152. 152.12 s gammaloop-nextest-integration> 36: <std[6c98fd8553dbae28]::sys::thread::unix::Thread>::new::thread_start<unknown>
  153. 152.12 s gammaloop-nextest-integration> at <unknown source file>:<unknown line>
  154. 152.12 s gammaloop-nextest-integration> 37: start_thread<unknown>
  155. 152.12 s gammaloop-nextest-integration> at <unknown source file>:<unknown line>
  156. 152.12 s gammaloop-nextest-integration> 38: __clone3<unknown>
  157. 152.12 s gammaloop-nextest-integration> at <unknown source file>:<unknown line>
  158. 152.12 s gammaloop-nextest-integration>
  159. 152.12 s gammaloop-nextest-integration> Run with COLORBT_SHOW_HIDDEN=1 environment variable to disable frame filtering.
  160. 152.12 s gammaloop-nextest-integration> Run with RUST_BACKTRACE=full to include source snippets.
  161. 152.12 s gammaloop-nextest-integration> Warning: SpanTrace capture is Unsupported.
  162. 152.12 s gammaloop-nextest-integration> Ensure that you've setup a tracing-error ErrorLayer and the semver versions are compatible
  163. 152.12 s gammaloop-nextest-integration>
  164. 163.38 s gammaloop-nextest-integration> FAIL [ 2.236s] (101/179) gammaloop-integration-tests::test_runs inspect::thermal_vacuum_2l_3l_inspect
  165. 163.38 s gammaloop-nextest-integration> stdout ---
  166. 163.38 s gammaloop-nextest-integration>
  167. 163.38 s gammaloop-nextest-integration> running 1 test
  168. 163.38 s gammaloop-nextest-integration> test inspect::thermal_vacuum_2l_3l_inspect ... FAILED
  169. 163.38 s gammaloop-nextest-integration>
  170. 163.38 s gammaloop-nextest-integration> failures:
  171. 163.38 s gammaloop-nextest-integration>
  172. 163.38 s gammaloop-nextest-integration> failures:
  173. 163.38 s gammaloop-nextest-integration> inspect::thermal_vacuum_2l_3l_inspect
  174. 163.38 s gammaloop-nextest-integration>
  175. 163.38 s gammaloop-nextest-integration> test result: FAILED. 0 passed; 1 failed; 0 ignored; 0 measured; 278 filtered out; finished in 2.20s
  176. 163.38 s gammaloop-nextest-integration>
  177. 163.38 s gammaloop-nextest-integration> stderr ---
  178. 163.38 s gammaloop-nextest-integration> [2026-09-23 20:41:44.073] @gammaloop_api::se... INFO : Running command import model sm-default.json
  179. 163.38 s gammaloop-nextest-integration> [2026-09-23 20:41:44.074] @import::model INFO : Loading built-in JSON model sm-default
  180. 163.38 s gammaloop-nextest-integration> [2026-09-23 20:41:44.144] @gammalooprs::model INFO : The following 15 external parameters were forced to zero by the restriction card:
  181. 163.38 s gammaloop-nextest-integration> lamWS, AWS, rhoWS, etaWS, ymc, yme, ymm, MC, Me, MM, WTau, muQ, muLe, muLmu, muLtau
  182. 163.38 s gammaloop-nextest-integration> [2026-09-23 20:41:44.144] @gammalooprs::model INFO : The following 34 vertex rules were removed by the restriction card:
  183. 163.38 s gammaloop-nextest-integration> V_82 -> (c~, d, G+) | V_83 -> (t~, d, G+) | V_84 -> (c~, s, G+) | V_85 -> (t~, s, G+) | V_86 -> (u~, b, G+) | V_87 -> (c~, b, G+) | V_90 -> (c~, d, W+) | V_91 -> (t~, d, W+) | V_92 -> (u~, s, W+) | V_94 -> (t~, s, W+) | V_95 -> (u~, b, W+) | V_96 -> (c~, b, W+) | V_101 -> (e+, e-, G0) | V_102 -> (mu+, mu-, G0) | V_104 -> (e+, e-, H) | V_105 -> (mu+, mu-, H) | V_110 -> (ve~, e-, G+) | V_111 -> (vm~, mu-, G+) | V_116 -> (b~, u, G-) | V_117 -> (d~, c, G-) | V_118 -> (s~, c, G-) | V_119 -> (b~, c, G-) | V_120 -> (d~, t, G-) | V_121 -> (s~, t, G-) | V_124 -> (s~, u, W-) | V_125 -> (b~, u, W-) | V_126 -> (d~, c, W-) | V_128 -> (b~, c, W-) | V_129 -> (d~, t, W-) | V_130 -> (s~, t, W-) | V_138 -> (c~, c, G0) | V_140 -> (c~, c, H) | V_145 -> (e+, ve, G-) | V_146 -> (mu+, vm, G-)
  184. 163.38 s gammaloop-nextest-integration> [2026-09-23 20:41:44.144] @gammalooprs::model INFO : The following 36 couplings were removed by the restriction card:
  185. 163.38 s gammaloop-nextest-integration> GC_13, GC_14, GC_16, GC_17, GC_18, GC_19, GC_20, GC_22, GC_23, GC_24, GC_25, GC_26, GC_28, GC_29, GC_42, GC_43, GC_44, GC_46, GC_47, GC_48, GC_84, GC_85, GC_86, GC_87, GC_88, GC_89, GC_90, GC_91, GC_92, GC_93, GC_101, GC_102, GC_103, GC_105, GC_106, GC_107
  186. 163.38 s gammaloop-nextest-integration> [2026-09-23 20:41:44.145] @gammaloop_api::se... INFO : Running command import graphs ./tests/resources/graphs/sunrise_qcd_vacuum.dot
  187. 163.38 s gammaloop-nextest-integration> [2026-09-23 20:41:44.145] @commands::import INFO : Loading graphs from '/build/source/tests/resources/graphs/sunrise_qcd_vacuum.dot'
  188. 163.38 s gammaloop-nextest-integration> [2026-09-23 20:41:44.153] @gammaloop_api::se... INFO : Running command import graphs ./tests/resources/graphs/mercedes_qcd_vacuum.dot
  189. 163.38 s gammaloop-nextest-integration> [2026-09-23 20:41:44.153] @commands::import INFO : Loading graphs from '/build/source/tests/resources/graphs/mercedes_qcd_vacuum.dot'
  190. 163.38 s gammaloop-nextest-integration> [2026-09-23 20:41:44.174] @gammaloop_api::se... INFO : Running command import graphs ./tests/resources/graphs/tennis_ball_qcd_vacuum.dot
  191. 163.38 s gammaloop-nextest-integration> [2026-09-23 20:41:44.174] @commands::import INFO : Loading graphs from '/build/source/tests/resources/graphs/tennis_ball_qcd_vacuum.dot'
  192. 163.38 s gammaloop-nextest-integration> [2026-09-23 20:41:44.190] @gammaloop_api::se... INFO : Running command set model aS=1.0
  193. 163.38 s gammaloop-nextest-integration> [2026-09-23 20:41:44.201] @gammaloop_api::se... INFO : Running command set model muB=0.0
  194. 163.38 s gammaloop-nextest-integration> [2026-09-23 20:41:44.207] @gammaloop_api::se... INFO : Running command generate
  195. 163.38 s gammaloop-nextest-integration> [2026-09-23 20:41:45.525] @commands::generate INFO :
  196. 163.38 s gammaloop-nextest-integration> Integrand generation summary
  197. 163.38 s gammaloop-nextest-integration> peak RAM 115.13 MiB | cores 1
  198. 163.38 s gammaloop-nextest-integration> ╭───────────┬───────┬─────────┬─────────────┬─────────────┬────────────────┬─────────────╮
  199. 163.38 s gammaloop-nextest-integration> │ integrand │ graph │ # evals │ expr build │ spenso │ symbolica eval │ compile │
  200. 163.38 s gammaloop-nextest-integration> ├───────────┼───────┼─────────┼─────────────┼─────────────┼────────────────┼─────────────┤
  201. 163.38 s gammaloop-nextest-integration> │ default │ GL0 │ 1 │ 29ms (81%) │ 4ms (12%) │ 2ms (6.5%) │ 0ms (0.00%) │
  202. 163.38 s gammaloop-nextest-integration> │ default │ GL2 │ 1 │ 284ms (34%) │ 111ms (13%) │ 443ms (53%) │ 0ms (0.00%) │
  203. 163.38 s gammaloop-nextest-integration> │ default │ GL3 │ 1 │ 255ms (63%) │ 90ms (22%) │ 57ms (14%) │ 0ms (0.00%) │
  204. 163.38 s gammaloop-nextest-integration> ├───────────┼───────┼─────────┼─────────────┼─────────────┼────────────────┼─────────────┤
  205. 163.38 s gammaloop-nextest-integration> │ Total │ │ 3 │ 569ms (45%) │ 206ms (16%) │ 503ms (39%) │ 0ms (0.00%) │
  206. 163.38 s gammaloop-nextest-integration> ╰───────────┴───────┴─────────┴─────────────┴─────────────┴────────────────┴─────────────╯
  207. 163.38 s gammaloop-nextest-integration> [2026-09-23 20:41:45.765] @gammaloop_api::se... INFO : Running command set model muB=0.0
  208. 163.38 s gammaloop-nextest-integration> [2026-09-23 20:41:45.790] @commands::inspect INFO :
  209. 163.38 s gammaloop-nextest-integration> Input point in momentum space:
  210. 163.38 s gammaloop-nextest-integration>
  211. 163.38 s gammaloop-nextest-integration> ( 0.1000000000000000, 0.2000000000000000, 0.3000000000000000, 0.4000000000000000, 0.5000000000000000, 0.6000000000000000 )
  212. 163.38 s gammaloop-nextest-integration>
  213. 163.38 s gammaloop-nextest-integration> The evaluation of integrand 'default' is:
  214. 163.38 s gammaloop-nextest-integration>
  215. 163.38 s gammaloop-nextest-integration> ( +0.0000000000000000e0, +2.8885972999394024e-3 i)
  216. 163.38 s gammaloop-nextest-integration>
  217. 163.38 s gammaloop-nextest-integration> [2026-09-23 20:41:45.802] @commands::inspect INFO :
  218. 163.38 s gammaloop-nextest-integration> Input point in momentum space:
  219. 163.38 s gammaloop-nextest-integration>
  220. 163.38 s gammaloop-nextest-integration> ( 1.1000000000000001, 0.2000000000000000, 0.3000000000000000, 0.4000000000000000, 1.5000000000000000, 0.6000000000000000 )
  221. 163.38 s gammaloop-nextest-integration>
  222. 163.38 s gammaloop-nextest-integration> The evaluation of integrand 'default' is:
  223. 163.38 s gammaloop-nextest-integration>
  224. 163.38 s gammaloop-nextest-integration> ( +0.0000000000000000e0, +2.9067242745452795e-4 i)
  225. 163.38 s gammaloop-nextest-integration>
  226. 163.38 s gammaloop-nextest-integration> [2026-09-23 20:41:45.906] @commands::inspect INFO :
  227. 163.38 s gammaloop-nextest-integration> Input point in momentum space:
  228. 163.38 s gammaloop-nextest-integration>
  229. 163.38 s gammaloop-nextest-integration> ( 0.1000000000000000, 0.2000000000000000, 0.3000000000000000, 0.4000000000000000, 0.5000000000000000, 0.6000000000000000, 0.7000000000000000, 0.8000000000000000, 0.9000000000000000 )
  230. 163.38 s gammaloop-nextest-integration>
  231. 163.38 s gammaloop-nextest-integration> The evaluation of integrand 'default' is:
  232. 163.38 s gammaloop-nextest-integration>
  233. 163.38 s gammaloop-nextest-integration> ( -4.8512092933174132e-308, +1.7507199596969886e-5 i)
  234. 163.38 s gammaloop-nextest-integration>
  235. 163.38 s gammaloop-nextest-integration> [2026-09-23 20:41:46.013] @commands::inspect INFO :
  236. 163.38 s gammaloop-nextest-integration> Input point in momentum space:
  237. 163.38 s gammaloop-nextest-integration>
  238. 163.38 s gammaloop-nextest-integration> ( 1.1000000000000001, 0.2000000000000000, 0.3000000000000000, 0.4000000000000000, 1.5000000000000000, 0.6000000000000000, 0.7000000000000000, 0.8000000000000000, 1.8999999999999999 )
  239. 163.38 s gammaloop-nextest-integration>
  240. 163.38 s gammaloop-nextest-integration> The evaluation of integrand 'default' is:
  241. 163.38 s gammaloop-nextest-integration>
  242. 163.38 s gammaloop-nextest-integration> ( -2.7917022134417262e-309, +6.1266473663220322e-7 i)
  243. 163.38 s gammaloop-nextest-integration>
  244. 163.38 s gammaloop-nextest-integration> [2026-09-23 20:41:46.072] @commands::inspect INFO :
  245. 163.38 s gammaloop-nextest-integration> Input point in momentum space:
  246. 163.38 s gammaloop-nextest-integration>
  247. 163.38 s gammaloop-nextest-integration> ( 0.1000000000000000, 0.2000000000000000, 0.3000000000000000, 0.4000000000000000, 0.5000000000000000, 0.6000000000000000, 0.7000000000000000, 0.8000000000000000, 0.9000000000000000 )
  248. 163.38 s gammaloop-nextest-integration>
  249. 163.38 s gammaloop-nextest-integration> The evaluation of integrand 'default' is:
  250. 163.38 s gammaloop-nextest-integration>
  251. 163.38 s gammaloop-nextest-integration> ( +0.0000000000000000e0, -2.4785147575349846e-5 i)
  252. 163.38 s gammaloop-nextest-integration>
  253. 163.38 s gammaloop-nextest-integration> The application panicked (crashed).
  254. 163.38 s gammaloop-nextest-integration> Message: thermal tennis ball inspect f64 benchmark at point 0 at muB=0.0: actual=(0+-0.000024785147575349846i), expected=(0+-0.00002403408249730896i), relative distance=0.03030303030302961, tolerance=1e-10
  255. 163.38 s gammaloop-nextest-integration> Location: tests/tests/test_runs/utils.rs:473
  256. 163.38 s gammaloop-nextest-integration>
  257. 163.38 s gammaloop-nextest-integration> ━━━━━━━━━━━━━━━━━━━━━━━━━━━━━━━━━━ BACKTRACE ━━━━━━━━━━━━━━━━━━━━━━━━━━━━━━━━━━━
  258. 163.38 s gammaloop-nextest-integration> 1: <color_eyre[17b75cb966c347d1]::config::PanicHook>::panic_report<unknown>
  259. 163.38 s gammaloop-nextest-integration> at <unknown source file>:<unknown line>
  260. 163.38 s gammaloop-nextest-integration> 2: <color_eyre[17b75cb966c347d1]::config::PanicHook>::into_panic_hook::{closure#0}<unknown>
  261. 163.38 s gammaloop-nextest-integration> at <unknown source file>:<unknown line>
  262. 163.38 s gammaloop-nextest-integration> 3: std[6c98fd8553dbae28]::panicking::panic_with_hook<unknown>
  263. 163.38 s gammaloop-nextest-integration> at <unknown source file>:<unknown line>
  264. 163.38 s gammaloop-nextest-integration> 4: std[6c98fd8553dbae28]::panicking::panic_handler::{closure#0}<unknown>
  265. 163.38 s gammaloop-nextest-integration> at <unknown source file>:<unknown line>
  266. 163.38 s gammaloop-nextest-integration> 5: std[6c98fd8553dbae28]::sys::backtrace::__rust_end_short_backtrace::<std[6c98fd8553dbae28]::panicking::panic_handler::{closure#0}, !><unknown>
  267. 163.38 s gammaloop-nextest-integration> at <unknown source file>:<unknown line>
  268. 163.38 s gammaloop-nextest-integration> 6: __rustc[100742bb89c490cb]::rust_begin_unwind<unknown>
  269. 163.38 s gammaloop-nextest-integration> at <unknown source file>:<unknown line>
  270. 163.38 s gammaloop-nextest-integration> 7: core[c0acaeba6ab4c2e0]::panicking::panic_fmt<unknown>
  271. 163.38 s gammaloop-nextest-integration> at <unknown source file>:<unknown line>
  272. 163.38 s gammaloop-nextest-integration> 8: test_runs[763c2ff637add11c]::utils::assert_complex_approx_eq::<&str><unknown>
  273. 163.38 s gammaloop-nextest-integration> at <unknown source file>:<unknown line>
  274. 163.38 s gammaloop-nextest-integration> 9: test_runs[763c2ff637add11c]::inspect::thermal_vacuum_2l_3l_inspect::assert_inspect<unknown>
  275. 163.38 s gammaloop-nextest-integration> at <unknown source file>:<unknown line>
  276. 163.38 s gammaloop-nextest-integration> 10: test_runs[763c2ff637add11c]::inspect::thermal_vacuum_2l_3l_inspect<unknown>
  277. 163.38 s gammaloop-nextest-integration> at <unknown source file>:<unknown line>
  278. 163.38 s gammaloop-nextest-integration> 11: <test_runs[763c2ff637add11c]::inspect::thermal_vacuum_2l_3l_inspect::{closure#0} as core[c0acaeba6ab4c2e0]::ops::function::FnOnce<()>>::call_once<unknown>
  279. 163.38 s gammaloop-nextest-integration> at <unknown source file>:<unknown line>
  280. 163.38 s gammaloop-nextest-integration> 12: test[69f9176bb4e5faed]::__rust_begin_short_backtrace::<core[c0acaeba6ab4c2e0]::result::Result<(), alloc[12e961f32105355]::string::String>, fn() -> core[c0acaeba6ab4c2e0]::result::Result<(), alloc[12e961f32105355]::string::String>><unknown>
  281. 163.38 s gammaloop-nextest-integration> at <unknown source file>:<unknown line>
  282. 163.38 s gammaloop-nextest-integration> 13: test[69f9176bb4e5faed]::run_test::{closure#0}<unknown>
  283. 163.38 s gammaloop-nextest-integration> at <unknown source file>:<unknown line>
  284. 163.38 s gammaloop-nextest-integration> 14: std[6c98fd8553dbae28]::sys::backtrace::__rust_begin_short_backtrace::<test[69f9176bb4e5faed]::run_test::{closure#1}, ()><unknown>
  285. 163.38 s gammaloop-nextest-integration> at <unknown source file>:<unknown line>
  286. 163.38 s gammaloop-nextest-integration> 15: <std[6c98fd8553dbae28]::thread::lifecycle::spawn_unchecked<test[69f9176bb4e5faed]::run_test::{closure#1}, ()>::{closure#1} as core[c0acaeba6ab4c2e0]::ops::function::FnOnce<()>>::call_once::{shim:vtable#0}<unknown>
  287. 163.38 s gammaloop-nextest-integration> at <unknown source file>:<unknown line>
  288. 163.38 s gammaloop-nextest-integration> 16: <std[6c98fd8553dbae28]::sys::thread::unix::Thread>::new::thread_start<unknown>
  289. 163.38 s gammaloop-nextest-integration> at <unknown source file>:<unknown line>
  290. 163.38 s gammaloop-nextest-integration> 17: start_thread<unknown>
  291. 163.38 s gammaloop-nextest-integration> at <unknown source file>:<unknown line>
  292. 163.38 s gammaloop-nextest-integration> 18: __clone3<unknown>
  293. 163.38 s gammaloop-nextest-integration> at <unknown source file>:<unknown line>
  294. 163.38 s gammaloop-nextest-integration>
  295. 163.38 s gammaloop-nextest-integration> Run with COLORBT_SHOW_HIDDEN=1 environment variable to disable frame filtering.
  296. 163.38 s gammaloop-nextest-integration> Run with RUST_BACKTRACE=full to include source snippets.
  297. 163.38 s gammaloop-nextest-integration>