1. 0.00 s $ /nix/store/61685rbaxmpigwi3z23i33sv3jyfl70q-coreutils-9.11/bin/timeout --kill-after=15s 7200s /nix/store/wknkybkzrc16r11vk5vrykh4wmw7a353-nix-2.34.8/bin/nix --extra-experimental-features nix-command --extra-experimental-features flakes flake clone git+https://github.com/alphal00p/gammaloop --dest /tmp/nix-ci-worker/stable-pwd/repo/
  2. 0.07 s Cloning into '/tmp/nix-ci-worker/stable-pwd/repo'...
  3. 2.70 s remote: Enumerating objects: 84553 remote: Enumerating objects: 96033, done.
  4. 2.93 s remote: Counting objects: 0% (1/11480) remote: Counting objects: 1% (115/11480) remote: Counting objects: 2% (230/11480) remote: Counting objects: 3% (345/11480) remote: Counting objects: 4% (460/11480) remote: Counting objects: 5% (574/11480) remote: Counting objects: 6% (689/11480) remote: Counting objects: 7% (804/11480) remote: Counting objects: 8% (919/11480) remote: Counting objects: 9% (1034/11480) remote: Counting objects: 10% (1148/11480) remote: Counting objects: 11% (1263/11480) remote: Counting objects: 12% (1378/11480) remote: Counting objects: 13% (1493/11480) remote: Counting objects: 14% (1608/11480) remote: Counting objects: 15% (1722/11480) remote: Counting objects: 16% (1837/11480) remote: Counting objects: 17% (1952/11480) remote: Counting objects: 18% (2067/11480) remote: Counting objects: 19% (2182/11480) remote: Counting objects: 20% (2296/11480) remote: Counting objects: 21% (2411/11480) remote: Counting objects: 22% (2526/11480) remote: Counting objects: 23% (2641/11480) remote: Counting objects: 24% (2756/11480) remote: Counting objects: 25% (2870/11480) remote: Counting objects: 26% (2985/11480) remote: Counting objects: 27% (3100/11480) remote: Counting objects: 28% (3215/11480) remote: Counting objects: 29% (3330/11480) remote: Counting objects: 30% (3444/11480) remote: Counting objects: 31% (3559/11480) remote: Counting objects: 32% (3674/11480) remote: Counting objects: 33% (3789/11480) remote: Counting objects: 34% (3904/11480) remote: Counting objects: 35% (4018/11480) remote: Counting objects: 36% (4133/11480) remote: Counting objects: 37% (4248/11480) remote: Counting objects: 38% (4363/11480) remote: Counting objects: 39% (4478/11480) remote: Counting objects: 40% (4592/11480) remote: Counting objects: 41% (4707/11480) remote: Counting objects: 42% (4822/11480) remote: Counting objects: 43% (4937/11480) remote: Counting objects: 44% (5052/11480) remote: Counting objects: 45% (5166/11480) remote: Counting objects: 46% (5281/11480) remote: Counting objects: 47% (5396/11480) remote: Counting objects: 48% (5511/11480) remote: Counting objects: 49% (5626/11480) remote: Counting objects: 50% (5740/11480) remote: Counting objects: 51% (5855/11480) remote: Counting objects: 52% (5970/11480) remote: Counting objects: 53% (6085/11480) remote: Counting objects: 54% (6200/11480) remote: Counting objects: 55% (6314/11480) remote: Counting objects: 56% (6429/11480) remote: Counting objects: 57% (6544/11480) remote: Counting objects: 58% (6659/11480) remote: Counting objects: 59% (6774/11480) remote: Counting objects: 60% (6888/11480) remote: Counting objects: 61% (7003/11480) remote: Counting objects: 62% (7118/11480) remote: Counting objects: 63% (7233/11480) remote: Counting objects: 64% (7348/11480) remote: Counting objects: 65% (7462/11480) remote: Counting objects: 66% (7577/11480) remote: Counting objects: 67% (7692/11480) remote: Counting objects: 68% (7807/11480) remote: Counting objects: 69% (7922/11480) remote: Counting objects: 70% (8036/11480) remote: Counting objects: 71% (8151/11480) remote: Counting objects: 72% (8266/11480) remote: Counting objects: 73% (8381/11480) remote: Counting objects: 74% (8496/11480) remote: Counting objects: 75% (8610/11480) remote: Counting objects: 76% (8725/11480) remote: Counting objects: 77% (8840/11480) remote: Counting objects: 78% (8955/11480) remote: Counting objects: 79% (9070/11480) remote: Counting objects: 80% (9184/11480) remote: Counting objects: 81% (9299/11480) remote: Counting objects: 82% (9414/11480) remote: Counting objects: 83% (9529/11480) remote: Counting objects: 84% (9644/11480) remote: Counting objects: 85% (9758/11480) remote: Counting objects: 86% (9873/11480) remote: Counting objects: 87% (9988/11480) remote: Counting objects: 88% (10103/11480) remote: Counting objects: 89% (10218/11480) remote: Counting objects: 90% (10332/11480) remote: Counting objects: 91% (10447/11480) remote: Counting objects: 92% (10562/11480) remote: Counting objects: 93% (10677/11480) remote: Counting objects: 94% (10792/11480) remote: Counting objects: 95% (10906/11480) remote: Counting objects: 96% (11021/11480) remote: Counting objects: 97% (11136/11480) remote: Counting objects: 98% (11251/11480) remote: Counting objects: 99% (11366/11480) remote: Counting objects: 100% (11480/11480) remote: Counting objects: 100% (11480/11480), done.
  5. 5.98 s remote: Compressing objects: 0% (1/2703) remote: Compressing objects: 1% (28/2703) remote: Compressing objects: 2% (55/2703) remote: Compressing objects: 3% (82/2703) remote: Compressing objects: 4% (109/2703) remote: Compressing objects: 5% (136/2703) remote: Compressing objects: 6% (163/2703) remote: Compressing objects: 7% (190/2703) remote: Compressing objects: 8% (217/2703) remote: Compressing objects: 9% (244/2703) remote: Compressing objects: 10% (271/2703) remote: Compressing objects: 11% (298/2703) remote: Compressing objects: 12% (325/2703) remote: Compressing objects: 13% (352/2703) remote: Compressing objects: 14% (379/2703) remote: Compressing objects: 14% (402/2703) remote: Compressing objects: 15% (406/2703) remote: Compressing objects: 16% (433/2703) remote: Compressing objects: 17% (460/2703) remote: Compressing objects: 18% (487/2703) remote: Compressing objects: 18% (512/2703) remote: Compressing objects: 19% (514/2703) remote: Compressing objects: 20% (541/2703) remote: Compressing objects: 21% (568/2703) remote: Compressing objects: 22% (595/2703) remote: Compressing objects: 23% (622/2703) remote: Compressing objects: 24% (649/2703) remote: Compressing objects: 25% (676/2703) remote: Compressing objects: 26% (703/2703) remote: Compressing objects: 27% (730/2703) remote: Compressing objects: 28% (757/2703) remote: Compressing objects: 29% (784/2703) remote: Compressing objects: 29% (806/2703) remote: Compressing objects: 30% (811/2703) remote: Compressing objects: 31% (838/2703) remote: Compressing objects: 32% (865/2703) remote: Compressing objects: 33% (892/2703) remote: Compressing objects: 34% (920/2703) remote: Compressing objects: 35% (947/2703) remote: Compressing objects: 36% (974/2703) remote: Compressing objects: 37% (1001/2703) remote: Compressing objects: 38% (1028/2703) remote: Compressing objects: 39% (1055/2703) remote: Compressing objects: 40% (1082/2703) remote: Compressing objects: 41% (1109/2703) remote: Compressing objects: 42% (1136/2703) remote: Compressing objects: 43% (1163/2703) remote: Compressing objects: 44% (1190/2703) remote: Compressing objects: 45% (1217/2703) remote: Compressing objects: 46% (1244/2703) remote: Compressing objects: 47% (1271/2703) remote: Compressing objects: 48% (1298/2703) remote: Compressing objects: 49% (1325/2703) remote: Compressing objects: 50% (1352/2703) remote: Compressing objects: 51% (1379/2703) remote: Compressing objects: 52% (1406/2703) remote: Compressing objects: 53% (1433/2703) remote: Compressing objects: 54% (1460/2703) remote: Compressing objects: 55% (1487/2703) remote: Compressing objects: 56% (1514/2703) remote: Compressing objects: 57% (1541/2703) remote: Compressing objects: 58% (1568/2703) remote: Compressing objects: 59% (1595/2703) remote: Compressing objects: 60% (1622/2703) remote: Compressing objects: 61% (1649/2703) remote: Compressing objects: 62% (1676/2703) remote: Compressing objects: 63% (1703/2703) remote: Compressing objects: 64% (1730/2703) remote: Compressing objects: 65% (1757/2703) remote: Compressing objects: 66% (1784/2703) remote: Compressing objects: 67% (1812/2703) remote: Compressing objects: 68% (1839/2703) remote: Compressing objects: 69% (1866/2703) remote: Compressing objects: 70% (1893/2703) remote: Compressing objects: 71% (1920/2703) remote: Compressing objects: 72% (1947/2703) remote: Compressing objects: 73% (1974/2703) remote: Compressing objects: 74% (2001/2703) remote: Compressing objects: 75% (2028/2703) remote: Compressing objects: 76% (2055/2703) remote: Compressing objects: 77% (2082/2703) remote: Compressing objects: 78% (2109/2703) remote: Compressing objects: 79% (2136/2703) remote: Compressing objects: 80% (2163/2703) remote: Compressing objects: 81% (2190/2703) remote: Compressing objects: 82% (2217/2703) remote: Compressing objects: 83% (2244/2703) remote: Compressing objects: 84% (2271/2703) remote: Compressing objects: 85% (2298/2703) remote: Compressing objects: 86% (2325/2703) remote: Compressing objects: 87% (2352/2703) remote: Compressing objects: 88% (2379/2703) remote: Compressing objects: 89% (2406/2703) remote: Compressing objects: 90% (2433/2703) remote: Compressing objects: 91% (2460/2703) remote: Compressing objects: 92% (2487/2703) remote: Compressing objects: 93% (2514/2703) remote: Compressing objects: 94% (2541/2703) remote: Compressing objects: 95% (2568/2703) remote: Compressing objects: 96% (2595/2703) remote: Compressing objects: 97% (2622/2703) remote: Compressing objects: 98% (2649/2703) remote: Compressing objects: 99% (2676/2703) remote: Compressing objects: 100% (2703/2703) remote: Compressing objects: 100% (2703/2703), done.
  6. 16.69 s Receiving objects: 0% (1/96033) Receiving objects: 1% (961/96033) Receiving objects: 2% (1921/96033) Receiving objects: 3% (2881/96033) Receiving objects: 4% (3842/96033) Receiving objects: 5% (4802/96033), 8.96 MiB | 17.91 MiB/s Receiving objects: 6% (5762/96033), 8.96 MiB | 17.91 MiB/s Receiving objects: 7% (6723/96033), 8.96 MiB | 17.91 MiB/s Receiving objects: 8% (7683/96033), 8.96 MiB | 17.91 MiB/s Receiving objects: 9% (8643/96033), 8.96 MiB | 17.91 MiB/s Receiving objects: 10% (9604/96033), 8.96 MiB | 17.91 MiB/s Receiving objects: 11% (10564/96033), 8.96 MiB | 17.91 MiB/s Receiving objects: 12% (11524/96033), 8.96 MiB | 17.91 MiB/s Receiving objects: 13% (12485/96033), 8.96 MiB | 17.91 MiB/s Receiving objects: 14% (13445/96033), 8.96 MiB | 17.91 MiB/s Receiving objects: 14% (14355/96033), 8.96 MiB | 17.91 MiB/s Receiving objects: 15% (14405/96033), 8.96 MiB | 17.91 MiB/s Receiving objects: 16% (15366/96033), 20.27 MiB | 20.26 MiB/s Receiving objects: 17% (16326/96033), 20.27 MiB | 20.26 MiB/s Receiving objects: 18% (17286/96033), 20.27 MiB | 20.26 MiB/s Receiving objects: 19% (18247/96033), 20.27 MiB | 20.26 MiB/s Receiving objects: 20% (19207/96033), 20.27 MiB | 20.26 MiB/s Receiving objects: 21% (20167/96033), 20.27 MiB | 20.26 MiB/s Receiving objects: 22% (21128/96033), 20.27 MiB | 20.26 MiB/s Receiving objects: 23% (22088/96033), 20.27 MiB | 20.26 MiB/s Receiving objects: 24% (23048/96033), 20.27 MiB | 20.26 MiB/s Receiving objects: 25% (24009/96033), 20.27 MiB | 20.26 MiB/s Receiving objects: 26% (24969/96033), 20.27 MiB | 20.26 MiB/s Receiving objects: 27% (25929/96033), 20.27 MiB | 20.26 MiB/s Receiving objects: 28% (26890/96033), 20.27 MiB | 20.26 MiB/s Receiving objects: 29% (27850/96033), 20.27 MiB | 20.26 MiB/s Receiving objects: 30% (28810/96033), 20.27 MiB | 20.26 MiB/s Receiving objects: 31% (29771/96033), 20.27 MiB | 20.26 MiB/s Receiving objects: 32% (30731/96033), 20.27 MiB | 20.26 MiB/s Receiving objects: 33% (31691/96033), 20.27 MiB | 20.26 MiB/s Receiving objects: 34% (32652/96033), 20.27 MiB | 20.26 MiB/s Receiving objects: 35% (33612/96033), 31.77 MiB | 21.17 MiB/s Receiving objects: 36% (34572/96033), 31.77 MiB | 21.17 MiB/s Receiving objects: 37% (35533/96033), 31.77 MiB | 21.17 MiB/s Receiving objects: 38% (36493/96033), 31.77 MiB | 21.17 MiB/s Receiving objects: 39% (37453/96033), 31.77 MiB | 21.17 MiB/s Receiving objects: 40% (38414/96033), 31.77 MiB | 21.17 MiB/s Receiving objects: 41% (39374/96033), 31.77 MiB | 21.17 MiB/s Receiving objects: 41% (39492/96033), 45.82 MiB | 22.91 MiB/s Receiving objects: 42% (40334/96033), 45.82 MiB | 22.91 MiB/s Receiving objects: 43% (41295/96033), 45.82 MiB | 22.91 MiB/s Receiving objects: 44% (42255/96033), 45.82 MiB | 22.91 MiB/s Receiving objects: 45% (43215/96033), 45.82 MiB | 22.91 MiB/s Receiving objects: 46% (44176/96033), 45.82 MiB | 22.91 MiB/s Receiving objects: 47% (45136/96033), 45.82 MiB | 22.91 MiB/s Receiving objects: 48% (46096/96033), 45.82 MiB | 22.91 MiB/s Receiving objects: 49% (47057/96033), 45.82 MiB | 22.91 MiB/s Receiving objects: 50% (48017/96033), 45.82 MiB | 22.91 MiB/s Receiving objects: 51% (48977/96033), 62.57 MiB | 25.03 MiB/s Receiving objects: 52% (49938/96033), 62.57 MiB | 25.03 MiB/s Receiving objects: 53% (50898/96033), 62.57 MiB | 25.03 MiB/s Receiving objects: 54% (51858/96033), 62.57 MiB | 25.03 MiB/s Receiving objects: 55% (52819/96033), 62.57 MiB | 25.03 MiB/s Receiving objects: 56% (53779/96033), 62.57 MiB | 25.03 MiB/s Receiving objects: 56% (53838/96033), 62.57 MiB | 25.03 MiB/s Receiving objects: 57% (54739/96033), 78.77 MiB | 26.26 MiB/s Receiving objects: 58% (55700/96033), 78.77 MiB | 26.26 MiB/s Receiving objects: 59% (56660/96033), 78.77 MiB | 26.26 MiB/s Receiving objects: 59% (57055/96033), 111.44 MiB | 27.84 MiB/s Receiving objects: 59% (57181/96033), 144.24 MiB | 30.01 MiB/s Receiving objects: 59% (57603/96033), 177.14 MiB | 32.19 MiB/s Receiving objects: 60% (57620/96033), 177.14 MiB | 32.19 MiB/s Receiving objects: 61% (58581/96033), 177.14 MiB | 32.19 MiB/s Receiving objects: 62% (59541/96033), 177.14 MiB | 32.19 MiB/s Receiving objects: 63% (60501/96033), 177.14 MiB | 32.19 MiB/s Receiving objects: 64% (61462/96033), 177.14 MiB | 32.19 MiB/s Receiving objects: 65% (62422/96033), 177.14 MiB | 32.19 MiB/s Receiving objects: 66% (63382/96033), 194.02 MiB | 32.81 MiB/s Receiving objects: 67% (64343/96033), 194.02 MiB | 32.81 MiB/s Receiving objects: 67% (65041/96033), 194.02 MiB | 32.81 MiB/s Receiving objects: 68% (65303/96033), 194.02 MiB | 32.81 MiB/s Receiving objects: 69% (66263/96033), 210.56 MiB | 32.69 MiB/s Receiving objects: 70% (67224/96033), 210.56 MiB | 32.69 MiB/s Receiving objects: 71% (68184/96033), 210.56 MiB | 32.69 MiB/s Receiving objects: 72% (69144/96033), 210.56 MiB | 32.69 MiB/s Receiving objects: 73% (70105/96033), 210.56 MiB | 32.69 MiB/s Receiving objects: 74% (71065/96033), 210.56 MiB | 32.69 MiB/s Receiving objects: 75% (72025/96033), 210.56 MiB | 32.69 MiB/s Receiving objects: 76% (72986/96033), 210.56 MiB | 32.69 MiB/s Receiving objects: 77% (73946/96033), 210.56 MiB | 32.69 MiB/s Receiving objects: 78% (74906/96033), 210.56 MiB | 32.69 MiB/s Receiving objects: 79% (75867/96033), 227.11 MiB | 32.77 MiB/s Receiving objects: 79% (76769/96033), 227.11 MiB | 32.77 MiB/s Receiving objects: 80% (76827/96033), 243.76 MiB | 32.78 MiB/s Receiving objects: 81% (77787/96033), 243.76 MiB | 32.78 MiB/s Receiving objects: 82% (78748/96033), 243.76 MiB | 32.78 MiB/s Receiving objects: 83% (79708/96033), 260.55 MiB | 32.78 MiB/s Receiving objects: 84% (80668/96033), 260.55 MiB | 32.78 MiB/s Receiving objects: 85% (81629/96033), 260.55 MiB | 32.78 MiB/s Receiving objects: 86% (82589/96033), 260.55 MiB | 32.78 MiB/s Receiving objects: 87% (83549/96033), 260.55 MiB | 32.78 MiB/s Receiving objects: 87% (84235/96033), 277.41 MiB | 32.85 MiB/s Receiving objects: 88% (84510/96033), 294.03 MiB | 32.96 MiB/s Receiving objects: 89% (85470/96033), 294.03 MiB | 32.96 MiB/s Receiving objects: 90% (86430/96033), 294.03 MiB | 32.96 MiB/s Receiving objects: 91% (87391/96033), 294.03 MiB | 32.96 MiB/s Receiving objects: 92% (88351/96033), 294.03 MiB | 32.96 MiB/s Receiving objects: 93% (89311/96033), 294.03 MiB | 32.96 MiB/s Receiving objects: 94% (90272/96033), 294.03 MiB | 32.96 MiB/s Receiving objects: 95% (91232/96033), 294.03 MiB | 32.96 MiB/s Receiving objects: 96% (92192/96033), 294.03 MiB | 32.96 MiB/s Receiving objects: 96% (93105/96033), 294.03 MiB | 32.96 MiB/s Receiving objects: 97% (93153/96033), 294.03 MiB | 32.96 MiB/s Receiving objects: 98% (94113/96033), 294.03 MiB | 32.96 MiB/s Receiving objects: 99% (95073/96033), 309.98 MiB | 32.86 MiB/s remote: Total 96033 (delta 9123), reused 9231 (delta 8109), pack-reused 84553 (from 3)
  7. 16.69 s Receiving objects: 100% (96033/96033), 326.36 MiB | 32.90 MiB/s Receiving objects: 100% (96033/96033), 331.28 MiB | 30.95 MiB/s, done.
  8. 17.78 s Resolving deltas: 0% (0/64190) Resolving deltas: 1% (642/64190) Resolving deltas: 2% (1284/64190) Resolving deltas: 3% (1926/64190) Resolving deltas: 4% (2568/64190) Resolving deltas: 5% (3210/64190) Resolving deltas: 6% (3852/64190) Resolving deltas: 7% (4494/64190) Resolving deltas: 8% (5136/64190) Resolving deltas: 9% (5778/64190) Resolving deltas: 10% (6419/64190) Resolving deltas: 11% (7061/64190) Resolving deltas: 12% (7703/64190) Resolving deltas: 13% (8345/64190) Resolving deltas: 14% (8988/64190) Resolving deltas: 15% (9630/64190) Resolving deltas: 16% (10271/64190) Resolving deltas: 17% (10913/64190) Resolving deltas: 18% (11555/64190) Resolving deltas: 19% (12197/64190) Resolving deltas: 20% (12838/64190) Resolving deltas: 21% (13480/64190) Resolving deltas: 22% (14122/64190) Resolving deltas: 23% (14764/64190) Resolving deltas: 24% (15406/64190) Resolving deltas: 25% (16048/64190) Resolving deltas: 26% (16690/64190) Resolving deltas: 27% (17332/64190) Resolving deltas: 28% (17974/64190) Resolving deltas: 29% (18616/64190) Resolving deltas: 30% (19257/64190) Resolving deltas: 31% (19899/64190) Resolving deltas: 32% (20541/64190) Resolving deltas: 33% (21183/64190) Resolving deltas: 34% (21826/64190) Resolving deltas: 35% (22467/64190) Resolving deltas: 36% (23109/64190) Resolving deltas: 37% (23751/64190) Resolving deltas: 38% (24393/64190) Resolving deltas: 39% (25039/64190) Resolving deltas: 40% (25676/64190) Resolving deltas: 41% (26318/64190) Resolving deltas: 42% (26960/64190) Resolving deltas: 43% (27602/64190) Resolving deltas: 44% (28245/64190) Resolving deltas: 45% (28887/64190) Resolving deltas: 46% (29528/64190) Resolving deltas: 47% (30170/64190) Resolving deltas: 48% (30812/64190) Resolving deltas: 49% (31454/64190) Resolving deltas: 50% (32095/64190) Resolving deltas: 51% (32737/64190) Resolving deltas: 52% (33379/64190) Resolving deltas: 53% (34021/64190) Resolving deltas: 54% (34663/64190) Resolving deltas: 55% (35305/64190) Resolving deltas: 56% (35949/64190) Resolving deltas: 57% (36590/64190) Resolving deltas: 58% (37231/64190) Resolving deltas: 59% (37873/64190) Resolving deltas: 60% (38515/64190) Resolving deltas: 61% (39156/64190) Resolving deltas: 62% (39798/64190) Resolving deltas: 63% (40440/64190) Resolving deltas: 64% (41082/64190) Resolving deltas: 65% (41724/64190) Resolving deltas: 66% (42366/64190) Resolving deltas: 67% (43008/64190) Resolving deltas: 68% (43651/64190) Resolving deltas: 69% (44292/64190) Resolving deltas: 70% (44933/64190) Resolving deltas: 71% (45576/64190) Resolving deltas: 72% (46217/64190) Resolving deltas: 73% (46859/64190) Resolving deltas: 74% (47501/64190) Resolving deltas: 75% (48143/64190) Resolving deltas: 76% (48785/64190) Resolving deltas: 77% (49428/64190) Resolving deltas: 78% (50069/64190) Resolving deltas: 79% (50712/64190) Resolving deltas: 80% (51352/64190) Resolving deltas: 81% (51996/64190) Resolving deltas: 82% (52636/64190) Resolving deltas: 83% (53278/64190) Resolving deltas: 84% (53920/64190) Resolving deltas: 85% (54562/64190) Resolving deltas: 86% (55204/64190) Resolving deltas: 87% (55846/64190) Resolving deltas: 88% (56488/64190) Resolving deltas: 89% (57130/64190) Resolving deltas: 90% (57771/64190) Resolving deltas: 91% (58413/64190) Resolving deltas: 92% (59055/64190) Resolving deltas: 93% (59697/64190) Resolving deltas: 93% (59750/64190) Resolving deltas: 94% (60339/64190) Resolving deltas: 95% (60981/64190) Resolving deltas: 96% (61623/64190) Resolving deltas: 97% (62266/64190) Resolving deltas: 98% (62907/64190) Resolving deltas: 99% (63549/64190) Resolving deltas: 100% (64190/64190) Resolving deltas: 100% (64190/64190), done.
  9. 18.45 s Fetching commit 70f8abc259890c98339f35e018b1aecc71874f6a for finite_T_and_mu ...
  10. 18.45 s $ /nix/store/5vpcfsdx1lcnlb2y4k7xyc74shp5qwbh-git-2.54.0/bin/git fetch origin 70f8abc259890c98339f35e018b1aecc71874f6a
  11. 18.89 s From https://github.com/alphal00p/gammaloop
  12. 18.89 s * branch 70f8abc259890c98339f35e018b1aecc71874f6a -> FETCH_HEAD
  13. 18.90 s $ /nix/store/61685rbaxmpigwi3z23i33sv3jyfl70q-coreutils-9.11/bin/timeout --kill-after=15s 7200s /nix/store/5vpcfsdx1lcnlb2y4k7xyc74shp5qwbh-git-2.54.0/bin/git -c advice.detachedHead=false checkout 70f8abc259890c98339f35e018b1aecc71874f6a
  14. 19.04 s HEAD is now at 70f8abc25 Add direct translation setting for JIT compilation
  15. 19.05 s $ /nix/store/61685rbaxmpigwi3z23i33sv3jyfl70q-coreutils-9.11/bin/timeout --kill-after=15s 7200s /nix/store/wknkybkzrc16r11vk5vrykh4wmw7a353-nix-2.34.8/bin/nix --extra-experimental-features nix-command --extra-experimental-features flakes --log-format internal-json run .#packages.x86_64-linux.nix-ci-check-gammaloop-nextest-integration --print-build-logs
  16. 22.99 s
  17. 23.06 s Downloading cached gammaloop-nextest-binaries-integration-gammaloop-integration-tests from https://cache.nix-ci.com
  18. 25.39 s Downloaded cached gammaloop-nextest-binaries-integration-gammaloop-integration-tests (426.9 MiB) in 2.3s
  19. 25.39 s Progress: 0 of 1 built, 1 of 3 downloaded from cache
  20. 25.39 s Downloading cached gammaloop-nextest-binaries-integration from https://cache.nix-ci.com
  21. 25.39 s Downloaded cached gammaloop-nextest-binaries-integration (528 B) in 3ms
  22. 25.39 s Progress: 0 of 1 built, 2 of 3 downloaded from cache
  23. 25.39 s Downloading cached nix-ci-check-gammaloop-nextest-integration from https://cache.nix-ci.com
  24. 25.40 s Downloaded cached nix-ci-check-gammaloop-nextest-integration (1032 B) in 3ms
  25. 25.40 s Progress: 0 of 1 built, 3 of 3 downloaded from cache
  26. 29.91 s evaluating derivation 'g copying '/nix/store/wx58 evaluating derivation 'g copying '/nix/store/wx58 evaluating derivation 'g copying '/nix/store/wx58 evaluating derivation 'g copying '/nix/store/wx58 evaluating derivation 'g copying '/nix/store/wx58 evaluating derivation 'g copying '/nix/store/wx58 evaluating derivation 'g copying '/nix/store/wx58 evaluating derivation 'g querying gammaloop-nexte [0/2 built, 0.0 KiB DL] [0/1 built, 0.0 KiB DL] [1/0/1 built, 0.0 KiB DLgammaloop-nextest-integration> Extracting 13 binaries, 1 build script output directory, and 3 linked paths to /build/nextest-archive-hE8IUq
  27. 32.11 s gammaloop-nextest-integration> Extracted 30 files to /build/nextest-archive-hE8IUq in 2.20s
  28. 32.13 s gammaloop-nextest-integration> ------------
  29. 32.13 s gammaloop-nextest-integration> Nextest run ID f7ba2bc0-f44f-417a-b58e-b39901d3d3ca with nextest profile: ci_gammaloop
  30. 32.13 s gammaloop-nextest-integration> Starting 169 tests across 13 binaries (209 tests skipped, including 208 tests via profile.ci_gammaloop.default-filter)
  31. 126.15 s gammaloop-nextest-integration> FAIL [ 2.999s] ( 55/169) gammaloop-integration-tests::test_runs aa_aa::important::aa_aa_local_inspect_backend_consistency
  32. 126.15 s gammaloop-nextest-integration> stdout ---
  33. 126.15 s gammaloop-nextest-integration>
  34. 126.15 s gammaloop-nextest-integration> running 1 test
  35. 126.15 s gammaloop-nextest-integration> test aa_aa::important::aa_aa_local_inspect_backend_consistency ... FAILED
  36. 126.15 s gammaloop-nextest-integration>
  37. 126.15 s gammaloop-nextest-integration> failures:
  38. 126.15 s gammaloop-nextest-integration>
  39. 126.15 s gammaloop-nextest-integration> failures:
  40. 126.15 s gammaloop-nextest-integration> aa_aa::important::aa_aa_local_inspect_backend_consistency
  41. 126.15 s gammaloop-nextest-integration>
  42. 126.15 s gammaloop-nextest-integration> test result: FAILED. 0 passed; 1 failed; 0 ignored; 0 measured; 273 filtered out; finished in 2.99s
  43. 126.15 s gammaloop-nextest-integration>
  44. 126.15 s gammaloop-nextest-integration> stderr ---
  45. 126.15 s gammaloop-nextest-integration> [2026-09-15 21:41:25.843] @gammaloop_api::se... INFO : Running command import model sm-default.json
  46. 126.15 s gammaloop-nextest-integration> [2026-09-15 21:41:25.843] @import::model INFO : Loading built-in JSON model sm-default
  47. 126.15 s gammaloop-nextest-integration> [2026-09-15 21:41:25.868] @gammalooprs::model INFO : The following 15 external parameters were forced to zero by the restriction card:
  48. 126.15 s gammaloop-nextest-integration> lamWS, AWS, rhoWS, etaWS, ymc, yme, ymm, MC, Me, MM, WTau, muQ, muLe, muLmu, muLtau
  49. 126.15 s gammaloop-nextest-integration> [2026-09-15 21:41:25.868] @gammalooprs::model INFO : The following 34 vertex rules were removed by the restriction card:
  50. 126.15 s gammaloop-nextest-integration> V_82 -> (c~, d, G+) | V_83 -> (t~, d, G+) | V_84 -> (c~, s, G+) | V_85 -> (t~, s, G+) | V_86 -> (u~, b, G+) | V_87 -> (c~, b, G+) | V_90 -> (c~, d, W+) | V_91 -> (t~, d, W+) | V_92 -> (u~, s, W+) | V_94 -> (t~, s, W+) | V_95 -> (u~, b, W+) | V_96 -> (c~, b, W+) | V_101 -> (e+, e-, G0) | V_102 -> (mu+, mu-, G0) | V_104 -> (e+, e-, H) | V_105 -> (mu+, mu-, H) | V_110 -> (ve~, e-, G+) | V_111 -> (vm~, mu-, G+) | V_116 -> (b~, u, G-) | V_117 -> (d~, c, G-) | V_118 -> (s~, c, G-) | V_119 -> (b~, c, G-) | V_120 -> (d~, t, G-) | V_121 -> (s~, t, G-) | V_124 -> (s~, u, W-) | V_125 -> (b~, u, W-) | V_126 -> (d~, c, W-) | V_128 -> (b~, c, W-) | V_129 -> (d~, t, W-) | V_130 -> (s~, t, W-) | V_138 -> (c~, c, G0) | V_140 -> (c~, c, H) | V_145 -> (e+, ve, G-) | V_146 -> (mu+, vm, G-)
  51. 126.15 s gammaloop-nextest-integration> [2026-09-15 21:41:25.868] @gammalooprs::model INFO : The following 36 couplings were removed by the restriction card:
  52. 126.15 s gammaloop-nextest-integration> GC_13, GC_14, GC_16, GC_17, GC_18, GC_19, GC_20, GC_22, GC_23, GC_24, GC_25, GC_26, GC_28, GC_29, GC_42, GC_43, GC_44, GC_46, GC_47, GC_48, GC_84, GC_85, GC_86, GC_87, GC_88, GC_89, GC_90, GC_91, GC_92, GC_93, GC_101, GC_102, GC_103, GC_105, GC_106, GC_107
  53. 126.15 s gammaloop-nextest-integration> [2026-09-15 21:41:25.868] @gammaloop_api::se... INFO : Running command run set_model_parameters
  54. 126.15 s gammaloop-nextest-integration> [2026-09-15 21:41:25.868] @gammaloop_api::se... INFO : Starting command block set_model_parameters
  55. 126.15 s gammaloop-nextest-integration> [2026-09-15 21:41:25.869] @gammaloop_api::se... INFO : Running command set model MT=173.0
  56. 126.15 s gammaloop-nextest-integration> [2026-09-15 21:41:25.873] @gammaloop_api::se... INFO : Running command set model WT=0.0
  57. 126.15 s gammaloop-nextest-integration> [2026-09-15 21:41:25.877] @gammaloop_api::se... INFO : Running command set model ymt=173.0
  58. 126.15 s gammaloop-nextest-integration> [2026-09-15 21:41:25.881] @gammaloop_api::se... INFO : Running command set model aS=0.118
  59. 126.15 s gammaloop-nextest-integration> [2026-09-15 21:41:25.886] @gammaloop_api::se... INFO : Running command set model aEWM1=137.036
  60. 126.15 s gammaloop-nextest-integration> [2026-09-15 21:41:25.891] @gammaloop_api::se... INFO : Running command set model Gf=1.166390e-05
  61. 126.15 s gammaloop-nextest-integration> [2026-09-15 21:41:25.896] @gammaloop_api::se... INFO : Running command set model MZ=91.188
  62. 126.15 s gammaloop-nextest-integration> [2026-09-15 21:41:25.901] @gammaloop_api::se... INFO : Running command set global string '
  63. 126.15 s gammaloop-nextest-integration> [global.generation.compile]
  64. 126.15 s gammaloop-nextest-integration> compilation_mode = "symjit"
  65. 126.15 s gammaloop-nextest-integration> optimization_level = "O0"
  66. 126.15 s gammaloop-nextest-integration> fast_math = false
  67. 126.15 s gammaloop-nextest-integration> [...]
  68. 126.15 s gammaloop-nextest-integration> [2026-09-15 21:41:25.902] @gammaloop_api::se... INFO : Running command import graphs ./examples/cli/aa_aa/1L/aa_aa_1L.dot -p aa_aa_all_helicities -i 1L_ppmm -o
  69. 126.15 s gammaloop-nextest-integration> [2026-09-15 21:41:25.902] @commands::import INFO : Loading graphs from '/build/source/examples/cli/aa_aa/1L/aa_aa_1L.dot'
  70. 126.15 s gammaloop-nextest-integration> [2026-09-15 21:41:25.911] @gammaloop_api::se... INFO : Running command generate existing -p aa_aa_all_helicities
  71. 126.15 s gammaloop-nextest-integration> The application panicked (crashed).
  72. 126.15 s gammaloop-nextest-integration> Message: label _func_power_ not found
  73. 126.15 s gammaloop-nextest-integration> Location: /nix/store/n9w914kh1cm59xx3spcs831cdyb56m32-vendor-cargo-deps/c19b7c6f923b580ac259164a89f2577984ad5ab09ee9d583b888f934adbbe8d0/symjit-2.25.6/src/symjit/assembler.rs:77
  74. 126.15 s gammaloop-nextest-integration>
  75. 126.15 s gammaloop-nextest-integration> ━━━━━━━━━━━━━━━━━━━━━━━━━━━━━━━━━━ BACKTRACE ━━━━━━━━━━━━━━━━━━━━━━━━━━━━━━━━━━━
  76. 126.15 s gammaloop-nextest-integration> 1: <color_eyre[51793ea62743adbd]::config::PanicHook>::panic_report<unknown>
  77. 126.15 s gammaloop-nextest-integration> at <unknown source file>:<unknown line>
  78. 126.15 s gammaloop-nextest-integration> 2: <color_eyre[51793ea62743adbd]::config::PanicHook>::into_panic_hook::{closure#0}<unknown>
  79. 126.15 s gammaloop-nextest-integration> at <unknown source file>:<unknown line>
  80. 126.15 s gammaloop-nextest-integration> 3: std[bcb96dfbba0ab899]::panicking::panic_with_hook<unknown>
  81. 126.15 s gammaloop-nextest-integration> at <unknown source file>:<unknown line>
  82. 126.15 s gammaloop-nextest-integration> 4: std[bcb96dfbba0ab899]::panicking::panic_handler::{closure#0}<unknown>
  83. 126.15 s gammaloop-nextest-integration> at <unknown source file>:<unknown line>
  84. 126.15 s gammaloop-nextest-integration> 5: std[bcb96dfbba0ab899]::sys::backtrace::__rust_end_short_backtrace::<std[bcb96dfbba0ab899]::panicking::panic_handler::{closure#0}, !><unknown>
  85. 126.15 s gammaloop-nextest-integration> at <unknown source file>:<unknown line>
  86. 126.15 s gammaloop-nextest-integration> 6: __rustc[6c289b9f9c454d21]::rust_begin_unwind<unknown>
  87. 126.15 s gammaloop-nextest-integration> at <unknown source file>:<unknown line>
  88. 126.15 s gammaloop-nextest-integration> 7: core[940e698046960fd5]::panicking::panic_fmt<unknown>
  89. 126.15 s gammaloop-nextest-integration> at <unknown source file>:<unknown line>
  90. 126.15 s gammaloop-nextest-integration> 8: <symjit[e408de789c333cd]::symjit::assembler::Assembler>::apply_jumps<unknown>
  91. 126.15 s gammaloop-nextest-integration> at <unknown source file>:<unknown line>
  92. 126.15 s gammaloop-nextest-integration> 9: <symjit[e408de789c333cd]::symjit::builder::Builder>::compile_from_mir::<symjit[e408de789c333cd]::symjit::amd::complex::AmdComplexGenerator><unknown>
  93. 126.15 s gammaloop-nextest-integration> at <unknown source file>:<unknown line>
  94. 126.15 s gammaloop-nextest-integration> 10: <symjit[e408de789c333cd]::symjit::runnable::Application>::compile_ty<unknown>
  95. 126.15 s gammaloop-nextest-integration> at <unknown source file>:<unknown line>
  96. 126.15 s gammaloop-nextest-integration> 11: <symjit[e408de789c333cd]::symjit::runnable::Application>::with_mir<unknown>
  97. 126.15 s gammaloop-nextest-integration> at <unknown source file>:<unknown line>
  98. 126.15 s gammaloop-nextest-integration> 12: <symjit[e408de789c333cd]::symjit::composer::DirectTranslator as symjit[e408de789c333cd]::symjit::composer::Composer>::compile<unknown>
  99. 126.15 s gammaloop-nextest-integration> at <unknown source file>:<unknown line>
  100. 126.15 s gammaloop-nextest-integration> 13: <symjit[e408de789c333cd]::symjit::compiler::Translator as symjit[e408de789c333cd]::symjit::composer::Composer>::compile<unknown>
  101. 126.15 s gammaloop-nextest-integration> at <unknown source file>:<unknown line>
  102. 126.15 s gammaloop-nextest-integration> 14: <numerica[124dab8567f4861e]::domains::float::complex::Complex<f64> as symbolica[10e259bab675d243]::evaluate::backend::JITCompiledNumber>::jit_compile<unknown>
  103. 126.15 s gammaloop-nextest-integration> at <unknown source file>:<unknown line>
  104. 126.15 s gammaloop-nextest-integration> 15: <symbolica[10e259bab675d243]::evaluate::evaluator::ExpressionEvaluator<numerica[124dab8567f4861e]::domains::float::complex::Complex<f64>>>::jit_compile<unknown>
  105. 126.15 s gammaloop-nextest-integration> at <unknown source file>:<unknown line>
  106. 126.15 s gammaloop-nextest-integration> 16: <gammalooprs[917cbd3df9e68f8f]::integrands::process::evaluators::GenericEvaluator>::activate_symjit<unknown>
  107. 126.15 s gammaloop-nextest-integration> at <unknown source file>:<unknown line>
  108. 126.15 s gammaloop-nextest-integration> 17: <gammalooprs[917cbd3df9e68f8f]::integrands::process::amplitude::AmplitudeIntegrand>::prepare_runtime_backends_after_generation_with_compile_times<unknown>
  109. 126.15 s gammaloop-nextest-integration> at <unknown source file>:<unknown line>
  110. 126.15 s gammaloop-nextest-integration> 18: <gammalooprs[917cbd3df9e68f8f]::processes::amplitude::Amplitude>::build_integrand<unknown>
  111. 126.15 s gammaloop-nextest-integration> at <unknown source file>:<unknown line>
  112. 126.15 s gammaloop-nextest-integration> 19: <gammalooprs[917cbd3df9e68f8f]::processes::process::Process>::generate_integrands<unknown>
  113. 126.15 s gammaloop-nextest-integration> at <unknown source file>:<unknown line>
  114. 126.15 s gammaloop-nextest-integration> 20: <gammaloop_api[9ebf6628f97aeb57]::state::State>::generate_integrand<unknown>
  115. 126.15 s gammaloop-nextest-integration> at <unknown source file>:<unknown line>
  116. 126.15 s gammaloop-nextest-integration> 21: <gammaloop_api[9ebf6628f97aeb57]::commands::generate::Generate>::run::<&std[bcb96dfbba0ab899]::path::PathBuf><unknown>
  117. 126.15 s gammaloop-nextest-integration> at <unknown source file>:<unknown line>
  118. 126.15 s gammaloop-nextest-integration> 22: <gammaloop_api[9ebf6628f97aeb57]::commands::Commands>::run<unknown>
  119. 126.15 s gammaloop-nextest-integration> at <unknown source file>:<unknown line>
  120. 126.15 s gammaloop-nextest-integration> 23: <gammaloop_api[9ebf6628f97aeb57]::session::CliSession>::execute_prepared<unknown>
  121. 126.15 s gammaloop-nextest-integration> at <unknown source file>:<unknown line>
  122. 126.15 s gammaloop-nextest-integration> 24: <gammaloop_api[9ebf6628f97aeb57]::session::CliSession>::execute_command<unknown>
  123. 126.15 s gammaloop-nextest-integration> at <unknown source file>:<unknown line>
  124. 126.15 s gammaloop-nextest-integration> 25: <gammaloop_integration_tests[191607b70c61cd5a]::CLIState>::run_command<unknown>
  125. 126.15 s gammaloop-nextest-integration> at <unknown source file>:<unknown line>
  126. 126.15 s gammaloop-nextest-integration> 26: test_runs[9b7e2dc2dc4f29b0]::aa_aa::generate_aa_aa_helicity_family<unknown>
  127. 126.15 s gammaloop-nextest-integration> at <unknown source file>:<unknown line>
  128. 126.15 s gammaloop-nextest-integration> 27: <test_runs[9b7e2dc2dc4f29b0]::aa_aa::important::aa_aa_local_inspect_backend_consistency::{closure#0} as core[940e698046960fd5]::ops::function::FnOnce<()>>::call_once<unknown>
  129. 126.15 s gammaloop-nextest-integration> at <unknown source file>:<unknown line>
  130. 126.15 s gammaloop-nextest-integration> 28: serial_test[cd99724524a2f1c0]::serial_code_lock::local_serial_core_with_return::<(), eyre[cb2fd339c0c40fca]::Report><unknown>
  131. 126.15 s gammaloop-nextest-integration> at <unknown source file>:<unknown line>
  132. 126.15 s gammaloop-nextest-integration> 29: <test_runs[9b7e2dc2dc4f29b0]::aa_aa::important::aa_aa_local_inspect_backend_consistency::{closure#0} as core[940e698046960fd5]::ops::function::FnOnce<()>>::call_once<unknown>
  133. 126.15 s gammaloop-nextest-integration> at <unknown source file>:<unknown line>
  134. 126.15 s gammaloop-nextest-integration> 30: test[75d6903177b1d7e9]::__rust_begin_short_backtrace::<core[940e698046960fd5]::result::Result<(), alloc[2ea6bcb46fca0c42]::string::String>, fn() -> core[940e698046960fd5]::result::Result<(), alloc[2ea6bcb46fca0c42]::string::String>><unknown>
  135. 126.15 s gammaloop-nextest-integration> at <unknown source file>:<unknown line>
  136. 126.15 s gammaloop-nextest-integration> 31: test[75d6903177b1d7e9]::run_test::{closure#0}<unknown>
  137. 126.15 s gammaloop-nextest-integration> at <unknown source file>:<unknown line>
  138. 126.15 s gammaloop-nextest-integration> 32: std[bcb96dfbba0ab899]::sys::backtrace::__rust_begin_short_backtrace::<test[75d6903177b1d7e9]::run_test::{closure#1}, ()><unknown>
  139. 126.15 s gammaloop-nextest-integration> at <unknown source file>:<unknown line>
  140. 126.15 s gammaloop-nextest-integration> 33: <std[bcb96dfbba0ab899]::thread::lifecycle::spawn_unchecked<test[75d6903177b1d7e9]::run_test::{closure#1}, ()>::{closure#1} as core[940e698046960fd5]::ops::function::FnOnce<()>>::call_once::{shim:vtable#0}<unknown>
  141. 126.15 s gammaloop-nextest-integration> at <unknown source file>:<unknown line>
  142. 126.15 s gammaloop-nextest-integration> 34: <std[bcb96dfbba0ab899]::sys::thread::unix::Thread>::new::thread_start<unknown>
  143. 126.15 s gammaloop-nextest-integration> at <unknown source file>:<unknown line>
  144. 126.15 s gammaloop-nextest-integration> 35: start_thread<unknown>
  145. 126.15 s gammaloop-nextest-integration> at <unknown source file>:<unknown line>
  146. 126.15 s gammaloop-nextest-integration> 36: __clone3<unknown>
  147. 126.15 s gammaloop-nextest-integration> at <unknown source file>:<unknown line>
  148. 126.15 s gammaloop-nextest-integration>
  149. 126.15 s gammaloop-nextest-integration> Run with COLORBT_SHOW_HIDDEN=1 environment variable to disable frame filtering.
  150. 126.15 s gammaloop-nextest-integration> Run with RUST_BACKTRACE=full to include source snippets.
  151. 126.15 s gammaloop-nextest-integration> Warning: SpanTrace capture is Unsupported.
  152. 126.15 s gammaloop-nextest-integration> Ensure that you've setup a tracing-error ErrorLayer and the semver versions are compatible
  153. 126.15 s gammaloop-nextest-integration>
  154. 167.84 s gammaloop-nextest-integration> FAIL [ 2.454s] (157/169) gammaloop-integration-tests::uv thermal_sunrise_uv
  155. 167.84 s gammaloop-nextest-integration> stdout ---
  156. 167.84 s gammaloop-nextest-integration>
  157. 167.84 s gammaloop-nextest-integration> running 1 test
  158. 167.84 s gammaloop-nextest-integration> test thermal_sunrise_uv ... FAILED
  159. 167.84 s gammaloop-nextest-integration>
  160. 167.84 s gammaloop-nextest-integration> failures:
  161. 167.84 s gammaloop-nextest-integration>
  162. 167.84 s gammaloop-nextest-integration> failures:
  163. 167.84 s gammaloop-nextest-integration> thermal_sunrise_uv
  164. 167.84 s gammaloop-nextest-integration>
  165. 167.84 s gammaloop-nextest-integration> test result: FAILED. 0 passed; 1 failed; 0 ignored; 0 measured; 31 filtered out; finished in 2.44s
  166. 167.84 s gammaloop-nextest-integration>
  167. 167.84 s gammaloop-nextest-integration> stderr ---
  168. 167.84 s gammaloop-nextest-integration> [2026-09-15 21:42:08.095] @gammaloop_api::se... INFO : Running command run generate
  169. 167.84 s gammaloop-nextest-integration> [2026-09-15 21:42:08.095] @gammaloop_api::se... INFO : Starting command block generate
  170. 167.84 s gammaloop-nextest-integration> [2026-09-15 21:42:08.096] @gammaloop_api::se... INFO : Running command import model sm-default.json
  171. 167.84 s gammaloop-nextest-integration> [2026-09-15 21:42:08.096] @import::model INFO : Loading built-in JSON model sm-default
  172. 167.84 s gammaloop-nextest-integration> [2026-09-15 21:42:08.121] @gammalooprs::model INFO : The following 15 external parameters were forced to zero by the restriction card:
  173. 167.84 s gammaloop-nextest-integration> lamWS, AWS, rhoWS, etaWS, ymc, yme, ymm, MC, Me, MM, WTau, muQ, muLe, muLmu, muLtau
  174. 167.84 s gammaloop-nextest-integration> [2026-09-15 21:42:08.121] @gammalooprs::model INFO : The following 34 vertex rules were removed by the restriction card:
  175. 167.84 s gammaloop-nextest-integration> V_82 -> (c~, d, G+) | V_83 -> (t~, d, G+) | V_84 -> (c~, s, G+) | V_85 -> (t~, s, G+) | V_86 -> (u~, b, G+) | V_87 -> (c~, b, G+) | V_90 -> (c~, d, W+) | V_91 -> (t~, d, W+) | V_92 -> (u~, s, W+) | V_94 -> (t~, s, W+) | V_95 -> (u~, b, W+) | V_96 -> (c~, b, W+) | V_101 -> (e+, e-, G0) | V_102 -> (mu+, mu-, G0) | V_104 -> (e+, e-, H) | V_105 -> (mu+, mu-, H) | V_110 -> (ve~, e-, G+) | V_111 -> (vm~, mu-, G+) | V_116 -> (b~, u, G-) | V_117 -> (d~, c, G-) | V_118 -> (s~, c, G-) | V_119 -> (b~, c, G-) | V_120 -> (d~, t, G-) | V_121 -> (s~, t, G-) | V_124 -> (s~, u, W-) | V_125 -> (b~, u, W-) | V_126 -> (d~, c, W-) | V_128 -> (b~, c, W-) | V_129 -> (d~, t, W-) | V_130 -> (s~, t, W-) | V_138 -> (c~, c, G0) | V_140 -> (c~, c, H) | V_145 -> (e+, ve, G-) | V_146 -> (mu+, vm, G-)
  176. 167.84 s gammaloop-nextest-integration> [2026-09-15 21:42:08.121] @gammalooprs::model INFO : The following 36 couplings were removed by the restriction card:
  177. 167.84 s gammaloop-nextest-integration> GC_13, GC_14, GC_16, GC_17, GC_18, GC_19, GC_20, GC_22, GC_23, GC_24, GC_25, GC_26, GC_28, GC_29, GC_42, GC_43, GC_44, GC_46, GC_47, GC_48, GC_84, GC_85, GC_86, GC_87, GC_88, GC_89, GC_90, GC_91, GC_92, GC_93, GC_101, GC_102, GC_103, GC_105, GC_106, GC_107
  178. 167.84 s gammaloop-nextest-integration> [2026-09-15 21:42:08.121] @gammaloop_api::se... INFO : Running command remove processes
  179. 167.84 s gammaloop-nextest-integration> [2026-09-15 21:42:08.121] @gammaloop_api::se... INFO : Running command generate amp {} > {} [{2}] | g u
  180. 167.84 s gammaloop-nextest-integration> --numerator-grouping group_identical_graphs_up_to_scalar_rescaling
  181. 167.84 s gammaloop-nextest-integration> --max-n-bridges 0
  182. 167.84 s gammaloop-nextest-integration> --number-of-factorized-loop-subtopologies 1 1
  183. 167.84 s gammaloop-nextest-integration> --number-of-anticommutating-loops 1 1
  184. 167.84 s gammaloop-nextest-integration> [...]
  185. 167.84 s gammaloop-nextest-integration> [2026-09-15 21:42:08.123] @feyngen::diagram_... INFO : 0s | Δ=0s | Starting Feynman graph generation with Symbolica...
  186. 167.84 s gammaloop-nextest-integration> [2026-09-15 21:42:08.123] @feyngen::diagram_... INFO : 0s | Δ=0s | Number of graphs resulting from Symbolica generation: 3
  187. 167.84 s gammaloop-nextest-integration> [2026-09-15 21:42:08.125] @feyngen::diagram_... INFO : 0s | Δ=0s | Number of graphs retained after removal of vetoed topologies: 2
  188. 167.84 s gammaloop-nextest-integration> [2026-09-15 21:42:08.125] @feyngen::diagram_... INFO : 0s | Δ=0s | Number of graphs after vertex info assignment: 2
  189. 167.84 s gammaloop-nextest-integration> [2026-09-15 21:42:08.125] @feyngen::diagram_... INFO : 0s | Δ=0s | Number of graphs after all complete graphs filters are applied: 2
  190. 167.84 s gammaloop-nextest-integration> [2026-09-15 21:42:08.125] @feyngen::diagram_... INFO : 0s | Δ=0s | Number of graphs after closed anticommutating chains analysis: 1
  191. 167.84 s gammaloop-nextest-integration> [2026-09-15 21:42:08.125] @feyngen::diagram_... INFO : 0s | Δ=0s | Number of graphs after symmetrization of external states: 1
  192. 167.84 s gammaloop-nextest-integration> [2026-09-15 21:42:08.125] @feyngen::diagram_... INFO : 0s | Δ=0s | Number of graphs after canonization of vertices, edges and flows (graph labels assigned here): 1
  193. 167.84 s gammaloop-nextest-integration> [2026-09-15 21:42:08.138] @feyngen::diagram_... INFO : 0s | Δ=0s | Number of graphs after numerator-aware grouping with strategy 'up to a scalar rescaling': 1 (1 isomorphically unique graph, 0 color zero, 0 lorentz zero, 0 grouped and 0 cancellation)
  194. 167.84 s gammaloop-nextest-integration> [2026-09-15 21:42:08.138] @feyngen::diagram_... INFO : ( Sum of the symmetry factors from each graph generated = -1/2 )
  195. 167.84 s gammaloop-nextest-integration> [2026-09-15 21:42:08.138] @commands::generate INFO : Generated amplitude 1 graphs.
  196. 167.84 s gammaloop-nextest-integration> [2026-09-15 21:42:08.138] @commands::generate INFO : Only diagram generation was requested, skipping integrand generation. You can generate integrands later using the 'generate existing <options>' command.
  197. 167.84 s gammaloop-nextest-integration> [2026-09-15 21:42:08.138] @gammaloop_api::se... INFO : Running command generate
  198. 167.84 s gammaloop-nextest-integration> The application panicked (crashed).
  199. 167.84 s gammaloop-nextest-integration> Message: label _func_power_ not found
  200. 167.84 s gammaloop-nextest-integration> Location: /nix/store/n9w914kh1cm59xx3spcs831cdyb56m32-vendor-cargo-deps/c19b7c6f923b580ac259164a89f2577984ad5ab09ee9d583b888f934adbbe8d0/symjit-2.25.6/src/symjit/assembler.rs:77
  201. 167.84 s gammaloop-nextest-integration>
  202. 167.84 s gammaloop-nextest-integration> ━━━━━━━━━━━━━━━━━━━━━━━━━━━━━━━━━━ BACKTRACE ━━━━━━━━━━━━━━━━━━━━━━━━━━━━━━━━━━━
  203. 167.84 s gammaloop-nextest-integration> 1: <color_eyre[51793ea62743adbd]::config::PanicHook>::panic_report<unknown>
  204. 167.84 s gammaloop-nextest-integration> at <unknown source file>:<unknown line>
  205. 167.84 s gammaloop-nextest-integration> 2: <color_eyre[51793ea62743adbd]::config::PanicHook>::into_panic_hook::{closure#0}<unknown>
  206. 167.84 s gammaloop-nextest-integration> at <unknown source file>:<unknown line>
  207. 167.84 s gammaloop-nextest-integration> 3: std[bcb96dfbba0ab899]::panicking::panic_with_hook<unknown>
  208. 167.84 s gammaloop-nextest-integration> at <unknown source file>:<unknown line>
  209. 167.84 s gammaloop-nextest-integration> 4: std[bcb96dfbba0ab899]::panicking::panic_handler::{closure#0}<unknown>
  210. 167.84 s gammaloop-nextest-integration> at <unknown source file>:<unknown line>
  211. 167.84 s gammaloop-nextest-integration> 5: std[bcb96dfbba0ab899]::sys::backtrace::__rust_end_short_backtrace::<std[bcb96dfbba0ab899]::panicking::panic_handler::{closure#0}, !><unknown>
  212. 167.84 s gammaloop-nextest-integration> at <unknown source file>:<unknown line>
  213. 167.84 s gammaloop-nextest-integration> 6: __rustc[6c289b9f9c454d21]::rust_begin_unwind<unknown>
  214. 167.84 s gammaloop-nextest-integration> at <unknown source file>:<unknown line>
  215. 167.84 s gammaloop-nextest-integration> 7: core[940e698046960fd5]::panicking::panic_fmt<unknown>
  216. 167.84 s gammaloop-nextest-integration> at <unknown source file>:<unknown line>
  217. 167.84 s gammaloop-nextest-integration> 8: <symjit[e408de789c333cd]::symjit::assembler::Assembler>::apply_jumps<unknown>
  218. 167.84 s gammaloop-nextest-integration> at <unknown source file>:<unknown line>
  219. 167.84 s gammaloop-nextest-integration> 9: <symjit[e408de789c333cd]::symjit::builder::Builder>::compile_from_mir::<symjit[e408de789c333cd]::symjit::amd::complex::AmdComplexGenerator><unknown>
  220. 167.84 s gammaloop-nextest-integration> at <unknown source file>:<unknown line>
  221. 167.84 s gammaloop-nextest-integration> 10: <symjit[e408de789c333cd]::symjit::runnable::Application>::compile_ty<unknown>
  222. 167.84 s gammaloop-nextest-integration> at <unknown source file>:<unknown line>
  223. 167.84 s gammaloop-nextest-integration> 11: <symjit[e408de789c333cd]::symjit::runnable::Application>::with_mir<unknown>
  224. 167.84 s gammaloop-nextest-integration> at <unknown source file>:<unknown line>
  225. 167.84 s gammaloop-nextest-integration> 12: <symjit[e408de789c333cd]::symjit::composer::DirectTranslator as symjit[e408de789c333cd]::symjit::composer::Composer>::compile<unknown>
  226. 167.84 s gammaloop-nextest-integration> at <unknown source file>:<unknown line>
  227. 167.84 s gammaloop-nextest-integration> 13: <symjit[e408de789c333cd]::symjit::compiler::Translator as symjit[e408de789c333cd]::symjit::composer::Composer>::compile<unknown>
  228. 167.84 s gammaloop-nextest-integration> at <unknown source file>:<unknown line>
  229. 167.84 s gammaloop-nextest-integration> 14: <numerica[124dab8567f4861e]::domains::float::complex::Complex<f64> as symbolica[10e259bab675d243]::evaluate::backend::JITCompiledNumber>::jit_compile<unknown>
  230. 167.84 s gammaloop-nextest-integration> at <unknown source file>:<unknown line>
  231. 167.84 s gammaloop-nextest-integration> 15: <symbolica[10e259bab675d243]::evaluate::evaluator::ExpressionEvaluator<numerica[124dab8567f4861e]::domains::float::complex::Complex<f64>>>::jit_compile<unknown>
  232. 167.84 s gammaloop-nextest-integration> at <unknown source file>:<unknown line>
  233. 167.84 s gammaloop-nextest-integration> 16: <gammalooprs[917cbd3df9e68f8f]::integrands::process::evaluators::GenericEvaluator>::activate_symjit<unknown>
  234. 167.84 s gammaloop-nextest-integration> at <unknown source file>:<unknown line>
  235. 167.84 s gammaloop-nextest-integration> 17: <gammalooprs[917cbd3df9e68f8f]::integrands::process::amplitude::AmplitudeIntegrand>::prepare_runtime_backends_after_generation_with_compile_times<unknown>
  236. 167.84 s gammaloop-nextest-integration> at <unknown source file>:<unknown line>
  237. 167.84 s gammaloop-nextest-integration> 18: <gammalooprs[917cbd3df9e68f8f]::processes::amplitude::Amplitude>::build_integrand<unknown>
  238. 167.84 s gammaloop-nextest-integration> at <unknown source file>:<unknown line>
  239. 167.84 s gammaloop-nextest-integration> 19: <gammalooprs[917cbd3df9e68f8f]::processes::process::Process>::generate_integrands<unknown>
  240. 167.84 s gammaloop-nextest-integration> at <unknown source file>:<unknown line>
  241. 167.84 s gammaloop-nextest-integration> 20: <gammalooprs[917cbd3df9e68f8f]::processes::ProcessList>::generate_integrands<unknown>
  242. 167.84 s gammaloop-nextest-integration> at <unknown source file>:<unknown line>
  243. 167.84 s gammaloop-nextest-integration> 21: <gammaloop_api[9ebf6628f97aeb57]::state::State>::generate_integrands<unknown>
  244. 167.84 s gammaloop-nextest-integration> at <unknown source file>:<unknown line>
  245. 167.84 s gammaloop-nextest-integration> 22: <gammaloop_api[9ebf6628f97aeb57]::commands::generate::Generate>::run::<&std[bcb96dfbba0ab899]::path::PathBuf><unknown>
  246. 167.84 s gammaloop-nextest-integration> at <unknown source file>:<unknown line>
  247. 167.84 s gammaloop-nextest-integration> 23: <gammaloop_api[9ebf6628f97aeb57]::commands::Commands>::run<unknown>
  248. 167.84 s gammaloop-nextest-integration> at <unknown source file>:<unknown line>
  249. 167.84 s gammaloop-nextest-integration> 24: <gammaloop_api[9ebf6628f97aeb57]::session::CliSession>::execute_prepared<unknown>
  250. 167.84 s gammaloop-nextest-integration> at <unknown source file>:<unknown line>
  251. 167.84 s gammaloop-nextest-integration> 25: <gammaloop_api[9ebf6628f97aeb57]::session::CliSession>::execute_prepared_commands<unknown>
  252. 167.84 s gammaloop-nextest-integration> at <unknown source file>:<unknown line>
  253. 167.84 s gammaloop-nextest-integration> 26: <gammaloop_api[9ebf6628f97aeb57]::session::CliSession>::execute_prepared<unknown>
  254. 167.84 s gammaloop-nextest-integration> at <unknown source file>:<unknown line>
  255. 167.84 s gammaloop-nextest-integration> 27: <gammaloop_api[9ebf6628f97aeb57]::session::CliSession>::execute_command<unknown>
  256. 167.84 s gammaloop-nextest-integration> at <unknown source file>:<unknown line>
  257. 167.84 s gammaloop-nextest-integration> 28: <gammaloop_integration_tests[191607b70c61cd5a]::CLIState>::run_command<unknown>
  258. 167.84 s gammaloop-nextest-integration> at <unknown source file>:<unknown line>
  259. 167.84 s gammaloop-nextest-integration> 29: uv[3c7454ef256d6487]::run_single_integrated_uv_case<unknown>
  260. 167.84 s gammaloop-nextest-integration> at <unknown source file>:<unknown line>
  261. 167.84 s gammaloop-nextest-integration> 30: <uv[3c7454ef256d6487]::thermal_sunrise_uv::{closure#0} as core[940e698046960fd5]::ops::function::FnOnce<()>>::call_once<unknown>
  262. 167.84 s gammaloop-nextest-integration> at <unknown source file>:<unknown line>
  263. 167.84 s gammaloop-nextest-integration> 31: test[75d6903177b1d7e9]::__rust_begin_short_backtrace::<core[940e698046960fd5]::result::Result<(), alloc[2ea6bcb46fca0c42]::string::String>, fn() -> core[940e698046960fd5]::result::Result<(), alloc[2ea6bcb46fca0c42]::string::String>><unknown>
  264. 167.84 s gammaloop-nextest-integration> at <unknown source file>:<unknown line>
  265. 167.84 s gammaloop-nextest-integration> 32: test[75d6903177b1d7e9]::run_test::{closure#0}<unknown>
  266. 167.84 s gammaloop-nextest-integration> at <unknown source file>:<unknown line>
  267. 167.84 s gammaloop-nextest-integration> 33: std[bcb96dfbba0ab899]::sys::backtrace::__rust_begin_short_backtrace::<test[75d6903177b1d7e9]::run_test::{closure#1}, ()><unknown>
  268. 167.84 s gammaloop-nextest-integration> at <unknown source file>:<unknown line>
  269. 167.84 s gammaloop-nextest-integration> 34: <std[bcb96dfbba0ab899]::thread::lifecycle::spawn_unchecked<test[75d6903177b1d7e9]::run_test::{closure#1}, ()>::{closure#1} as core[940e698046960fd5]::ops::function::FnOnce<()>>::call_once::{shim:vtable#0}<unknown>
  270. 167.84 s gammaloop-nextest-integration> at <unknown source file>:<unknown line>
  271. 167.84 s gammaloop-nextest-integration> 35: <std[bcb96dfbba0ab899]::sys::thread::unix::Thread>::new::thread_start<unknown>
  272. 167.84 s gammaloop-nextest-integration> at <unknown source file>:<unknown line>
  273. 167.84 s gammaloop-nextest-integration> 36: start_thread<unknown>
  274. 167.84 s gammaloop-nextest-integration> at <unknown source file>:<unknown line>
  275. 167.84 s gammaloop-nextest-integration> 37: __clone3<unknown>
  276. 167.84 s gammaloop-nextest-integration> at <unknown source file>:<unknown line>
  277. 167.84 s gammaloop-nextest-integration>
  278. 167.84 s gammaloop-nextest-integration> Run with COLORBT_SHOW_HIDDEN=1 environment variable to disable frame filtering.
  279. 167.84 s gammaloop-nextest-integration> Run with RUST_BACKTRACE=full to include source snippets.
  280. 167.84 s gammaloop-nextest-integration> Warning: SpanTrace capture is Unsupported.
  281. 167.84 s gammaloop-nextest-integration> Ensure that you've setup a tracing-error ErrorLayer and the semver versions are compatible
  282. 167.84 s gammaloop-nextest-integration>
  283. 232.96 s gammaloop-nextest-integration> ------------
  284. 232.96 s gammaloop-nextest-integration> Summary [ 200.826s] 169 tests run: 167 passed, 2 failed, 209 skipped
  285. 232.96 s gammaloop-nextest-integration> FAIL [ 2.999s] ( 55/169) gammaloop-integration-tests::test_runs aa_aa::important::aa_aa_local_inspect_backend_consistency
  286. 232.96 s gammaloop-nextest-integration> stdout ---
  287. 232.96 s gammaloop-nextest-integration>
  288. 232.96 s gammaloop-nextest-integration> running 1 test
  289. 232.96 s gammaloop-nextest-integration> test aa_aa::important::aa_aa_local_inspect_backend_consistency ... FAILED
  290. 232.96 s gammaloop-nextest-integration>
  291. 232.96 s gammaloop-nextest-integration> failures:
  292. 232.96 s gammaloop-nextest-integration>
  293. 232.96 s gammaloop-nextest-integration> failures:
  294. 232.96 s gammaloop-nextest-integration> aa_aa::important::aa_aa_local_inspect_backend_consistency
  295. 232.96 s gammaloop-nextest-integration>
  296. 232.96 s gammaloop-nextest-integration> test result: FAILED. 0 passed; 1 failed; 0 ignored; 0 measured; 273 filtered out; finished in 2.99s
  297. 232.96 s gammaloop-nextest-integration>
  298. 232.96 s gammaloop-nextest-integration> stderr ---
  299. 232.96 s gammaloop-nextest-integration> [2026-09-15 21:41:25.843] @gammaloop_api::se... INFO : Running command import model sm-default.json
  300. 232.96 s gammaloop-nextest-integration> [2026-09-15 21:41:25.843] @import::model INFO : Loading built-in JSON model sm-default
  301. 232.96 s gammaloop-nextest-integration> [2026-09-15 21:41:25.868] @gammalooprs::model INFO : The following 15 external parameters were forced to zero by the restriction card:
  302. 232.96 s gammaloop-nextest-integration> lamWS, AWS, rhoWS, etaWS, ymc, yme, ymm, MC, Me, MM, WTau, muQ, muLe, muLmu, muLtau
  303. 232.96 s gammaloop-nextest-integration> [2026-09-15 21:41:25.868] @gammalooprs::model INFO : The following 34 vertex rules were removed by the restriction card:
  304. 232.96 s gammaloop-nextest-integration> V_82 -> (c~, d, G+) | V_83 -> (t~, d, G+) | V_84 -> (c~, s, G+) | V_85 -> (t~, s, G+) | V_86 -> (u~, b, G+) | V_87 -> (c~, b, G+) | V_90 -> (c~, d, W+) | V_91 -> (t~, d, W+) | V_92 -> (u~, s, W+) | V_94 -> (t~, s, W+) | V_95 -> (u~, b, W+) | V_96 -> (c~, b, W+) | V_101 -> (e+, e-, G0) | V_102 -> (mu+, mu-, G0) | V_104 -> (e+, e-, H) | V_105 -> (mu+, mu-, H) | V_110 -> (ve~, e-, G+) | V_111 -> (vm~, mu-, G+) | V_116 -> (b~, u, G-) | V_117 -> (d~, c, G-) | V_118 -> (s~, c, G-) | V_119 -> (b~, c, G-) | V_120 -> (d~, t, G-) | V_121 -> (s~, t, G-) | V_124 -> (s~, u, W-) | V_125 -> (b~, u, W-) | V_126 -> (d~, c, W-) | V_128 -> (b~, c, W-) | V_129 -> (d~, t, W-) | V_130 -> (s~, t, W-) | V_138 -> (c~, c, G0) | V_140 -> (c~, c, H) | V_145 -> (e+, ve, G-) | V_146 -> (mu+, vm, G-)
  305. 232.96 s gammaloop-nextest-integration> [2026-09-15 21:41:25.868] @gammalooprs::model INFO : The following 36 couplings were removed by the restriction card:
  306. 232.96 s gammaloop-nextest-integration> GC_13, GC_14, GC_16, GC_17, GC_18, GC_19, GC_20, GC_22, GC_23, GC_24, GC_25, GC_26, GC_28, GC_29, GC_42, GC_43, GC_44, GC_46, GC_47, GC_48, GC_84, GC_85, GC_86, GC_87, GC_88, GC_89, GC_90, GC_91, GC_92, GC_93, GC_101, GC_102, GC_103, GC_105, GC_106, GC_107
  307. 232.96 s gammaloop-nextest-integration> [2026-09-15 21:41:25.868] @gammaloop_api::se... INFO : Running command run set_model_parameters
  308. 232.96 s gammaloop-nextest-integration> [2026-09-15 21:41:25.868] @gammaloop_api::se... INFO : Starting command block set_model_parameters
  309. 232.96 s gammaloop-nextest-integration> [2026-09-15 21:41:25.869] @gammaloop_api::se... INFO : Running command set model MT=173.0
  310. 232.96 s gammaloop-nextest-integration> [2026-09-15 21:41:25.873] @gammaloop_api::se... INFO : Running command set model WT=0.0
  311. 232.96 s gammaloop-nextest-integration> [2026-09-15 21:41:25.877] @gammaloop_api::se... INFO : Running command set model ymt=173.0
  312. 232.96 s gammaloop-nextest-integration> [2026-09-15 21:41:25.881] @gammaloop_api::se... INFO : Running command set model aS=0.118
  313. 232.96 s gammaloop-nextest-integration> [2026-09-15 21:41:25.886] @gammaloop_api::se... INFO : Running command set model aEWM1=137.036
  314. 232.96 s gammaloop-nextest-integration> [2026-09-15 21:41:25.891] @gammaloop_api::se... INFO : Running command set model Gf=1.166390e-05
  315. 232.96 s gammaloop-nextest-integration> [2026-09-15 21:41:25.896] @gammaloop_api::se... INFO : Running command set model MZ=91.188
  316. 232.96 s gammaloop-nextest-integration> [2026-09-15 21:41:25.901] @gammaloop_api::se... INFO : Running command set global string '
  317. 232.96 s gammaloop-nextest-integration> [global.generation.compile]
  318. 232.96 s gammaloop-nextest-integration> compilation_mode = "symjit"
  319. 232.96 s gammaloop-nextest-integration> optimization_level = "O0"
  320. 232.96 s gammaloop-nextest-integration> fast_math = false
  321. 232.96 s gammaloop-nextest-integration> [...]
  322. 232.96 s gammaloop-nextest-integration> [2026-09-15 21:41:25.902] @gammaloop_api::se... INFO : Running command import graphs ./examples/cli/aa_aa/1L/aa_aa_1L.dot -p aa_aa_all_helicities -i 1L_ppmm -o
  323. 232.96 s gammaloop-nextest-integration> [2026-09-15 21:41:25.902] @commands::import INFO : Loading graphs from '/build/source/examples/cli/aa_aa/1L/aa_aa_1L.dot'
  324. 232.96 s gammaloop-nextest-integration> [2026-09-15 21:41:25.911] @gammaloop_api::se... INFO : Running command generate existing -p aa_aa_all_helicities
  325. 232.97 s gammaloop-nextest-integration> The application panicked (crashed).
  326. 232.97 s gammaloop-nextest-integration> Message: label _func_power_ not found
  327. 232.97 s gammaloop-nextest-integration> Location: /nix/store/n9w914kh1cm59xx3spcs831cdyb56m32-vendor-cargo-deps/c19b7c6f923b580ac259164a89f2577984ad5ab09ee9d583b888f934adbbe8d0/symjit-2.25.6/src/symjit/assembler.rs:77
  328. 232.97 s gammaloop-nextest-integration>
  329. 232.97 s gammaloop-nextest-integration> ━━━━━━━━━━━━━━━━━━━━━━━━━━━━━━━━━━ BACKTRACE ━━━━━━━━━━━━━━━━━━━━━━━━━━━━━━━━━━━
  330. 232.97 s gammaloop-nextest-integration> 1: <color_eyre[51793ea62743adbd]::config::PanicHook>::panic_report<unknown>
  331. 232.97 s gammaloop-nextest-integration> at <unknown source file>:<unknown line>
  332. 232.97 s gammaloop-nextest-integration> 2: <color_eyre[51793ea62743adbd]::config::PanicHook>::into_panic_hook::{closure#0}<unknown>
  333. 232.97 s gammaloop-nextest-integration> at <unknown source file>:<unknown line>
  334. 232.97 s gammaloop-nextest-integration> 3: std[bcb96dfbba0ab899]::panicking::panic_with_hook<unknown>
  335. 232.97 s gammaloop-nextest-integration> at <unknown source file>:<unknown line>
  336. 232.97 s gammaloop-nextest-integration> 4: std[bcb96dfbba0ab899]::panicking::panic_handler::{closure#0}<unknown>
  337. 232.97 s gammaloop-nextest-integration> at <unknown source file>:<unknown line>
  338. 232.97 s gammaloop-nextest-integration> 5: std[bcb96dfbba0ab899]::sys::backtrace::__rust_end_short_backtrace::<std[bcb96dfbba0ab899]::panicking::panic_handler::{closure#0}, !><unknown>
  339. 232.97 s gammaloop-nextest-integration> at <unknown source file>:<unknown line>
  340. 232.97 s gammaloop-nextest-integration> 6: __rustc[6c289b9f9c454d21]::rust_begin_unwind<unknown>
  341. 232.97 s gammaloop-nextest-integration> at <unknown source file>:<unknown line>
  342. 232.97 s gammaloop-nextest-integration> 7: core[940e698046960fd5]::panicking::panic_fmt<unknown>
  343. 232.97 s gammaloop-nextest-integration> at <unknown source file>:<unknown line>
  344. 232.97 s gammaloop-nextest-integration> 8: <symjit[e408de789c333cd]::symjit::assembler::Assembler>::apply_jumps<unknown>
  345. 232.97 s gammaloop-nextest-integration> at <unknown source file>:<unknown line>
  346. 232.97 s gammaloop-nextest-integration> 9: <symjit[e408de789c333cd]::symjit::builder::Builder>::compile_from_mir::<symjit[e408de789c333cd]::symjit::amd::complex::AmdComplexGenerator><unknown>
  347. 232.97 s gammaloop-nextest-integration> at <unknown source file>:<unknown line>
  348. 232.97 s gammaloop-nextest-integration> 10: <symjit[e408de789c333cd]::symjit::runnable::Application>::compile_ty<unknown>
  349. 232.97 s gammaloop-nextest-integration> at <unknown source file>:<unknown line>
  350. 232.97 s gammaloop-nextest-integration> 11: <symjit[e408de789c333cd]::symjit::runnable::Application>::with_mir<unknown>
  351. 232.97 s gammaloop-nextest-integration> at <unknown source file>:<unknown line>
  352. 232.97 s gammaloop-nextest-integration> 12: <symjit[e408de789c333cd]::symjit::composer::DirectTranslator as symjit[e408de789c333cd]::symjit::composer::Composer>::compile<unknown>
  353. 232.97 s gammaloop-nextest-integration> at <unknown source file>:<unknown line>
  354. 232.97 s gammaloop-nextest-integration> 13: <symjit[e408de789c333cd]::symjit::compiler::Translator as symjit[e408de789c333cd]::symjit::composer::Composer>::compile<unknown>
  355. 232.97 s gammaloop-nextest-integration> at <unknown source file>:<unknown line>
  356. 232.97 s gammaloop-nextest-integration> 14: <numerica[124dab8567f4861e]::domains::float::complex::Complex<f64> as symbolica[10e259bab675d243]::evaluate::backend::JITCompiledNumber>::jit_compile<unknown>
  357. 232.97 s gammaloop-nextest-integration> at <unknown source file>:<unknown line>
  358. 232.97 s gammaloop-nextest-integration> 15: <symbolica[10e259bab675d243]::evaluate::evaluator::ExpressionEvaluator<numerica[124dab8567f4861e]::domains::float::complex::Complex<f64>>>::jit_compile<unknown>
  359. 232.97 s gammaloop-nextest-integration> at <unknown source file>:<unknown line>
  360. 232.97 s gammaloop-nextest-integration> 16: <gammalooprs[917cbd3df9e68f8f]::integrands::process::evaluators::GenericEvaluator>::activate_symjit<unknown>
  361. 232.97 s gammaloop-nextest-integration> at <unknown source file>:<unknown line>
  362. 232.97 s gammaloop-nextest-integration> 17: <gammalooprs[917cbd3df9e68f8f]::integrands::process::amplitude::AmplitudeIntegrand>::prepare_runtime_backends_after_generation_with_compile_times<unknown>
  363. 232.97 s gammaloop-nextest-integration> at <unknown source file>:<unknown line>
  364. 232.97 s gammaloop-nextest-integration> 18: <gammalooprs[917cbd3df9e68f8f]::processes::amplitude::Amplitude>::build_integrand<unknown>
  365. 232.97 s gammaloop-nextest-integration> at <unknown source file>:<unknown line>
  366. 232.97 s gammaloop-nextest-integration> 19: <gammalooprs[917cbd3df9e68f8f]::processes::process::Process>::generate_integrands<unknown>
  367. 232.97 s gammaloop-nextest-integration> at <unknown source file>:<unknown line>
  368. 232.97 s gammaloop-nextest-integration> 20: <gammaloop_api[9ebf6628f97aeb57]::state::State>::generate_integrand<unknown>
  369. 232.97 s gammaloop-nextest-integration> at <unknown source file>:<unknown line>
  370. 232.97 s gammaloop-nextest-integration> 21: <gammaloop_api[9ebf6628f97aeb57]::commands::generate::Generate>::run::<&std[bcb96dfbba0ab899]::path::PathBuf><unknown>
  371. 232.97 s gammaloop-nextest-integration> at <unknown source file>:<unknown line>
  372. 232.97 s gammaloop-nextest-integration> 22: <gammaloop_api[9ebf6628f97aeb57]::commands::Commands>::run<unknown>
  373. 232.97 s gammaloop-nextest-integration> at <unknown source file>:<unknown line>
  374. 232.97 s gammaloop-nextest-integration> 23: <gammaloop_api[9ebf6628f97aeb57]::session::CliSession>::execute_prepared<unknown>
  375. 232.97 s gammaloop-nextest-integration> at <unknown source file>:<unknown line>
  376. 232.97 s gammaloop-nextest-integration> 24: <gammaloop_api[9ebf6628f97aeb57]::session::CliSession>::execute_command<unknown>
  377. 232.97 s gammaloop-nextest-integration> at <unknown source file>:<unknown line>
  378. 232.97 s gammaloop-nextest-integration> 25: <gammaloop_integration_tests[191607b70c61cd5a]::CLIState>::run_command<unknown>
  379. 232.97 s gammaloop-nextest-integration> at <unknown source file>:<unknown line>
  380. 232.97 s gammaloop-nextest-integration> 26: test_runs[9b7e2dc2dc4f29b0]::aa_aa::generate_aa_aa_helicity_family<unknown>
  381. 232.97 s gammaloop-nextest-integration> at <unknown source file>:<unknown line>
  382. 232.97 s gammaloop-nextest-integration> 27: <test_runs[9b7e2dc2dc4f29b0]::aa_aa::important::aa_aa_local_inspect_backend_consistency::{closure#0} as core[940e698046960fd5]::ops::function::FnOnce<()>>::call_once<unknown>
  383. 232.97 s gammaloop-nextest-integration> at <unknown source file>:<unknown line>
  384. 232.97 s gammaloop-nextest-integration> 28: serial_test[cd99724524a2f1c0]::serial_code_lock::local_serial_core_with_return::<(), eyre[cb2fd339c0c40fca]::Report><unknown>
  385. 232.97 s gammaloop-nextest-integration> at <unknown source file>:<unknown line>
  386. 232.97 s gammaloop-nextest-integration> 29: <test_runs[9b7e2dc2dc4f29b0]::aa_aa::important::aa_aa_local_inspect_backend_consistency::{closure#0} as core[940e698046960fd5]::ops::function::FnOnce<()>>::call_once<unknown>
  387. 232.97 s gammaloop-nextest-integration> at <unknown source file>:<unknown line>
  388. 232.97 s gammaloop-nextest-integration> 30: test[75d6903177b1d7e9]::__rust_begin_short_backtrace::<core[940e698046960fd5]::result::Result<(), alloc[2ea6bcb46fca0c42]::string::String>, fn() -> core[940e698046960fd5]::result::Result<(), alloc[2ea6bcb46fca0c42]::string::String>><unknown>
  389. 232.97 s gammaloop-nextest-integration> at <unknown source file>:<unknown line>
  390. 232.97 s gammaloop-nextest-integration> 31: test[75d6903177b1d7e9]::run_test::{closure#0}<unknown>
  391. 232.97 s gammaloop-nextest-integration> at <unknown source file>:<unknown line>
  392. 232.97 s gammaloop-nextest-integration> 32: std[bcb96dfbba0ab899]::sys::backtrace::__rust_begin_short_backtrace::<test[75d6903177b1d7e9]::run_test::{closure#1}, ()><unknown>
  393. 232.97 s gammaloop-nextest-integration> at <unknown source file>:<unknown line>
  394. 232.97 s gammaloop-nextest-integration> 33: <std[bcb96dfbba0ab899]::thread::lifecycle::spawn_unchecked<test[75d6903177b1d7e9]::run_test::{closure#1}, ()>::{closure#1} as core[940e698046960fd5]::ops::function::FnOnce<()>>::call_once::{shim:vtable#0}<unknown>
  395. 232.97 s gammaloop-nextest-integration> at <unknown source file>:<unknown line>
  396. 232.97 s gammaloop-nextest-integration> 34: <std[bcb96dfbba0ab899]::sys::thread::unix::Thread>::new::thread_start<unknown>
  397. 232.97 s gammaloop-nextest-integration> at <unknown source file>:<unknown line>
  398. 232.97 s gammaloop-nextest-integration> 35: start_thread<unknown>
  399. 232.97 s gammaloop-nextest-integration> at <unknown source file>:<unknown line>
  400. 232.97 s gammaloop-nextest-integration> 36: __clone3<unknown>
  401. 232.97 s gammaloop-nextest-integration> at <unknown source file>:<unknown line>
  402. 232.97 s gammaloop-nextest-integration>
  403. 232.97 s gammaloop-nextest-integration> Run with COLORBT_SHOW_HIDDEN=1 environment variable to disable frame filtering.
  404. 232.97 s gammaloop-nextest-integration> Run with RUST_BACKTRACE=full to include source snippets.
  405. 232.97 s gammaloop-nextest-integration> Warning: SpanTrace capture is Unsupported.
  406. 232.97 s gammaloop-nextest-integration> Ensure that you've setup a tracing-error ErrorLayer and the semver versions are compatible
  407. 232.97 s gammaloop-nextest-integration>
  408. 232.97 s gammaloop-nextest-integration> FAIL [ 2.454s] (157/169) gammaloop-integration-tests::uv thermal_sunrise_uv
  409. 232.97 s gammaloop-nextest-integration> stdout ---
  410. 232.97 s gammaloop-nextest-integration>
  411. 232.97 s gammaloop-nextest-integration> running 1 test
  412. 232.97 s gammaloop-nextest-integration> test thermal_sunrise_uv ... FAILED
  413. 232.97 s gammaloop-nextest-integration>
  414. 232.97 s gammaloop-nextest-integration> failures:
  415. 232.97 s gammaloop-nextest-integration>
  416. 232.97 s gammaloop-nextest-integration> failures:
  417. 232.97 s gammaloop-nextest-integration> thermal_sunrise_uv
  418. 232.97 s gammaloop-nextest-integration>
  419. 232.97 s gammaloop-nextest-integration> test result: FAILED. 0 passed; 1 failed; 0 ignored; 0 measured; 31 filtered out; finished in 2.44s
  420. 232.97 s gammaloop-nextest-integration>
  421. 232.97 s gammaloop-nextest-integration> stderr ---
  422. 232.97 s gammaloop-nextest-integration> [2026-09-15 21:42:08.095] @gammaloop_api::se... INFO : Running command run generate
  423. 232.97 s gammaloop-nextest-integration> [2026-09-15 21:42:08.095] @gammaloop_api::se... INFO : Starting command block generate
  424. 232.97 s gammaloop-nextest-integration> [2026-09-15 21:42:08.096] @gammaloop_api::se... INFO : Running command import model sm-default.json
  425. 232.97 s gammaloop-nextest-integration> [2026-09-15 21:42:08.096] @import::model INFO : Loading built-in JSON model sm-default
  426. 232.97 s gammaloop-nextest-integration> [2026-09-15 21:42:08.121] @gammalooprs::model INFO : The following 15 external parameters were forced to zero by the restriction card:
  427. 232.97 s gammaloop-nextest-integration> lamWS, AWS, rhoWS, etaWS, ymc, yme, ymm, MC, Me, MM, WTau, muQ, muLe, muLmu, muLtau
  428. 232.97 s gammaloop-nextest-integration> [2026-09-15 21:42:08.121] @gammalooprs::model INFO : The following 34 vertex rules were removed by the restriction card:
  429. 232.97 s gammaloop-nextest-integration> V_82 -> (c~, d, G+) | V_83 -> (t~, d, G+) | V_84 -> (c~, s, G+) | V_85 -> (t~, s, G+) | V_86 -> (u~, b, G+) | V_87 -> (c~, b, G+) | V_90 -> (c~, d, W+) | V_91 -> (t~, d, W+) | V_92 -> (u~, s, W+) | V_94 -> (t~, s, W+) | V_95 -> (u~, b, W+) | V_96 -> (c~, b, W+) | V_101 -> (e+, e-, G0) | V_102 -> (mu+, mu-, G0) | V_104 -> (e+, e-, H) | V_105 -> (mu+, mu-, H) | V_110 -> (ve~, e-, G+) | V_111 -> (vm~, mu-, G+) | V_116 -> (b~, u, G-) | V_117 -> (d~, c, G-) | V_118 -> (s~, c, G-) | V_119 -> (b~, c, G-) | V_120 -> (d~, t, G-) | V_121 -> (s~, t, G-) | V_124 -> (s~, u, W-) | V_125 -> (b~, u, W-) | V_126 -> (d~, c, W-) | V_128 -> (b~, c, W-) | V_129 -> (d~, t, W-) | V_130 -> (s~, t, W-) | V_138 -> (c~, c, G0) | V_140 -> (c~, c, H) | V_145 -> (e+, ve, G-) | V_146 -> (mu+, vm, G-)
  430. 232.97 s gammaloop-nextest-integration> [2026-09-15 21:42:08.121] @gammalooprs::model INFO : The following 36 couplings were removed by the restriction card:
  431. 232.97 s gammaloop-nextest-integration> GC_13, GC_14, GC_16, GC_17, GC_18, GC_19, GC_20, GC_22, GC_23, GC_24, GC_25, GC_26, GC_28, GC_29, GC_42, GC_43, GC_44, GC_46, GC_47, GC_48, GC_84, GC_85, GC_86, GC_87, GC_88, GC_89, GC_90, GC_91, GC_92, GC_93, GC_101, GC_102, GC_103, GC_105, GC_106, GC_107
  432. 232.97 s gammaloop-nextest-integration> [2026-09-15 21:42:08.121] @gammaloop_api::se... INFO : Running command remove processes
  433. 232.97 s gammaloop-nextest-integration> [2026-09-15 21:42:08.121] @gammaloop_api::se... INFO : Running command generate amp {} > {} [{2}] | g u
  434. 232.97 s gammaloop-nextest-integration> --numerator-grouping group_identical_graphs_up_to_scalar_rescaling
  435. 232.97 s gammaloop-nextest-integration> --max-n-bridges 0
  436. 232.97 s gammaloop-nextest-integration> --number-of-factorized-loop-subtopologies 1 1
  437. 232.97 s gammaloop-nextest-integration> --number-of-anticommutating-loops 1 1
  438. 232.97 s gammaloop-nextest-integration> [...]
  439. 232.97 s gammaloop-nextest-integration> [2026-09-15 21:42:08.123] @feyngen::diagram_... INFO : 0s | Δ=0s | Starting Feynman graph generation with Symbolica...
  440. 232.97 s gammaloop-nextest-integration> [2026-09-15 21:42:08.123] @feyngen::diagram_... INFO : 0s | Δ=0s | Number of graphs resulting from Symbolica generation: 3
  441. 232.97 s gammaloop-nextest-integration> [2026-09-15 21:42:08.125] @feyngen::diagram_... INFO : 0s | Δ=0s | Number of graphs retained after removal of vetoed topologies: 2
  442. 232.97 s gammaloop-nextest-integration> [2026-09-15 21:42:08.125] @feyngen::diagram_... INFO : 0s | Δ=0s | Number of graphs after vertex info assignment: 2
  443. 232.97 s gammaloop-nextest-integration> [2026-09-15 21:42:08.125] @feyngen::diagram_... INFO : 0s | Δ=0s | Number of graphs after all complete graphs filters are applied: 2
  444. 232.97 s gammaloop-nextest-integration> [2026-09-15 21:42:08.125] @feyngen::diagram_... INFO : 0s | Δ=0s | Number of graphs after closed anticommutating chains analysis: 1
  445. 232.97 s gammaloop-nextest-integration> [2026-09-15 21:42:08.125] @feyngen::diagram_... INFO : 0s | Δ=0s | Number of graphs after symmetrization of external states: 1
  446. 232.97 s gammaloop-nextest-integration> [2026-09-15 21:42:08.125] @feyngen::diagram_... INFO : 0s | Δ=0s | Number of graphs after canonization of vertices, edges and flows (graph labels assigned here): 1
  447. 232.97 s gammaloop-nextest-integration> [2026-09-15 21:42:08.138] @feyngen::diagram_... INFO : 0s | Δ=0s | Number of graphs after numerator-aware grouping with strategy 'up to a scalar rescaling': 1 (1 isomorphically unique graph, 0 color zero, 0 lorentz zero, 0 grouped and 0 cancellation)
  448. 232.97 s gammaloop-nextest-integration> [2026-09-15 21:42:08.138] @feyngen::diagram_... INFO : ( Sum of the symmetry factors from each graph generated = -1/2 )
  449. 232.97 s gammaloop-nextest-integration> [2026-09-15 21:42:08.138] @commands::generate INFO : Generated amplitude 1 graphs.
  450. 232.97 s gammaloop-nextest-integration> [2026-09-15 21:42:08.138] @commands::generate INFO : Only diagram generation was requested, skipping integrand generation. You can generate integrands later using the 'generate existing <options>' command.
  451. 232.97 s gammaloop-nextest-integration> [2026-09-15 21:42:08.138] @gammaloop_api::se... INFO : Running command generate
  452. 232.97 s gammaloop-nextest-integration> The application panicked (crashed).
  453. 232.97 s gammaloop-nextest-integration> Message: label _func_power_ not found
  454. 232.97 s gammaloop-nextest-integration> Location: /nix/store/n9w914kh1cm59xx3spcs831cdyb56m32-vendor-cargo-deps/c19b7c6f923b580ac259164a89f2577984ad5ab09ee9d583b888f934adbbe8d0/symjit-2.25.6/src/symjit/assembler.rs:77
  455. 232.97 s gammaloop-nextest-integration>
  456. 232.97 s gammaloop-nextest-integration> ━━━━━━━━━━━━━━━━━━━━━━━━━━━━━━━━━━ BACKTRACE ━━━━━━━━━━━━━━━━━━━━━━━━━━━━━━━━━━━
  457. 232.97 s gammaloop-nextest-integration> 1: <color_eyre[51793ea62743adbd]::config::PanicHook>::panic_report<unknown>
  458. 232.97 s gammaloop-nextest-integration> at <unknown source file>:<unknown line>
  459. 232.97 s gammaloop-nextest-integration> 2: <color_eyre[51793ea62743adbd]::config::PanicHook>::into_panic_hook::{closure#0}<unknown>
  460. 232.97 s gammaloop-nextest-integration> at <unknown source file>:<unknown line>
  461. 232.97 s gammaloop-nextest-integration> 3: std[bcb96dfbba0ab899]::panicking::panic_with_hook<unknown>
  462. 232.97 s gammaloop-nextest-integration> at <unknown source file>:<unknown line>
  463. 232.97 s gammaloop-nextest-integration> 4: std[bcb96dfbba0ab899]::panicking::panic_handler::{closure#0}<unknown>
  464. 232.97 s gammaloop-nextest-integration> at <unknown source file>:<unknown line>
  465. 232.97 s gammaloop-nextest-integration> 5: std[bcb96dfbba0ab899]::sys::backtrace::__rust_end_short_backtrace::<std[bcb96dfbba0ab899]::panicking::panic_handler::{closure#0}, !><unknown>
  466. 232.97 s gammaloop-nextest-integration> at <unknown source file>:<unknown line>
  467. 232.97 s gammaloop-nextest-integration> 6: __rustc[6c289b9f9c454d21]::rust_begin_unwind<unknown>
  468. 232.97 s gammaloop-nextest-integration> at <unknown source file>:<unknown line>
  469. 232.97 s gammaloop-nextest-integration> 7: core[940e698046960fd5]::panicking::panic_fmt<unknown>
  470. 232.97 s gammaloop-nextest-integration> at <unknown source file>:<unknown line>
  471. 232.97 s gammaloop-nextest-integration> 8: <symjit[e408de789c333cd]::symjit::assembler::Assembler>::apply_jumps<unknown>
  472. 232.97 s gammaloop-nextest-integration> at <unknown source file>:<unknown line>
  473. 232.97 s gammaloop-nextest-integration> 9: <symjit[e408de789c333cd]::symjit::builder::Builder>::compile_from_mir::<symjit[e408de789c333cd]::symjit::amd::complex::AmdComplexGenerator><unknown>
  474. 232.97 s gammaloop-nextest-integration> at <unknown source file>:<unknown line>
  475. 232.97 s gammaloop-nextest-integration> 10: <symjit[e408de789c333cd]::symjit::runnable::Application>::compile_ty<unknown>
  476. 232.97 s gammaloop-nextest-integration> at <unknown source file>:<unknown line>
  477. 232.97 s gammaloop-nextest-integration> 11: <symjit[e408de789c333cd]::symjit::runnable::Application>::with_mir<unknown>
  478. 232.97 s gammaloop-nextest-integration> at <unknown source file>:<unknown line>
  479. 232.97 s gammaloop-nextest-integration> 12: <symjit[e408de789c333cd]::symjit::composer::DirectTranslator as symjit[e408de789c333cd]::symjit::composer::Composer>::compile<unknown>
  480. 232.97 s gammaloop-nextest-integration> at <unknown source file>:<unknown line>
  481. 232.97 s gammaloop-nextest-integration> 13: <symjit[e408de789c333cd]::symjit::compiler::Translator as symjit[e408de789c333cd]::symjit::composer::Composer>::compile<unknown>
  482. 232.97 s gammaloop-nextest-integration> at <unknown source file>:<unknown line>
  483. 232.97 s gammaloop-nextest-integration> 14: <numerica[124dab8567f4861e]::domains::float::complex::Complex<f64> as symbolica[10e259bab675d243]::evaluate::backend::JITCompiledNumber>::jit_compile<unknown>
  484. 232.97 s gammaloop-nextest-integration> at <unknown source file>:<unknown line>
  485. 232.97 s gammaloop-nextest-integration> 15: <symbolica[10e259bab675d243]::evaluate::evaluator::ExpressionEvaluator<numerica[124dab8567f4861e]::domains::float::complex::Complex<f64>>>::jit_compile<unknown>
  486. 232.97 s gammaloop-nextest-integration> at <unknown source file>:<unknown line>
  487. 232.97 s gammaloop-nextest-integration> 16: <gammalooprs[917cbd3df9e68f8f]::integrands::process::evaluators::GenericEvaluator>::activate_symjit<unknown>
  488. 232.97 s gammaloop-nextest-integration> at <unknown source file>:<unknown line>
  489. 232.97 s gammaloop-nextest-integration> 17: <gammalooprs[917cbd3df9e68f8f]::integrands::process::amplitude::AmplitudeIntegrand>::prepare_runtime_backends_after_generation_with_compile_times<unknown>
  490. 232.97 s gammaloop-nextest-integration> at <unknown source file>:<unknown line>
  491. 232.97 s gammaloop-nextest-integration> 18: <gammalooprs[917cbd3df9e68f8f]::processes::amplitude::Amplitude>::build_integrand<unknown>
  492. 232.97 s gammaloop-nextest-integration> at <unknown source file>:<unknown line>
  493. 232.97 s gammaloop-nextest-integration> 19: <gammalooprs[917cbd3df9e68f8f]::processes::process::Process>::generate_integrands<unknown>
  494. 232.97 s gammaloop-nextest-integration> at <unknown source file>:<unknown line>
  495. 232.97 s gammaloop-nextest-integration> 20: <gammalooprs[917cbd3df9e68f8f]::processes::ProcessList>::generate_integrands<unknown>
  496. 232.97 s gammaloop-nextest-integration> at <unknown source file>:<unknown line>
  497. 232.97 s gammaloop-nextest-integration> 21: <gammaloop_api[9ebf6628f97aeb57]::state::State>::generate_integrands<unknown>
  498. 232.97 s gammaloop-nextest-integration> at <unknown source file>:<unknown line>
  499. 232.97 s gammaloop-nextest-integration> 22: <gammaloop_api[9ebf6628f97aeb57]::commands::generate::Generate>::run::<&std[bcb96dfbba0ab899]::path::PathBuf><unknown>
  500. 232.97 s gammaloop-nextest-integration> at <unknown source file>:<unknown line>
  501. 232.97 s gammaloop-nextest-integration> 23: <gammaloop_api[9ebf6628f97aeb57]::commands::Commands>::run<unknown>
  502. 232.97 s gammaloop-nextest-integration> at <unknown source file>:<unknown line>
  503. 232.97 s gammaloop-nextest-integration> 24: <gammaloop_api[9ebf6628f97aeb57]::session::CliSession>::execute_prepared<unknown>
  504. 232.97 s gammaloop-nextest-integration> at <unknown source file>:<unknown line>
  505. 232.97 s gammaloop-nextest-integration> 25: <gammaloop_api[9ebf6628f97aeb57]::session::CliSession>::execute_prepared_commands<unknown>
  506. 232.97 s gammaloop-nextest-integration> at <unknown source file>:<unknown line>
  507. 232.97 s gammaloop-nextest-integration> 26: <gammaloop_api[9ebf6628f97aeb57]::session::CliSession>::execute_prepared<unknown>
  508. 232.97 s gammaloop-nextest-integration> at <unknown source file>:<unknown line>
  509. 232.97 s gammaloop-nextest-integration> 27: <gammaloop_api[9ebf6628f97aeb57]::session::CliSession>::execute_command<unknown>
  510. 232.97 s gammaloop-nextest-integration> at <unknown source file>:<unknown line>
  511. 232.97 s gammaloop-nextest-integration> 28: <gammaloop_integration_tests[191607b70c61cd5a]::CLIState>::run_command<unknown>
  512. 232.97 s gammaloop-nextest-integration> at <unknown source file>:<unknown line>
  513. 232.97 s gammaloop-nextest-integration> 29: uv[3c7454ef256d6487]::run_single_integrated_uv_case<unknown>
  514. 232.97 s gammaloop-nextest-integration> at <unknown source file>:<unknown line>
  515. 232.97 s gammaloop-nextest-integration> 30: <uv[3c7454ef256d6487]::thermal_sunrise_uv::{closure#0} as core[940e698046960fd5]::ops::function::FnOnce<()>>::call_once<unknown>
  516. 232.97 s gammaloop-nextest-integration> at <unknown source file>:<unknown line>
  517. 232.97 s gammaloop-nextest-integration> 31: test[75d6903177b1d7e9]::__rust_begin_short_backtrace::<core[940e698046960fd5]::result::Result<(), alloc[2ea6bcb46fca0c42]::string::String>, fn() -> core[940e698046960fd5]::result::Result<(), alloc[2ea6bcb46fca0c42]::string::String>><unknown>
  518. 232.97 s gammaloop-nextest-integration> at <unknown source file>:<unknown line>
  519. 232.97 s gammaloop-nextest-integration> 32: test[75d6903177b1d7e9]::run_test::{closure#0}<unknown>
  520. 232.97 s gammaloop-nextest-integration> at <unknown source file>:<unknown line>
  521. 232.97 s gammaloop-nextest-integration> 33: std[bcb96dfbba0ab899]::sys::backtrace::__rust_begin_short_backtrace::<test[75d6903177b1d7e9]::run_test::{closure#1}, ()><unknown>
  522. 232.97 s gammaloop-nextest-integration> at <unknown source file>:<unknown line>
  523. 232.97 s gammaloop-nextest-integration> 34: <std[bcb96dfbba0ab899]::thread::lifecycle::spawn_unchecked<test[75d6903177b1d7e9]::run_test::{closure#1}, ()>::{closure#1} as core[940e698046960fd5]::ops::function::FnOnce<()>>::call_once::{shim:vtable#0}<unknown>
  524. 232.97 s gammaloop-nextest-integration> at <unknown source file>:<unknown line>
  525. 232.97 s gammaloop-nextest-integration> 35: <std[bcb96dfbba0ab899]::sys::thread::unix::Thread>::new::thread_start<unknown>
  526. 232.97 s gammaloop-nextest-integration> at <unknown source file>:<unknown line>
  527. 232.97 s gammaloop-nextest-integration> 36: start_thread<unknown>
  528. 232.97 s gammaloop-nextest-integration> at <unknown source file>:<unknown line>
  529. 232.97 s gammaloop-nextest-integration> 37: __clone3<unknown>
  530. 232.97 s gammaloop-nextest-integration> at <unknown source file>:<unknown line>
  531. 232.97 s gammaloop-nextest-integration>
  532. 232.97 s gammaloop-nextest-integration> Run with COLORBT_SHOW_HIDDEN=1 environment variable to disable frame filtering.
  533. 232.97 s gammaloop-nextest-integration> Run with RUST_BACKTRACE=full to include source snippets.
  534. 232.97 s gammaloop-nextest-integration> Warning: SpanTrace capture is Unsupported.
  535. 232.97 s gammaloop-nextest-integration> Ensure that you've setup a tracing-error ErrorLayer and the semver versions are compatible
  536. 232.97 s gammaloop-nextest-integration>
  537. 233.23 s gammaloop-nextest-integration> error: test run failed
  538. 233.30 s gammaloop-nextest-integration>
  539. 233.30 s gammaloop-nextest-integration> ========== nextest test summary ==========
  540. 233.30 s gammaloop-nextest-integration> report: target/nextest/ci_gammaloop/junit.xml
  541. 233.30 s gammaloop-nextest-integration> tests: 169, failures: 2, errors: 0
  542. 233.30 s gammaloop-nextest-integration>
  543. 233.30 s gammaloop-nextest-integration> 1. gammaloop-integration-tests::test_runs::aa_aa::important::aa_aa_local_inspect_backend_consistency
  544. 233.30 s gammaloop-nextest-integration> failure: test failure with exit code 101
  545. 233.30 s gammaloop-nextest-integration> system-out
  546. 233.30 s gammaloop-nextest-integration> running 1 test
  547. 233.30 s gammaloop-nextest-integration> test aa_aa::important::aa_aa_local_inspect_backend_consistency ... FAILED
  548. 233.30 s gammaloop-nextest-integration>
  549. 233.30 s gammaloop-nextest-integration> failures:
  550. 233.30 s gammaloop-nextest-integration>
  551. 233.30 s gammaloop-nextest-integration> failures:
  552. 233.30 s gammaloop-nextest-integration> aa_aa::important::aa_aa_local_inspect_backend_consistency
  553. 233.30 s gammaloop-nextest-integration>
  554. 233.30 s gammaloop-nextest-integration> test result: FAILED. 0 passed; 1 failed; 0 ignored; 0 measured; 273 filtered out; finished in 2.99s
  555. 233.30 s gammaloop-nextest-integration> system-err
  556. 233.30 s gammaloop-nextest-integration> [2026-09-15 21:41:25.843] @gammaloop_api::se... INFO : Running command import model sm-default.json
  557. 233.30 s gammaloop-nextest-integration> [2026-09-15 21:41:25.843] @import::model INFO : Loading built-in JSON model sm-default
  558. 233.30 s gammaloop-nextest-integration> [2026-09-15 21:41:25.868] @gammalooprs::model INFO : The following 15 external parameters were forced to zero by the restriction card:
  559. 233.30 s gammaloop-nextest-integration> lamWS, AWS, rhoWS, etaWS, ymc, yme, ymm, MC, Me, MM, WTau, muQ, muLe, muLmu, muLtau
  560. 233.30 s gammaloop-nextest-integration> [2026-09-15 21:41:25.868] @gammalooprs::model INFO : The following 34 vertex rules were removed by the restriction card:
  561. 233.30 s gammaloop-nextest-integration> V_82 -> (c~, d, G+) | V_83 -> (t~, d, G+) | V_84 -> (c~, s, G+) | V_85 -> (t~, s, G+) | V_86 -> (u~, b, G+) | V_87 -> (c~, b, G+) | V_90 -> (c~, d, W+) | V_91 -> (t~, d, W+) | V_92 -> (u~, s, W+) | V_94 -> (t~, s, W+) | V_95 -> (u~, b, W+) | V_96 -> (c~, b, W+) | V_101 -> (e+, e-, G0) | V_102 -> (mu+, mu-, G0) | V_104 -> (e+, e-, H) | V_105 -> (mu+, mu-, H) | V_110 -> (ve~, e-, G+) | V_111 -> (vm~, mu-, G+) | V_116 -> (b~, u, G-) | V_117 -> (d~, c, G-) | V_118 -> (s~, c, G-) | V_119 -> (b~, c, G-) | V_120 -> (d~, t, G-) | V_121 -> (s~, t, G-) | V_124 -> (s~, u, W-) | V_125 -> (b~, u, W-) | V_126 -> (d~, c, W-) | V_128 -> (b~, c, W-) | V_129 -> (d~, t, W-) | V_130 -> (s~, t, W-) | V_138 -> (c~, c, G0) | V_140 -> (c~, c, H) | V_145 -> (e+, ve, G-) | V_146 -> (mu+, vm, G-)
  562. 233.30 s gammaloop-nextest-integration> [2026-09-15 21:41:25.868] @gammalooprs::model INFO : The following 36 couplings were removed by the restriction card:
  563. 233.30 s gammaloop-nextest-integration> GC_13, GC_14, GC_16, GC_17, GC_18, GC_19, GC_20, GC_22, GC_23, GC_24, GC_25, GC_26, GC_28, GC_29, GC_42, GC_43, GC_44, GC_46, GC_47, GC_48, GC_84, GC_85, GC_86, GC_87, GC_88, GC_89, GC_90, GC_91, GC_92, GC_93, GC_101, GC_102, GC_103, GC_105, GC_106, GC_107
  564. 233.30 s gammaloop-nextest-integration> [2026-09-15 21:41:25.868] @gammaloop_api::se... INFO : Running command run set_model_parameters
  565. 233.30 s gammaloop-nextest-integration> [2026-09-15 21:41:25.868] @gammaloop_api::se... INFO : Starting command block set_model_parameters
  566. 233.30 s gammaloop-nextest-integration> [2026-09-15 21:41:25.869] @gammaloop_api::se... INFO : Running command set model MT=173.0
  567. 233.30 s gammaloop-nextest-integration> [2026-09-15 21:41:25.873] @gammaloop_api::se... INFO : Running command set model WT=0.0
  568. 233.30 s gammaloop-nextest-integration> [2026-09-15 21:41:25.877] @gammaloop_api::se... INFO : Running command set model ymt=173.0
  569. 233.30 s gammaloop-nextest-integration> [2026-09-15 21:41:25.881] @gammaloop_api::se... INFO : Running command set model aS=0.118
  570. 233.30 s gammaloop-nextest-integration> [2026-09-15 21:41:25.886] @gammaloop_api::se... INFO : Running command set model aEWM1=137.036
  571. 233.30 s gammaloop-nextest-integration> [2026-09-15 21:41:25.891] @gammaloop_api::se... INFO : Running command set model Gf=1.166390e-05
  572. 233.30 s gammaloop-nextest-integration> [2026-09-15 21:41:25.896] @gammaloop_api::se... INFO : Running command set model MZ=91.188
  573. 233.30 s gammaloop-nextest-integration> [2026-09-15 21:41:25.901] @gammaloop_api::se... INFO : Running command set global string '
  574. 233.30 s gammaloop-nextest-integration> [global.generation.compile]
  575. 233.30 s gammaloop-nextest-integration> compilation_mode = "symjit"
  576. 233.30 s gammaloop-nextest-integration> optimization_level = "O0"
  577. 233.30 s gammaloop-nextest-integration> fast_math = false
  578. 233.30 s gammaloop-nextest-integration> [...]
  579. 233.30 s gammaloop-nextest-integration> [2026-09-15 21:41:25.902] @gammaloop_api::se... INFO : Running command import graphs ./examples/cli/aa_aa/1L/aa_aa_1L.dot -p aa_aa_all_helicities -i 1L_ppmm -o
  580. 233.30 s gammaloop-nextest-integration> [2026-09-15 21:41:25.902] @commands::import INFO : Loading graphs from '/build/source/examples/cli/aa_aa/1L/aa_aa_1L.dot'
  581. 233.30 s gammaloop-nextest-integration> [2026-09-15 21:41:25.911] @gammaloop_api::se... INFO : Running command generate existing -p aa_aa_all_helicities
  582. 233.30 s gammaloop-nextest-integration> The application panicked (crashed).
  583. 233.30 s gammaloop-nextest-integration> Message: label _func_power_ not found
  584. 233.31 s gammaloop-nextest-integration> Location: /nix/store/n9w914kh1cm59xx3spcs831cdyb56m32-vendor-cargo-deps/c19b7c6f923b580ac259164a89f2577984ad5ab09ee9d583b888f934adbbe8d0/symjit-2.25.6/src/symjit/assembler.rs:77
  585. 233.31 s gammaloop-nextest-integration>
  586. 233.31 s gammaloop-nextest-integration> ━━━━━━━━━━━━━━━━━━━━━━━━━━━━━━━━━━ BACKTRACE ━━━━━━━━━━━━━━━━━━━━━━━━━━━━━━━━━━━
  587. 233.31 s gammaloop-nextest-integration> 1: <color_eyre[51793ea62743adbd]::config::PanicHook>::panic_report<unknown>
  588. 233.31 s gammaloop-nextest-integration> at <unknown source file>:<unknown line>
  589. 233.31 s gammaloop-nextest-integration> 2: <color_eyre[51793ea62743adbd]::config::PanicHook>::into_panic_hook::{closure#0}<unknown>
  590. 233.31 s gammaloop-nextest-integration> at <unknown source file>:<unknown line>
  591. 233.31 s gammaloop-nextest-integration> 3: std[bcb96dfbba0ab899]::panicking::panic_with_hook<unknown>
  592. 233.31 s gammaloop-nextest-integration> at <unknown source file>:<unknown line>
  593. 233.31 s gammaloop-nextest-integration> 4: std[bcb96dfbba0ab899]::panicking::panic_handler::{closure#0}<unknown>
  594. 233.31 s gammaloop-nextest-integration> at <unknown source file>:<unknown line>
  595. 233.31 s gammaloop-nextest-integration> 5: std[bcb96dfbba0ab899]::sys::backtrace::__rust_end_short_backtrace::<std[bcb96dfbba0ab899]::panicking::panic_handler::{closure#0}, !><unknown>
  596. 233.31 s gammaloop-nextest-integration> at <unknown source file>:<unknown line>
  597. 233.31 s gammaloop-nextest-integration> 6: __rustc[6c289b9f9c454d21]::rust_begin_unwind<unknown>
  598. 233.31 s gammaloop-nextest-integration> at <unknown source file>:<unknown line>
  599. 233.31 s gammaloop-nextest-integration> 7: core[940e698046960fd5]::panicking::panic_fmt<unknown>
  600. 233.31 s gammaloop-nextest-integration> at <unknown source file>:<unknown line>
  601. 233.31 s gammaloop-nextest-integration> 8: <symjit[e408de789c333cd]::symjit::assembler::Assembler>::apply_jumps<unknown>
  602. 233.31 s gammaloop-nextest-integration> at <unknown source file>:<unknown line>
  603. 233.31 s gammaloop-nextest-integration> 9: <symjit[e408de789c333cd]::symjit::builder::Builder>::compile_from_mir::<symjit[e408de789c333cd]::symjit::amd::complex::AmdComplexGenerator><unknown>
  604. 233.31 s gammaloop-nextest-integration> at <unknown source file>:<unknown line>
  605. 233.31 s gammaloop-nextest-integration> 10: <symjit[e408de789c333cd]::symjit::runnable::Application>::compile_ty<unknown>
  606. 233.31 s gammaloop-nextest-integration> at <unknown source file>:<unknown line>
  607. 233.31 s gammaloop-nextest-integration> 11: <symjit[e408de789c333cd]::symjit::runnable::Application>::with_mir<unknown>
  608. 233.31 s gammaloop-nextest-integration> at <unknown source file>:<unknown line>
  609. 233.31 s gammaloop-nextest-integration> 12: <symjit[e408de789c333cd]::symjit::composer::DirectTranslator as symjit[e408de789c333cd]::symjit::composer::Composer>::compile<unknown>
  610. 233.31 s gammaloop-nextest-integration> at <unknown source file>:<unknown line>
  611. 233.31 s gammaloop-nextest-integration> 13: <symjit[e408de789c333cd]::symjit::compiler::Translator as symjit[e408de789c333cd]::symjit::composer::Composer>::compile<unknown>
  612. 233.31 s gammaloop-nextest-integration> at <unknown source file>:<unknown line>
  613. 233.31 s gammaloop-nextest-integration> 14: <numerica[124dab8567f4861e]::domains::float::complex::Complex<f64> as symbolica[10e259bab675d243]::evaluate::backend::JITCompiledNumber>::jit_compile<unknown>
  614. 233.31 s gammaloop-nextest-integration> at <unknown source file>:<unknown line>
  615. 233.31 s gammaloop-nextest-integration> 15: <symbolica[10e259bab675d243]::evaluate::evaluator::ExpressionEvaluator<numerica[124dab8567f4861e]::domains::float::complex::Complex<f64>>>::jit_compile<unknown>
  616. 233.31 s gammaloop-nextest-integration> at <unknown source file>:<unknown line>
  617. 233.31 s gammaloop-nextest-integration> 16: <gammalooprs[917cbd3df9e68f8f]::integrands::process::evaluators::GenericEvaluator>::activate_symjit<unknown>
  618. 233.31 s gammaloop-nextest-integration> at <unknown source file>:<unknown line>
  619. 233.31 s gammaloop-nextest-integration> 17: <gammalooprs[917cbd3df9e68f8f]::integrands::process::amplitude::AmplitudeIntegrand>::prepare_runtime_backends_after_generation_with_compile_times<unknown>
  620. 233.31 s gammaloop-nextest-integration> at <unknown source file>:<unknown line>
  621. 233.31 s gammaloop-nextest-integration> 18: <gammalooprs[917cbd3df9e68f8f]::processes::amplitude::Amplitude>::build_integrand<unknown>
  622. 233.31 s gammaloop-nextest-integration> at <unknown source file>:<unknown line>
  623. 233.31 s gammaloop-nextest-integration> 19: <gammalooprs[917cbd3df9e68f8f]::processes::process::Process>::generate_integrands<unknown>
  624. 233.31 s gammaloop-nextest-integration> at <unknown source file>:<unknown line>
  625. 233.31 s gammaloop-nextest-integration> 20: <gammaloop_api[9ebf6628f97aeb57]::state::State>::generate_integrand<unknown>
  626. 233.31 s gammaloop-nextest-integration> at <unknown source file>:<unknown line>
  627. 233.31 s gammaloop-nextest-integration> 21: <gammaloop_api[9ebf6628f97aeb57]::commands::generate::Generate>::run::<&std[bcb96dfbba0ab899]::path::PathBuf><unknown>
  628. 233.31 s gammaloop-nextest-integration> at <unknown source file>:<unknown line>
  629. 233.31 s gammaloop-nextest-integration> 22: <gammaloop_api[9ebf6628f97aeb57]::commands::Commands>::run<unknown>
  630. 233.31 s gammaloop-nextest-integration> at <unknown source file>:<unknown line>
  631. 233.31 s gammaloop-nextest-integration> 23: <gammaloop_api[9ebf6628f97aeb57]::session::CliSession>::execute_prepared<unknown>
  632. 233.31 s gammaloop-nextest-integration> at <unknown source file>:<unknown line>
  633. 233.31 s gammaloop-nextest-integration> 24: <gammaloop_api[9ebf6628f97aeb57]::session::CliSession>::execute_command<unknown>
  634. 233.31 s gammaloop-nextest-integration> at <unknown source file>:<unknown line>
  635. 233.31 s gammaloop-nextest-integration> 25: <gammaloop_integration_tests[191607b70c61cd5a]::CLIState>::run_command<unknown>
  636. 233.31 s gammaloop-nextest-integration> at <unknown source file>:<unknown line>
  637. 233.31 s gammaloop-nextest-integration> 26: test_runs[9b7e2dc2dc4f29b0]::aa_aa::generate_aa_aa_helicity_family<unknown>
  638. 233.31 s gammaloop-nextest-integration> at <unknown source file>:<unknown line>
  639. 233.31 s gammaloop-nextest-integration> 27: <test_runs[9b7e2dc2dc4f29b0]::aa_aa::important::aa_aa_local_inspect_backend_consistency::{closure#0} as core[940e698046960fd5]::ops::function::FnOnce<()>>::call_once<unknown>
  640. 233.31 s gammaloop-nextest-integration> at <unknown source file>:<unknown line>
  641. 233.31 s gammaloop-nextest-integration> 28: serial_test[cd99724524a2f1c0]::serial_code_lock::local_serial_core_with_return::<(), eyre[cb2fd339c0c40fca]::Report><unknown>
  642. 233.31 s gammaloop-nextest-integration> at <unknown source file>:<unknown line>
  643. 233.31 s gammaloop-nextest-integration> 29: <test_runs[9b7e2dc2dc4f29b0]::aa_aa::important::aa_aa_local_inspect_backend_consistency::{closure#0} as core[940e698046960fd5]::ops::function::FnOnce<()>>::call_once<unknown>
  644. 233.31 s gammaloop-nextest-integration> at <unknown source file>:<unknown line>
  645. 233.31 s gammaloop-nextest-integration> 30: test[75d6903177b1d7e9]::__rust_begin_short_backtrace::<core[940e698046960fd5]::result::Result<(), alloc[2ea6bcb46fca0c42]::string::String>, fn() -> core[940e698046960fd5]::result::Result<(), alloc[2ea6bcb46fca0c42]::string::String>><unknown>
  646. 233.31 s gammaloop-nextest-integration> at <unknown source file>:<unknown line>
  647. 233.31 s gammaloop-nextest-integration> 31: test[75d6903177b1d7e9]::run_test::{closure#0}<unknown>
  648. 233.31 s gammaloop-nextest-integration> at <unknown source file>:<unknown line>
  649. 233.31 s gammaloop-nextest-integration> 32: std[bcb96dfbba0ab899]::sys::backtrace::__rust_begin_short_backtrace::<test[75d6903177b1d7e9]::run_test::{closure#1}, ()><unknown>
  650. 233.31 s gammaloop-nextest-integration> at <unknown source file>:<unknown line>
  651. 233.31 s gammaloop-nextest-integration> 33: <std[bcb96dfbba0ab899]::thread::lifecycle::spawn_unchecked<test[75d6903177b1d7e9]::run_test::{closure#1}, ()>::{closure#1} as core[940e698046960fd5]::ops::function::FnOnce<()>>::call_once::{shim:vtable#0}<unknown>
  652. 233.31 s gammaloop-nextest-integration> at <unknown source file>:<unknown line>
  653. 233.31 s gammaloop-nextest-integration> 34: <std[bcb96dfbba0ab899]::sys::thread::unix::Thread>::new::thread_start<unknown>
  654. 233.31 s gammaloop-nextest-integration> at <unknown source file>:<unknown line>
  655. 233.31 s gammaloop-nextest-integration> 35: start_thread<unknown>
  656. 233.31 s gammaloop-nextest-integration> at <unknown source file>:<unknown line>
  657. 233.31 s gammaloop-nextest-integration> 36: __clone3<unknown>
  658. 233.31 s gammaloop-nextest-integration> at <unknown source file>:<unknown line>
  659. 233.31 s gammaloop-nextest-integration>
  660. 233.31 s gammaloop-nextest-integration> Run with COLORBT_SHOW_HIDDEN=1 environment variable to disable frame filtering.
  661. 233.31 s gammaloop-nextest-integration> Run with RUST_BACKTRACE=full to include source snippets.
  662. 233.31 s gammaloop-nextest-integration> Warning: SpanTrace capture is Unsupported.
  663. 233.31 s gammaloop-nextest-integration> Ensure that you've setup a tracing-error ErrorLayer and the semver versions are compatible
  664. 233.31 s gammaloop-nextest-integration>
  665. 233.31 s gammaloop-nextest-integration> 2. gammaloop-integration-tests::uv::thermal_sunrise_uv
  666. 233.31 s gammaloop-nextest-integration> failure: test failure with exit code 101
  667. 233.31 s gammaloop-nextest-integration> system-out
  668. 233.31 s gammaloop-nextest-integration> running 1 test
  669. 233.31 s gammaloop-nextest-integration> test thermal_sunrise_uv ... FAILED
  670. 233.31 s gammaloop-nextest-integration>
  671. 233.31 s gammaloop-nextest-integration> failures:
  672. 233.31 s gammaloop-nextest-integration>
  673. 233.31 s gammaloop-nextest-integration> failures:
  674. 233.31 s gammaloop-nextest-integration> thermal_sunrise_uv
  675. 233.31 s gammaloop-nextest-integration>
  676. 233.31 s gammaloop-nextest-integration> test result: FAILED. 0 passed; 1 failed; 0 ignored; 0 measured; 31 filtered out; finished in 2.44s
  677. 233.31 s gammaloop-nextest-integration> system-err
  678. 233.31 s gammaloop-nextest-integration> [2026-09-15 21:42:08.095] @gammaloop_api::se... INFO : Running command run generate
  679. 233.31 s gammaloop-nextest-integration> [2026-09-15 21:42:08.095] @gammaloop_api::se... INFO : Starting command block generate
  680. 233.31 s gammaloop-nextest-integration> [2026-09-15 21:42:08.096] @gammaloop_api::se... INFO : Running command import model sm-default.json
  681. 233.31 s gammaloop-nextest-integration> [2026-09-15 21:42:08.096] @import::model INFO : Loading built-in JSON model sm-default
  682. 233.31 s gammaloop-nextest-integration> [2026-09-15 21:42:08.121] @gammalooprs::model INFO : The following 15 external parameters were forced to zero by the restriction card:
  683. 233.31 s gammaloop-nextest-integration> lamWS, AWS, rhoWS, etaWS, ymc, yme, ymm, MC, Me, MM, WTau, muQ, muLe, muLmu, muLtau
  684. 233.31 s gammaloop-nextest-integration> [2026-09-15 21:42:08.121] @gammalooprs::model INFO : The following 34 vertex rules were removed by the restriction card:
  685. 233.31 s gammaloop-nextest-integration> V_82 -> (c~, d, G+) | V_83 -> (t~, d, G+) | V_84 -> (c~, s, G+) | V_85 -> (t~, s, G+) | V_86 -> (u~, b, G+) | V_87 -> (c~, b, G+) | V_90 -> (c~, d, W+) | V_91 -> (t~, d, W+) | V_92 -> (u~, s, W+) | V_94 -> (t~, s, W+) | V_95 -> (u~, b, W+) | V_96 -> (c~, b, W+) | V_101 -> (e+, e-, G0) | V_102 -> (mu+, mu-, G0) | V_104 -> (e+, e-, H) | V_105 -> (mu+, mu-, H) | V_110 -> (ve~, e-, G+) | V_111 -> (vm~, mu-, G+) | V_116 -> (b~, u, G-) | V_117 -> (d~, c, G-) | V_118 -> (s~, c, G-) | V_119 -> (b~, c, G-) | V_120 -> (d~, t, G-) | V_121 -> (s~, t, G-) | V_124 -> (s~, u, W-) | V_125 -> (b~, u, W-) | V_126 -> (d~, c, W-) | V_128 -> (b~, c, W-) | V_129 -> (d~, t, W-) | V_130 -> (s~, t, W-) | V_138 -> (c~, c, G0) | V_140 -> (c~, c, H) | V_145 -> (e+, ve, G-) | V_146 -> (mu+, vm, G-)
  686. 233.31 s gammaloop-nextest-integration> [2026-09-15 21:42:08.121] @gammalooprs::model INFO : The following 36 couplings were removed by the restriction card:
  687. 233.31 s gammaloop-nextest-integration> GC_13, GC_14, GC_16, GC_17, GC_18, GC_19, GC_20, GC_22, GC_23, GC_24, GC_25, GC_26, GC_28, GC_29, GC_42, GC_43, GC_44, GC_46, GC_47, GC_48, GC_84, GC_85, GC_86, GC_87, GC_88, GC_89, GC_90, GC_91, GC_92, GC_93, GC_101, GC_102, GC_103, GC_105, GC_106, GC_107
  688. 233.31 s gammaloop-nextest-integration> [2026-09-15 21:42:08.121] @gammaloop_api::se... INFO : Running command remove processes
  689. 233.31 s gammaloop-nextest-integration> [2026-09-15 21:42:08.121] @gammaloop_api::se... INFO : Running command generate amp {} > {} [{2}] | g u
  690. 233.31 s gammaloop-nextest-integration> --numerator-grouping group_identical_graphs_up_to_scalar_rescaling
  691. 233.31 s gammaloop-nextest-integration> --max-n-bridges 0
  692. 233.31 s gammaloop-nextest-integration> --number-of-factorized-loop-subtopologies 1 1
  693. 233.31 s gammaloop-nextest-integration> --number-of-anticommutating-loops 1 1
  694. 233.31 s gammaloop-nextest-integration> [...]
  695. 233.31 s gammaloop-nextest-integration> [2026-09-15 21:42:08.123] @feyngen::diagram_... INFO : 0s | Δ=0s | Starting Feynman graph generation with Symbolica...
  696. 233.31 s gammaloop-nextest-integration> [2026-09-15 21:42:08.123] @feyngen::diagram_... INFO : 0s | Δ=0s | Number of graphs resulting from Symbolica generation: 3
  697. 233.31 s gammaloop-nextest-integration> [2026-09-15 21:42:08.125] @feyngen::diagram_... INFO : 0s | Δ=0s | Number of graphs retained after removal of vetoed topologies: 2
  698. 233.31 s gammaloop-nextest-integration> [2026-09-15 21:42:08.125] @feyngen::diagram_... INFO : 0s | Δ=0s | Number of graphs after vertex info assignment: 2
  699. 233.31 s gammaloop-nextest-integration> [2026-09-15 21:42:08.125] @feyngen::diagram_... INFO : 0s | Δ=0s | Number of graphs after all complete graphs filters are applied: 2
  700. 233.31 s gammaloop-nextest-integration> [2026-09-15 21:42:08.125] @feyngen::diagram_... INFO : 0s | Δ=0s | Number of graphs after closed anticommutating chains analysis: 1
  701. 233.31 s gammaloop-nextest-integration> [2026-09-15 21:42:08.125] @feyngen::diagram_... INFO : 0s | Δ=0s | Number of graphs after symmetrization of external states: 1
  702. 233.31 s gammaloop-nextest-integration> [2026-09-15 21:42:08.125] @feyngen::diagram_... INFO : 0s | Δ=0s | Number of graphs after canonization of vertices, edges and flows (graph labels assigned here): 1
  703. 233.31 s gammaloop-nextest-integration> [2026-09-15 21:42:08.138] @feyngen::diagram_... INFO : 0s | Δ=0s | Number of graphs after numerator-aware grouping with strategy 'up to a scalar rescaling': 1 (1 isomorphically unique graph, 0 color zero, 0 lorentz zero, 0 grouped and 0 cancellation)
  704. 233.31 s gammaloop-nextest-integration> [2026-09-15 21:42:08.138] @feyngen::diagram_... INFO : ( Sum of the symmetry factors from each graph generated = -1/2 )
  705. 233.31 s gammaloop-nextest-integration> [2026-09-15 21:42:08.138] @commands::generate INFO : Generated amplitude 1 graphs.
  706. 233.31 s gammaloop-nextest-integration> [2026-09-15 21:42:08.138] @commands::generate INFO : Only diagram generation was requested, skipping integrand generation. You can generate integrands later using the 'generate existing <options>' command.
  707. 233.31 s gammaloop-nextest-integration> [2026-09-15 21:42:08.138] @gammaloop_api::se... INFO : Running command generate
  708. 233.31 s gammaloop-nextest-integration> The application panicked (crashed).
  709. 233.31 s gammaloop-nextest-integration> Message: label _func_power_ not found
  710. 233.31 s gammaloop-nextest-integration> Location: /nix/store/n9w914kh1cm59xx3spcs831cdyb56m32-vendor-cargo-deps/c19b7c6f923b580ac259164a89f2577984ad5ab09ee9d583b888f934adbbe8d0/symjit-2.25.6/src/symjit/assembler.rs:77
  711. 233.31 s gammaloop-nextest-integration>
  712. 233.31 s gammaloop-nextest-integration> ━━━━━━━━━━━━━━━━━━━━━━━━━━━━━━━━━━ BACKTRACE ━━━━━━━━━━━━━━━━━━━━━━━━━━━━━━━━━━━
  713. 233.31 s gammaloop-nextest-integration> 1: <color_eyre[51793ea62743adbd]::config::PanicHook>::panic_report<unknown>
  714. 233.31 s gammaloop-nextest-integration> at <unknown source file>:<unknown line>
  715. 233.31 s gammaloop-nextest-integration> 2: <color_eyre[51793ea62743adbd]::config::PanicHook>::into_panic_hook::{closure#0}<unknown>
  716. 233.31 s gammaloop-nextest-integration> at <unknown source file>:<unknown line>
  717. 233.31 s gammaloop-nextest-integration> 3: std[bcb96dfbba0ab899]::panicking::panic_with_hook<unknown>
  718. 233.31 s gammaloop-nextest-integration> at <unknown source file>:<unknown line>
  719. 233.31 s gammaloop-nextest-integration> 4: std[bcb96dfbba0ab899]::panicking::panic_handler::{closure#0}<unknown>
  720. 233.31 s gammaloop-nextest-integration> at <unknown source file>:<unknown line>
  721. 233.31 s gammaloop-nextest-integration> 5: std[bcb96dfbba0ab899]::sys::backtrace::__rust_end_short_backtrace::<std[bcb96dfbba0ab899]::panicking::panic_handler::{closure#0}, !><unknown>
  722. 233.31 s gammaloop-nextest-integration> at <unknown source file>:<unknown line>
  723. 233.31 s gammaloop-nextest-integration> 6: __rustc[6c289b9f9c454d21]::rust_begin_unwind<unknown>
  724. 233.31 s gammaloop-nextest-integration> at <unknown source file>:<unknown line>
  725. 233.31 s gammaloop-nextest-integration> 7: core[940e698046960fd5]::panicking::panic_fmt<unknown>
  726. 233.31 s gammaloop-nextest-integration> at <unknown source file>:<unknown line>
  727. 233.31 s gammaloop-nextest-integration> 8: <symjit[e408de789c333cd]::symjit::assembler::Assembler>::apply_jumps<unknown>
  728. 233.31 s gammaloop-nextest-integration> at <unknown source file>:<unknown line>
  729. 233.31 s gammaloop-nextest-integration> 9: <symjit[e408de789c333cd]::symjit::builder::Builder>::compile_from_mir::<symjit[e408de789c333cd]::symjit::amd::complex::AmdComplexGenerator><unknown>
  730. 233.31 s gammaloop-nextest-integration> at <unknown source file>:<unknown line>
  731. 233.31 s gammaloop-nextest-integration> 10: <symjit[e408de789c333cd]::symjit::runnable::Application>::compile_ty<unknown>
  732. 233.31 s gammaloop-nextest-integration> at <unknown source file>:<unknown line>
  733. 233.31 s gammaloop-nextest-integration> 11: <symjit[e408de789c333cd]::symjit::runnable::Application>::with_mir<unknown>
  734. 233.31 s gammaloop-nextest-integration> at <unknown source file>:<unknown line>
  735. 233.31 s gammaloop-nextest-integration> 12: <symjit[e408de789c333cd]::symjit::composer::DirectTranslator as symjit[e408de789c333cd]::symjit::composer::Composer>::compile<unknown>
  736. 233.31 s gammaloop-nextest-integration> at <unknown source file>:<unknown line>
  737. 233.31 s gammaloop-nextest-integration> 13: <symjit[e408de789c333cd]::symjit::compiler::Translator as symjit[e408de789c333cd]::symjit::composer::Composer>::compile<unknown>
  738. 233.31 s gammaloop-nextest-integration> at <unknown source file>:<unknown line>
  739. 233.31 s gammaloop-nextest-integration> 14: <numerica[124dab8567f4861e]::domains::float::complex::Complex<f64> as symbolica[10e259bab675d243]::evaluate::backend::JITCompiledNumber>::jit_compile<unknown>
  740. 233.31 s gammaloop-nextest-integration> at <unknown source file>:<unknown line>
  741. 233.31 s gammaloop-nextest-integration> 15: <symbolica[10e259bab675d243]::evaluate::evaluator::ExpressionEvaluator<numerica[124dab8567f4861e]::domains::float::complex::Complex<f64>>>::jit_compile<unknown>
  742. 233.31 s gammaloop-nextest-integration> at <unknown source file>:<unknown line>
  743. 233.31 s gammaloop-nextest-integration> 16: <gammalooprs[917cbd3df9e68f8f]::integrands::process::evaluators::GenericEvaluator>::activate_symjit<unknown>
  744. 233.31 s gammaloop-nextest-integration> at <unknown source file>:<unknown line>
  745. 233.31 s gammaloop-nextest-integration> 17: <gammalooprs[917cbd3df9e68f8f]::integrands::process::amplitude::AmplitudeIntegrand>::prepare_runtime_backends_after_generation_with_compile_times<unknown>
  746. 233.31 s gammaloop-nextest-integration> at <unknown source file>:<unknown line>
  747. 233.31 s gammaloop-nextest-integration> 18: <gammalooprs[917cbd3df9e68f8f]::processes::amplitude::Amplitude>::build_integrand<unknown>
  748. 233.31 s gammaloop-nextest-integration> at <unknown source file>:<unknown line>
  749. 233.31 s gammaloop-nextest-integration> 19: <gammalooprs[917cbd3df9e68f8f]::processes::process::Process>::generate_integrands<unknown>
  750. 233.31 s gammaloop-nextest-integration> at <unknown source file>:<unknown line>
  751. 233.31 s gammaloop-nextest-integration> 20: <gammalooprs[917cbd3df9e68f8f]::processes::ProcessList>::generate_integrands<unknown>
  752. 233.31 s gammaloop-nextest-integration> at <unknown source file>:<unknown line>
  753. 233.31 s gammaloop-nextest-integration> 21: <gammaloop_api[9ebf6628f97aeb57]::state::State>::generate_integrands<unknown>
  754. 233.31 s gammaloop-nextest-integration> at <unknown source file>:<unknown line>
  755. 233.31 s gammaloop-nextest-integration> 22: <gammaloop_api[9ebf6628f97aeb57]::commands::generate::Generate>::run::<&std[bcb96dfbba0ab899]::path::PathBuf><unknown>
  756. 233.31 s gammaloop-nextest-integration> at <unknown source file>:<unknown line>
  757. 233.31 s gammaloop-nextest-integration> 23: <gammaloop_api[9ebf6628f97aeb57]::commands::Commands>::run<unknown>
  758. 233.31 s gammaloop-nextest-integration> at <unknown source file>:<unknown line>
  759. 233.31 s gammaloop-nextest-integration> 24: <gammaloop_api[9ebf6628f97aeb57]::session::CliSession>::execute_prepared<unknown>
  760. 233.31 s gammaloop-nextest-integration> at <unknown source file>:<unknown line>
  761. 233.31 s gammaloop-nextest-integration> 25: <gammaloop_api[9ebf6628f97aeb57]::session::CliSession>::execute_prepared_commands<unknown>
  762. 233.31 s gammaloop-nextest-integration> at <unknown source file>:<unknown line>
  763. 233.31 s gammaloop-nextest-integration> 26: <gammaloop_api[9ebf6628f97aeb57]::session::CliSession>::execute_prepared<unknown>
  764. 233.31 s gammaloop-nextest-integration> at <unknown source file>:<unknown line>
  765. 233.31 s gammaloop-nextest-integration> 27: <gammaloop_api[9ebf6628f97aeb57]::session::CliSession>::execute_command<unknown>
  766. 233.31 s gammaloop-nextest-integration> at <unknown source file>:<unknown line>
  767. 233.31 s gammaloop-nextest-integration> 28: <gammaloop_integration_tests[191607b70c61cd5a]::CLIState>::run_command<unknown>
  768. 233.31 s gammaloop-nextest-integration> at <unknown source file>:<unknown line>
  769. 233.31 s gammaloop-nextest-integration> 29: uv[3c7454ef256d6487]::run_single_integrated_uv_case<unknown>
  770. 233.31 s gammaloop-nextest-integration> at <unknown source file>:<unknown line>
  771. 233.31 s gammaloop-nextest-integration> 30: <uv[3c7454ef256d6487]::thermal_sunrise_uv::{closure#0} as core[940e698046960fd5]::ops::function::FnOnce<()>>::call_once<unknown>
  772. 233.32 s gammaloop-nextest-integration> at <unknown source file>:<unknown line>
  773. 233.32 s gammaloop-nextest-integration> 31: test[75d6903177b1d7e9]::__rust_begin_short_backtrace::<core[940e698046960fd5]::result::Result<(), alloc[2ea6bcb46fca0c42]::string::String>, fn() -> core[940e698046960fd5]::result::Result<(), alloc[2ea6bcb46fca0c42]::string::String>><unknown>
  774. 233.32 s gammaloop-nextest-integration> at <unknown source file>:<unknown line>
  775. 233.32 s gammaloop-nextest-integration> 32: test[75d6903177b1d7e9]::run_test::{closure#0}<unknown>
  776. 233.32 s gammaloop-nextest-integration> at <unknown source file>:<unknown line>
  777. 233.32 s gammaloop-nextest-integration> 33: std[bcb96dfbba0ab899]::sys::backtrace::__rust_begin_short_backtrace::<test[75d6903177b1d7e9]::run_test::{closure#1}, ()><unknown>
  778. 233.32 s gammaloop-nextest-integration> at <unknown source file>:<unknown line>
  779. 233.32 s gammaloop-nextest-integration> 34: <std[bcb96dfbba0ab899]::thread::lifecycle::spawn_unchecked<test[75d6903177b1d7e9]::run_test::{closure#1}, ()>::{closure#1} as core[940e698046960fd5]::ops::function::FnOnce<()>>::call_once::{shim:vtable#0}<unknown>
  780. 233.32 s gammaloop-nextest-integration> at <unknown source file>:<unknown line>
  781. 233.32 s gammaloop-nextest-integration> 35: <std[bcb96dfbba0ab899]::sys::thread::unix::Thread>::new::thread_start<unknown>
  782. 233.32 s gammaloop-nextest-integration> at <unknown source file>:<unknown line>
  783. 233.32 s gammaloop-nextest-integration> 36: start_thread<unknown>
  784. 233.32 s gammaloop-nextest-integration> at <unknown source file>:<unknown line>
  785. 233.32 s gammaloop-nextest-integration> 37: __clone3<unknown>
  786. 233.32 s gammaloop-nextest-integration> at <unknown source file>:<unknown line>
  787. 233.32 s gammaloop-nextest-integration>
  788. 233.32 s gammaloop-nextest-integration> Run with COLORBT_SHOW_HIDDEN=1 environment variable to disable frame filtering.
  789. 233.32 s gammaloop-nextest-integration> Run with RUST_BACKTRACE=full to include source snippets.
  790. 233.32 s gammaloop-nextest-integration> Warning: SpanTrace capture is Unsupported.
  791. 233.32 s gammaloop-nextest-integration> Ensure that you've setup a tracing-error ErrorLayer and the semver versions are compatible
  792. 233.32 s gammaloop-nextest-integration> =========================================
  793. 233.48 s error: Cannot build '/nix/store/mzkwykiwpnc2c1k4w0h0d3936pcxgvpd-gammaloop-nextest-integration.drv'.
  794. 233.48 s Reason: builder failed with exit code 100.
  795. 233.48 s Output paths:
  796. 233.48 s /nix/store/k0617kixhfk502xp29s91hm2a8dm72mc-gammaloop-nextest-integration
  797. 233.48 s Last 767 log lines:
  798. 233.48 s > Extracting 13 binaries, 1 build script output directory, and 3 linked paths to /build/nextest-archive-hE8IUq
  799. 233.48 s > Extracted 30 files to /build/nextest-archive-hE8IUq in 2.20s
  800. 233.48 s > ------------
  801. 233.48 s > Nextest run ID f7ba2bc0-f44f-417a-b58e-b39901d3d3ca with nextest profile: ci_gammaloop
  802. 233.48 s > Starting 169 tests across 13 binaries (209 tests skipped, including 208 tests via profile.ci_gammaloop.default-filter)
  803. 233.48 s > FAIL [ 2.999s] ( 55/169) gammaloop-integration-tests::test_runs aa_aa::important::aa_aa_local_inspect_backend_consistency
  804. 233.48 s > stdout ---
  805. 233.48 s >
  806. 233.48 s > running 1 test
  807. 233.48 s > test aa_aa::important::aa_aa_local_inspect_backend_consistency ... FAILED
  808. 233.48 s >
  809. 233.48 s > failures:
  810. 233.48 s >
  811. 233.48 s > failures:
  812. 233.48 s > aa_aa::important::aa_aa_local_inspect_backend_consistency
  813. 233.48 s >
  814. 233.48 s > test result: FAILED. 0 passed; 1 failed; 0 ignored; 0 measured; 273 filtered out; finished in 2.99s
  815. 233.48 s >
  816. 233.48 s > stderr ---
  817. 233.48 s > [2026-09-15 21:41:25.843] @gammaloop_api::se... INFO : Running command import model sm-default.json
  818. 233.48 s > [2026-09-15 21:41:25.843] @import::model INFO : Loading built-in JSON model sm-default
  819. 233.48 s > [2026-09-15 21:41:25.868] @gammalooprs::model INFO : The following 15 external parameters were forced to zero by the restriction card:
  820. 233.48 s > lamWS, AWS, rhoWS, etaWS, ymc, yme, ymm, MC, Me, MM, WTau, muQ, muLe, muLmu, muLtau
  821. 233.48 s > [2026-09-15 21:41:25.868] @gammalooprs::model INFO : The following 34 vertex rules were removed by the restriction card:
  822. 233.48 s > V_82 -> (c~, d, G+) | V_83 -> (t~, d, G+) | V_84 -> (c~, s, G+) | V_85 -> (t~, s, G+) | V_86 -> (u~, b, G+) | V_87 -> (c~, b, G+) | V_90 -> (c~, d, W+) | V_91 -> (t~, d, W+) | V_92 -> (u~, s, W+) | V_94 -> (t~, s, W+) | V_95 -> (u~, b, W+) | V_96 -> (c~, b, W+) | V_101 -> (e+, e-, G0) | V_102 -> (mu+, mu-, G0) | V_104 -> (e+, e-, H) | V_105 -> (mu+, mu-, H) | V_110 -> (ve~, e-, G+) | V_111 -> (vm~, mu-, G+) | V_116 -> (b~, u, G-) | V_117 -> (d~, c, G-) | V_118 -> (s~, c, G-) | V_119 -> (b~, c, G-) | V_120 -> (d~, t, G-) | V_121 -> (s~, t, G-) | V_124 -> (s~, u, W-) | V_125 -> (b~, u, W-) | V_126 -> (d~, c, W-) | V_128 -> (b~, c, W-) | V_129 -> (d~, t, W-) | V_130 -> (s~, t, W-) | V_138 -> (c~, c, G0) | V_140 -> (c~, c, H) | V_145 -> (e+, ve, G-) | V_146 -> (mu+, vm, G-)
  823. 233.48 s > [2026-09-15 21:41:25.868] @gammalooprs::model INFO : The following 36 couplings were removed by the restriction card:
  824. 233.48 s > GC_13, GC_14, GC_16, GC_17, GC_18, GC_19, GC_20, GC_22, GC_23, GC_24, GC_25, GC_26, GC_28, GC_29, GC_42, GC_43, GC_44, GC_46, GC_47, GC_48, GC_84, GC_85, GC_86, GC_87, GC_88, GC_89, GC_90, GC_91, GC_92, GC_93, GC_101, GC_102, GC_103, GC_105, GC_106, GC_107
  825. 233.48 s > [2026-09-15 21:41:25.868] @gammaloop_api::se... INFO : Running command run set_model_parameters
  826. 233.48 s > [2026-09-15 21:41:25.868] @gammaloop_api::se... INFO : Starting command block set_model_parameters
  827. 233.48 s > [2026-09-15 21:41:25.869] @gammaloop_api::se... INFO : Running command set model MT=173.0
  828. 233.48 s > [2026-09-15 21:41:25.873] @gammaloop_api::se... INFO : Running command set model WT=0.0
  829. 233.48 s > [2026-09-15 21:41:25.877] @gammaloop_api::se... INFO : Running command set model ymt=173.0
  830. 233.48 s > [2026-09-15 21:41:25.881] @gammaloop_api::se... INFO : Running command set model aS=0.118
  831. 233.48 s > [2026-09-15 21:41:25.886] @gammaloop_api::se... INFO : Running command set model aEWM1=137.036
  832. 233.48 s > [2026-09-15 21:41:25.891] @gammaloop_api::se... INFO : Running command set model Gf=1.166390e-05
  833. 233.48 s > [2026-09-15 21:41:25.896] @gammaloop_api::se... INFO : Running command set model MZ=91.188
  834. 233.48 s > [2026-09-15 21:41:25.901] @gammaloop_api::se... INFO : Running command set global string '
  835. 233.48 s > [global.generation.compile]
  836. 233.48 s > compilation_mode = "symjit"
  837. 233.48 s > optimization_level = "O0"
  838. 233.48 s > fast_math = false
  839. 233.48 s > [...]
  840. 233.48 s > [2026-09-15 21:41:25.902] @gammaloop_api::se... INFO : Running command import graphs ./examples/cli/aa_aa/1L/aa_aa_1L.dot -p aa_aa_all_helicities -i 1L_ppmm -o
  841. 233.48 s > [2026-09-15 21:41:25.902] @commands::import INFO : Loading graphs from '/build/source/examples/cli/aa_aa/1L/aa_aa_1L.dot'
  842. 233.48 s > [2026-09-15 21:41:25.911] @gammaloop_api::se... INFO : Running command generate existing -p aa_aa_all_helicities
  843. 233.48 s > The application panicked (crashed).
  844. 233.48 s > Message: label _func_power_ not found
  845. 233.48 s > Location: /nix/store/n9w914kh1cm59xx3spcs831cdyb56m32-vendor-cargo-deps/c19b7c6f923b580ac259164a89f2577984ad5ab09ee9d583b888f934adbbe8d0/symjit-2.25.6/src/symjit/assembler.rs:77
  846. 233.48 s >
  847. 233.48 s > ━━━━━━━━━━━━━━━━━━━━━━━━━━━━━━━━━━ BACKTRACE ━━━━━━━━━━━━━━━━━━━━━━━━━━━━━━━━━━━
  848. 233.48 s > 1: <color_eyre[51793ea62743adbd]::config::PanicHook>::panic_report<unknown>
  849. 233.48 s > at <unknown source file>:<unknown line>
  850. 233.48 s > 2: <color_eyre[51793ea62743adbd]::config::PanicHook>::into_panic_hook::{closure#0}<unknown>
  851. 233.48 s > at <unknown source file>:<unknown line>
  852. 233.48 s > 3: std[bcb96dfbba0ab899]::panicking::panic_with_hook<unknown>
  853. 233.48 s > at <unknown source file>:<unknown line>
  854. 233.48 s > 4: std[bcb96dfbba0ab899]::panicking::panic_handler::{closure#0}<unknown>
  855. 233.48 s > at <unknown source file>:<unknown line>
  856. 233.48 s > 5: std[bcb96dfbba0ab899]::sys::backtrace::__rust_end_short_backtrace::<std[bcb96dfbba0ab899]::panicking::panic_handler::{closure#0}, !><unknown>
  857. 233.48 s > at <unknown source file>:<unknown line>
  858. 233.48 s > 6: __rustc[6c289b9f9c454d21]::rust_begin_unwind<unknown>
  859. 233.48 s > at <unknown source file>:<unknown line>
  860. 233.48 s > 7: core[940e698046960fd5]::panicking::panic_fmt<unknown>
  861. 233.48 s > at <unknown source file>:<unknown line>
  862. 233.48 s > 8: <symjit[e408de789c333cd]::symjit::assembler::Assembler>::apply_jumps<unknown>
  863. 233.48 s > at <unknown source file>:<unknown line>
  864. 233.48 s > 9: <symjit[e408de789c333cd]::symjit::builder::Builder>::compile_from_mir::<symjit[e408de789c333cd]::symjit::amd::complex::AmdComplexGenerator><unknown>
  865. 233.48 s > at <unknown source file>:<unknown line>
  866. 233.48 s > 10: <symjit[e408de789c333cd]::symjit::runnable::Application>::compile_ty<unknown>
  867. 233.48 s > at <unknown source file>:<unknown line>
  868. 233.48 s > 11: <symjit[e408de789c333cd]::symjit::runnable::Application>::with_mir<unknown>
  869. 233.48 s > at <unknown source file>:<unknown line>
  870. 233.48 s > 12: <symjit[e408de789c333cd]::symjit::composer::DirectTranslator as symjit[e408de789c333cd]::symjit::composer::Composer>::compile<unknown>
  871. 233.48 s > at <unknown source file>:<unknown line>
  872. 233.48 s > 13: <symjit[e408de789c333cd]::symjit::compiler::Translator as symjit[e408de789c333cd]::symjit::composer::Composer>::compile<unknown>
  873. 233.48 s > at <unknown source file>:<unknown line>
  874. 233.48 s > 14: <numerica[124dab8567f4861e]::domains::float::complex::Complex<f64> as symbolica[10e259bab675d243]::evaluate::backend::JITCompiledNumber>::jit_compile<unknown>
  875. 233.48 s > at <unknown source file>:<unknown line>
  876. 233.48 s > 15: <symbolica[10e259bab675d243]::evaluate::evaluator::ExpressionEvaluator<numerica[124dab8567f4861e]::domains::float::complex::Complex<f64>>>::jit_compile<unknown>
  877. 233.48 s > at <unknown source file>:<unknown line>
  878. 233.48 s > 16: <gammalooprs[917cbd3df9e68f8f]::integrands::process::evaluators::GenericEvaluator>::activate_symjit<unknown>
  879. 233.48 s > at <unknown source file>:<unknown line>
  880. 233.48 s > 17: <gammalooprs[917cbd3df9e68f8f]::integrands::process::amplitude::AmplitudeIntegrand>::prepare_runtime_backends_after_generation_with_compile_times<unknown>
  881. 233.48 s > at <unknown source file>:<unknown line>
  882. 233.48 s > 18: <gammalooprs[917cbd3df9e68f8f]::processes::amplitude::Amplitude>::build_integrand<unknown>
  883. 233.48 s > at <unknown source file>:<unknown line>
  884. 233.48 s > 19: <gammalooprs[917cbd3df9e68f8f]::processes::process::Process>::generate_integrands<unknown>
  885. 233.48 s > at <unknown source file>:<unknown line>
  886. 233.48 s > 20: <gammaloop_api[9ebf6628f97aeb57]::state::State>::generate_integrand<unknown>
  887. 233.48 s > at <unknown source file>:<unknown line>
  888. 233.48 s > 21: <gammaloop_api[9ebf6628f97aeb57]::commands::generate::Generate>::run::<&std[bcb96dfbba0ab899]::path::PathBuf><unknown>
  889. 233.48 s > at <unknown source file>:<unknown line>
  890. 233.48 s > 22: <gammaloop_api[9ebf6628f97aeb57]::commands::Commands>::run<unknown>
  891. 233.48 s > at <unknown source file>:<unknown line>
  892. 233.48 s > 23: <gammaloop_api[9ebf6628f97aeb57]::session::CliSession>::execute_prepared<unknown>
  893. 233.48 s > at <unknown source file>:<unknown line>
  894. 233.48 s > 24: <gammaloop_api[9ebf6628f97aeb57]::session::CliSession>::execute_command<unknown>
  895. 233.48 s > at <unknown source file>:<unknown line>
  896. 233.48 s > 25: <gammaloop_integration_tests[191607b70c61cd5a]::CLIState>::run_command<unknown>
  897. 233.48 s > at <unknown source file>:<unknown line>
  898. 233.48 s > 26: test_runs[9b7e2dc2dc4f29b0]::aa_aa::generate_aa_aa_helicity_family<unknown>
  899. 233.48 s > at <unknown source file>:<unknown line>
  900. 233.48 s > 27: <test_runs[9b7e2dc2dc4f29b0]::aa_aa::important::aa_aa_local_inspect_backend_consistency::{closure#0} as core[940e698046960fd5]::ops::function::FnOnce<()>>::call_once<unknown>
  901. 233.48 s > at <unknown source file>:<unknown line>
  902. 233.48 s > 28: serial_test[cd99724524a2f1c0]::serial_code_lock::local_serial_core_with_return::<(), eyre[cb2fd339c0c40fca]::Report><unknown>
  903. 233.48 s > at <unknown source file>:<unknown line>
  904. 233.48 s > 29: <test_runs[9b7e2dc2dc4f29b0]::aa_aa::important::aa_aa_local_inspect_backend_consistency::{closure#0} as core[940e698046960fd5]::ops::function::FnOnce<()>>::call_once<unknown>
  905. 233.48 s > at <unknown source file>:<unknown line>
  906. 233.48 s > 30: test[75d6903177b1d7e9]::__rust_begin_short_backtrace::<core[940e698046960fd5]::result::Result<(), alloc[2ea6bcb46fca0c42]::string::String>, fn() -> core[940e698046960fd5]::result::Result<(), alloc[2ea6bcb46fca0c42]::string::String>><unknown>
  907. 233.48 s > at <unknown source file>:<unknown line>
  908. 233.48 s > 31: test[75d6903177b1d7e9]::run_test::{closure#0}<unknown>
  909. 233.48 s > at <unknown source file>:<unknown line>
  910. 233.48 s > 32: std[bcb96dfbba0ab899]::sys::backtrace::__rust_begin_short_backtrace::<test[75d6903177b1d7e9]::run_test::{closure#1}, ()><unknown>
  911. 233.48 s > at <unknown source file>:<unknown line>
  912. 233.48 s > 33: <std[bcb96dfbba0ab899]::thread::lifecycle::spawn_unchecked<test[75d6903177b1d7e9]::run_test::{closure#1}, ()>::{closure#1} as core[940e698046960fd5]::ops::function::FnOnce<()>>::call_once::{shim:vtable#0}<unknown>
  913. 233.48 s > at <unknown source file>:<unknown line>
  914. 233.48 s > 34: <std[bcb96dfbba0ab899]::sys::thread::unix::Thread>::new::thread_start<unknown>
  915. 233.48 s > at <unknown source file>:<unknown line>
  916. 233.48 s > 35: start_thread<unknown>
  917. 233.48 s > at <unknown source file>:<unknown line>
  918. 233.48 s > 36: __clone3<unknown>
  919. 233.48 s > at <unknown source file>:<unknown line>
  920. 233.48 s >
  921. 233.48 s > Run with COLORBT_SHOW_HIDDEN=1 environment variable to disable frame filtering.
  922. 233.48 s > Run with RUST_BACKTRACE=full to include source snippets.
  923. 233.48 s > Warning: SpanTrace capture is Unsupported.
  924. 233.48 s > Ensure that you've setup a tracing-error ErrorLayer and the semver versions are compatible
  925. 233.48 s >
  926. 233.48 s > FAIL [ 2.454s] (157/169) gammaloop-integration-tests::uv thermal_sunrise_uv
  927. 233.48 s > stdout ---
  928. 233.48 s >
  929. 233.48 s > running 1 test
  930. 233.48 s > test thermal_sunrise_uv ... FAILED
  931. 233.48 s >
  932. 233.48 s > failures:
  933. 233.48 s >
  934. 233.48 s > failures:
  935. 233.48 s > thermal_sunrise_uv
  936. 233.48 s >
  937. 233.48 s > test result: FAILED. 0 passed; 1 failed; 0 ignored; 0 measured; 31 filtered out; finished in 2.44s
  938. 233.48 s >
  939. 233.48 s > stderr ---
  940. 233.48 s > [2026-09-15 21:42:08.095] @gammaloop_api::se... INFO : Running command run generate
  941. 233.48 s > [2026-09-15 21:42:08.095] @gammaloop_api::se... INFO : Starting command block generate
  942. 233.48 s > [2026-09-15 21:42:08.096] @gammaloop_api::se... INFO : Running command import model sm-default.json
  943. 233.48 s > [2026-09-15 21:42:08.096] @import::model INFO : Loading built-in JSON model sm-default
  944. 233.48 s > [2026-09-15 21:42:08.121] @gammalooprs::model INFO : The following 15 external parameters were forced to zero by the restriction card:
  945. 233.48 s > lamWS, AWS, rhoWS, etaWS, ymc, yme, ymm, MC, Me, MM, WTau, muQ, muLe, muLmu, muLtau
  946. 233.48 s > [2026-09-15 21:42:08.121] @gammalooprs::model INFO : The following 34 vertex rules were removed by the restriction card:
  947. 233.48 s > V_82 -> (c~, d, G+) | V_83 -> (t~, d, G+) | V_84 -> (c~, s, G+) | V_85 -> (t~, s, G+) | V_86 -> (u~, b, G+) | V_87 -> (c~, b, G+) | V_90 -> (c~, d, W+) | V_91 -> (t~, d, W+) | V_92 -> (u~, s, W+) | V_94 -> (t~, s, W+) | V_95 -> (u~, b, W+) | V_96 -> (c~, b, W+) | V_101 -> (e+, e-, G0) | V_102 -> (mu+, mu-, G0) | V_104 -> (e+, e-, H) | V_105 -> (mu+, mu-, H) | V_110 -> (ve~, e-, G+) | V_111 -> (vm~, mu-, G+) | V_116 -> (b~, u, G-) | V_117 -> (d~, c, G-) | V_118 -> (s~, c, G-) | V_119 -> (b~, c, G-) | V_120 -> (d~, t, G-) | V_121 -> (s~, t, G-) | V_124 -> (s~, u, W-) | V_125 -> (b~, u, W-) | V_126 -> (d~, c, W-) | V_128 -> (b~, c, W-) | V_129 -> (d~, t, W-) | V_130 -> (s~, t, W-) | V_138 -> (c~, c, G0) | V_140 -> (c~, c, H) | V_145 -> (e+, ve, G-) | V_146 -> (mu+, vm, G-)
  948. 233.48 s > [2026-09-15 21:42:08.121] @gammalooprs::model INFO : The following 36 couplings were removed by the restriction card:
  949. 233.48 s > GC_13, GC_14, GC_16, GC_17, GC_18, GC_19, GC_20, GC_22, GC_23, GC_24, GC_25, GC_26, GC_28, GC_29, GC_42, GC_43, GC_44, GC_46, GC_47, GC_48, GC_84, GC_85, GC_86, GC_87, GC_88, GC_89, GC_90, GC_91, GC_92, GC_93, GC_101, GC_102, GC_103, GC_105, GC_106, GC_107
  950. 233.48 s > [2026-09-15 21:42:08.121] @gammaloop_api::se... INFO : Running command remove processes
  951. 233.48 s > [2026-09-15 21:42:08.121] @gammaloop_api::se... INFO : Running command generate amp {} > {} [{2}] | g u
  952. 233.48 s > --numerator-grouping group_identical_graphs_up_to_scalar_rescaling
  953. 233.48 s > --max-n-bridges 0
  954. 233.48 s > --number-of-factorized-loop-subtopologies 1 1
  955. 233.48 s > --number-of-anticommutating-loops 1 1
  956. 233.48 s > [...]
  957. 233.48 s > [2026-09-15 21:42:08.123] @feyngen::diagram_... INFO : 0s | Δ=0s | Starting Feynman graph generation with Symbolica...
  958. 233.48 s > [2026-09-15 21:42:08.123] @feyngen::diagram_... INFO : 0s | Δ=0s | Number of graphs resulting from Symbolica generation: 3
  959. 233.48 s > [2026-09-15 21:42:08.125] @feyngen::diagram_... INFO : 0s | Δ=0s | Number of graphs retained after removal of vetoed topologies: 2
  960. 233.48 s > [2026-09-15 21:42:08.125] @feyngen::diagram_... INFO : 0s | Δ=0s | Number of graphs after vertex info assignment: 2
  961. 233.48 s > [2026-09-15 21:42:08.125] @feyngen::diagram_... INFO : 0s | Δ=0s | Number of graphs after all complete graphs filters are applied: 2
  962. 233.48 s > [2026-09-15 21:42:08.125] @feyngen::diagram_... INFO : 0s | Δ=0s | Number of graphs after closed anticommutating chains analysis: 1
  963. 233.48 s > [2026-09-15 21:42:08.125] @feyngen::diagram_... INFO : 0s | Δ=0s | Number of graphs after symmetrization of external states: 1
  964. 233.48 s > [2026-09-15 21:42:08.125] @feyngen::diagram_... INFO : 0s | Δ=0s | Number of graphs after canonization of vertices, edges and flows (graph labels assigned here): 1
  965. 233.48 s > [2026-09-15 21:42:08.138] @feyngen::diagram_... INFO : 0s | Δ=0s | Number of graphs after numerator-aware grouping with strategy 'up to a scalar rescaling': 1 (1 isomorphically unique graph, 0 color zero, 0 lorentz zero, 0 grouped and 0 cancellation)
  966. 233.48 s > [2026-09-15 21:42:08.138] @feyngen::diagram_... INFO : ( Sum of the symmetry factors from each graph generated = -1/2 )
  967. 233.48 s > [2026-09-15 21:42:08.138] @commands::generate INFO : Generated amplitude 1 graphs.
  968. 233.48 s > [2026-09-15 21:42:08.138] @commands::generate INFO : Only diagram generation was requested, skipping integrand generation. You can generate integrands later using the 'generate existing <options>' command.
  969. 233.48 s > [2026-09-15 21:42:08.138] @gammaloop_api::se... INFO : Running command generate
  970. 233.48 s > The application panicked (crashed).
  971. 233.48 s > Message: label _func_power_ not found
  972. 233.48 s > Location: /nix/store/n9w914kh1cm59xx3spcs831cdyb56m32-vendor-cargo-deps/c19b7c6f923b580ac259164a89f2577984ad5ab09ee9d583b888f934adbbe8d0/symjit-2.25.6/src/symjit/assembler.rs:77
  973. 233.48 s >
  974. 233.48 s > ━━━━━━━━━━━━━━━━━━━━━━━━━━━━━━━━━━ BACKTRACE ━━━━━━━━━━━━━━━━━━━━━━━━━━━━━━━━━━━
  975. 233.48 s > 1: <color_eyre[51793ea62743adbd]::config::PanicHook>::panic_report<unknown>
  976. 233.48 s > at <unknown source file>:<unknown line>
  977. 233.48 s > 2: <color_eyre[51793ea62743adbd]::config::PanicHook>::into_panic_hook::{closure#0}<unknown>
  978. 233.48 s > at <unknown source file>:<unknown line>
  979. 233.48 s > 3: std[bcb96dfbba0ab899]::panicking::panic_with_hook<unknown>
  980. 233.48 s > at <unknown source file>:<unknown line>
  981. 233.48 s > 4: std[bcb96dfbba0ab899]::panicking::panic_handler::{closure#0}<unknown>
  982. 233.48 s > at <unknown source file>:<unknown line>
  983. 233.48 s > 5: std[bcb96dfbba0ab899]::sys::backtrace::__rust_end_short_backtrace::<std[bcb96dfbba0ab899]::panicking::panic_handler::{closure#0}, !><unknown>
  984. 233.48 s > at <unknown source file>:<unknown line>
  985. 233.48 s > 6: __rustc[6c289b9f9c454d21]::rust_begin_unwind<unknown>
  986. 233.48 s > at <unknown source file>:<unknown line>
  987. 233.48 s > 7: core[940e698046960fd5]::panicking::panic_fmt<unknown>
  988. 233.48 s > at <unknown source file>:<unknown line>
  989. 233.48 s > 8: <symjit[e408de789c333cd]::symjit::assembler::Assembler>::apply_jumps<unknown>
  990. 233.48 s > at <unknown source file>:<unknown line>
  991. 233.48 s > 9: <symjit[e408de789c333cd]::symjit::builder::Builder>::compile_from_mir::<symjit[e408de789c333cd]::symjit::amd::complex::AmdComplexGenerator><unknown>
  992. 233.48 s > at <unknown source file>:<unknown line>
  993. 233.48 s > 10: <symjit[e408de789c333cd]::symjit::runnable::Application>::compile_ty<unknown>
  994. 233.48 s > at <unknown source file>:<unknown line>
  995. 233.48 s > 11: <symjit[e408de789c333cd]::symjit::runnable::Application>::with_mir<unknown>
  996. 233.48 s > at <unknown source file>:<unknown line>
  997. 233.48 s > 12: <symjit[e408de789c333cd]::symjit::composer::DirectTranslator as symjit[e408de789c333cd]::symjit::composer::Composer>::compile<unknown>
  998. 233.48 s > at <unknown source file>:<unknown line>
  999. 233.48 s > 13: <symjit[e408de789c333cd]::symjit::compiler::Translator as symjit[e408de789c333cd]::symjit::composer::Composer>::compile<unknown>
  1000. 233.48 s > at <unknown source file>:<unknown line>
  1001. 233.48 s > 14: <numerica[124dab8567f4861e]::domains::float::complex::Complex<f64> as symbolica[10e259bab675d243]::evaluate::backend::JITCompiledNumber>::jit_compile<unknown>
  1002. 233.48 s > at <unknown source file>:<unknown line>
  1003. 233.48 s > 15: <symbolica[10e259bab675d243]::evaluate::evaluator::ExpressionEvaluator<numerica[124dab8567f4861e]::domains::float::complex::Complex<f64>>>::jit_compile<unknown>
  1004. 233.48 s > at <unknown source file>:<unknown line>
  1005. 233.48 s > 16: <gammalooprs[917cbd3df9e68f8f]::integrands::process::evaluators::GenericEvaluator>::activate_symjit<unknown>
  1006. 233.48 s > at <unknown source file>:<unknown line>
  1007. 233.48 s > 17: <gammalooprs[917cbd3df9e68f8f]::integrands::process::amplitude::AmplitudeIntegrand>::prepare_runtime_backends_after_generation_with_compile_times<unknown>
  1008. 233.48 s > at <unknown source file>:<unknown line>
  1009. 233.48 s > 18: <gammalooprs[917cbd3df9e68f8f]::processes::amplitude::Amplitude>::build_integrand<unknown>
  1010. 233.48 s > at <unknown source file>:<unknown line>
  1011. 233.48 s > 19: <gammalooprs[917cbd3df9e68f8f]::processes::process::Process>::generate_integrands<unknown>
  1012. 233.48 s > at <unknown source file>:<unknown line>
  1013. 233.48 s > 20: <gammalooprs[917cbd3df9e68f8f]::processes::ProcessList>::generate_integrands<unknown>
  1014. 233.48 s > at <unknown source file>:<unknown line>
  1015. 233.48 s > 21: <gammaloop_api[9ebf6628f97aeb57]::state::State>::generate_integrands<unknown>
  1016. 233.48 s > at <unknown source file>:<unknown line>
  1017. 233.48 s > 22: <gammaloop_api[9ebf6628f97aeb57]::commands::generate::Generate>::run::<&std[bcb96dfbba0ab899]::path::PathBuf><unknown>
  1018. 233.48 s > at <unknown source file>:<unknown line>
  1019. 233.48 s > 23: <gammaloop_api[9ebf6628f97aeb57]::commands::Commands>::run<unknown>
  1020. 233.48 s > at <unknown source file>:<unknown line>
  1021. 233.48 s > 24: <gammaloop_api[9ebf6628f97aeb57]::session::CliSession>::execute_prepared<unknown>
  1022. 233.48 s > at <unknown source file>:<unknown line>
  1023. 233.48 s > 25: <gammaloop_api[9ebf6628f97aeb57]::session::CliSession>::execute_prepared_commands<unknown>
  1024. 233.48 s > at <unknown source file>:<unknown line>
  1025. 233.48 s > 26: <gammaloop_api[9ebf6628f97aeb57]::session::CliSession>::execute_prepared<unknown>
  1026. 233.48 s > at <unknown source file>:<unknown line>
  1027. 233.48 s > 27: <gammaloop_api[9ebf6628f97aeb57]::session::CliSession>::execute_command<unknown>
  1028. 233.48 s > at <unknown source file>:<unknown line>
  1029. 233.48 s > 28: <gammaloop_integration_tests[191607b70c61cd5a]::CLIState>::run_command<unknown>
  1030. 233.48 s > at <unknown source file>:<unknown line>
  1031. 233.48 s > 29: uv[3c7454ef256d6487]::run_single_integrated_uv_case<unknown>
  1032. 233.48 s > at <unknown source file>:<unknown line>
  1033. 233.48 s > 30: <uv[3c7454ef256d6487]::thermal_sunrise_uv::{closure#0} as core[940e698046960fd5]::ops::function::FnOnce<()>>::call_once<unknown>
  1034. 233.48 s > at <unknown source file>:<unknown line>
  1035. 233.48 s > 31: test[75d6903177b1d7e9]::__rust_begin_short_backtrace::<core[940e698046960fd5]::result::Result<(), alloc[2ea6bcb46fca0c42]::string::String>, fn() -> core[940e698046960fd5]::result::Result<(), alloc[2ea6bcb46fca0c42]::string::String>><unknown>
  1036. 233.48 s > at <unknown source file>:<unknown line>
  1037. 233.48 s > 32: test[75d6903177b1d7e9]::run_test::{closure#0}<unknown>
  1038. 233.48 s > at <unknown source file>:<unknown line>
  1039. 233.48 s > 33: std[bcb96dfbba0ab899]::sys::backtrace::__rust_begin_short_backtrace::<test[75d6903177b1d7e9]::run_test::{closure#1}, ()><unknown>
  1040. 233.48 s > at <unknown source file>:<unknown line>
  1041. 233.48 s > 34: <std[bcb96dfbba0ab899]::thread::lifecycle::spawn_unchecked<test[75d6903177b1d7e9]::run_test::{closure#1}, ()>::{closure#1} as core[940e698046960fd5]::ops::function::FnOnce<()>>::call_once::{shim:vtable#0}<unknown>
  1042. 233.48 s > at <unknown source file>:<unknown line>
  1043. 233.48 s > 35: <std[bcb96dfbba0ab899]::sys::thread::unix::Thread>::new::thread_start<unknown>
  1044. 233.48 s > at <unknown source file>:<unknown line>
  1045. 233.48 s > 36: start_thread<unknown>
  1046. 233.48 s > at <unknown source file>:<unknown line>
  1047. 233.48 s > 37: __clone3<unknown>
  1048. 233.48 s > at <unknown source file>:<unknown line>
  1049. 233.48 s >
  1050. 233.48 s > Run with COLORBT_SHOW_HIDDEN=1 environment variable to disable frame filtering.
  1051. 233.48 s > Run with RUST_BACKTRACE=full to include source snippets.
  1052. 233.48 s > Warning: SpanTrace capture is Unsupported.
  1053. 233.48 s > Ensure that you've setup a tracing-error ErrorLayer and the semver versions are compatible
  1054. 233.48 s >
  1055. 233.48 s > ------------
  1056. 233.48 s > Summary [ 200.826s] 169 tests run: 167 passed, 2 failed, 209 skipped
  1057. 233.48 s > FAIL [ 2.999s] ( 55/169) gammaloop-integration-tests::test_runs aa_aa::important::aa_aa_local_inspect_backend_consistency
  1058. 233.48 s > stdout ---
  1059. 233.48 s >
  1060. 233.48 s > running 1 test
  1061. 233.48 s > test aa_aa::important::aa_aa_local_inspect_backend_consistency ... FAILED
  1062. 233.48 s >
  1063. 233.48 s > failures:
  1064. 233.48 s >
  1065. 233.48 s > failures:
  1066. 233.48 s > aa_aa::important::aa_aa_local_inspect_backend_consistency
  1067. 233.48 s >
  1068. 233.48 s > test result: FAILED. 0 passed; 1 failed; 0 ignored; 0 measured; 273 filtered out; finished in 2.99s
  1069. 233.48 s >
  1070. 233.48 s > stderr ---
  1071. 233.48 s > [2026-09-15 21:41:25.843] @gammaloop_api::se... INFO : Running command import model sm-default.json
  1072. 233.48 s > [2026-09-15 21:41:25.843] @import::model INFO : Loading built-in JSON model sm-default
  1073. 233.48 s > [2026-09-15 21:41:25.868] @gammalooprs::model INFO : The following 15 external parameters were forced to zero by the restriction card:
  1074. 233.48 s > lamWS, AWS, rhoWS, etaWS, ymc, yme, ymm, MC, Me, MM, WTau, muQ, muLe, muLmu, muLtau
  1075. 233.48 s > [2026-09-15 21:41:25.868] @gammalooprs::model INFO : The following 34 vertex rules were removed by the restriction card:
  1076. 233.48 s > V_82 -> (c~, d, G+) | V_83 -> (t~, d, G+) | V_84 -> (c~, s, G+) | V_85 -> (t~, s, G+) | V_86 -> (u~, b, G+) | V_87 -> (c~, b, G+) | V_90 -> (c~, d, W+) | V_91 -> (t~, d, W+) | V_92 -> (u~, s, W+) | V_94 -> (t~, s, W+) | V_95 -> (u~, b, W+) | V_96 -> (c~, b, W+) | V_101 -> (e+, e-, G0) | V_102 -> (mu+, mu-, G0) | V_104 -> (e+, e-, H) | V_105 -> (mu+, mu-, H) | V_110 -> (ve~, e-, G+) | V_111 -> (vm~, mu-, G+) | V_116 -> (b~, u, G-) | V_117 -> (d~, c, G-) | V_118 -> (s~, c, G-) | V_119 -> (b~, c, G-) | V_120 -> (d~, t, G-) | V_121 -> (s~, t, G-) | V_124 -> (s~, u, W-) | V_125 -> (b~, u, W-) | V_126 -> (d~, c, W-) | V_128 -> (b~, c, W-) | V_129 -> (d~, t, W-) | V_130 -> (s~, t, W-) | V_138 -> (c~, c, G0) | V_140 -> (c~, c, H) | V_145 -> (e+, ve, G-) | V_146 -> (mu+, vm, G-)
  1077. 233.48 s > [2026-09-15 21:41:25.868] @gammalooprs::model INFO : The following 36 couplings were removed by the restriction card:
  1078. 233.48 s > GC_13, GC_14, GC_16, GC_17, GC_18, GC_19, GC_20, GC_22, GC_23, GC_24, GC_25, GC_26, GC_28, GC_29, GC_42, GC_43, GC_44, GC_46, GC_47, GC_48, GC_84, GC_85, GC_86, GC_87, GC_88, GC_89, GC_90, GC_91, GC_92, GC_93, GC_101, GC_102, GC_103, GC_105, GC_106, GC_107
  1079. 233.48 s > [2026-09-15 21:41:25.868] @gammaloop_api::se... INFO : Running command run set_model_parameters
  1080. 233.48 s > [2026-09-15 21:41:25.868] @gammaloop_api::se... INFO : Starting command block set_model_parameters
  1081. 233.48 s > [2026-09-15 21:41:25.869] @gammaloop_api::se... INFO : Running command set model MT=173.0
  1082. 233.48 s > [2026-09-15 21:41:25.873] @gammaloop_api::se... INFO : Running command set model WT=0.0
  1083. 233.48 s > [2026-09-15 21:41:25.877] @gammaloop_api::se... INFO : Running command set model ymt=173.0
  1084. 233.48 s > [2026-09-15 21:41:25.881] @gammaloop_api::se... INFO : Running command set model aS=0.118
  1085. 233.48 s > [2026-09-15 21:41:25.886] @gammaloop_api::se... INFO : Running command set model aEWM1=137.036
  1086. 233.48 s > [2026-09-15 21:41:25.891] @gammaloop_api::se... INFO : Running command set model Gf=1.166390e-05
  1087. 233.48 s > [2026-09-15 21:41:25.896] @gammaloop_api::se... INFO : Running command set model MZ=91.188
  1088. 233.48 s > [2026-09-15 21:41:25.901] @gammaloop_api::se... INFO : Running command set global string '
  1089. 233.48 s > [global.generation.compile]
  1090. 233.48 s > compilation_mode = "symjit"
  1091. 233.48 s > optimization_level = "O0"
  1092. 233.48 s > fast_math = false
  1093. 233.48 s > [...]
  1094. 233.48 s > [2026-09-15 21:41:25.902] @gammaloop_api::se... INFO : Running command import graphs ./examples/cli/aa_aa/1L/aa_aa_1L.dot -p aa_aa_all_helicities -i 1L_ppmm -o
  1095. 233.48 s > [2026-09-15 21:41:25.902] @commands::import INFO : Loading graphs from '/build/source/examples/cli/aa_aa/1L/aa_aa_1L.dot'
  1096. 233.48 s > [2026-09-15 21:41:25.911] @gammaloop_api::se... INFO : Running command generate existing -p aa_aa_all_helicities
  1097. 233.48 s > The application panicked (crashed).
  1098. 233.48 s > Message: label _func_power_ not found
  1099. 233.48 s > Location: /nix/store/n9w914kh1cm59xx3spcs831cdyb56m32-vendor-cargo-deps/c19b7c6f923b580ac259164a89f2577984ad5ab09ee9d583b888f934adbbe8d0/symjit-2.25.6/src/symjit/assembler.rs:77
  1100. 233.48 s >
  1101. 233.48 s > ━━━━━━━━━━━━━━━━━━━━━━━━━━━━━━━━━━ BACKTRACE ━━━━━━━━━━━━━━━━━━━━━━━━━━━━━━━━━━━
  1102. 233.48 s > 1: <color_eyre[51793ea62743adbd]::config::PanicHook>::panic_report<unknown>
  1103. 233.48 s > at <unknown source file>:<unknown line>
  1104. 233.48 s > 2: <color_eyre[51793ea62743adbd]::config::PanicHook>::into_panic_hook::{closure#0}<unknown>
  1105. 233.48 s > at <unknown source file>:<unknown line>
  1106. 233.48 s > 3: std[bcb96dfbba0ab899]::panicking::panic_with_hook<unknown>
  1107. 233.48 s > at <unknown source file>:<unknown line>
  1108. 233.48 s > 4: std[bcb96dfbba0ab899]::panicking::panic_handler::{closure#0}<unknown>
  1109. 233.48 s > at <unknown source file>:<unknown line>
  1110. 233.48 s > 5: std[bcb96dfbba0ab899]::sys::backtrace::__rust_end_short_backtrace::<std[bcb96dfbba0ab899]::panicking::panic_handler::{closure#0}, !><unknown>
  1111. 233.48 s > at <unknown source file>:<unknown line>
  1112. 233.48 s > 6: __rustc[6c289b9f9c454d21]::rust_begin_unwind<unknown>
  1113. 233.48 s > at <unknown source file>:<unknown line>
  1114. 233.48 s > 7: core[940e698046960fd5]::panicking::panic_fmt<unknown>
  1115. 233.48 s > at <unknown source file>:<unknown line>
  1116. 233.48 s > 8: <symjit[e408de789c333cd]::symjit::assembler::Assembler>::apply_jumps<unknown>
  1117. 233.48 s > at <unknown source file>:<unknown line>
  1118. 233.48 s > 9: <symjit[e408de789c333cd]::symjit::builder::Builder>::compile_from_mir::<symjit[e408de789c333cd]::symjit::amd::complex::AmdComplexGenerator><unknown>
  1119. 233.48 s > at <unknown source file>:<unknown line>
  1120. 233.48 s > 10: <symjit[e408de789c333cd]::symjit::runnable::Application>::compile_ty<unknown>
  1121. 233.48 s > at <unknown source file>:<unknown line>
  1122. 233.48 s > 11: <symjit[e408de789c333cd]::symjit::runnable::Application>::with_mir<unknown>
  1123. 233.48 s > at <unknown source file>:<unknown line>
  1124. 233.48 s > 12: <symjit[e408de789c333cd]::symjit::composer::DirectTranslator as symjit[e408de789c333cd]::symjit::composer::Composer>::compile<unknown>
  1125. 233.48 s > at <unknown source file>:<unknown line>
  1126. 233.48 s > 13: <symjit[e408de789c333cd]::symjit::compiler::Translator as symjit[e408de789c333cd]::symjit::composer::Composer>::compile<unknown>
  1127. 233.48 s > at <unknown source file>:<unknown line>
  1128. 233.48 s > 14: <numerica[124dab8567f4861e]::domains::float::complex::Complex<f64> as symbolica[10e259bab675d243]::evaluate::backend::JITCompiledNumber>::jit_compile<unknown>
  1129. 233.48 s > at <unknown source file>:<unknown line>
  1130. 233.48 s > 15: <symbolica[10e259bab675d243]::evaluate::evaluator::ExpressionEvaluator<numerica[124dab8567f4861e]::domains::float::complex::Complex<f64>>>::jit_compile<unknown>
  1131. 233.48 s > at <unknown source file>:<unknown line>
  1132. 233.48 s > 16: <gammalooprs[917cbd3df9e68f8f]::integrands::process::evaluators::GenericEvaluator>::activate_symjit<unknown>
  1133. 233.48 s > at <unknown source file>:<unknown line>
  1134. 233.48 s > 17: <gammalooprs[917cbd3df9e68f8f]::integrands::process::amplitude::AmplitudeIntegrand>::prepare_runtime_backends_after_generation_with_compile_times<unknown>
  1135. 233.48 s > at <unknown source file>:<unknown line>
  1136. 233.48 s > 18: <gammalooprs[917cbd3df9e68f8f]::processes::amplitude::Amplitude>::build_integrand<unknown>
  1137. 233.48 s > at <unknown source file>:<unknown line>
  1138. 233.48 s > 19: <gammalooprs[917cbd3df9e68f8f]::processes::process::Process>::generate_integrands<unknown>
  1139. 233.48 s > at <unknown source file>:<unknown line>
  1140. 233.48 s > 20: <gammaloop_api[9ebf6628f97aeb57]::state::State>::generate_integrand<unknown>
  1141. 233.48 s > at <unknown source file>:<unknown line>
  1142. 233.48 s > 21: <gammaloop_api[9ebf6628f97aeb57]::commands::generate::Generate>::run::<&std[bcb96dfbba0ab899]::path::PathBuf><unknown>
  1143. 233.48 s > at <unknown source file>:<unknown line>
  1144. 233.49 s > 22: <gammaloop_api[9ebf6628f97aeb57]::commands::Commands>::run<unknown>
  1145. 233.49 s > at <unknown source file>:<unknown line>
  1146. 233.49 s > 23: <gammaloop_api[9ebf6628f97aeb57]::session::CliSession>::execute_prepared<unknown>
  1147. 233.49 s > at <unknown source file>:<unknown line>
  1148. 233.49 s > 24: <gammaloop_api[9ebf6628f97aeb57]::session::CliSession>::execute_command<unknown>
  1149. 233.49 s > at <unknown source file>:<unknown line>
  1150. 233.49 s > 25: <gammaloop_integration_tests[191607b70c61cd5a]::CLIState>::run_command<unknown>
  1151. 233.49 s > at <unknown source file>:<unknown line>
  1152. 233.49 s > 26: test_runs[9b7e2dc2dc4f29b0]::aa_aa::generate_aa_aa_helicity_family<unknown>
  1153. 233.49 s > at <unknown source file>:<unknown line>
  1154. 233.49 s > 27: <test_runs[9b7e2dc2dc4f29b0]::aa_aa::important::aa_aa_local_inspect_backend_consistency::{closure#0} as core[940e698046960fd5]::ops::function::FnOnce<()>>::call_once<unknown>
  1155. 233.49 s > at <unknown source file>:<unknown line>
  1156. 233.49 s > 28: serial_test[cd99724524a2f1c0]::serial_code_lock::local_serial_core_with_return::<(), eyre[cb2fd339c0c40fca]::Report><unknown>
  1157. 233.49 s > at <unknown source file>:<unknown line>
  1158. 233.49 s > 29: <test_runs[9b7e2dc2dc4f29b0]::aa_aa::important::aa_aa_local_inspect_backend_consistency::{closure#0} as core[940e698046960fd5]::ops::function::FnOnce<()>>::call_once<unknown>
  1159. 233.49 s > at <unknown source file>:<unknown line>
  1160. 233.49 s > 30: test[75d6903177b1d7e9]::__rust_begin_short_backtrace::<core[940e698046960fd5]::result::Result<(), alloc[2ea6bcb46fca0c42]::string::String>, fn() -> core[940e698046960fd5]::result::Result<(), alloc[2ea6bcb46fca0c42]::string::String>><unknown>
  1161. 233.49 s > at <unknown source file>:<unknown line>
  1162. 233.49 s > 31: test[75d6903177b1d7e9]::run_test::{closure#0}<unknown>
  1163. 233.49 s > at <unknown source file>:<unknown line>
  1164. 233.49 s > 32: std[bcb96dfbba0ab899]::sys::backtrace::__rust_begin_short_backtrace::<test[75d6903177b1d7e9]::run_test::{closure#1}, ()><unknown>
  1165. 233.49 s > at <unknown source file>:<unknown line>
  1166. 233.49 s > 33: <std[bcb96dfbba0ab899]::thread::lifecycle::spawn_unchecked<test[75d6903177b1d7e9]::run_test::{closure#1}, ()>::{closure#1} as core[940e698046960fd5]::ops::function::FnOnce<()>>::call_once::{shim:vtable#0}<unknown>
  1167. 233.49 s > at <unknown source file>:<unknown line>
  1168. 233.49 s > 34: <std[bcb96dfbba0ab899]::sys::thread::unix::Thread>::new::thread_start<unknown>
  1169. 233.49 s > at <unknown source file>:<unknown line>
  1170. 233.49 s > 35: start_thread<unknown>
  1171. 233.49 s > at <unknown source file>:<unknown line>
  1172. 233.49 s > 36: __clone3<unknown>
  1173. 233.49 s > at <unknown source file>:<unknown line>
  1174. 233.49 s >
  1175. 233.49 s > Run with COLORBT_SHOW_HIDDEN=1 environment variable to disable frame filtering.
  1176. 233.49 s > Run with RUST_BACKTRACE=full to include source snippets.
  1177. 233.49 s > Warning: SpanTrace capture is Unsupported.
  1178. 233.49 s > Ensure that you've setup a tracing-error ErrorLayer and the semver versions are compatible
  1179. 233.49 s >
  1180. 233.49 s > FAIL [ 2.454s] (157/169) gammaloop-integration-tests::uv thermal_sunrise_uv
  1181. 233.49 s > stdout ---
  1182. 233.49 s >
  1183. 233.49 s > running 1 test
  1184. 233.49 s > test thermal_sunrise_uv ... FAILED
  1185. 233.49 s >
  1186. 233.49 s > failures:
  1187. 233.49 s >
  1188. 233.49 s > failures:
  1189. 233.49 s > thermal_sunrise_uv
  1190. 233.49 s >
  1191. 233.49 s > test result: FAILED. 0 passed; 1 failed; 0 ignored; 0 measured; 31 filtered out; finished in 2.44s
  1192. 233.49 s >
  1193. 233.49 s > stderr ---
  1194. 233.49 s > [2026-09-15 21:42:08.095] @gammaloop_api::se... INFO : Running command run generate
  1195. 233.49 s > [2026-09-15 21:42:08.095] @gammaloop_api::se... INFO : Starting command block generate
  1196. 233.49 s > [2026-09-15 21:42:08.096] @gammaloop_api::se... INFO : Running command import model sm-default.json
  1197. 233.49 s > [2026-09-15 21:42:08.096] @import::model INFO : Loading built-in JSON model sm-default
  1198. 233.49 s > [2026-09-15 21:42:08.121] @gammalooprs::model INFO : The following 15 external parameters were forced to zero by the restriction card:
  1199. 233.49 s > lamWS, AWS, rhoWS, etaWS, ymc, yme, ymm, MC, Me, MM, WTau, muQ, muLe, muLmu, muLtau
  1200. 233.49 s > [2026-09-15 21:42:08.121] @gammalooprs::model INFO : The following 34 vertex rules were removed by the restriction card:
  1201. 233.49 s > V_82 -> (c~, d, G+) | V_83 -> (t~, d, G+) | V_84 -> (c~, s, G+) | V_85 -> (t~, s, G+) | V_86 -> (u~, b, G+) | V_87 -> (c~, b, G+) | V_90 -> (c~, d, W+) | V_91 -> (t~, d, W+) | V_92 -> (u~, s, W+) | V_94 -> (t~, s, W+) | V_95 -> (u~, b, W+) | V_96 -> (c~, b, W+) | V_101 -> (e+, e-, G0) | V_102 -> (mu+, mu-, G0) | V_104 -> (e+, e-, H) | V_105 -> (mu+, mu-, H) | V_110 -> (ve~, e-, G+) | V_111 -> (vm~, mu-, G+) | V_116 -> (b~, u, G-) | V_117 -> (d~, c, G-) | V_118 -> (s~, c, G-) | V_119 -> (b~, c, G-) | V_120 -> (d~, t, G-) | V_121 -> (s~, t, G-) | V_124 -> (s~, u, W-) | V_125 -> (b~, u, W-) | V_126 -> (d~, c, W-) | V_128 -> (b~, c, W-) | V_129 -> (d~, t, W-) | V_130 -> (s~, t, W-) | V_138 -> (c~, c, G0) | V_140 -> (c~, c, H) | V_145 -> (e+, ve, G-) | V_146 -> (mu+, vm, G-)
  1202. 233.49 s > [2026-09-15 21:42:08.121] @gammalooprs::model INFO : The following 36 couplings were removed by the restriction card:
  1203. 233.49 s > GC_13, GC_14, GC_16, GC_17, GC_18, GC_19, GC_20, GC_22, GC_23, GC_24, GC_25, GC_26, GC_28, GC_29, GC_42, GC_43, GC_44, GC_46, GC_47, GC_48, GC_84, GC_85, GC_86, GC_87, GC_88, GC_89, GC_90, GC_91, GC_92, GC_93, GC_101, GC_102, GC_103, GC_105, GC_106, GC_107
  1204. 233.49 s > [2026-09-15 21:42:08.121] @gammaloop_api::se... INFO : Running command remove processes
  1205. 233.49 s > [2026-09-15 21:42:08.121] @gammaloop_api::se... INFO : Running command generate amp {} > {} [{2}] | g u
  1206. 233.49 s > --numerator-grouping group_identical_graphs_up_to_scalar_rescaling
  1207. 233.49 s > --max-n-bridges 0
  1208. 233.49 s > --number-of-factorized-loop-subtopologies 1 1
  1209. 233.49 s > --number-of-anticommutating-loops 1 1
  1210. 233.49 s > [...]
  1211. 233.49 s > [2026-09-15 21:42:08.123] @feyngen::diagram_... INFO : 0s | Δ=0s | Starting Feynman graph generation with Symbolica...
  1212. 233.49 s > [2026-09-15 21:42:08.123] @feyngen::diagram_... INFO : 0s | Δ=0s | Number of graphs resulting from Symbolica generation: 3
  1213. 233.49 s > [2026-09-15 21:42:08.125] @feyngen::diagram_... INFO : 0s | Δ=0s | Number of graphs retained after removal of vetoed topologies: 2
  1214. 233.49 s > [2026-09-15 21:42:08.125] @feyngen::diagram_... INFO : 0s | Δ=0s | Number of graphs after vertex info assignment: 2
  1215. 233.49 s > [2026-09-15 21:42:08.125] @feyngen::diagram_... INFO : 0s | Δ=0s | Number of graphs after all complete graphs filters are applied: 2
  1216. 233.49 s > [2026-09-15 21:42:08.125] @feyngen::diagram_... INFO : 0s | Δ=0s | Number of graphs after closed anticommutating chains analysis: 1
  1217. 233.49 s > [2026-09-15 21:42:08.125] @feyngen::diagram_... INFO : 0s | Δ=0s | Number of graphs after symmetrization of external states: 1
  1218. 233.49 s > [2026-09-15 21:42:08.125] @feyngen::diagram_... INFO : 0s | Δ=0s | Number of graphs after canonization of vertices, edges and flows (graph labels assigned here): 1
  1219. 233.49 s > [2026-09-15 21:42:08.138] @feyngen::diagram_... INFO : 0s | Δ=0s | Number of graphs after numerator-aware grouping with strategy 'up to a scalar rescaling': 1 (1 isomorphically unique graph, 0 color zero, 0 lorentz zero, 0 grouped and 0 cancellation)
  1220. 233.49 s > [2026-09-15 21:42:08.138] @feyngen::diagram_... INFO : ( Sum of the symmetry factors from each graph generated = -1/2 )
  1221. 233.49 s > [2026-09-15 21:42:08.138] @commands::generate INFO : Generated amplitude 1 graphs.
  1222. 233.49 s > [2026-09-15 21:42:08.138] @commands::generate INFO : Only diagram generation was requested, skipping integrand generation. You can generate integrands later using the 'generate existing <options>' command.
  1223. 233.49 s > [2026-09-15 21:42:08.138] @gammaloop_api::se... INFO : Running command generate
  1224. 233.49 s > The application panicked (crashed).
  1225. 233.49 s > Message: label _func_power_ not found
  1226. 233.49 s > Location: /nix/store/n9w914kh1cm59xx3spcs831cdyb56m32-vendor-cargo-deps/c19b7c6f923b580ac259164a89f2577984ad5ab09ee9d583b888f934adbbe8d0/symjit-2.25.6/src/symjit/assembler.rs:77
  1227. 233.49 s >
  1228. 233.49 s > ━━━━━━━━━━━━━━━━━━━━━━━━━━━━━━━━━━ BACKTRACE ━━━━━━━━━━━━━━━━━━━━━━━━━━━━━━━━━━━
  1229. 233.49 s > 1: <color_eyre[51793ea62743adbd]::config::PanicHook>::panic_report<unknown>
  1230. 233.49 s > at <unknown source file>:<unknown line>
  1231. 233.49 s > 2: <color_eyre[51793ea62743adbd]::config::PanicHook>::into_panic_hook::{closure#0}<unknown>
  1232. 233.49 s > at <unknown source file>:<unknown line>
  1233. 233.49 s > 3: std[bcb96dfbba0ab899]::panicking::panic_with_hook<unknown>
  1234. 233.49 s > at <unknown source file>:<unknown line>
  1235. 233.49 s > 4: std[bcb96dfbba0ab899]::panicking::panic_handler::{closure#0}<unknown>
  1236. 233.49 s > at <unknown source file>:<unknown line>
  1237. 233.49 s > 5: std[bcb96dfbba0ab899]::sys::backtrace::__rust_end_short_backtrace::<std[bcb96dfbba0ab899]::panicking::panic_handler::{closure#0}, !><unknown>
  1238. 233.49 s > at <unknown source file>:<unknown line>
  1239. 233.49 s > 6: __rustc[6c289b9f9c454d21]::rust_begin_unwind<unknown>
  1240. 233.49 s > at <unknown source file>:<unknown line>
  1241. 233.49 s > 7: core[940e698046960fd5]::panicking::panic_fmt<unknown>
  1242. 233.49 s > at <unknown source file>:<unknown line>
  1243. 233.49 s > 8: <symjit[e408de789c333cd]::symjit::assembler::Assembler>::apply_jumps<unknown>
  1244. 233.49 s > at <unknown source file>:<unknown line>
  1245. 233.49 s > 9: <symjit[e408de789c333cd]::symjit::builder::Builder>::compile_from_mir::<symjit[e408de789c333cd]::symjit::amd::complex::AmdComplexGenerator><unknown>
  1246. 233.49 s > at <unknown source file>:<unknown line>
  1247. 233.49 s > 10: <symjit[e408de789c333cd]::symjit::runnable::Application>::compile_ty<unknown>
  1248. 233.49 s > at <unknown source file>:<unknown line>
  1249. 233.49 s > 11: <symjit[e408de789c333cd]::symjit::runnable::Application>::with_mir<unknown>
  1250. 233.49 s > at <unknown source file>:<unknown line>
  1251. 233.49 s > 12: <symjit[e408de789c333cd]::symjit::composer::DirectTranslator as symjit[e408de789c333cd]::symjit::composer::Composer>::compile<unknown>
  1252. 233.49 s > at <unknown source file>:<unknown line>
  1253. 233.49 s > 13: <symjit[e408de789c333cd]::symjit::compiler::Translator as symjit[e408de789c333cd]::symjit::composer::Composer>::compile<unknown>
  1254. 233.49 s > at <unknown source file>:<unknown line>
  1255. 233.49 s > 14: <numerica[124dab8567f4861e]::domains::float::complex::Complex<f64> as symbolica[10e259bab675d243]::evaluate::backend::JITCompiledNumber>::jit_compile<unknown>
  1256. 233.49 s > at <unknown source file>:<unknown line>
  1257. 233.49 s > 15: <symbolica[10e259bab675d243]::evaluate::evaluator::ExpressionEvaluator<numerica[124dab8567f4861e]::domains::float::complex::Complex<f64>>>::jit_compile<unknown>
  1258. 233.49 s > at <unknown source file>:<unknown line>
  1259. 233.49 s > 16: <gammalooprs[917cbd3df9e68f8f]::integrands::process::evaluators::GenericEvaluator>::activate_symjit<unknown>
  1260. 233.49 s > at <unknown source file>:<unknown line>
  1261. 233.49 s > 17: <gammalooprs[917cbd3df9e68f8f]::integrands::process::amplitude::AmplitudeIntegrand>::prepare_runtime_backends_after_generation_with_compile_times<unknown>
  1262. 233.49 s > at <unknown source file>:<unknown line>
  1263. 233.49 s > 18: <gammalooprs[917cbd3df9e68f8f]::processes::amplitude::Amplitude>::build_integrand<unknown>
  1264. 233.49 s > at <unknown source file>:<unknown line>
  1265. 233.49 s > 19: <gammalooprs[917cbd3df9e68f8f]::processes::process::Process>::generate_integrands<unknown>
  1266. 233.49 s > at <unknown source file>:<unknown line>
  1267. 233.49 s > 20: <gammalooprs[917cbd3df9e68f8f]::processes::ProcessList>::generate_integrands<unknown>
  1268. 233.49 s > at <unknown source file>:<unknown line>
  1269. 233.49 s > 21: <gammaloop_api[9ebf6628f97aeb57]::state::State>::generate_integrands<unknown>
  1270. 233.49 s > at <unknown source file>:<unknown line>
  1271. 233.49 s > 22: <gammaloop_api[9ebf6628f97aeb57]::commands::generate::Generate>::run::<&std[bcb96dfbba0ab899]::path::PathBuf><unknown>
  1272. 233.49 s > at <unknown source file>:<unknown line>
  1273. 233.49 s > 23: <gammaloop_api[9ebf6628f97aeb57]::commands::Commands>::run<unknown>
  1274. 233.49 s > at <unknown source file>:<unknown line>
  1275. 233.49 s > 24: <gammaloop_api[9ebf6628f97aeb57]::session::CliSession>::execute_prepared<unknown>
  1276. 233.49 s > at <unknown source file>:<unknown line>
  1277. 233.49 s > 25: <gammaloop_api[9ebf6628f97aeb57]::session::CliSession>::execute_prepared_commands<unknown>
  1278. 233.49 s > at <unknown source file>:<unknown line>
  1279. 233.49 s > 26: <gammaloop_api[9ebf6628f97aeb57]::session::CliSession>::execute_prepared<unknown>
  1280. 233.49 s > at <unknown source file>:<unknown line>
  1281. 233.49 s > 27: <gammaloop_api[9ebf6628f97aeb57]::session::CliSession>::execute_command<unknown>
  1282. 233.49 s > at <unknown source file>:<unknown line>
  1283. 233.49 s > 28: <gammaloop_integration_tests[191607b70c61cd5a]::CLIState>::run_command<unknown>
  1284. 233.49 s > at <unknown source file>:<unknown line>
  1285. 233.49 s > 29: uv[3c7454ef256d6487]::run_single_integrated_uv_case<unknown>
  1286. 233.49 s > at <unknown source file>:<unknown line>
  1287. 233.49 s > 30: <uv[3c7454ef256d6487]::thermal_sunrise_uv::{closure#0} as core[940e698046960fd5]::ops::function::FnOnce<()>>::call_once<unknown>
  1288. 233.49 s > at <unknown source file>:<unknown line>
  1289. 233.49 s > 31: test[75d6903177b1d7e9]::__rust_begin_short_backtrace::<core[940e698046960fd5]::result::Result<(), alloc[2ea6bcb46fca0c42]::string::String>, fn() -> core[940e698046960fd5]::result::Result<(), alloc[2ea6bcb46fca0c42]::string::String>><unknown>
  1290. 233.49 s > at <unknown source file>:<unknown line>
  1291. 233.49 s > 32: test[75d6903177b1d7e9]::run_test::{closure#0}<unknown>
  1292. 233.49 s > at <unknown source file>:<unknown line>
  1293. 233.49 s > 33: std[bcb96dfbba0ab899]::sys::backtrace::__rust_begin_short_backtrace::<test[75d6903177b1d7e9]::run_test::{closure#1}, ()><unknown>
  1294. 233.49 s > at <unknown source file>:<unknown line>
  1295. 233.49 s > 34: <std[bcb96dfbba0ab899]::thread::lifecycle::spawn_unchecked<test[75d6903177b1d7e9]::run_test::{closure#1}, ()>::{closure#1} as core[940e698046960fd5]::ops::function::FnOnce<()>>::call_once::{shim:vtable#0}<unknown>
  1296. 233.49 s > at <unknown source file>:<unknown line>
  1297. 233.49 s > 35: <std[bcb96dfbba0ab899]::sys::thread::unix::Thread>::new::thread_start<unknown>
  1298. 233.49 s > at <unknown source file>:<unknown line>
  1299. 233.49 s > 36: start_thread<unknown>
  1300. 233.49 s > at <unknown source file>:<unknown line>
  1301. 233.49 s > 37: __clone3<unknown>
  1302. 233.49 s > at <unknown source file>:<unknown line>
  1303. 233.49 s >
  1304. 233.49 s > Run with COLORBT_SHOW_HIDDEN=1 environment variable to disable frame filtering.
  1305. 233.49 s > Run with RUST_BACKTRACE=full to include source snippets.
  1306. 233.49 s > Warning: SpanTrace capture is Unsupported.
  1307. 233.49 s > Ensure that you've setup a tracing-error ErrorLayer and the semver versions are compatible
  1308. 233.49 s >
  1309. 233.49 s > error: test run failed
  1310. 233.49 s >
  1311. 233.49 s > ========== nextest test summary ==========
  1312. 233.49 s > report: target/nextest/ci_gammaloop/junit.xml
  1313. 233.49 s > tests: 169, failures: 2, errors: 0
  1314. 233.49 s >
  1315. 233.49 s > 1. gammaloop-integration-tests::test_runs::aa_aa::important::aa_aa_local_inspect_backend_consistency
  1316. 233.49 s > failure: test failure with exit code 101
  1317. 233.49 s > system-out
  1318. 233.49 s > running 1 test
  1319. 233.49 s > test aa_aa::important::aa_aa_local_inspect_backend_consistency ... FAILED
  1320. 233.49 s >
  1321. 233.49 s > failures:
  1322. 233.49 s >
  1323. 233.49 s > failures:
  1324. 233.49 s > aa_aa::important::aa_aa_local_inspect_backend_consistency
  1325. 233.49 s >
  1326. 233.49 s > test result: FAILED. 0 passed; 1 failed; 0 ignored; 0 measured; 273 filtered out; finished in 2.99s
  1327. 233.49 s > system-err
  1328. 233.49 s > [2026-09-15 21:41:25.843] @gammaloop_api::se... INFO : Running command import model sm-default.json
  1329. 233.49 s > [2026-09-15 21:41:25.843] @import::model INFO : Loading built-in JSON model sm-default
  1330. 233.49 s > [2026-09-15 21:41:25.868] @gammalooprs::model INFO : The following 15 external parameters were forced to zero by the restriction card:
  1331. 233.49 s > lamWS, AWS, rhoWS, etaWS, ymc, yme, ymm, MC, Me, MM, WTau, muQ, muLe, muLmu, muLtau
  1332. 233.49 s > [2026-09-15 21:41:25.868] @gammalooprs::model INFO : The following 34 vertex rules were removed by the restriction card:
  1333. 233.49 s > V_82 -> (c~, d, G+) | V_83 -> (t~, d, G+) | V_84 -> (c~, s, G+) | V_85 -> (t~, s, G+) | V_86 -> (u~, b, G+) | V_87 -> (c~, b, G+) | V_90 -> (c~, d, W+) | V_91 -> (t~, d, W+) | V_92 -> (u~, s, W+) | V_94 -> (t~, s, W+) | V_95 -> (u~, b, W+) | V_96 -> (c~, b, W+) | V_101 -> (e+, e-, G0) | V_102 -> (mu+, mu-, G0) | V_104 -> (e+, e-, H) | V_105 -> (mu+, mu-, H) | V_110 -> (ve~, e-, G+) | V_111 -> (vm~, mu-, G+) | V_116 -> (b~, u, G-) | V_117 -> (d~, c, G-) | V_118 -> (s~, c, G-) | V_119 -> (b~, c, G-) | V_120 -> (d~, t, G-) | V_121 -> (s~, t, G-) | V_124 -> (s~, u, W-) | V_125 -> (b~, u, W-) | V_126 -> (d~, c, W-) | V_128 -> (b~, c, W-) | V_129 -> (d~, t, W-) | V_130 -> (s~, t, W-) | V_138 -> (c~, c, G0) | V_140 -> (c~, c, H) | V_145 -> (e+, ve, G-) | V_146 -> (mu+, vm, G-)
  1334. 233.49 s > [2026-09-15 21:41:25.868] @gammalooprs::model INFO : The following 36 couplings were removed by the restriction card:
  1335. 233.49 s > GC_13, GC_14, GC_16, GC_17, GC_18, GC_19, GC_20, GC_22, GC_23, GC_24, GC_25, GC_26, GC_28, GC_29, GC_42, GC_43, GC_44, GC_46, GC_47, GC_48, GC_84, GC_85, GC_86, GC_87, GC_88, GC_89, GC_90, GC_91, GC_92, GC_93, GC_101, GC_102, GC_103, GC_105, GC_106, GC_107
  1336. 233.49 s > [2026-09-15 21:41:25.868] @gammaloop_api::se... INFO : Running command run set_model_parameters
  1337. 233.49 s > [2026-09-15 21:41:25.868] @gammaloop_api::se... INFO : Starting command block set_model_parameters
  1338. 233.49 s > [2026-09-15 21:41:25.869] @gammaloop_api::se... INFO : Running command set model MT=173.0
  1339. 233.49 s > [2026-09-15 21:41:25.873] @gammaloop_api::se... INFO : Running command set model WT=0.0
  1340. 233.49 s > [2026-09-15 21:41:25.877] @gammaloop_api::se... INFO : Running command set model ymt=173.0
  1341. 233.49 s > [2026-09-15 21:41:25.881] @gammaloop_api::se... INFO : Running command set model aS=0.118
  1342. 233.49 s > [2026-09-15 21:41:25.886] @gammaloop_api::se... INFO : Running command set model aEWM1=137.036
  1343. 233.49 s > [2026-09-15 21:41:25.891] @gammaloop_api::se... INFO : Running command set model Gf=1.166390e-05
  1344. 233.49 s > [2026-09-15 21:41:25.896] @gammaloop_api::se... INFO : Running command set model MZ=91.188
  1345. 233.49 s > [2026-09-15 21:41:25.901] @gammaloop_api::se... INFO : Running command set global string '
  1346. 233.49 s > [global.generation.compile]
  1347. 233.49 s > compilation_mode = "symjit"
  1348. 233.49 s > optimization_level = "O0"
  1349. 233.49 s > fast_math = false
  1350. 233.49 s > [...]
  1351. 233.49 s > [2026-09-15 21:41:25.902] @gammaloop_api::se... INFO : Running command import graphs ./examples/cli/aa_aa/1L/aa_aa_1L.dot -p aa_aa_all_helicities -i 1L_ppmm -o
  1352. 233.49 s > [2026-09-15 21:41:25.902] @commands::import INFO : Loading graphs from '/build/source/examples/cli/aa_aa/1L/aa_aa_1L.dot'
  1353. 233.49 s > [2026-09-15 21:41:25.911] @gammaloop_api::se... INFO : Running command generate existing -p aa_aa_all_helicities
  1354. 233.49 s > The application panicked (crashed).
  1355. 233.49 s > Message: label _func_power_ not found
  1356. 233.49 s > Location: /nix/store/n9w914kh1cm59xx3spcs831cdyb56m32-vendor-cargo-deps/c19b7c6f923b580ac259164a89f2577984ad5ab09ee9d583b888f934adbbe8d0/symjit-2.25.6/src/symjit/assembler.rs:77
  1357. 233.49 s >
  1358. 233.49 s > ━━━━━━━━━━━━━━━━━━━━━━━━━━━━━━━━━━ BACKTRACE ━━━━━━━━━━━━━━━━━━━━━━━━━━━━━━━━━━━
  1359. 233.49 s > 1: <color_eyre[51793ea62743adbd]::config::PanicHook>::panic_report<unknown>
  1360. 233.49 s > at <unknown source file>:<unknown line>
  1361. 233.49 s > 2: <color_eyre[51793ea62743adbd]::config::PanicHook>::into_panic_hook::{closure#0}<unknown>
  1362. 233.49 s > at <unknown source file>:<unknown line>
  1363. 233.49 s > 3: std[bcb96dfbba0ab899]::panicking::panic_with_hook<unknown>
  1364. 233.49 s > at <unknown source file>:<unknown line>
  1365. 233.49 s > 4: std[bcb96dfbba0ab899]::panicking::panic_handler::{closure#0}<unknown>
  1366. 233.49 s > at <unknown source file>:<unknown line>
  1367. 233.49 s > 5: std[bcb96dfbba0ab899]::sys::backtrace::__rust_end_short_backtrace::<std[bcb96dfbba0ab899]::panicking::panic_handler::{closure#0}, !><unknown>
  1368. 233.49 s > at <unknown source file>:<unknown line>
  1369. 233.49 s > 6: __rustc[6c289b9f9c454d21]::rust_begin_unwind<unknown>
  1370. 233.49 s > at <unknown source file>:<unknown line>
  1371. 233.49 s > 7: core[940e698046960fd5]::panicking::panic_fmt<unknown>
  1372. 233.49 s > at <unknown source file>:<unknown line>
  1373. 233.49 s > 8: <symjit[e408de789c333cd]::symjit::assembler::Assembler>::apply_jumps<unknown>
  1374. 233.49 s > at <unknown source file>:<unknown line>
  1375. 233.49 s > 9: <symjit[e408de789c333cd]::symjit::builder::Builder>::compile_from_mir::<symjit[e408de789c333cd]::symjit::amd::complex::AmdComplexGenerator><unknown>
  1376. 233.49 s > at <unknown source file>:<unknown line>
  1377. 233.49 s > 10: <symjit[e408de789c333cd]::symjit::runnable::Application>::compile_ty<unknown>
  1378. 233.49 s > at <unknown source file>:<unknown line>
  1379. 233.49 s > 11: <symjit[e408de789c333cd]::symjit::runnable::Application>::with_mir<unknown>
  1380. 233.49 s > at <unknown source file>:<unknown line>
  1381. 233.49 s > 12: <symjit[e408de789c333cd]::symjit::composer::DirectTranslator as symjit[e408de789c333cd]::symjit::composer::Composer>::compile<unknown>
  1382. 233.49 s > at <unknown source file>:<unknown line>
  1383. 233.49 s > 13: <symjit[e408de789c333cd]::symjit::compiler::Translator as symjit[e408de789c333cd]::symjit::composer::Composer>::compile<unknown>
  1384. 233.49 s > at <unknown source file>:<unknown line>
  1385. 233.49 s > 14: <numerica[124dab8567f4861e]::domains::float::complex::Complex<f64> as symbolica[10e259bab675d243]::evaluate::backend::JITCompiledNumber>::jit_compile<unknown>
  1386. 233.49 s > at <unknown source file>:<unknown line>
  1387. 233.49 s > 15: <symbolica[10e259bab675d243]::evaluate::evaluator::ExpressionEvaluator<numerica[124dab8567f4861e]::domains::float::complex::Complex<f64>>>::jit_compile<unknown>
  1388. 233.49 s > at <unknown source file>:<unknown line>
  1389. 233.49 s > 16: <gammalooprs[917cbd3df9e68f8f]::integrands::process::evaluators::GenericEvaluator>::activate_symjit<unknown>
  1390. 233.49 s > at <unknown source file>:<unknown line>
  1391. 233.49 s > 17: <gammalooprs[917cbd3df9e68f8f]::integrands::process::amplitude::AmplitudeIntegrand>::prepare_runtime_backends_after_generation_with_compile_times<unknown>
  1392. 233.49 s > at <unknown source file>:<unknown line>
  1393. 233.49 s > 18: <gammalooprs[917cbd3df9e68f8f]::processes::amplitude::Amplitude>::build_integrand<unknown>
  1394. 233.49 s > at <unknown source file>:<unknown line>
  1395. 233.49 s > 19: <gammalooprs[917cbd3df9e68f8f]::processes::process::Process>::generate_integrands<unknown>
  1396. 233.49 s > at <unknown source file>:<unknown line>
  1397. 233.49 s > 20: <gammaloop_api[9ebf6628f97aeb57]::state::State>::generate_integrand<unknown>
  1398. 233.49 s > at <unknown source file>:<unknown line>
  1399. 233.49 s > 21: <gammaloop_api[9ebf6628f97aeb57]::commands::generate::Generate>::run::<&std[bcb96dfbba0ab899]::path::PathBuf><unknown>
  1400. 233.49 s > at <unknown source file>:<unknown line>
  1401. 233.49 s > 22: <gammaloop_api[9ebf6628f97aeb57]::commands::Commands>::run<unknown>
  1402. 233.49 s > at <unknown source file>:<unknown line>
  1403. 233.49 s > 23: <gammaloop_api[9ebf6628f97aeb57]::session::CliSession>::execute_prepared<unknown>
  1404. 233.49 s > at <unknown source file>:<unknown line>
  1405. 233.49 s > 24: <gammaloop_api[9ebf6628f97aeb57]::session::CliSession>::execute_command<unknown>
  1406. 233.49 s > at <unknown source file>:<unknown line>
  1407. 233.49 s > 25: <gammaloop_integration_tests[191607b70c61cd5a]::CLIState>::run_command<unknown>
  1408. 233.49 s > at <unknown source file>:<unknown line>
  1409. 233.49 s > 26: test_runs[9b7e2dc2dc4f29b0]::aa_aa::generate_aa_aa_helicity_family<unknown>
  1410. 233.49 s > at <unknown source file>:<unknown line>
  1411. 233.49 s > 27: <test_runs[9b7e2dc2dc4f29b0]::aa_aa::important::aa_aa_local_inspect_backend_consistency::{closure#0} as core[940e698046960fd5]::ops::function::FnOnce<()>>::call_once<unknown>
  1412. 233.49 s > at <unknown source file>:<unknown line>
  1413. 233.49 s > 28: serial_test[cd99724524a2f1c0]::serial_code_lock::local_serial_core_with_return::<(), eyre[cb2fd339c0c40fca]::Report><unknown>
  1414. 233.49 s > at <unknown source file>:<unknown line>
  1415. 233.49 s > 29: <test_runs[9b7e2dc2dc4f29b0]::aa_aa::important::aa_aa_local_inspect_backend_consistency::{closure#0} as core[940e698046960fd5]::ops::function::FnOnce<()>>::call_once<unknown>
  1416. 233.49 s > at <unknown source file>:<unknown line>
  1417. 233.49 s > 30: test[75d6903177b1d7e9]::__rust_begin_short_backtrace::<core[940e698046960fd5]::result::Result<(), alloc[2ea6bcb46fca0c42]::string::String>, fn() -> core[940e698046960fd5]::result::Result<(), alloc[2ea6bcb46fca0c42]::string::String>><unknown>
  1418. 233.49 s > at <unknown source file>:<unknown line>
  1419. 233.49 s > 31: test[75d6903177b1d7e9]::run_test::{closure#0}<unknown>
  1420. 233.49 s > at <unknown source file>:<unknown line>
  1421. 233.49 s > 32: std[bcb96dfbba0ab899]::sys::backtrace::__rust_begin_short_backtrace::<test[75d6903177b1d7e9]::run_test::{closure#1}, ()><unknown>
  1422. 233.49 s > at <unknown source file>:<unknown line>
  1423. 233.49 s > 33: <std[bcb96dfbba0ab899]::thread::lifecycle::spawn_unchecked<test[75d6903177b1d7e9]::run_test::{closure#1}, ()>::{closure#1} as core[940e698046960fd5]::ops::function::FnOnce<()>>::call_once::{shim:vtable#0}<unknown>
  1424. 233.49 s > at <unknown source file>:<unknown line>
  1425. 233.49 s > 34: <std[bcb96dfbba0ab899]::sys::thread::unix::Thread>::new::thread_start<unknown>
  1426. 233.49 s > at <unknown source file>:<unknown line>
  1427. 233.49 s > 35: start_thread<unknown>
  1428. 233.49 s > at <unknown source file>:<unknown line>
  1429. 233.49 s > 36: __clone3<unknown>
  1430. 233.49 s > at <unknown source file>:<unknown line>
  1431. 233.49 s >
  1432. 233.49 s > Run with COLORBT_SHOW_HIDDEN=1 environment variable to disable frame filtering.
  1433. 233.49 s > Run with RUST_BACKTRACE=full to include source snippets.
  1434. 233.49 s > Warning: SpanTrace capture is Unsupported.
  1435. 233.49 s > Ensure that you've setup a tracing-error ErrorLayer and the semver versions are compatible
  1436. 233.49 s >
  1437. 233.49 s > 2. gammaloop-integration-tests::uv::thermal_sunrise_uv
  1438. 233.49 s > failure: test failure with exit code 101
  1439. 233.49 s > system-out
  1440. 233.49 s > running 1 test
  1441. 233.49 s > test thermal_sunrise_uv ... FAILED
  1442. 233.49 s >
  1443. 233.49 s > failures:
  1444. 233.49 s >
  1445. 233.49 s > failures:
  1446. 233.49 s > thermal_sunrise_uv
  1447. 233.49 s >
  1448. 233.49 s > test result: FAILED. 0 passed; 1 failed; 0 ignored; 0 measured; 31 filtered out; finished in 2.44s
  1449. 233.49 s > system-err
  1450. 233.49 s > [2026-09-15 21:42:08.095] @gammaloop_api::se... INFO : Running command run generate
  1451. 233.49 s > [2026-09-15 21:42:08.095] @gammaloop_api::se... INFO : Starting command block generate
  1452. 233.49 s > [2026-09-15 21:42:08.096] @gammaloop_api::se... INFO : Running command import model sm-default.json
  1453. 233.49 s > [2026-09-15 21:42:08.096] @import::model INFO : Loading built-in JSON model sm-default
  1454. 233.49 s > [2026-09-15 21:42:08.121] @gammalooprs::model INFO : The following 15 external parameters were forced to zero by the restriction card:
  1455. 233.49 s > lamWS, AWS, rhoWS, etaWS, ymc, yme, ymm, MC, Me, MM, WTau, muQ, muLe, muLmu, muLtau
  1456. 233.49 s > [2026-09-15 21:42:08.121] @gammalooprs::model INFO : The following 34 vertex rules were removed by the restriction card:
  1457. 233.49 s > V_82 -> (c~, d, G+) | V_83 -> (t~, d, G+) | V_84 -> (c~, s, G+) | V_85 -> (t~, s, G+) | V_86 -> (u~, b, G+) | V_87 -> (c~, b, G+) | V_90 -> (c~, d, W+) | V_91 -> (t~, d, W+) | V_92 -> (u~, s, W+) | V_94 -> (t~, s, W+) | V_95 -> (u~, b, W+) | V_96 -> (c~, b, W+) | V_101 -> (e+, e-, G0) | V_102 -> (mu+, mu-, G0) | V_104 -> (e+, e-, H) | V_105 -> (mu+, mu-, H) | V_110 -> (ve~, e-, G+) | V_111 -> (vm~, mu-, G+) | V_116 -> (b~, u, G-) | V_117 -> (d~, c, G-) | V_118 -> (s~, c, G-) | V_119 -> (b~, c, G-) | V_120 -> (d~, t, G-) | V_121 -> (s~, t, G-) | V_124 -> (s~, u, W-) | V_125 -> (b~, u, W-) | V_126 -> (d~, c, W-) | V_128 -> (b~, c, W-) | V_129 -> (d~, t, W-) | V_130 -> (s~, t, W-) | V_138 -> (c~, c, G0) | V_140 -> (c~, c, H) | V_145 -> (e+, ve, G-) | V_146 -> (mu+, vm, G-)
  1458. 233.49 s > [2026-09-15 21:42:08.121] @gammalooprs::model INFO : The following 36 couplings were removed by the restriction card:
  1459. 233.49 s > GC_13, GC_14, GC_16, GC_17, GC_18, GC_19, GC_20, GC_22, GC_23, GC_24, GC_25, GC_26, GC_28, GC_29, GC_42, GC_43, GC_44, GC_46, GC_47, GC_48, GC_84, GC_85, GC_86, GC_87, GC_88, GC_89, GC_90, GC_91, GC_92, GC_93, GC_101, GC_102, GC_103, GC_105, GC_106, GC_107
  1460. 233.49 s > [2026-09-15 21:42:08.121] @gammaloop_api::se... INFO : Running command remove processes
  1461. 233.49 s > [2026-09-15 21:42:08.121] @gammaloop_api::se... INFO : Running command generate amp {} > {} [{2}] | g u
  1462. 233.49 s > --numerator-grouping group_identical_graphs_up_to_scalar_rescaling
  1463. 233.49 s > --max-n-bridges 0
  1464. 233.49 s > --number-of-factorized-loop-subtopologies 1 1
  1465. 233.49 s > --number-of-anticommutating-loops 1 1
  1466. 233.49 s > [...]
  1467. 233.49 s > [2026-09-15 21:42:08.123] @feyngen::diagram_... INFO : 0s | Δ=0s | Starting Feynman graph generation with Symbolica...
  1468. 233.49 s > [2026-09-15 21:42:08.123] @feyngen::diagram_... INFO : 0s | Δ=0s | Number of graphs resulting from Symbolica generation: 3
  1469. 233.49 s > [2026-09-15 21:42:08.125] @feyngen::diagram_... INFO : 0s | Δ=0s | Number of graphs retained after removal of vetoed topologies: 2
  1470. 233.49 s > [2026-09-15 21:42:08.125] @feyngen::diagram_... INFO : 0s | Δ=0s | Number of graphs after vertex info assignment: 2
  1471. 233.49 s > [2026-09-15 21:42:08.125] @feyngen::diagram_... INFO : 0s | Δ=0s | Number of graphs after all complete graphs filters are applied: 2
  1472. 233.49 s > [2026-09-15 21:42:08.125] @feyngen::diagram_... INFO : 0s | Δ=0s | Number of graphs after closed anticommutating chains analysis: 1
  1473. 233.49 s > [2026-09-15 21:42:08.125] @feyngen::diagram_... INFO : 0s | Δ=0s | Number of graphs after symmetrization of external states: 1
  1474. 233.49 s > [2026-09-15 21:42:08.125] @feyngen::diagram_... INFO : 0s | Δ=0s | Number of graphs after canonization of vertices, edges and flows (graph labels assigned here): 1
  1475. 233.49 s > [2026-09-15 21:42:08.138] @feyngen::diagram_... INFO : 0s | Δ=0s | Number of graphs after numerator-aware grouping with strategy 'up to a scalar rescaling': 1 (1 isomorphically unique graph, 0 color zero, 0 lorentz zero, 0 grouped and 0 cancellation)
  1476. 233.49 s > [2026-09-15 21:42:08.138] @feyngen::diagram_... INFO : ( Sum of the symmetry factors from each graph generated = -1/2 )
  1477. 233.49 s > [2026-09-15 21:42:08.138] @commands::generate INFO : Generated amplitude 1 graphs.
  1478. 233.49 s > [2026-09-15 21:42:08.138] @commands::generate INFO : Only diagram generation was requested, skipping integrand generation. You can generate integrands later using the 'generate existing <options>' command.
  1479. 233.49 s > [2026-09-15 21:42:08.138] @gammaloop_api::se... INFO : Running command generate
  1480. 233.49 s > The application panicked (crashed).
  1481. 233.49 s > Message: label _func_power_ not found
  1482. 233.49 s > Location: /nix/store/n9w914kh1cm59xx3spcs831cdyb56m32-vendor-cargo-deps/c19b7c6f923b580ac259164a89f2577984ad5ab09ee9d583b888f934adbbe8d0/symjit-2.25.6/src/symjit/assembler.rs:77
  1483. 233.49 s >
  1484. 233.49 s > ━━━━━━━━━━━━━━━━━━━━━━━━━━━━━━━━━━ BACKTRACE ━━━━━━━━━━━━━━━━━━━━━━━━━━━━━━━━━━━
  1485. 233.49 s > 1: <color_eyre[51793ea62743adbd]::config::PanicHook>::panic_report<unknown>
  1486. 233.49 s > at <unknown source file>:<unknown line>
  1487. 233.49 s > 2: <color_eyre[51793ea62743adbd]::config::PanicHook>::into_panic_hook::{closure#0}<unknown>
  1488. 233.49 s > at <unknown source file>:<unknown line>
  1489. 233.49 s > 3: std[bcb96dfbba0ab899]::panicking::panic_with_hook<unknown>
  1490. 233.49 s > at <unknown source file>:<unknown line>
  1491. 233.49 s > 4: std[bcb96dfbba0ab899]::panicking::panic_handler::{closure#0}<unknown>
  1492. 233.49 s > at <unknown source file>:<unknown line>
  1493. 233.49 s > 5: std[bcb96dfbba0ab899]::sys::backtrace::__rust_end_short_backtrace::<std[bcb96dfbba0ab899]::panicking::panic_handler::{closure#0}, !><unknown>
  1494. 233.49 s > at <unknown source file>:<unknown line>
  1495. 233.49 s > 6: __rustc[6c289b9f9c454d21]::rust_begin_unwind<unknown>
  1496. 233.49 s > at <unknown source file>:<unknown line>
  1497. 233.49 s > 7: core[940e698046960fd5]::panicking::panic_fmt<unknown>
  1498. 233.49 s > at <unknown source file>:<unknown line>
  1499. 233.49 s > 8: <symjit[e408de789c333cd]::symjit::assembler::Assembler>::apply_jumps<unknown>
  1500. 233.49 s > at <unknown source file>:<unknown line>
  1501. 233.49 s > 9: <symjit[e408de789c333cd]::symjit::builder::Builder>::compile_from_mir::<symjit[e408de789c333cd]::symjit::amd::complex::AmdComplexGenerator><unknown>
  1502. 233.49 s > at <unknown source file>:<unknown line>
  1503. 233.49 s > 10: <symjit[e408de789c333cd]::symjit::runnable::Application>::compile_ty<unknown>
  1504. 233.49 s > at <unknown source file>:<unknown line>
  1505. 233.49 s > 11: <symjit[e408de789c333cd]::symjit::runnable::Application>::with_mir<unknown>
  1506. 233.49 s > at <unknown source file>:<unknown line>
  1507. 233.49 s > 12: <symjit[e408de789c333cd]::symjit::composer::DirectTranslator as symjit[e408de789c333cd]::symjit::composer::Composer>::compile<unknown>
  1508. 233.49 s > at <unknown source file>:<unknown line>
  1509. 233.49 s > 13: <symjit[e408de789c333cd]::symjit::compiler::Translator as symjit[e408de789c333cd]::symjit::composer::Composer>::compile<unknown>
  1510. 233.49 s > at <unknown source file>:<unknown line>
  1511. 233.49 s > 14: <numerica[124dab8567f4861e]::domains::float::complex::Complex<f64> as symbolica[10e259bab675d243]::evaluate::backend::JITCompiledNumber>::jit_compile<unknown>
  1512. 233.49 s > at <unknown source file>:<unknown line>
  1513. 233.49 s > 15: <symbolica[10e259bab675d243]::evaluate::evaluator::ExpressionEvaluator<numerica[124dab8567f4861e]::domains::float::complex::Complex<f64>>>::jit_compile<unknown>
  1514. 233.49 s > at <unknown source file>:<unknown line>
  1515. 233.49 s > 16: <gammalooprs[917cbd3df9e68f8f]::integrands::process::evaluators::GenericEvaluator>::activate_symjit<unknown>
  1516. 233.49 s > at <unknown source file>:<unknown line>
  1517. 233.49 s > 17: <gammalooprs[917cbd3df9e68f8f]::integrands::process::amplitude::AmplitudeIntegrand>::prepare_runtime_backends_after_generation_with_compile_times<unknown>
  1518. 233.49 s > at <unknown source file>:<unknown line>
  1519. 233.49 s > 18: <gammalooprs[917cbd3df9e68f8f]::processes::amplitude::Amplitude>::build_integrand<unknown>
  1520. 233.49 s > at <unknown source file>:<unknown line>
  1521. 233.49 s > 19: <gammalooprs[917cbd3df9e68f8f]::processes::process::Process>::generate_integrands<unknown>
  1522. 233.49 s > at <unknown source file>:<unknown line>
  1523. 233.49 s > 20: <gammalooprs[917cbd3df9e68f8f]::processes::ProcessList>::generate_integrands<unknown>
  1524. 233.49 s > at <unknown source file>:<unknown line>
  1525. 233.49 s > 21: <gammaloop_api[9ebf6628f97aeb57]::state::State>::generate_integrands<unknown>
  1526. 233.49 s > at <unknown source file>:<unknown line>
  1527. 233.49 s > 22: <gammaloop_api[9ebf6628f97aeb57]::commands::generate::Generate>::run::<&std[bcb96dfbba0ab899]::path::PathBuf><unknown>
  1528. 233.49 s > at <unknown source file>:<unknown line>
  1529. 233.49 s > 23: <gammaloop_api[9ebf6628f97aeb57]::commands::Commands>::run<unknown>
  1530. 233.49 s > at <unknown source file>:<unknown line>
  1531. 233.49 s > 24: <gammaloop_api[9ebf6628f97aeb57]::session::CliSession>::execute_prepared<unknown>
  1532. 233.49 s > at <unknown source file>:<unknown line>
  1533. 233.49 s > 25: <gammaloop_api[9ebf6628f97aeb57]::session::CliSession>::execute_prepared_commands<unknown>
  1534. 233.49 s > at <unknown source file>:<unknown line>
  1535. 233.49 s > 26: <gammaloop_api[9ebf6628f97aeb57]::session::CliSession>::execute_prepared<unknown>
  1536. 233.49 s > at <unknown source file>:<unknown line>
  1537. 233.49 s > 27: <gammaloop_api[9ebf6628f97aeb57]::session::CliSession>::execute_command<unknown>
  1538. 233.49 s > at <unknown source file>:<unknown line>
  1539. 233.49 s > 28: <gammaloop_integration_tests[191607b70c61cd5a]::CLIState>::run_command<unknown>
  1540. 233.49 s > at <unknown source file>:<unknown line>
  1541. 233.49 s > 29: uv[3c7454ef256d6487]::run_single_integrated_uv_case<unknown>
  1542. 233.49 s > at <unknown source file>:<unknown line>
  1543. 233.49 s > 30: <uv[3c7454ef256d6487]::thermal_sunrise_uv::{closure#0} as core[940e698046960fd5]::ops::function::FnOnce<()>>::call_once<unknown>
  1544. 233.49 s > at <unknown source file>:<unknown line>
  1545. 233.49 s > 31: test[75d6903177b1d7e9]::__rust_begin_short_backtrace::<core[940e698046960fd5]::result::Result<(), alloc[2ea6bcb46fca0c42]::string::String>, fn() -> core[940e698046960fd5]::result::Result<(), alloc[2ea6bcb46fca0c42]::string::String>><unknown>
  1546. 233.49 s > at <unknown source file>:<unknown line>
  1547. 233.49 s > 32: test[75d6903177b1d7e9]::run_test::{closure#0}<unknown>
  1548. 233.49 s > at <unknown source file>:<unknown line>
  1549. 233.49 s > 33: std[bcb96dfbba0ab899]::sys::backtrace::__rust_begin_short_backtrace::<test[75d6903177b1d7e9]::run_test::{closure#1}, ()><unknown>
  1550. 233.49 s > at <unknown source file>:<unknown line>
  1551. 233.49 s > 34: <std[bcb96dfbba0ab899]::thread::lifecycle::spawn_unchecked<test[75d6903177b1d7e9]::run_test::{closure#1}, ()>::{closure#1} as core[940e698046960fd5]::ops::function::FnOnce<()>>::call_once::{shim:vtable#0}<unknown>
  1552. 233.49 s > at <unknown source file>:<unknown line>
  1553. 233.49 s > 35: <std[bcb96dfbba0ab899]::sys::thread::unix::Thread>::new::thread_start<unknown>
  1554. 233.49 s > at <unknown source file>:<unknown line>
  1555. 233.49 s > 36: start_thread<unknown>
  1556. 233.49 s > at <unknown source file>:<unknown line>
  1557. 233.49 s > 37: __clone3<unknown>
  1558. 233.49 s > at <unknown source file>:<unknown line>
  1559. 233.49 s >
  1560. 233.49 s > Run with COLORBT_SHOW_HIDDEN=1 environment variable to disable frame filtering.
  1561. 233.49 s > Run with RUST_BACKTRACE=full to include source snippets.
  1562. 233.49 s > Warning: SpanTrace capture is Unsupported.
  1563. 233.49 s > Ensure that you've setup a tracing-error ErrorLayer and the semver versions are compatible
  1564. 233.49 s > =========================================
  1565. 233.49 s For full logs, run:
  1566. 233.49 s nix log /nix/store/mzkwykiwpnc2c1k4w0h0d3936pcxgvpd-gammaloop-nextest-integration.drv
  1567. 234.20 s [0 built (1 failed), 0.0Run failed.