test packages.x86_64-linux.nix-ci-check-gammaloop-nextest-integration

Reproduce this run
Original Run
  1. 0.01 s $ /nix/store/61685rbaxmpigwi3z23i33sv3jyfl70q-coreutils-9.11/bin/timeout --kill-after=15s 7200s /nix/store/wknkybkzrc16r11vk5vrykh4wmw7a353-nix-2.34.8/bin/nix --extra-experimental-features nix-command --extra-experimental-features flakes flake clone git+https://github.com/alphal00p/gammaloop --dest /tmp/nix-ci-worker/stable-pwd/repo/
  2. 0.37 s Cloning into '/tmp/nix-ci-worker/stable-pwd/repo'...
  3. 2.20 s remote: Enumerating objects: 96033, done.
  4. 2.32 s remote: Counting objects: 0% (1/11450) remote: Counting objects: 1% (115/11450) remote: Counting objects: 2% (229/11450) remote: Counting objects: 3% (344/11450) remote: Counting objects: 4% (458/11450) remote: Counting objects: 5% (573/11450) remote: Counting objects: 6% (687/11450) remote: Counting objects: 7% (802/11450) remote: Counting objects: 8% (916/11450) remote: Counting objects: 9% (1031/11450) remote: Counting objects: 10% (1145/11450) remote: Counting objects: 11% (1260/11450) remote: Counting objects: 12% (1374/11450) remote: Counting objects: 13% (1489/11450) remote: Counting objects: 14% (1603/11450) remote: Counting objects: 15% (1718/11450) remote: Counting objects: 16% (1832/11450) remote: Counting objects: 17% (1947/11450) remote: Counting objects: 18% (2061/11450) remote: Counting objects: 19% (2176/11450) remote: Counting objects: 20% (2290/11450) remote: Counting objects: 21% (2405/11450) remote: Counting objects: 22% (2519/11450) remote: Counting objects: 23% (2634/11450) remote: Counting objects: 24% (2748/11450) remote: Counting objects: 25% (2863/11450) remote: Counting objects: 26% (2977/11450) remote: Counting objects: 27% (3092/11450) remote: Counting objects: 28% (3206/11450) remote: Counting objects: 29% (3321/11450) remote: Counting objects: 30% (3435/11450) remote: Counting objects: 31% (3550/11450) remote: Counting objects: 32% (3664/11450) remote: Counting objects: 33% (3779/11450) remote: Counting objects: 34% (3893/11450) remote: Counting objects: 35% (4008/11450) remote: Counting objects: 36% (4122/11450) remote: Counting objects: 37% (4237/11450) remote: Counting objects: 38% (4351/11450) remote: Counting objects: 39% (4466/11450) remote: Counting objects: 40% (4580/11450) remote: Counting objects: 41% (4695/11450) remote: Counting objects: 42% (4809/11450) remote: Counting objects: 43% (4924/11450) remote: Counting objects: 44% (5038/11450) remote: Counting objects: 45% (5153/11450) remote: Counting objects: 46% (5267/11450) remote: Counting objects: 47% (5382/11450) remote: Counting objects: 48% (5496/11450) remote: Counting objects: 49% (5611/11450) remote: Counting objects: 50% (5725/11450) remote: Counting objects: 51% (5840/11450) remote: Counting objects: 52% (5954/11450) remote: Counting objects: 53% (6069/11450) remote: Counting objects: 54% (6183/11450) remote: Counting objects: 55% (6298/11450) remote: Counting objects: 56% (6412/11450) remote: Counting objects: 57% (6527/11450) remote: Counting objects: 58% (6641/11450) remote: Counting objects: 59% (6756/11450) remote: Counting objects: 60% (6870/11450) remote: Counting objects: 61% (6985/11450) remote: Counting objects: 62% (7099/11450) remote: Counting objects: 63% (7214/11450) remote: Counting objects: 64% (7328/11450) remote: Counting objects: 65% (7443/11450) remote: Counting objects: 66% (7557/11450) remote: Counting objects: 67% (7672/11450) remote: Counting objects: 68% (7786/11450) remote: Counting objects: 69% (7901/11450) remote: Counting objects: 70% (8015/11450) remote: Counting objects: 71% (8130/11450) remote: Counting objects: 72% (8244/11450) remote: Counting objects: 73% (8359/11450) remote: Counting objects: 74% (8473/11450) remote: Counting objects: 75% (8588/11450) remote: Counting objects: 76% (8702/11450) remote: Counting objects: 77% (8817/11450) remote: Counting objects: 78% (8931/11450) remote: Counting objects: 79% (9046/11450) remote: Counting objects: 80% (9160/11450) remote: Counting objects: 81% (9275/11450) remote: Counting objects: 82% (9389/11450) remote: Counting objects: 83% (9504/11450) remote: Counting objects: 84% (9618/11450) remote: Counting objects: 85% (9733/11450) remote: Counting objects: 86% (9847/11450) remote: Counting objects: 87% (9962/11450) remote: Counting objects: 88% (10076/11450) remote: Counting objects: 89% (10191/11450) remote: Counting objects: 90% (10305/11450) remote: Counting objects: 91% (10420/11450) remote: Counting objects: 92% (10534/11450) remote: Counting objects: 93% (10649/11450) remote: Counting objects: 94% (10763/11450) remote: Counting objects: 95% (10878/11450) remote: Counting objects: 96% (10992/11450) remote: Counting objects: 97% (11107/11450) remote: Counting objects: 98% (11221/11450) remote: Counting objects: 99% (11336/11450) remote: Counting objects: 100% (11450/11450) remote: Counting objects: 100% (11450/11450), done.
  5. 5.42 s remote: Compressing objects: 0% (1/2699) remote: Compressing objects: 1% (27/2699) remote: Compressing objects: 2% (54/2699) remote: Compressing objects: 3% (81/2699) remote: Compressing objects: 4% (108/2699) remote: Compressing objects: 5% (135/2699) remote: Compressing objects: 6% (162/2699) remote: Compressing objects: 7% (189/2699) remote: Compressing objects: 8% (216/2699) remote: Compressing objects: 9% (243/2699) remote: Compressing objects: 10% (270/2699) remote: Compressing objects: 11% (297/2699) remote: Compressing objects: 12% (324/2699) remote: Compressing objects: 13% (351/2699) remote: Compressing objects: 14% (378/2699) remote: Compressing objects: 14% (402/2699) remote: Compressing objects: 15% (405/2699) remote: Compressing objects: 16% (432/2699) remote: Compressing objects: 17% (459/2699) remote: Compressing objects: 18% (486/2699) remote: Compressing objects: 19% (513/2699) remote: Compressing objects: 19% (525/2699) remote: Compressing objects: 20% (540/2699) remote: Compressing objects: 21% (567/2699) remote: Compressing objects: 22% (594/2699) remote: Compressing objects: 23% (621/2699) remote: Compressing objects: 24% (648/2699) remote: Compressing objects: 25% (675/2699) remote: Compressing objects: 26% (702/2699) remote: Compressing objects: 27% (729/2699) remote: Compressing objects: 28% (756/2699) remote: Compressing objects: 29% (783/2699) remote: Compressing objects: 30% (810/2699) remote: Compressing objects: 31% (837/2699) remote: Compressing objects: 31% (850/2699) remote: Compressing objects: 32% (864/2699) remote: Compressing objects: 33% (891/2699) remote: Compressing objects: 34% (918/2699) remote: Compressing objects: 35% (945/2699) remote: Compressing objects: 36% (972/2699) remote: Compressing objects: 37% (999/2699) remote: Compressing objects: 38% (1026/2699) remote: Compressing objects: 39% (1053/2699) remote: Compressing objects: 40% (1080/2699) remote: Compressing objects: 41% (1107/2699) remote: Compressing objects: 42% (1134/2699) remote: Compressing objects: 43% (1161/2699) remote: Compressing objects: 44% (1188/2699) remote: Compressing objects: 45% (1215/2699) remote: Compressing objects: 46% (1242/2699) remote: Compressing objects: 47% (1269/2699) remote: Compressing objects: 48% (1296/2699) remote: Compressing objects: 49% (1323/2699) remote: Compressing objects: 50% (1350/2699) remote: Compressing objects: 51% (1377/2699) remote: Compressing objects: 52% (1404/2699) remote: Compressing objects: 53% (1431/2699) remote: Compressing objects: 54% (1458/2699) remote: Compressing objects: 55% (1485/2699) remote: Compressing objects: 56% (1512/2699) remote: Compressing objects: 57% (1539/2699) remote: Compressing objects: 58% (1566/2699) remote: Compressing objects: 59% (1593/2699) remote: Compressing objects: 60% (1620/2699) remote: Compressing objects: 61% (1647/2699) remote: Compressing objects: 62% (1674/2699) remote: Compressing objects: 63% (1701/2699) remote: Compressing objects: 64% (1728/2699) remote: Compressing objects: 65% (1755/2699) remote: Compressing objects: 66% (1782/2699) remote: Compressing objects: 67% (1809/2699) remote: Compressing objects: 68% (1836/2699) remote: Compressing objects: 69% (1863/2699) remote: Compressing objects: 70% (1890/2699) remote: Compressing objects: 71% (1917/2699) remote: Compressing objects: 72% (1944/2699) remote: Compressing objects: 73% (1971/2699) remote: Compressing objects: 74% (1998/2699) remote: Compressing objects: 75% (2025/2699) remote: Compressing objects: 76% (2052/2699) remote: Compressing objects: 77% (2079/2699) remote: Compressing objects: 78% (2106/2699) remote: Compressing objects: 79% (2133/2699) remote: Compressing objects: 80% (2160/2699) remote: Compressing objects: 81% (2187/2699) remote: Compressing objects: 82% (2214/2699) remote: Compressing objects: 83% (2241/2699) remote: Compressing objects: 84% (2268/2699) remote: Compressing objects: 85% (2295/2699) remote: Compressing objects: 86% (2322/2699) remote: Compressing objects: 87% (2349/2699) remote: Compressing objects: 88% (2376/2699) remote: Compressing objects: 89% (2403/2699) remote: Compressing objects: 90% (2430/2699) remote: Compressing objects: 91% (2457/2699) remote: Compressing objects: 92% (2484/2699) remote: Compressing objects: 93% (2511/2699) remote: Compressing objects: 94% (2538/2699) remote: Compressing objects: 95% (2565/2699) remote: Compressing objects: 96% (2592/2699) remote: Compressing objects: 97% (2619/2699) remote: Compressing objects: 98% (2646/2699) remote: Compressing objects: 99% (2673/2699) remote: Compressing objects: 100% (2699/2699) remote: Compressing objects: 100% (2699/2699), done.
  6. 15.50 s Receiving objects: 0% (1/96033) Receiving objects: 1% (961/96033) Receiving objects: 2% (1921/96033) Receiving objects: 3% (2881/96033) Receiving objects: 4% (3842/96033) Receiving objects: 5% (4802/96033) Receiving objects: 6% (5762/96033) Receiving objects: 7% (6723/96033) Receiving objects: 8% (7683/96033), 11.71 MiB | 23.40 MiB/s Receiving objects: 9% (8643/96033), 11.71 MiB | 23.40 MiB/s Receiving objects: 10% (9604/96033), 11.71 MiB | 23.40 MiB/s Receiving objects: 11% (10564/96033), 11.71 MiB | 23.40 MiB/s Receiving objects: 12% (11524/96033), 11.71 MiB | 23.40 MiB/s Receiving objects: 13% (12485/96033), 11.71 MiB | 23.40 MiB/s Receiving objects: 14% (13445/96033), 11.71 MiB | 23.40 MiB/s Receiving objects: 15% (14405/96033), 11.71 MiB | 23.40 MiB/s Receiving objects: 16% (15366/96033), 11.71 MiB | 23.40 MiB/s Receiving objects: 17% (16326/96033), 11.71 MiB | 23.40 MiB/s Receiving objects: 18% (17286/96033), 11.71 MiB | 23.40 MiB/s Receiving objects: 19% (18247/96033), 11.71 MiB | 23.40 MiB/s Receiving objects: 20% (19207/96033), 11.71 MiB | 23.40 MiB/s Receiving objects: 21% (20167/96033), 11.71 MiB | 23.40 MiB/s Receiving objects: 22% (21128/96033), 11.71 MiB | 23.40 MiB/s Receiving objects: 23% (22088/96033), 11.71 MiB | 23.40 MiB/s Receiving objects: 24% (23048/96033), 11.71 MiB | 23.40 MiB/s Receiving objects: 25% (24009/96033), 11.71 MiB | 23.40 MiB/s Receiving objects: 26% (24969/96033), 11.71 MiB | 23.40 MiB/s Receiving objects: 27% (25929/96033), 11.71 MiB | 23.40 MiB/s Receiving objects: 28% (26890/96033), 11.71 MiB | 23.40 MiB/s Receiving objects: 29% (27850/96033), 11.71 MiB | 23.40 MiB/s Receiving objects: 30% (28810/96033), 11.71 MiB | 23.40 MiB/s Receiving objects: 31% (29771/96033), 11.71 MiB | 23.40 MiB/s Receiving objects: 32% (30731/96033), 11.71 MiB | 23.40 MiB/s Receiving objects: 33% (31691/96033), 11.71 MiB | 23.40 MiB/s Receiving objects: 34% (32652/96033), 11.71 MiB | 23.40 MiB/s Receiving objects: 35% (33612/96033), 11.71 MiB | 23.40 MiB/s Receiving objects: 35% (33907/96033), 32.13 MiB | 32.12 MiB/s Receiving objects: 36% (34572/96033), 32.13 MiB | 32.12 MiB/s Receiving objects: 37% (35533/96033), 32.13 MiB | 32.12 MiB/s Receiving objects: 38% (36493/96033), 32.13 MiB | 32.12 MiB/s Receiving objects: 39% (37453/96033), 32.13 MiB | 32.12 MiB/s Receiving objects: 40% (38414/96033), 32.13 MiB | 32.12 MiB/s Receiving objects: 41% (39374/96033), 32.13 MiB | 32.12 MiB/s Receiving objects: 42% (40334/96033), 32.13 MiB | 32.12 MiB/s Receiving objects: 43% (41295/96033), 48.82 MiB | 32.35 MiB/s Receiving objects: 44% (42255/96033), 48.82 MiB | 32.35 MiB/s Receiving objects: 45% (43215/96033), 48.82 MiB | 32.35 MiB/s Receiving objects: 46% (44176/96033), 48.82 MiB | 32.35 MiB/s Receiving objects: 47% (45136/96033), 48.82 MiB | 32.35 MiB/s Receiving objects: 48% (46096/96033), 48.82 MiB | 32.35 MiB/s Receiving objects: 49% (47057/96033), 48.82 MiB | 32.35 MiB/s Receiving objects: 50% (48017/96033), 48.82 MiB | 32.35 MiB/s Receiving objects: 50% (48736/96033), 64.81 MiB | 32.26 MiB/s Receiving objects: 51% (48977/96033), 64.81 MiB | 32.26 MiB/s Receiving objects: 52% (49938/96033), 64.81 MiB | 32.26 MiB/s Receiving objects: 53% (50898/96033), 64.81 MiB | 32.26 MiB/s Receiving objects: 54% (51858/96033), 64.81 MiB | 32.26 MiB/s Receiving objects: 55% (52819/96033), 64.81 MiB | 32.26 MiB/s Receiving objects: 56% (53779/96033), 64.81 MiB | 32.26 MiB/s Receiving objects: 57% (54739/96033), 64.81 MiB | 32.26 MiB/s Receiving objects: 58% (55700/96033), 64.81 MiB | 32.26 MiB/s Receiving objects: 59% (56660/96033), 64.81 MiB | 32.26 MiB/s Receiving objects: 59% (57290/96033), 81.89 MiB | 32.04 MiB/s Receiving objects: 59% (57447/96033), 116.72 MiB | 32.82 MiB/s Receiving objects: 59% (57544/96033), 149.58 MiB | 32.73 MiB/s Receiving objects: 60% (57620/96033), 181.90 MiB | 32.69 MiB/s Receiving objects: 60% (57999/96033), 199.32 MiB | 32.91 MiB/s Receiving objects: 61% (58581/96033), 199.32 MiB | 32.91 MiB/s Receiving objects: 62% (59541/96033), 199.32 MiB | 32.91 MiB/s Receiving objects: 63% (60501/96033), 215.68 MiB | 32.99 MiB/s Receiving objects: 64% (61462/96033), 215.68 MiB | 32.99 MiB/s Receiving objects: 65% (62422/96033), 215.68 MiB | 32.99 MiB/s Receiving objects: 66% (63382/96033), 215.68 MiB | 32.99 MiB/s Receiving objects: 67% (64343/96033), 215.68 MiB | 32.99 MiB/s Receiving objects: 67% (64780/96033), 215.68 MiB | 32.99 MiB/s Receiving objects: 68% (65303/96033), 231.77 MiB | 33.02 MiB/s Receiving objects: 69% (66263/96033), 231.77 MiB | 33.02 MiB/s Receiving objects: 70% (67224/96033), 231.77 MiB | 33.02 MiB/s Receiving objects: 71% (68184/96033), 231.77 MiB | 33.02 MiB/s Receiving objects: 72% (69144/96033), 231.77 MiB | 33.02 MiB/s Receiving objects: 73% (70105/96033), 231.77 MiB | 33.02 MiB/s Receiving objects: 74% (71065/96033), 231.77 MiB | 33.02 MiB/s Receiving objects: 75% (72025/96033), 231.77 MiB | 33.02 MiB/s Receiving objects: 76% (72986/96033), 231.77 MiB | 33.02 MiB/s Receiving objects: 77% (73946/96033), 231.77 MiB | 33.02 MiB/s Receiving objects: 78% (74906/96033), 249.29 MiB | 32.93 MiB/s Receiving objects: 79% (75867/96033), 249.29 MiB | 32.93 MiB/s Receiving objects: 80% (76827/96033), 249.29 MiB | 32.93 MiB/s Receiving objects: 80% (76989/96033), 249.29 MiB | 32.93 MiB/s Receiving objects: 81% (77787/96033), 281.71 MiB | 32.93 MiB/s Receiving objects: 82% (78748/96033), 281.71 MiB | 32.93 MiB/s Receiving objects: 83% (79708/96033), 281.71 MiB | 32.93 MiB/s Receiving objects: 84% (80668/96033), 281.71 MiB | 32.93 MiB/s Receiving objects: 85% (81629/96033), 281.71 MiB | 32.93 MiB/s Receiving objects: 86% (82589/96033), 281.71 MiB | 32.93 MiB/s Receiving objects: 87% (83549/96033), 281.71 MiB | 32.93 MiB/s Receiving objects: 87% (84038/96033), 281.71 MiB | 32.93 MiB/s Receiving objects: 88% (84510/96033), 298.61 MiB | 32.84 MiB/s Receiving objects: 89% (85470/96033), 298.61 MiB | 32.84 MiB/s Receiving objects: 90% (86430/96033), 298.61 MiB | 32.84 MiB/s Receiving objects: 91% (87391/96033), 298.61 MiB | 32.84 MiB/s Receiving objects: 92% (88351/96033), 298.61 MiB | 32.84 MiB/s Receiving objects: 93% (89311/96033), 298.61 MiB | 32.84 MiB/s Receiving objects: 94% (90272/96033), 298.61 MiB | 32.84 MiB/s Receiving objects: 95% (91232/96033), 298.61 MiB | 32.84 MiB/s Receiving objects: 96% (92192/96033), 298.61 MiB | 32.84 MiB/s Receiving objects: 97% (93153/96033), 298.61 MiB | 32.84 MiB/s Receiving objects: 98% (94113/96033), 298.61 MiB | 32.84 MiB/s Receiving objects: 99% (95073/96033), 298.61 MiB | 32.84 MiB/s Receiving objects: 99% (95930/96033), 315.82 MiB | 32.92 MiB/s remote: Total 96033 (delta 9093), reused 9205 (delta 8083), pack-reused 84583 (from 3)
  7. 15.50 s Receiving objects: 100% (96033/96033), 315.82 MiB | 32.92 MiB/s Receiving objects: 100% (96033/96033), 331.28 MiB | 32.85 MiB/s, done.
  8. 18.11 s Resolving deltas: 0% (0/64190) Resolving deltas: 1% (642/64190) Resolving deltas: 2% (1284/64190) Resolving deltas: 3% (1926/64190) Resolving deltas: 4% (2568/64190) Resolving deltas: 5% (3210/64190) Resolving deltas: 6% (3852/64190) Resolving deltas: 7% (4494/64190) Resolving deltas: 8% (5136/64190) Resolving deltas: 9% (5778/64190) Resolving deltas: 10% (6419/64190) Resolving deltas: 11% (7061/64190) Resolving deltas: 12% (7704/64190) Resolving deltas: 13% (8345/64190) Resolving deltas: 14% (8987/64190) Resolving deltas: 15% (9629/64190) Resolving deltas: 16% (10271/64190) Resolving deltas: 17% (10913/64190) Resolving deltas: 18% (11555/64190) Resolving deltas: 19% (12197/64190) Resolving deltas: 20% (12838/64190) Resolving deltas: 21% (13480/64190) Resolving deltas: 22% (14122/64190) Resolving deltas: 23% (14764/64190) Resolving deltas: 24% (15406/64190) Resolving deltas: 25% (16048/64190) Resolving deltas: 26% (16690/64190) Resolving deltas: 27% (17332/64190) Resolving deltas: 28% (17974/64190) Resolving deltas: 29% (18616/64190) Resolving deltas: 30% (19257/64190) Resolving deltas: 31% (19899/64190) Resolving deltas: 32% (20541/64190) Resolving deltas: 33% (21183/64190) Resolving deltas: 34% (21825/64190) Resolving deltas: 35% (22467/64190) Resolving deltas: 36% (23109/64190) Resolving deltas: 37% (23751/64190) Resolving deltas: 38% (24393/64190) Resolving deltas: 39% (25035/64190) Resolving deltas: 40% (25676/64190) Resolving deltas: 41% (26318/64190) Resolving deltas: 42% (26960/64190) Resolving deltas: 43% (27602/64190) Resolving deltas: 44% (28244/64190) Resolving deltas: 45% (28886/64190) Resolving deltas: 46% (29528/64190) Resolving deltas: 47% (30170/64190) Resolving deltas: 48% (30812/64190) Resolving deltas: 49% (31454/64190) Resolving deltas: 49% (31716/64190) Resolving deltas: 50% (32095/64190) Resolving deltas: 51% (32737/64190) Resolving deltas: 52% (33379/64190) Resolving deltas: 53% (34021/64190) Resolving deltas: 54% (34663/64190) Resolving deltas: 55% (35305/64190) Resolving deltas: 56% (35947/64190) Resolving deltas: 57% (36589/64190) Resolving deltas: 58% (37231/64190) Resolving deltas: 59% (37873/64190) Resolving deltas: 60% (38514/64190) Resolving deltas: 61% (39156/64190) Resolving deltas: 62% (39798/64190) Resolving deltas: 63% (40440/64190) Resolving deltas: 64% (41082/64190) Resolving deltas: 65% (41724/64190) Resolving deltas: 66% (42366/64190) Resolving deltas: 67% (43008/64190) Resolving deltas: 68% (43650/64190) Resolving deltas: 69% (44292/64190) Resolving deltas: 70% (44933/64190) Resolving deltas: 71% (45575/64190) Resolving deltas: 72% (46217/64190) Resolving deltas: 73% (46859/64190) Resolving deltas: 74% (47501/64190) Resolving deltas: 75% (48143/64190) Resolving deltas: 76% (48785/64190) Resolving deltas: 77% (49427/64190) Resolving deltas: 78% (50069/64190) Resolving deltas: 79% (50711/64190) Resolving deltas: 79% (51072/64190) Resolving deltas: 80% (51352/64190) Resolving deltas: 81% (51994/64190) Resolving deltas: 82% (52636/64190) Resolving deltas: 83% (53278/64190) Resolving deltas: 84% (53920/64190) Resolving deltas: 85% (54562/64190) Resolving deltas: 86% (55204/64190) Resolving deltas: 87% (55846/64190) Resolving deltas: 88% (56488/64190) Resolving deltas: 89% (57130/64190) Resolving deltas: 90% (57771/64190) Resolving deltas: 91% (58413/64190) Resolving deltas: 92% (59055/64190) Resolving deltas: 93% (59698/64190) Resolving deltas: 94% (60339/64190) Resolving deltas: 95% (60981/64190) Resolving deltas: 96% (61623/64190) Resolving deltas: 97% (62265/64190) Resolving deltas: 98% (62907/64190) Resolving deltas: 99% (63549/64190) Resolving deltas: 100% (64190/64190) Resolving deltas: 100% (64190/64190), done.
  9. 18.95 s Fetching commit 70f8abc259890c98339f35e018b1aecc71874f6a for finite_T_and_mu ...
  10. 18.95 s $ /nix/store/5vpcfsdx1lcnlb2y4k7xyc74shp5qwbh-git-2.54.0/bin/git fetch origin 70f8abc259890c98339f35e018b1aecc71874f6a
  11. 19.52 s From https://github.com/alphal00p/gammaloop
  12. 19.52 s * branch 70f8abc259890c98339f35e018b1aecc71874f6a -> FETCH_HEAD
  13. 19.60 s $ /nix/store/61685rbaxmpigwi3z23i33sv3jyfl70q-coreutils-9.11/bin/timeout --kill-after=15s 7200s /nix/store/5vpcfsdx1lcnlb2y4k7xyc74shp5qwbh-git-2.54.0/bin/git -c advice.detachedHead=false checkout 70f8abc259890c98339f35e018b1aecc71874f6a
  14. 19.97 s HEAD is now at 70f8abc25 Add direct translation setting for JIT compilation
  15. 20.00 s $ /nix/store/61685rbaxmpigwi3z23i33sv3jyfl70q-coreutils-9.11/bin/timeout --kill-after=15s 7200s /nix/store/wknkybkzrc16r11vk5vrykh4wmw7a353-nix-2.34.8/bin/nix --extra-experimental-features nix-command --extra-experimental-features flakes --log-format internal-json run .#packages.x86_64-linux.nix-ci-check-gammaloop-nextest-integration --print-build-logs
  16. 20.42 s
  17. 27.26 s evaluating derivation 'g copying '/nix/store/wx58 evaluating derivation 'g copying '/nix/store/wx58 evaluating derivation 'g copying '/nix/store/wx58 evaluating derivation 'g copying '/nix/store/wx58 evaluating derivation 'g copying '/nix/store/wx58 evaluating derivation 'g copying '/nix/store/wx58 evaluating derivation 'g copying '/nix/store/wx58 evaluating derivation 'g [0/1 built] [1/0/1 built] [1/0/1 built] building ggammaloop-nextest-integration> Extracting 13 binaries, 1 build script output directory, and 3 linked paths to /build/nextest-archive-9nWrbi
  18. 29.82 s gammaloop-nextest-integration> Extracted 30 files to /build/nextest-archive-9nWrbi in 2.56s
  19. 29.96 s gammaloop-nextest-integration> ------------
  20. 29.96 s gammaloop-nextest-integration> Nextest run ID 1b091131-1a5a-47b6-aad5-776d976e7c2c with nextest profile: ci_gammaloop
  21. 29.96 s gammaloop-nextest-integration> Starting 169 tests across 13 binaries (209 tests skipped, including 208 tests via profile.ci_gammaloop.default-filter)
  22. 136.36 s gammaloop-nextest-integration> FAIL [ 3.204s] ( 55/169) gammaloop-integration-tests::test_runs aa_aa::important::aa_aa_local_inspect_backend_consistency
  23. 136.36 s gammaloop-nextest-integration> stdout ---
  24. 136.36 s gammaloop-nextest-integration>
  25. 136.36 s gammaloop-nextest-integration> running 1 test
  26. 136.36 s gammaloop-nextest-integration> test aa_aa::important::aa_aa_local_inspect_backend_consistency ... FAILED
  27. 136.36 s gammaloop-nextest-integration>
  28. 136.36 s gammaloop-nextest-integration> failures:
  29. 136.36 s gammaloop-nextest-integration>
  30. 136.36 s gammaloop-nextest-integration> failures:
  31. 136.36 s gammaloop-nextest-integration> aa_aa::important::aa_aa_local_inspect_backend_consistency
  32. 136.36 s gammaloop-nextest-integration>
  33. 136.36 s gammaloop-nextest-integration> test result: FAILED. 0 passed; 1 failed; 0 ignored; 0 measured; 273 filtered out; finished in 3.19s
  34. 136.36 s gammaloop-nextest-integration>
  35. 136.36 s gammaloop-nextest-integration> stderr ---
  36. 136.36 s gammaloop-nextest-integration> [2026-09-15 21:45:34.897] @gammaloop_api::se... INFO : Running command import model sm-default.json
  37. 136.36 s gammaloop-nextest-integration> [2026-09-15 21:45:34.897] @import::model INFO : Loading built-in JSON model sm-default
  38. 136.36 s gammaloop-nextest-integration> [2026-09-15 21:45:34.920] @gammalooprs::model INFO : The following 15 external parameters were forced to zero by the restriction card:
  39. 136.36 s gammaloop-nextest-integration> lamWS, AWS, rhoWS, etaWS, ymc, yme, ymm, MC, Me, MM, WTau, muQ, muLe, muLmu, muLtau
  40. 136.36 s gammaloop-nextest-integration> [2026-09-15 21:45:34.920] @gammalooprs::model INFO : The following 34 vertex rules were removed by the restriction card:
  41. 136.36 s gammaloop-nextest-integration> V_82 -> (c~, d, G+) | V_83 -> (t~, d, G+) | V_84 -> (c~, s, G+) | V_85 -> (t~, s, G+) | V_86 -> (u~, b, G+) | V_87 -> (c~, b, G+) | V_90 -> (c~, d, W+) | V_91 -> (t~, d, W+) | V_92 -> (u~, s, W+) | V_94 -> (t~, s, W+) | V_95 -> (u~, b, W+) | V_96 -> (c~, b, W+) | V_101 -> (e+, e-, G0) | V_102 -> (mu+, mu-, G0) | V_104 -> (e+, e-, H) | V_105 -> (mu+, mu-, H) | V_110 -> (ve~, e-, G+) | V_111 -> (vm~, mu-, G+) | V_116 -> (b~, u, G-) | V_117 -> (d~, c, G-) | V_118 -> (s~, c, G-) | V_119 -> (b~, c, G-) | V_120 -> (d~, t, G-) | V_121 -> (s~, t, G-) | V_124 -> (s~, u, W-) | V_125 -> (b~, u, W-) | V_126 -> (d~, c, W-) | V_128 -> (b~, c, W-) | V_129 -> (d~, t, W-) | V_130 -> (s~, t, W-) | V_138 -> (c~, c, G0) | V_140 -> (c~, c, H) | V_145 -> (e+, ve, G-) | V_146 -> (mu+, vm, G-)
  42. 136.36 s gammaloop-nextest-integration> [2026-09-15 21:45:34.920] @gammalooprs::model INFO : The following 36 couplings were removed by the restriction card:
  43. 136.36 s gammaloop-nextest-integration> GC_13, GC_14, GC_16, GC_17, GC_18, GC_19, GC_20, GC_22, GC_23, GC_24, GC_25, GC_26, GC_28, GC_29, GC_42, GC_43, GC_44, GC_46, GC_47, GC_48, GC_84, GC_85, GC_86, GC_87, GC_88, GC_89, GC_90, GC_91, GC_92, GC_93, GC_101, GC_102, GC_103, GC_105, GC_106, GC_107
  44. 136.36 s gammaloop-nextest-integration> [2026-09-15 21:45:34.921] @gammaloop_api::se... INFO : Running command run set_model_parameters
  45. 136.36 s gammaloop-nextest-integration> [2026-09-15 21:45:34.921] @gammaloop_api::se... INFO : Starting command block set_model_parameters
  46. 136.36 s gammaloop-nextest-integration> [2026-09-15 21:45:34.921] @gammaloop_api::se... INFO : Running command set model MT=173.0
  47. 136.36 s gammaloop-nextest-integration> [2026-09-15 21:45:34.926] @gammaloop_api::se... INFO : Running command set model WT=0.0
  48. 136.36 s gammaloop-nextest-integration> [2026-09-15 21:45:34.931] @gammaloop_api::se... INFO : Running command set model ymt=173.0
  49. 136.36 s gammaloop-nextest-integration> [2026-09-15 21:45:34.936] @gammaloop_api::se... INFO : Running command set model aS=0.118
  50. 136.36 s gammaloop-nextest-integration> [2026-09-15 21:45:34.940] @gammaloop_api::se... INFO : Running command set model aEWM1=137.036
  51. 136.36 s gammaloop-nextest-integration> [2026-09-15 21:45:34.945] @gammaloop_api::se... INFO : Running command set model Gf=1.166390e-05
  52. 136.36 s gammaloop-nextest-integration> [2026-09-15 21:45:34.950] @gammaloop_api::se... INFO : Running command set model MZ=91.188
  53. 136.36 s gammaloop-nextest-integration> [2026-09-15 21:45:34.955] @gammaloop_api::se... INFO : Running command set global string '
  54. 136.36 s gammaloop-nextest-integration> [global.generation.compile]
  55. 136.36 s gammaloop-nextest-integration> compilation_mode = "symjit"
  56. 136.36 s gammaloop-nextest-integration> optimization_level = "O0"
  57. 136.36 s gammaloop-nextest-integration> fast_math = false
  58. 136.36 s gammaloop-nextest-integration> [...]
  59. 136.36 s gammaloop-nextest-integration> [2026-09-15 21:45:34.956] @gammaloop_api::se... INFO : Running command import graphs ./examples/cli/aa_aa/1L/aa_aa_1L.dot -p aa_aa_all_helicities -i 1L_ppmm -o
  60. 136.36 s gammaloop-nextest-integration> [2026-09-15 21:45:34.956] @commands::import INFO : Loading graphs from '/build/source/examples/cli/aa_aa/1L/aa_aa_1L.dot'
  61. 136.36 s gammaloop-nextest-integration> [2026-09-15 21:45:34.965] @gammaloop_api::se... INFO : Running command generate existing -p aa_aa_all_helicities
  62. 136.36 s gammaloop-nextest-integration> The application panicked (crashed).
  63. 136.36 s gammaloop-nextest-integration> Message: label _func_power_ not found
  64. 136.36 s gammaloop-nextest-integration> Location: /nix/store/n9w914kh1cm59xx3spcs831cdyb56m32-vendor-cargo-deps/c19b7c6f923b580ac259164a89f2577984ad5ab09ee9d583b888f934adbbe8d0/symjit-2.25.6/src/symjit/assembler.rs:77
  65. 136.36 s gammaloop-nextest-integration>
  66. 136.36 s gammaloop-nextest-integration> ━━━━━━━━━━━━━━━━━━━━━━━━━━━━━━━━━━ BACKTRACE ━━━━━━━━━━━━━━━━━━━━━━━━━━━━━━━━━━━
  67. 136.36 s gammaloop-nextest-integration> 1: <color_eyre[51793ea62743adbd]::config::PanicHook>::panic_report<unknown>
  68. 136.36 s gammaloop-nextest-integration> at <unknown source file>:<unknown line>
  69. 136.36 s gammaloop-nextest-integration> 2: <color_eyre[51793ea62743adbd]::config::PanicHook>::into_panic_hook::{closure#0}<unknown>
  70. 136.36 s gammaloop-nextest-integration> at <unknown source file>:<unknown line>
  71. 136.36 s gammaloop-nextest-integration> 3: std[bcb96dfbba0ab899]::panicking::panic_with_hook<unknown>
  72. 136.36 s gammaloop-nextest-integration> at <unknown source file>:<unknown line>
  73. 136.36 s gammaloop-nextest-integration> 4: std[bcb96dfbba0ab899]::panicking::panic_handler::{closure#0}<unknown>
  74. 136.36 s gammaloop-nextest-integration> at <unknown source file>:<unknown line>
  75. 136.36 s gammaloop-nextest-integration> 5: std[bcb96dfbba0ab899]::sys::backtrace::__rust_end_short_backtrace::<std[bcb96dfbba0ab899]::panicking::panic_handler::{closure#0}, !><unknown>
  76. 136.36 s gammaloop-nextest-integration> at <unknown source file>:<unknown line>
  77. 136.36 s gammaloop-nextest-integration> 6: __rustc[6c289b9f9c454d21]::rust_begin_unwind<unknown>
  78. 136.36 s gammaloop-nextest-integration> at <unknown source file>:<unknown line>
  79. 136.36 s gammaloop-nextest-integration> 7: core[940e698046960fd5]::panicking::panic_fmt<unknown>
  80. 136.36 s gammaloop-nextest-integration> at <unknown source file>:<unknown line>
  81. 136.36 s gammaloop-nextest-integration> 8: <symjit[e408de789c333cd]::symjit::assembler::Assembler>::apply_jumps<unknown>
  82. 136.36 s gammaloop-nextest-integration> at <unknown source file>:<unknown line>
  83. 136.36 s gammaloop-nextest-integration> 9: <symjit[e408de789c333cd]::symjit::builder::Builder>::compile_from_mir::<symjit[e408de789c333cd]::symjit::amd::complex::AmdComplexGenerator><unknown>
  84. 136.36 s gammaloop-nextest-integration> at <unknown source file>:<unknown line>
  85. 136.36 s gammaloop-nextest-integration> 10: <symjit[e408de789c333cd]::symjit::runnable::Application>::compile_ty<unknown>
  86. 136.36 s gammaloop-nextest-integration> at <unknown source file>:<unknown line>
  87. 136.36 s gammaloop-nextest-integration> 11: <symjit[e408de789c333cd]::symjit::runnable::Application>::with_mir<unknown>
  88. 136.36 s gammaloop-nextest-integration> at <unknown source file>:<unknown line>
  89. 136.36 s gammaloop-nextest-integration> 12: <symjit[e408de789c333cd]::symjit::composer::DirectTranslator as symjit[e408de789c333cd]::symjit::composer::Composer>::compile<unknown>
  90. 136.36 s gammaloop-nextest-integration> at <unknown source file>:<unknown line>
  91. 136.36 s gammaloop-nextest-integration> 13: <symjit[e408de789c333cd]::symjit::compiler::Translator as symjit[e408de789c333cd]::symjit::composer::Composer>::compile<unknown>
  92. 136.36 s gammaloop-nextest-integration> at <unknown source file>:<unknown line>
  93. 136.36 s gammaloop-nextest-integration> 14: <numerica[124dab8567f4861e]::domains::float::complex::Complex<f64> as symbolica[10e259bab675d243]::evaluate::backend::JITCompiledNumber>::jit_compile<unknown>
  94. 136.36 s gammaloop-nextest-integration> at <unknown source file>:<unknown line>
  95. 136.36 s gammaloop-nextest-integration> 15: <symbolica[10e259bab675d243]::evaluate::evaluator::ExpressionEvaluator<numerica[124dab8567f4861e]::domains::float::complex::Complex<f64>>>::jit_compile<unknown>
  96. 136.36 s gammaloop-nextest-integration> at <unknown source file>:<unknown line>
  97. 136.36 s gammaloop-nextest-integration> 16: <gammalooprs[917cbd3df9e68f8f]::integrands::process::evaluators::GenericEvaluator>::activate_symjit<unknown>
  98. 136.36 s gammaloop-nextest-integration> at <unknown source file>:<unknown line>
  99. 136.36 s gammaloop-nextest-integration> 17: <gammalooprs[917cbd3df9e68f8f]::integrands::process::amplitude::AmplitudeIntegrand>::prepare_runtime_backends_after_generation_with_compile_times<unknown>
  100. 136.36 s gammaloop-nextest-integration> at <unknown source file>:<unknown line>
  101. 136.36 s gammaloop-nextest-integration> 18: <gammalooprs[917cbd3df9e68f8f]::processes::amplitude::Amplitude>::build_integrand<unknown>
  102. 136.36 s gammaloop-nextest-integration> at <unknown source file>:<unknown line>
  103. 136.36 s gammaloop-nextest-integration> 19: <gammalooprs[917cbd3df9e68f8f]::processes::process::Process>::generate_integrands<unknown>
  104. 136.36 s gammaloop-nextest-integration> at <unknown source file>:<unknown line>
  105. 136.36 s gammaloop-nextest-integration> 20: <gammaloop_api[9ebf6628f97aeb57]::state::State>::generate_integrand<unknown>
  106. 136.36 s gammaloop-nextest-integration> at <unknown source file>:<unknown line>
  107. 136.36 s gammaloop-nextest-integration> 21: <gammaloop_api[9ebf6628f97aeb57]::commands::generate::Generate>::run::<&std[bcb96dfbba0ab899]::path::PathBuf><unknown>
  108. 136.36 s gammaloop-nextest-integration> at <unknown source file>:<unknown line>
  109. 136.36 s gammaloop-nextest-integration> 22: <gammaloop_api[9ebf6628f97aeb57]::commands::Commands>::run<unknown>
  110. 136.36 s gammaloop-nextest-integration> at <unknown source file>:<unknown line>
  111. 136.36 s gammaloop-nextest-integration> 23: <gammaloop_api[9ebf6628f97aeb57]::session::CliSession>::execute_prepared<unknown>
  112. 136.36 s gammaloop-nextest-integration> at <unknown source file>:<unknown line>
  113. 136.36 s gammaloop-nextest-integration> 24: <gammaloop_api[9ebf6628f97aeb57]::session::CliSession>::execute_command<unknown>
  114. 136.36 s gammaloop-nextest-integration> at <unknown source file>:<unknown line>
  115. 136.36 s gammaloop-nextest-integration> 25: <gammaloop_integration_tests[191607b70c61cd5a]::CLIState>::run_command<unknown>
  116. 136.36 s gammaloop-nextest-integration> at <unknown source file>:<unknown line>
  117. 136.36 s gammaloop-nextest-integration> 26: test_runs[9b7e2dc2dc4f29b0]::aa_aa::generate_aa_aa_helicity_family<unknown>
  118. 136.36 s gammaloop-nextest-integration> at <unknown source file>:<unknown line>
  119. 136.36 s gammaloop-nextest-integration> 27: <test_runs[9b7e2dc2dc4f29b0]::aa_aa::important::aa_aa_local_inspect_backend_consistency::{closure#0} as core[940e698046960fd5]::ops::function::FnOnce<()>>::call_once<unknown>
  120. 136.36 s gammaloop-nextest-integration> at <unknown source file>:<unknown line>
  121. 136.36 s gammaloop-nextest-integration> 28: serial_test[cd99724524a2f1c0]::serial_code_lock::local_serial_core_with_return::<(), eyre[cb2fd339c0c40fca]::Report><unknown>
  122. 136.36 s gammaloop-nextest-integration> at <unknown source file>:<unknown line>
  123. 136.36 s gammaloop-nextest-integration> 29: <test_runs[9b7e2dc2dc4f29b0]::aa_aa::important::aa_aa_local_inspect_backend_consistency::{closure#0} as core[940e698046960fd5]::ops::function::FnOnce<()>>::call_once<unknown>
  124. 136.36 s gammaloop-nextest-integration> at <unknown source file>:<unknown line>
  125. 136.36 s gammaloop-nextest-integration> 30: test[75d6903177b1d7e9]::__rust_begin_short_backtrace::<core[940e698046960fd5]::result::Result<(), alloc[2ea6bcb46fca0c42]::string::String>, fn() -> core[940e698046960fd5]::result::Result<(), alloc[2ea6bcb46fca0c42]::string::String>><unknown>
  126. 136.36 s gammaloop-nextest-integration> at <unknown source file>:<unknown line>
  127. 136.36 s gammaloop-nextest-integration> 31: test[75d6903177b1d7e9]::run_test::{closure#0}<unknown>
  128. 136.36 s gammaloop-nextest-integration> at <unknown source file>:<unknown line>
  129. 136.36 s gammaloop-nextest-integration> 32: std[bcb96dfbba0ab899]::sys::backtrace::__rust_begin_short_backtrace::<test[75d6903177b1d7e9]::run_test::{closure#1}, ()><unknown>
  130. 136.36 s gammaloop-nextest-integration> at <unknown source file>:<unknown line>
  131. 136.36 s gammaloop-nextest-integration> 33: <std[bcb96dfbba0ab899]::thread::lifecycle::spawn_unchecked<test[75d6903177b1d7e9]::run_test::{closure#1}, ()>::{closure#1} as core[940e698046960fd5]::ops::function::FnOnce<()>>::call_once::{shim:vtable#0}<unknown>
  132. 136.36 s gammaloop-nextest-integration> at <unknown source file>:<unknown line>
  133. 136.36 s gammaloop-nextest-integration> 34: <std[bcb96dfbba0ab899]::sys::thread::unix::Thread>::new::thread_start<unknown>
  134. 136.36 s gammaloop-nextest-integration> at <unknown source file>:<unknown line>
  135. 136.36 s gammaloop-nextest-integration> 35: start_thread<unknown>
  136. 136.36 s gammaloop-nextest-integration> at <unknown source file>:<unknown line>
  137. 136.36 s gammaloop-nextest-integration> 36: __clone3<unknown>
  138. 136.36 s gammaloop-nextest-integration> at <unknown source file>:<unknown line>
  139. 136.36 s gammaloop-nextest-integration>
  140. 136.36 s gammaloop-nextest-integration> Run with COLORBT_SHOW_HIDDEN=1 environment variable to disable frame filtering.
  141. 136.36 s gammaloop-nextest-integration> Run with RUST_BACKTRACE=full to include source snippets.
  142. 136.36 s gammaloop-nextest-integration> Warning: SpanTrace capture is Unsupported.
  143. 136.36 s gammaloop-nextest-integration> Ensure that you've setup a tracing-error ErrorLayer and the semver versions are compatible
  144. 136.36 s gammaloop-nextest-integration>
  145. 198.23 s gammaloop-nextest-integration> FAIL [ 3.097s] (158/169) gammaloop-integration-tests::uv thermal_sunrise_uv
  146. 198.23 s gammaloop-nextest-integration> stdout ---
  147. 198.23 s gammaloop-nextest-integration>
  148. 198.23 s gammaloop-nextest-integration> running 1 test
  149. 198.23 s gammaloop-nextest-integration> test thermal_sunrise_uv ... FAILED
  150. 198.23 s gammaloop-nextest-integration>
  151. 198.23 s gammaloop-nextest-integration> failures:
  152. 198.23 s gammaloop-nextest-integration>
  153. 198.23 s gammaloop-nextest-integration> failures:
  154. 198.23 s gammaloop-nextest-integration> thermal_sunrise_uv
  155. 198.23 s gammaloop-nextest-integration>
  156. 198.23 s gammaloop-nextest-integration> test result: FAILED. 0 passed; 1 failed; 0 ignored; 0 measured; 31 filtered out; finished in 3.06s
  157. 198.23 s gammaloop-nextest-integration>
  158. 198.23 s gammaloop-nextest-integration> stderr ---
  159. 198.23 s gammaloop-nextest-integration> [2026-09-15 21:46:37.168] @gammaloop_api::se... INFO : Running command run generate
  160. 198.23 s gammaloop-nextest-integration> [2026-09-15 21:46:37.168] @gammaloop_api::se... INFO : Starting command block generate
  161. 198.23 s gammaloop-nextest-integration> [2026-09-15 21:46:37.168] @gammaloop_api::se... INFO : Running command import model sm-default.json
  162. 198.23 s gammaloop-nextest-integration> [2026-09-15 21:46:37.168] @import::model INFO : Loading built-in JSON model sm-default
  163. 198.23 s gammaloop-nextest-integration> [2026-09-15 21:46:37.366] @gammalooprs::model INFO : The following 15 external parameters were forced to zero by the restriction card:
  164. 198.23 s gammaloop-nextest-integration> lamWS, AWS, rhoWS, etaWS, ymc, yme, ymm, MC, Me, MM, WTau, muQ, muLe, muLmu, muLtau
  165. 198.23 s gammaloop-nextest-integration> [2026-09-15 21:46:37.366] @gammalooprs::model INFO : The following 34 vertex rules were removed by the restriction card:
  166. 198.23 s gammaloop-nextest-integration> V_82 -> (c~, d, G+) | V_83 -> (t~, d, G+) | V_84 -> (c~, s, G+) | V_85 -> (t~, s, G+) | V_86 -> (u~, b, G+) | V_87 -> (c~, b, G+) | V_90 -> (c~, d, W+) | V_91 -> (t~, d, W+) | V_92 -> (u~, s, W+) | V_94 -> (t~, s, W+) | V_95 -> (u~, b, W+) | V_96 -> (c~, b, W+) | V_101 -> (e+, e-, G0) | V_102 -> (mu+, mu-, G0) | V_104 -> (e+, e-, H) | V_105 -> (mu+, mu-, H) | V_110 -> (ve~, e-, G+) | V_111 -> (vm~, mu-, G+) | V_116 -> (b~, u, G-) | V_117 -> (d~, c, G-) | V_118 -> (s~, c, G-) | V_119 -> (b~, c, G-) | V_120 -> (d~, t, G-) | V_121 -> (s~, t, G-) | V_124 -> (s~, u, W-) | V_125 -> (b~, u, W-) | V_126 -> (d~, c, W-) | V_128 -> (b~, c, W-) | V_129 -> (d~, t, W-) | V_130 -> (s~, t, W-) | V_138 -> (c~, c, G0) | V_140 -> (c~, c, H) | V_145 -> (e+, ve, G-) | V_146 -> (mu+, vm, G-)
  167. 198.23 s gammaloop-nextest-integration> [2026-09-15 21:46:37.366] @gammalooprs::model INFO : The following 36 couplings were removed by the restriction card:
  168. 198.23 s gammaloop-nextest-integration> GC_13, GC_14, GC_16, GC_17, GC_18, GC_19, GC_20, GC_22, GC_23, GC_24, GC_25, GC_26, GC_28, GC_29, GC_42, GC_43, GC_44, GC_46, GC_47, GC_48, GC_84, GC_85, GC_86, GC_87, GC_88, GC_89, GC_90, GC_91, GC_92, GC_93, GC_101, GC_102, GC_103, GC_105, GC_106, GC_107
  169. 198.23 s gammaloop-nextest-integration> [2026-09-15 21:46:37.367] @gammaloop_api::se... INFO : Running command remove processes
  170. 198.23 s gammaloop-nextest-integration> [2026-09-15 21:46:37.367] @gammaloop_api::se... INFO : Running command generate amp {} > {} [{2}] | g u
  171. 198.23 s gammaloop-nextest-integration> --numerator-grouping group_identical_graphs_up_to_scalar_rescaling
  172. 198.23 s gammaloop-nextest-integration> --max-n-bridges 0
  173. 198.23 s gammaloop-nextest-integration> --number-of-factorized-loop-subtopologies 1 1
  174. 198.23 s gammaloop-nextest-integration> --number-of-anticommutating-loops 1 1
  175. 198.23 s gammaloop-nextest-integration> [...]
  176. 198.23 s gammaloop-nextest-integration> [2026-09-15 21:46:37.368] @feyngen::diagram_... INFO : 0s | Δ=0s | Starting Feynman graph generation with Symbolica...
  177. 198.23 s gammaloop-nextest-integration> [2026-09-15 21:46:37.369] @feyngen::diagram_... INFO : 0s | Δ=0s | Number of graphs resulting from Symbolica generation: 3
  178. 198.23 s gammaloop-nextest-integration> [2026-09-15 21:46:37.386] @feyngen::diagram_... INFO : 0s | Δ=0s | Number of graphs retained after removal of vetoed topologies: 2
  179. 198.23 s gammaloop-nextest-integration> [2026-09-15 21:46:37.389] @feyngen::diagram_... INFO : 0s | Δ=0s | Number of graphs after vertex info assignment: 2
  180. 198.23 s gammaloop-nextest-integration> [2026-09-15 21:46:37.389] @feyngen::diagram_... INFO : 0s | Δ=0s | Number of graphs after all complete graphs filters are applied: 2
  181. 198.23 s gammaloop-nextest-integration> [2026-09-15 21:46:37.389] @feyngen::diagram_... INFO : 0s | Δ=0s | Number of graphs after closed anticommutating chains analysis: 1
  182. 198.23 s gammaloop-nextest-integration> [2026-09-15 21:46:37.389] @feyngen::diagram_... INFO : 0s | Δ=0s | Number of graphs after symmetrization of external states: 1
  183. 198.23 s gammaloop-nextest-integration> [2026-09-15 21:46:37.392] @feyngen::diagram_... INFO : 0s | Δ=0s | Number of graphs after canonization of vertices, edges and flows (graph labels assigned here): 1
  184. 198.23 s gammaloop-nextest-integration> [2026-09-15 21:46:37.406] @feyngen::diagram_... INFO : 0s | Δ=0s | Number of graphs after numerator-aware grouping with strategy 'up to a scalar rescaling': 1 (1 isomorphically unique graph, 0 color zero, 0 lorentz zero, 0 grouped and 0 cancellation)
  185. 198.23 s gammaloop-nextest-integration> [2026-09-15 21:46:37.406] @feyngen::diagram_... INFO : ( Sum of the symmetry factors from each graph generated = -1/2 )
  186. 198.23 s gammaloop-nextest-integration> [2026-09-15 21:46:37.406] @commands::generate INFO : Generated amplitude 1 graphs.
  187. 198.23 s gammaloop-nextest-integration> [2026-09-15 21:46:37.406] @commands::generate INFO : Only diagram generation was requested, skipping integrand generation. You can generate integrands later using the 'generate existing <options>' command.
  188. 198.23 s gammaloop-nextest-integration> [2026-09-15 21:46:37.406] @gammaloop_api::se... INFO : Running command generate
  189. 198.23 s gammaloop-nextest-integration> The application panicked (crashed).
  190. 198.23 s gammaloop-nextest-integration> Message: label _func_power_ not found
  191. 198.23 s gammaloop-nextest-integration> Location: /nix/store/n9w914kh1cm59xx3spcs831cdyb56m32-vendor-cargo-deps/c19b7c6f923b580ac259164a89f2577984ad5ab09ee9d583b888f934adbbe8d0/symjit-2.25.6/src/symjit/assembler.rs:77
  192. 198.23 s gammaloop-nextest-integration>
  193. 198.23 s gammaloop-nextest-integration> ━━━━━━━━━━━━━━━━━━━━━━━━━━━━━━━━━━ BACKTRACE ━━━━━━━━━━━━━━━━━━━━━━━━━━━━━━━━━━━
  194. 198.23 s gammaloop-nextest-integration> 1: <color_eyre[51793ea62743adbd]::config::PanicHook>::panic_report<unknown>
  195. 198.23 s gammaloop-nextest-integration> at <unknown source file>:<unknown line>
  196. 198.23 s gammaloop-nextest-integration> 2: <color_eyre[51793ea62743adbd]::config::PanicHook>::into_panic_hook::{closure#0}<unknown>
  197. 198.23 s gammaloop-nextest-integration> at <unknown source file>:<unknown line>
  198. 198.23 s gammaloop-nextest-integration> 3: std[bcb96dfbba0ab899]::panicking::panic_with_hook<unknown>
  199. 198.23 s gammaloop-nextest-integration> at <unknown source file>:<unknown line>
  200. 198.23 s gammaloop-nextest-integration> 4: std[bcb96dfbba0ab899]::panicking::panic_handler::{closure#0}<unknown>
  201. 198.23 s gammaloop-nextest-integration> at <unknown source file>:<unknown line>
  202. 198.23 s gammaloop-nextest-integration> 5: std[bcb96dfbba0ab899]::sys::backtrace::__rust_end_short_backtrace::<std[bcb96dfbba0ab899]::panicking::panic_handler::{closure#0}, !><unknown>
  203. 198.23 s gammaloop-nextest-integration> at <unknown source file>:<unknown line>
  204. 198.23 s gammaloop-nextest-integration> 6: __rustc[6c289b9f9c454d21]::rust_begin_unwind<unknown>
  205. 198.23 s gammaloop-nextest-integration> at <unknown source file>:<unknown line>
  206. 198.23 s gammaloop-nextest-integration> 7: core[940e698046960fd5]::panicking::panic_fmt<unknown>
  207. 198.23 s gammaloop-nextest-integration> at <unknown source file>:<unknown line>
  208. 198.23 s gammaloop-nextest-integration> 8: <symjit[e408de789c333cd]::symjit::assembler::Assembler>::apply_jumps<unknown>
  209. 198.23 s gammaloop-nextest-integration> at <unknown source file>:<unknown line>
  210. 198.23 s gammaloop-nextest-integration> 9: <symjit[e408de789c333cd]::symjit::builder::Builder>::compile_from_mir::<symjit[e408de789c333cd]::symjit::amd::complex::AmdComplexGenerator><unknown>
  211. 198.23 s gammaloop-nextest-integration> at <unknown source file>:<unknown line>
  212. 198.23 s gammaloop-nextest-integration> 10: <symjit[e408de789c333cd]::symjit::runnable::Application>::compile_ty<unknown>
  213. 198.23 s gammaloop-nextest-integration> at <unknown source file>:<unknown line>
  214. 198.23 s gammaloop-nextest-integration> 11: <symjit[e408de789c333cd]::symjit::runnable::Application>::with_mir<unknown>
  215. 198.23 s gammaloop-nextest-integration> at <unknown source file>:<unknown line>
  216. 198.23 s gammaloop-nextest-integration> 12: <symjit[e408de789c333cd]::symjit::composer::DirectTranslator as symjit[e408de789c333cd]::symjit::composer::Composer>::compile<unknown>
  217. 198.23 s gammaloop-nextest-integration> at <unknown source file>:<unknown line>
  218. 198.23 s gammaloop-nextest-integration> 13: <symjit[e408de789c333cd]::symjit::compiler::Translator as symjit[e408de789c333cd]::symjit::composer::Composer>::compile<unknown>
  219. 198.23 s gammaloop-nextest-integration> at <unknown source file>:<unknown line>
  220. 198.23 s gammaloop-nextest-integration> 14: <numerica[124dab8567f4861e]::domains::float::complex::Complex<f64> as symbolica[10e259bab675d243]::evaluate::backend::JITCompiledNumber>::jit_compile<unknown>
  221. 198.23 s gammaloop-nextest-integration> at <unknown source file>:<unknown line>
  222. 198.23 s gammaloop-nextest-integration> 15: <symbolica[10e259bab675d243]::evaluate::evaluator::ExpressionEvaluator<numerica[124dab8567f4861e]::domains::float::complex::Complex<f64>>>::jit_compile<unknown>
  223. 198.23 s gammaloop-nextest-integration> at <unknown source file>:<unknown line>
  224. 198.23 s gammaloop-nextest-integration> 16: <gammalooprs[917cbd3df9e68f8f]::integrands::process::evaluators::GenericEvaluator>::activate_symjit<unknown>
  225. 198.23 s gammaloop-nextest-integration> at <unknown source file>:<unknown line>
  226. 198.23 s gammaloop-nextest-integration> 17: <gammalooprs[917cbd3df9e68f8f]::integrands::process::amplitude::AmplitudeIntegrand>::prepare_runtime_backends_after_generation_with_compile_times<unknown>
  227. 198.23 s gammaloop-nextest-integration> at <unknown source file>:<unknown line>
  228. 198.23 s gammaloop-nextest-integration> 18: <gammalooprs[917cbd3df9e68f8f]::processes::amplitude::Amplitude>::build_integrand<unknown>
  229. 198.23 s gammaloop-nextest-integration> at <unknown source file>:<unknown line>
  230. 198.23 s gammaloop-nextest-integration> 19: <gammalooprs[917cbd3df9e68f8f]::processes::process::Process>::generate_integrands<unknown>
  231. 198.23 s gammaloop-nextest-integration> at <unknown source file>:<unknown line>
  232. 198.23 s gammaloop-nextest-integration> 20: <gammalooprs[917cbd3df9e68f8f]::processes::ProcessList>::generate_integrands<unknown>
  233. 198.23 s gammaloop-nextest-integration> at <unknown source file>:<unknown line>
  234. 198.23 s gammaloop-nextest-integration> 21: <gammaloop_api[9ebf6628f97aeb57]::state::State>::generate_integrands<unknown>
  235. 198.23 s gammaloop-nextest-integration> at <unknown source file>:<unknown line>
  236. 198.23 s gammaloop-nextest-integration> 22: <gammaloop_api[9ebf6628f97aeb57]::commands::generate::Generate>::run::<&std[bcb96dfbba0ab899]::path::PathBuf><unknown>
  237. 198.23 s gammaloop-nextest-integration> at <unknown source file>:<unknown line>
  238. 198.23 s gammaloop-nextest-integration> 23: <gammaloop_api[9ebf6628f97aeb57]::commands::Commands>::run<unknown>
  239. 198.23 s gammaloop-nextest-integration> at <unknown source file>:<unknown line>
  240. 198.23 s gammaloop-nextest-integration> 24: <gammaloop_api[9ebf6628f97aeb57]::session::CliSession>::execute_prepared<unknown>
  241. 198.23 s gammaloop-nextest-integration> at <unknown source file>:<unknown line>
  242. 198.23 s gammaloop-nextest-integration> 25: <gammaloop_api[9ebf6628f97aeb57]::session::CliSession>::execute_prepared_commands<unknown>
  243. 198.23 s gammaloop-nextest-integration> at <unknown source file>:<unknown line>
  244. 198.23 s gammaloop-nextest-integration> 26: <gammaloop_api[9ebf6628f97aeb57]::session::CliSession>::execute_prepared<unknown>
  245. 198.23 s gammaloop-nextest-integration> at <unknown source file>:<unknown line>
  246. 198.23 s gammaloop-nextest-integration> 27: <gammaloop_api[9ebf6628f97aeb57]::session::CliSession>::execute_command<unknown>
  247. 198.23 s gammaloop-nextest-integration> at <unknown source file>:<unknown line>
  248. 198.23 s gammaloop-nextest-integration> 28: <gammaloop_integration_tests[191607b70c61cd5a]::CLIState>::run_command<unknown>
  249. 198.23 s gammaloop-nextest-integration> at <unknown source file>:<unknown line>
  250. 198.23 s gammaloop-nextest-integration> 29: uv[3c7454ef256d6487]::run_single_integrated_uv_case<unknown>
  251. 198.23 s gammaloop-nextest-integration> at <unknown source file>:<unknown line>
  252. 198.23 s gammaloop-nextest-integration> 30: <uv[3c7454ef256d6487]::thermal_sunrise_uv::{closure#0} as core[940e698046960fd5]::ops::function::FnOnce<()>>::call_once<unknown>
  253. 198.23 s gammaloop-nextest-integration> at <unknown source file>:<unknown line>
  254. 198.23 s gammaloop-nextest-integration> 31: test[75d6903177b1d7e9]::__rust_begin_short_backtrace::<core[940e698046960fd5]::result::Result<(), alloc[2ea6bcb46fca0c42]::string::String>, fn() -> core[940e698046960fd5]::result::Result<(), alloc[2ea6bcb46fca0c42]::string::String>><unknown>
  255. 198.23 s gammaloop-nextest-integration> at <unknown source file>:<unknown line>
  256. 198.23 s gammaloop-nextest-integration> 32: test[75d6903177b1d7e9]::run_test::{closure#0}<unknown>
  257. 198.23 s gammaloop-nextest-integration> at <unknown source file>:<unknown line>
  258. 198.23 s gammaloop-nextest-integration> 33: std[bcb96dfbba0ab899]::sys::backtrace::__rust_begin_short_backtrace::<test[75d6903177b1d7e9]::run_test::{closure#1}, ()><unknown>
  259. 198.23 s gammaloop-nextest-integration> at <unknown source file>:<unknown line>
  260. 198.23 s gammaloop-nextest-integration> 34: <std[bcb96dfbba0ab899]::thread::lifecycle::spawn_unchecked<test[75d6903177b1d7e9]::run_test::{closure#1}, ()>::{closure#1} as core[940e698046960fd5]::ops::function::FnOnce<()>>::call_once::{shim:vtable#0}<unknown>
  261. 198.23 s gammaloop-nextest-integration> at <unknown source file>:<unknown line>
  262. 198.23 s gammaloop-nextest-integration> 35: <std[bcb96dfbba0ab899]::sys::thread::unix::Thread>::new::thread_start<unknown>
  263. 198.23 s gammaloop-nextest-integration> at <unknown source file>:<unknown line>
  264. 198.23 s gammaloop-nextest-integration> 36: start_thread<unknown>
  265. 198.23 s gammaloop-nextest-integration> at <unknown source file>:<unknown line>
  266. 198.23 s gammaloop-nextest-integration> 37: __clone3<unknown>
  267. 198.23 s gammaloop-nextest-integration> at <unknown source file>:<unknown line>
  268. 198.23 s gammaloop-nextest-integration>
  269. 198.23 s gammaloop-nextest-integration> Run with COLORBT_SHOW_HIDDEN=1 environment variable to disable frame filtering.
  270. 198.23 s gammaloop-nextest-integration> Run with RUST_BACKTRACE=full to include source snippets.
  271. 198.23 s gammaloop-nextest-integration> Warning: SpanTrace capture is Unsupported.
  272. 198.23 s gammaloop-nextest-integration> Ensure that you've setup a tracing-error ErrorLayer and the semver versions are compatible
  273. 198.23 s gammaloop-nextest-integration>
  274. 257.59 s gammaloop-nextest-integration> ------------
  275. 257.59 s gammaloop-nextest-integration> Summary [ 227.631s] 169 tests run: 167 passed, 2 failed, 209 skipped
  276. 257.59 s gammaloop-nextest-integration> FAIL [ 3.204s] ( 55/169) gammaloop-integration-tests::test_runs aa_aa::important::aa_aa_local_inspect_backend_consistency
  277. 257.59 s gammaloop-nextest-integration> stdout ---
  278. 257.59 s gammaloop-nextest-integration>
  279. 257.59 s gammaloop-nextest-integration> running 1 test
  280. 257.59 s gammaloop-nextest-integration> test aa_aa::important::aa_aa_local_inspect_backend_consistency ... FAILED
  281. 257.59 s gammaloop-nextest-integration>
  282. 257.59 s gammaloop-nextest-integration> failures:
  283. 257.59 s gammaloop-nextest-integration>
  284. 257.59 s gammaloop-nextest-integration> failures:
  285. 257.59 s gammaloop-nextest-integration> aa_aa::important::aa_aa_local_inspect_backend_consistency
  286. 257.59 s gammaloop-nextest-integration>
  287. 257.59 s gammaloop-nextest-integration> test result: FAILED. 0 passed; 1 failed; 0 ignored; 0 measured; 273 filtered out; finished in 3.19s
  288. 257.59 s gammaloop-nextest-integration>
  289. 257.59 s gammaloop-nextest-integration> stderr ---
  290. 257.59 s gammaloop-nextest-integration> [2026-09-15 21:45:34.897] @gammaloop_api::se... INFO : Running command import model sm-default.json
  291. 257.59 s gammaloop-nextest-integration> [2026-09-15 21:45:34.897] @import::model INFO : Loading built-in JSON model sm-default
  292. 257.59 s gammaloop-nextest-integration> [2026-09-15 21:45:34.920] @gammalooprs::model INFO : The following 15 external parameters were forced to zero by the restriction card:
  293. 257.59 s gammaloop-nextest-integration> lamWS, AWS, rhoWS, etaWS, ymc, yme, ymm, MC, Me, MM, WTau, muQ, muLe, muLmu, muLtau
  294. 257.59 s gammaloop-nextest-integration> [2026-09-15 21:45:34.920] @gammalooprs::model INFO : The following 34 vertex rules were removed by the restriction card:
  295. 257.59 s gammaloop-nextest-integration> V_82 -> (c~, d, G+) | V_83 -> (t~, d, G+) | V_84 -> (c~, s, G+) | V_85 -> (t~, s, G+) | V_86 -> (u~, b, G+) | V_87 -> (c~, b, G+) | V_90 -> (c~, d, W+) | V_91 -> (t~, d, W+) | V_92 -> (u~, s, W+) | V_94 -> (t~, s, W+) | V_95 -> (u~, b, W+) | V_96 -> (c~, b, W+) | V_101 -> (e+, e-, G0) | V_102 -> (mu+, mu-, G0) | V_104 -> (e+, e-, H) | V_105 -> (mu+, mu-, H) | V_110 -> (ve~, e-, G+) | V_111 -> (vm~, mu-, G+) | V_116 -> (b~, u, G-) | V_117 -> (d~, c, G-) | V_118 -> (s~, c, G-) | V_119 -> (b~, c, G-) | V_120 -> (d~, t, G-) | V_121 -> (s~, t, G-) | V_124 -> (s~, u, W-) | V_125 -> (b~, u, W-) | V_126 -> (d~, c, W-) | V_128 -> (b~, c, W-) | V_129 -> (d~, t, W-) | V_130 -> (s~, t, W-) | V_138 -> (c~, c, G0) | V_140 -> (c~, c, H) | V_145 -> (e+, ve, G-) | V_146 -> (mu+, vm, G-)
  296. 257.59 s gammaloop-nextest-integration> [2026-09-15 21:45:34.920] @gammalooprs::model INFO : The following 36 couplings were removed by the restriction card:
  297. 257.59 s gammaloop-nextest-integration> GC_13, GC_14, GC_16, GC_17, GC_18, GC_19, GC_20, GC_22, GC_23, GC_24, GC_25, GC_26, GC_28, GC_29, GC_42, GC_43, GC_44, GC_46, GC_47, GC_48, GC_84, GC_85, GC_86, GC_87, GC_88, GC_89, GC_90, GC_91, GC_92, GC_93, GC_101, GC_102, GC_103, GC_105, GC_106, GC_107
  298. 257.59 s gammaloop-nextest-integration> [2026-09-15 21:45:34.921] @gammaloop_api::se... INFO : Running command run set_model_parameters
  299. 257.59 s gammaloop-nextest-integration> [2026-09-15 21:45:34.921] @gammaloop_api::se... INFO : Starting command block set_model_parameters
  300. 257.59 s gammaloop-nextest-integration> [2026-09-15 21:45:34.921] @gammaloop_api::se... INFO : Running command set model MT=173.0
  301. 257.59 s gammaloop-nextest-integration> [2026-09-15 21:45:34.926] @gammaloop_api::se... INFO : Running command set model WT=0.0
  302. 257.59 s gammaloop-nextest-integration> [2026-09-15 21:45:34.931] @gammaloop_api::se... INFO : Running command set model ymt=173.0
  303. 257.59 s gammaloop-nextest-integration> [2026-09-15 21:45:34.936] @gammaloop_api::se... INFO : Running command set model aS=0.118
  304. 257.59 s gammaloop-nextest-integration> [2026-09-15 21:45:34.940] @gammaloop_api::se... INFO : Running command set model aEWM1=137.036
  305. 257.59 s gammaloop-nextest-integration> [2026-09-15 21:45:34.945] @gammaloop_api::se... INFO : Running command set model Gf=1.166390e-05
  306. 257.59 s gammaloop-nextest-integration> [2026-09-15 21:45:34.950] @gammaloop_api::se... INFO : Running command set model MZ=91.188
  307. 257.59 s gammaloop-nextest-integration> [2026-09-15 21:45:34.955] @gammaloop_api::se... INFO : Running command set global string '
  308. 257.59 s gammaloop-nextest-integration> [global.generation.compile]
  309. 257.59 s gammaloop-nextest-integration> compilation_mode = "symjit"
  310. 257.59 s gammaloop-nextest-integration> optimization_level = "O0"
  311. 257.59 s gammaloop-nextest-integration> fast_math = false
  312. 257.59 s gammaloop-nextest-integration> [...]
  313. 257.59 s gammaloop-nextest-integration> [2026-09-15 21:45:34.956] @gammaloop_api::se... INFO : Running command import graphs ./examples/cli/aa_aa/1L/aa_aa_1L.dot -p aa_aa_all_helicities -i 1L_ppmm -o
  314. 257.59 s gammaloop-nextest-integration> [2026-09-15 21:45:34.956] @commands::import INFO : Loading graphs from '/build/source/examples/cli/aa_aa/1L/aa_aa_1L.dot'
  315. 257.59 s gammaloop-nextest-integration> [2026-09-15 21:45:34.965] @gammaloop_api::se... INFO : Running command generate existing -p aa_aa_all_helicities
  316. 257.59 s gammaloop-nextest-integration> The application panicked (crashed).
  317. 257.59 s gammaloop-nextest-integration> Message: label _func_power_ not found
  318. 257.59 s gammaloop-nextest-integration> Location: /nix/store/n9w914kh1cm59xx3spcs831cdyb56m32-vendor-cargo-deps/c19b7c6f923b580ac259164a89f2577984ad5ab09ee9d583b888f934adbbe8d0/symjit-2.25.6/src/symjit/assembler.rs:77
  319. 257.59 s gammaloop-nextest-integration>
  320. 257.59 s gammaloop-nextest-integration> ━━━━━━━━━━━━━━━━━━━━━━━━━━━━━━━━━━ BACKTRACE ━━━━━━━━━━━━━━━━━━━━━━━━━━━━━━━━━━━
  321. 257.59 s gammaloop-nextest-integration> 1: <color_eyre[51793ea62743adbd]::config::PanicHook>::panic_report<unknown>
  322. 257.59 s gammaloop-nextest-integration> at <unknown source file>:<unknown line>
  323. 257.59 s gammaloop-nextest-integration> 2: <color_eyre[51793ea62743adbd]::config::PanicHook>::into_panic_hook::{closure#0}<unknown>
  324. 257.59 s gammaloop-nextest-integration> at <unknown source file>:<unknown line>
  325. 257.59 s gammaloop-nextest-integration> 3: std[bcb96dfbba0ab899]::panicking::panic_with_hook<unknown>
  326. 257.59 s gammaloop-nextest-integration> at <unknown source file>:<unknown line>
  327. 257.59 s gammaloop-nextest-integration> 4: std[bcb96dfbba0ab899]::panicking::panic_handler::{closure#0}<unknown>
  328. 257.59 s gammaloop-nextest-integration> at <unknown source file>:<unknown line>
  329. 257.59 s gammaloop-nextest-integration> 5: std[bcb96dfbba0ab899]::sys::backtrace::__rust_end_short_backtrace::<std[bcb96dfbba0ab899]::panicking::panic_handler::{closure#0}, !><unknown>
  330. 257.59 s gammaloop-nextest-integration> at <unknown source file>:<unknown line>
  331. 257.59 s gammaloop-nextest-integration> 6: __rustc[6c289b9f9c454d21]::rust_begin_unwind<unknown>
  332. 257.59 s gammaloop-nextest-integration> at <unknown source file>:<unknown line>
  333. 257.59 s gammaloop-nextest-integration> 7: core[940e698046960fd5]::panicking::panic_fmt<unknown>
  334. 257.59 s gammaloop-nextest-integration> at <unknown source file>:<unknown line>
  335. 257.59 s gammaloop-nextest-integration> 8: <symjit[e408de789c333cd]::symjit::assembler::Assembler>::apply_jumps<unknown>
  336. 257.59 s gammaloop-nextest-integration> at <unknown source file>:<unknown line>
  337. 257.59 s gammaloop-nextest-integration> 9: <symjit[e408de789c333cd]::symjit::builder::Builder>::compile_from_mir::<symjit[e408de789c333cd]::symjit::amd::complex::AmdComplexGenerator><unknown>
  338. 257.59 s gammaloop-nextest-integration> at <unknown source file>:<unknown line>
  339. 257.59 s gammaloop-nextest-integration> 10: <symjit[e408de789c333cd]::symjit::runnable::Application>::compile_ty<unknown>
  340. 257.59 s gammaloop-nextest-integration> at <unknown source file>:<unknown line>
  341. 257.59 s gammaloop-nextest-integration> 11: <symjit[e408de789c333cd]::symjit::runnable::Application>::with_mir<unknown>
  342. 257.59 s gammaloop-nextest-integration> at <unknown source file>:<unknown line>
  343. 257.59 s gammaloop-nextest-integration> 12: <symjit[e408de789c333cd]::symjit::composer::DirectTranslator as symjit[e408de789c333cd]::symjit::composer::Composer>::compile<unknown>
  344. 257.59 s gammaloop-nextest-integration> at <unknown source file>:<unknown line>
  345. 257.59 s gammaloop-nextest-integration> 13: <symjit[e408de789c333cd]::symjit::compiler::Translator as symjit[e408de789c333cd]::symjit::composer::Composer>::compile<unknown>
  346. 257.59 s gammaloop-nextest-integration> at <unknown source file>:<unknown line>
  347. 257.59 s gammaloop-nextest-integration> 14: <numerica[124dab8567f4861e]::domains::float::complex::Complex<f64> as symbolica[10e259bab675d243]::evaluate::backend::JITCompiledNumber>::jit_compile<unknown>
  348. 257.59 s gammaloop-nextest-integration> at <unknown source file>:<unknown line>
  349. 257.59 s gammaloop-nextest-integration> 15: <symbolica[10e259bab675d243]::evaluate::evaluator::ExpressionEvaluator<numerica[124dab8567f4861e]::domains::float::complex::Complex<f64>>>::jit_compile<unknown>
  350. 257.59 s gammaloop-nextest-integration> at <unknown source file>:<unknown line>
  351. 257.59 s gammaloop-nextest-integration> 16: <gammalooprs[917cbd3df9e68f8f]::integrands::process::evaluators::GenericEvaluator>::activate_symjit<unknown>
  352. 257.59 s gammaloop-nextest-integration> at <unknown source file>:<unknown line>
  353. 257.59 s gammaloop-nextest-integration> 17: <gammalooprs[917cbd3df9e68f8f]::integrands::process::amplitude::AmplitudeIntegrand>::prepare_runtime_backends_after_generation_with_compile_times<unknown>
  354. 257.59 s gammaloop-nextest-integration> at <unknown source file>:<unknown line>
  355. 257.59 s gammaloop-nextest-integration> 18: <gammalooprs[917cbd3df9e68f8f]::processes::amplitude::Amplitude>::build_integrand<unknown>
  356. 257.59 s gammaloop-nextest-integration> at <unknown source file>:<unknown line>
  357. 257.59 s gammaloop-nextest-integration> 19: <gammalooprs[917cbd3df9e68f8f]::processes::process::Process>::generate_integrands<unknown>
  358. 257.59 s gammaloop-nextest-integration> at <unknown source file>:<unknown line>
  359. 257.59 s gammaloop-nextest-integration> 20: <gammaloop_api[9ebf6628f97aeb57]::state::State>::generate_integrand<unknown>
  360. 257.59 s gammaloop-nextest-integration> at <unknown source file>:<unknown line>
  361. 257.59 s gammaloop-nextest-integration> 21: <gammaloop_api[9ebf6628f97aeb57]::commands::generate::Generate>::run::<&std[bcb96dfbba0ab899]::path::PathBuf><unknown>
  362. 257.59 s gammaloop-nextest-integration> at <unknown source file>:<unknown line>
  363. 257.59 s gammaloop-nextest-integration> 22: <gammaloop_api[9ebf6628f97aeb57]::commands::Commands>::run<unknown>
  364. 257.59 s gammaloop-nextest-integration> at <unknown source file>:<unknown line>
  365. 257.59 s gammaloop-nextest-integration> 23: <gammaloop_api[9ebf6628f97aeb57]::session::CliSession>::execute_prepared<unknown>
  366. 257.59 s gammaloop-nextest-integration> at <unknown source file>:<unknown line>
  367. 257.59 s gammaloop-nextest-integration> 24: <gammaloop_api[9ebf6628f97aeb57]::session::CliSession>::execute_command<unknown>
  368. 257.59 s gammaloop-nextest-integration> at <unknown source file>:<unknown line>
  369. 257.59 s gammaloop-nextest-integration> 25: <gammaloop_integration_tests[191607b70c61cd5a]::CLIState>::run_command<unknown>
  370. 257.59 s gammaloop-nextest-integration> at <unknown source file>:<unknown line>
  371. 257.59 s gammaloop-nextest-integration> 26: test_runs[9b7e2dc2dc4f29b0]::aa_aa::generate_aa_aa_helicity_family<unknown>
  372. 257.59 s gammaloop-nextest-integration> at <unknown source file>:<unknown line>
  373. 257.59 s gammaloop-nextest-integration> 27: <test_runs[9b7e2dc2dc4f29b0]::aa_aa::important::aa_aa_local_inspect_backend_consistency::{closure#0} as core[940e698046960fd5]::ops::function::FnOnce<()>>::call_once<unknown>
  374. 257.59 s gammaloop-nextest-integration> at <unknown source file>:<unknown line>
  375. 257.59 s gammaloop-nextest-integration> 28: serial_test[cd99724524a2f1c0]::serial_code_lock::local_serial_core_with_return::<(), eyre[cb2fd339c0c40fca]::Report><unknown>
  376. 257.59 s gammaloop-nextest-integration> at <unknown source file>:<unknown line>
  377. 257.59 s gammaloop-nextest-integration> 29: <test_runs[9b7e2dc2dc4f29b0]::aa_aa::important::aa_aa_local_inspect_backend_consistency::{closure#0} as core[940e698046960fd5]::ops::function::FnOnce<()>>::call_once<unknown>
  378. 257.59 s gammaloop-nextest-integration> at <unknown source file>:<unknown line>
  379. 257.59 s gammaloop-nextest-integration> 30: test[75d6903177b1d7e9]::__rust_begin_short_backtrace::<core[940e698046960fd5]::result::Result<(), alloc[2ea6bcb46fca0c42]::string::String>, fn() -> core[940e698046960fd5]::result::Result<(), alloc[2ea6bcb46fca0c42]::string::String>><unknown>
  380. 257.59 s gammaloop-nextest-integration> at <unknown source file>:<unknown line>
  381. 257.59 s gammaloop-nextest-integration> 31: test[75d6903177b1d7e9]::run_test::{closure#0}<unknown>
  382. 257.59 s gammaloop-nextest-integration> at <unknown source file>:<unknown line>
  383. 257.59 s gammaloop-nextest-integration> 32: std[bcb96dfbba0ab899]::sys::backtrace::__rust_begin_short_backtrace::<test[75d6903177b1d7e9]::run_test::{closure#1}, ()><unknown>
  384. 257.59 s gammaloop-nextest-integration> at <unknown source file>:<unknown line>
  385. 257.59 s gammaloop-nextest-integration> 33: <std[bcb96dfbba0ab899]::thread::lifecycle::spawn_unchecked<test[75d6903177b1d7e9]::run_test::{closure#1}, ()>::{closure#1} as core[940e698046960fd5]::ops::function::FnOnce<()>>::call_once::{shim:vtable#0}<unknown>
  386. 257.59 s gammaloop-nextest-integration> at <unknown source file>:<unknown line>
  387. 257.59 s gammaloop-nextest-integration> 34: <std[bcb96dfbba0ab899]::sys::thread::unix::Thread>::new::thread_start<unknown>
  388. 257.59 s gammaloop-nextest-integration> at <unknown source file>:<unknown line>
  389. 257.59 s gammaloop-nextest-integration> 35: start_thread<unknown>
  390. 257.59 s gammaloop-nextest-integration> at <unknown source file>:<unknown line>
  391. 257.59 s gammaloop-nextest-integration> 36: __clone3<unknown>
  392. 257.59 s gammaloop-nextest-integration> at <unknown source file>:<unknown line>
  393. 257.59 s gammaloop-nextest-integration>
  394. 257.59 s gammaloop-nextest-integration> Run with COLORBT_SHOW_HIDDEN=1 environment variable to disable frame filtering.
  395. 257.59 s gammaloop-nextest-integration> Run with RUST_BACKTRACE=full to include source snippets.
  396. 257.59 s gammaloop-nextest-integration> Warning: SpanTrace capture is Unsupported.
  397. 257.59 s gammaloop-nextest-integration> Ensure that you've setup a tracing-error ErrorLayer and the semver versions are compatible
  398. 257.59 s gammaloop-nextest-integration>
  399. 257.59 s gammaloop-nextest-integration> FAIL [ 3.097s] (158/169) gammaloop-integration-tests::uv thermal_sunrise_uv
  400. 257.59 s gammaloop-nextest-integration> stdout ---
  401. 257.59 s gammaloop-nextest-integration>
  402. 257.59 s gammaloop-nextest-integration> running 1 test
  403. 257.59 s gammaloop-nextest-integration> test thermal_sunrise_uv ... FAILED
  404. 257.59 s gammaloop-nextest-integration>
  405. 257.59 s gammaloop-nextest-integration> failures:
  406. 257.59 s gammaloop-nextest-integration>
  407. 257.59 s gammaloop-nextest-integration> failures:
  408. 257.59 s gammaloop-nextest-integration> thermal_sunrise_uv
  409. 257.59 s gammaloop-nextest-integration>
  410. 257.59 s gammaloop-nextest-integration> test result: FAILED. 0 passed; 1 failed; 0 ignored; 0 measured; 31 filtered out; finished in 3.06s
  411. 257.59 s gammaloop-nextest-integration>
  412. 257.59 s gammaloop-nextest-integration> stderr ---
  413. 257.59 s gammaloop-nextest-integration> [2026-09-15 21:46:37.168] @gammaloop_api::se... INFO : Running command run generate
  414. 257.59 s gammaloop-nextest-integration> [2026-09-15 21:46:37.168] @gammaloop_api::se... INFO : Starting command block generate
  415. 257.59 s gammaloop-nextest-integration> [2026-09-15 21:46:37.168] @gammaloop_api::se... INFO : Running command import model sm-default.json
  416. 257.59 s gammaloop-nextest-integration> [2026-09-15 21:46:37.168] @import::model INFO : Loading built-in JSON model sm-default
  417. 257.59 s gammaloop-nextest-integration> [2026-09-15 21:46:37.366] @gammalooprs::model INFO : The following 15 external parameters were forced to zero by the restriction card:
  418. 257.59 s gammaloop-nextest-integration> lamWS, AWS, rhoWS, etaWS, ymc, yme, ymm, MC, Me, MM, WTau, muQ, muLe, muLmu, muLtau
  419. 257.59 s gammaloop-nextest-integration> [2026-09-15 21:46:37.366] @gammalooprs::model INFO : The following 34 vertex rules were removed by the restriction card:
  420. 257.59 s gammaloop-nextest-integration> V_82 -> (c~, d, G+) | V_83 -> (t~, d, G+) | V_84 -> (c~, s, G+) | V_85 -> (t~, s, G+) | V_86 -> (u~, b, G+) | V_87 -> (c~, b, G+) | V_90 -> (c~, d, W+) | V_91 -> (t~, d, W+) | V_92 -> (u~, s, W+) | V_94 -> (t~, s, W+) | V_95 -> (u~, b, W+) | V_96 -> (c~, b, W+) | V_101 -> (e+, e-, G0) | V_102 -> (mu+, mu-, G0) | V_104 -> (e+, e-, H) | V_105 -> (mu+, mu-, H) | V_110 -> (ve~, e-, G+) | V_111 -> (vm~, mu-, G+) | V_116 -> (b~, u, G-) | V_117 -> (d~, c, G-) | V_118 -> (s~, c, G-) | V_119 -> (b~, c, G-) | V_120 -> (d~, t, G-) | V_121 -> (s~, t, G-) | V_124 -> (s~, u, W-) | V_125 -> (b~, u, W-) | V_126 -> (d~, c, W-) | V_128 -> (b~, c, W-) | V_129 -> (d~, t, W-) | V_130 -> (s~, t, W-) | V_138 -> (c~, c, G0) | V_140 -> (c~, c, H) | V_145 -> (e+, ve, G-) | V_146 -> (mu+, vm, G-)
  421. 257.59 s gammaloop-nextest-integration> [2026-09-15 21:46:37.366] @gammalooprs::model INFO : The following 36 couplings were removed by the restriction card:
  422. 257.59 s gammaloop-nextest-integration> GC_13, GC_14, GC_16, GC_17, GC_18, GC_19, GC_20, GC_22, GC_23, GC_24, GC_25, GC_26, GC_28, GC_29, GC_42, GC_43, GC_44, GC_46, GC_47, GC_48, GC_84, GC_85, GC_86, GC_87, GC_88, GC_89, GC_90, GC_91, GC_92, GC_93, GC_101, GC_102, GC_103, GC_105, GC_106, GC_107
  423. 257.59 s gammaloop-nextest-integration> [2026-09-15 21:46:37.367] @gammaloop_api::se... INFO : Running command remove processes
  424. 257.59 s gammaloop-nextest-integration> [2026-09-15 21:46:37.367] @gammaloop_api::se... INFO : Running command generate amp {} > {} [{2}] | g u
  425. 257.59 s gammaloop-nextest-integration> --numerator-grouping group_identical_graphs_up_to_scalar_rescaling
  426. 257.59 s gammaloop-nextest-integration> --max-n-bridges 0
  427. 257.59 s gammaloop-nextest-integration> --number-of-factorized-loop-subtopologies 1 1
  428. 257.59 s gammaloop-nextest-integration> --number-of-anticommutating-loops 1 1
  429. 257.59 s gammaloop-nextest-integration> [...]
  430. 257.59 s gammaloop-nextest-integration> [2026-09-15 21:46:37.368] @feyngen::diagram_... INFO : 0s | Δ=0s | Starting Feynman graph generation with Symbolica...
  431. 257.59 s gammaloop-nextest-integration> [2026-09-15 21:46:37.369] @feyngen::diagram_... INFO : 0s | Δ=0s | Number of graphs resulting from Symbolica generation: 3
  432. 257.59 s gammaloop-nextest-integration> [2026-09-15 21:46:37.386] @feyngen::diagram_... INFO : 0s | Δ=0s | Number of graphs retained after removal of vetoed topologies: 2
  433. 257.59 s gammaloop-nextest-integration> [2026-09-15 21:46:37.389] @feyngen::diagram_... INFO : 0s | Δ=0s | Number of graphs after vertex info assignment: 2
  434. 257.59 s gammaloop-nextest-integration> [2026-09-15 21:46:37.389] @feyngen::diagram_... INFO : 0s | Δ=0s | Number of graphs after all complete graphs filters are applied: 2
  435. 257.59 s gammaloop-nextest-integration> [2026-09-15 21:46:37.389] @feyngen::diagram_... INFO : 0s | Δ=0s | Number of graphs after closed anticommutating chains analysis: 1
  436. 257.59 s gammaloop-nextest-integration> [2026-09-15 21:46:37.389] @feyngen::diagram_... INFO : 0s | Δ=0s | Number of graphs after symmetrization of external states: 1
  437. 257.59 s gammaloop-nextest-integration> [2026-09-15 21:46:37.392] @feyngen::diagram_... INFO : 0s | Δ=0s | Number of graphs after canonization of vertices, edges and flows (graph labels assigned here): 1
  438. 257.59 s gammaloop-nextest-integration> [2026-09-15 21:46:37.406] @feyngen::diagram_... INFO : 0s | Δ=0s | Number of graphs after numerator-aware grouping with strategy 'up to a scalar rescaling': 1 (1 isomorphically unique graph, 0 color zero, 0 lorentz zero, 0 grouped and 0 cancellation)
  439. 257.59 s gammaloop-nextest-integration> [2026-09-15 21:46:37.406] @feyngen::diagram_... INFO : ( Sum of the symmetry factors from each graph generated = -1/2 )
  440. 257.59 s gammaloop-nextest-integration> [2026-09-15 21:46:37.406] @commands::generate INFO : Generated amplitude 1 graphs.
  441. 257.59 s gammaloop-nextest-integration> [2026-09-15 21:46:37.406] @commands::generate INFO : Only diagram generation was requested, skipping integrand generation. You can generate integrands later using the 'generate existing <options>' command.
  442. 257.59 s gammaloop-nextest-integration> [2026-09-15 21:46:37.406] @gammaloop_api::se... INFO : Running command generate
  443. 257.59 s gammaloop-nextest-integration> The application panicked (crashed).
  444. 257.59 s gammaloop-nextest-integration> Message: label _func_power_ not found
  445. 257.59 s gammaloop-nextest-integration> Location: /nix/store/n9w914kh1cm59xx3spcs831cdyb56m32-vendor-cargo-deps/c19b7c6f923b580ac259164a89f2577984ad5ab09ee9d583b888f934adbbe8d0/symjit-2.25.6/src/symjit/assembler.rs:77
  446. 257.59 s gammaloop-nextest-integration>
  447. 257.59 s gammaloop-nextest-integration> ━━━━━━━━━━━━━━━━━━━━━━━━━━━━━━━━━━ BACKTRACE ━━━━━━━━━━━━━━━━━━━━━━━━━━━━━━━━━━━
  448. 257.59 s gammaloop-nextest-integration> 1: <color_eyre[51793ea62743adbd]::config::PanicHook>::panic_report<unknown>
  449. 257.59 s gammaloop-nextest-integration> at <unknown source file>:<unknown line>
  450. 257.59 s gammaloop-nextest-integration> 2: <color_eyre[51793ea62743adbd]::config::PanicHook>::into_panic_hook::{closure#0}<unknown>
  451. 257.59 s gammaloop-nextest-integration> at <unknown source file>:<unknown line>
  452. 257.59 s gammaloop-nextest-integration> 3: std[bcb96dfbba0ab899]::panicking::panic_with_hook<unknown>
  453. 257.59 s gammaloop-nextest-integration> at <unknown source file>:<unknown line>
  454. 257.59 s gammaloop-nextest-integration> 4: std[bcb96dfbba0ab899]::panicking::panic_handler::{closure#0}<unknown>
  455. 257.59 s gammaloop-nextest-integration> at <unknown source file>:<unknown line>
  456. 257.59 s gammaloop-nextest-integration> 5: std[bcb96dfbba0ab899]::sys::backtrace::__rust_end_short_backtrace::<std[bcb96dfbba0ab899]::panicking::panic_handler::{closure#0}, !><unknown>
  457. 257.59 s gammaloop-nextest-integration> at <unknown source file>:<unknown line>
  458. 257.59 s gammaloop-nextest-integration> 6: __rustc[6c289b9f9c454d21]::rust_begin_unwind<unknown>
  459. 257.59 s gammaloop-nextest-integration> at <unknown source file>:<unknown line>
  460. 257.59 s gammaloop-nextest-integration> 7: core[940e698046960fd5]::panicking::panic_fmt<unknown>
  461. 257.59 s gammaloop-nextest-integration> at <unknown source file>:<unknown line>
  462. 257.59 s gammaloop-nextest-integration> 8: <symjit[e408de789c333cd]::symjit::assembler::Assembler>::apply_jumps<unknown>
  463. 257.59 s gammaloop-nextest-integration> at <unknown source file>:<unknown line>
  464. 257.59 s gammaloop-nextest-integration> 9: <symjit[e408de789c333cd]::symjit::builder::Builder>::compile_from_mir::<symjit[e408de789c333cd]::symjit::amd::complex::AmdComplexGenerator><unknown>
  465. 257.59 s gammaloop-nextest-integration> at <unknown source file>:<unknown line>
  466. 257.59 s gammaloop-nextest-integration> 10: <symjit[e408de789c333cd]::symjit::runnable::Application>::compile_ty<unknown>
  467. 257.59 s gammaloop-nextest-integration> at <unknown source file>:<unknown line>
  468. 257.59 s gammaloop-nextest-integration> 11: <symjit[e408de789c333cd]::symjit::runnable::Application>::with_mir<unknown>
  469. 257.59 s gammaloop-nextest-integration> at <unknown source file>:<unknown line>
  470. 257.59 s gammaloop-nextest-integration> 12: <symjit[e408de789c333cd]::symjit::composer::DirectTranslator as symjit[e408de789c333cd]::symjit::composer::Composer>::compile<unknown>
  471. 257.59 s gammaloop-nextest-integration> at <unknown source file>:<unknown line>
  472. 257.59 s gammaloop-nextest-integration> 13: <symjit[e408de789c333cd]::symjit::compiler::Translator as symjit[e408de789c333cd]::symjit::composer::Composer>::compile<unknown>
  473. 257.59 s gammaloop-nextest-integration> at <unknown source file>:<unknown line>
  474. 257.59 s gammaloop-nextest-integration> 14: <numerica[124dab8567f4861e]::domains::float::complex::Complex<f64> as symbolica[10e259bab675d243]::evaluate::backend::JITCompiledNumber>::jit_compile<unknown>
  475. 257.59 s gammaloop-nextest-integration> at <unknown source file>:<unknown line>
  476. 257.59 s gammaloop-nextest-integration> 15: <symbolica[10e259bab675d243]::evaluate::evaluator::ExpressionEvaluator<numerica[124dab8567f4861e]::domains::float::complex::Complex<f64>>>::jit_compile<unknown>
  477. 257.59 s gammaloop-nextest-integration> at <unknown source file>:<unknown line>
  478. 257.59 s gammaloop-nextest-integration> 16: <gammalooprs[917cbd3df9e68f8f]::integrands::process::evaluators::GenericEvaluator>::activate_symjit<unknown>
  479. 257.59 s gammaloop-nextest-integration> at <unknown source file>:<unknown line>
  480. 257.59 s gammaloop-nextest-integration> 17: <gammalooprs[917cbd3df9e68f8f]::integrands::process::amplitude::AmplitudeIntegrand>::prepare_runtime_backends_after_generation_with_compile_times<unknown>
  481. 257.59 s gammaloop-nextest-integration> at <unknown source file>:<unknown line>
  482. 257.59 s gammaloop-nextest-integration> 18: <gammalooprs[917cbd3df9e68f8f]::processes::amplitude::Amplitude>::build_integrand<unknown>
  483. 257.59 s gammaloop-nextest-integration> at <unknown source file>:<unknown line>
  484. 257.59 s gammaloop-nextest-integration> 19: <gammalooprs[917cbd3df9e68f8f]::processes::process::Process>::generate_integrands<unknown>
  485. 257.59 s gammaloop-nextest-integration> at <unknown source file>:<unknown line>
  486. 257.59 s gammaloop-nextest-integration> 20: <gammalooprs[917cbd3df9e68f8f]::processes::ProcessList>::generate_integrands<unknown>
  487. 257.59 s gammaloop-nextest-integration> at <unknown source file>:<unknown line>
  488. 257.59 s gammaloop-nextest-integration> 21: <gammaloop_api[9ebf6628f97aeb57]::state::State>::generate_integrands<unknown>
  489. 257.59 s gammaloop-nextest-integration> at <unknown source file>:<unknown line>
  490. 257.59 s gammaloop-nextest-integration> 22: <gammaloop_api[9ebf6628f97aeb57]::commands::generate::Generate>::run::<&std[bcb96dfbba0ab899]::path::PathBuf><unknown>
  491. 257.59 s gammaloop-nextest-integration> at <unknown source file>:<unknown line>
  492. 257.59 s gammaloop-nextest-integration> 23: <gammaloop_api[9ebf6628f97aeb57]::commands::Commands>::run<unknown>
  493. 257.59 s gammaloop-nextest-integration> at <unknown source file>:<unknown line>
  494. 257.59 s gammaloop-nextest-integration> 24: <gammaloop_api[9ebf6628f97aeb57]::session::CliSession>::execute_prepared<unknown>
  495. 257.59 s gammaloop-nextest-integration> at <unknown source file>:<unknown line>
  496. 257.59 s gammaloop-nextest-integration> 25: <gammaloop_api[9ebf6628f97aeb57]::session::CliSession>::execute_prepared_commands<unknown>
  497. 257.59 s gammaloop-nextest-integration> at <unknown source file>:<unknown line>
  498. 257.59 s gammaloop-nextest-integration> 26: <gammaloop_api[9ebf6628f97aeb57]::session::CliSession>::execute_prepared<unknown>
  499. 257.59 s gammaloop-nextest-integration> at <unknown source file>:<unknown line>
  500. 257.59 s gammaloop-nextest-integration> 27: <gammaloop_api[9ebf6628f97aeb57]::session::CliSession>::execute_command<unknown>
  501. 257.59 s gammaloop-nextest-integration> at <unknown source file>:<unknown line>
  502. 257.59 s gammaloop-nextest-integration> 28: <gammaloop_integration_tests[191607b70c61cd5a]::CLIState>::run_command<unknown>
  503. 257.59 s gammaloop-nextest-integration> at <unknown source file>:<unknown line>
  504. 257.59 s gammaloop-nextest-integration> 29: uv[3c7454ef256d6487]::run_single_integrated_uv_case<unknown>
  505. 257.59 s gammaloop-nextest-integration> at <unknown source file>:<unknown line>
  506. 257.59 s gammaloop-nextest-integration> 30: <uv[3c7454ef256d6487]::thermal_sunrise_uv::{closure#0} as core[940e698046960fd5]::ops::function::FnOnce<()>>::call_once<unknown>
  507. 257.59 s gammaloop-nextest-integration> at <unknown source file>:<unknown line>
  508. 257.59 s gammaloop-nextest-integration> 31: test[75d6903177b1d7e9]::__rust_begin_short_backtrace::<core[940e698046960fd5]::result::Result<(), alloc[2ea6bcb46fca0c42]::string::String>, fn() -> core[940e698046960fd5]::result::Result<(), alloc[2ea6bcb46fca0c42]::string::String>><unknown>
  509. 257.59 s gammaloop-nextest-integration> at <unknown source file>:<unknown line>
  510. 257.59 s gammaloop-nextest-integration> 32: test[75d6903177b1d7e9]::run_test::{closure#0}<unknown>
  511. 257.59 s gammaloop-nextest-integration> at <unknown source file>:<unknown line>
  512. 257.59 s gammaloop-nextest-integration> 33: std[bcb96dfbba0ab899]::sys::backtrace::__rust_begin_short_backtrace::<test[75d6903177b1d7e9]::run_test::{closure#1}, ()><unknown>
  513. 257.59 s gammaloop-nextest-integration> at <unknown source file>:<unknown line>
  514. 257.59 s gammaloop-nextest-integration> 34: <std[bcb96dfbba0ab899]::thread::lifecycle::spawn_unchecked<test[75d6903177b1d7e9]::run_test::{closure#1}, ()>::{closure#1} as core[940e698046960fd5]::ops::function::FnOnce<()>>::call_once::{shim:vtable#0}<unknown>
  515. 257.59 s gammaloop-nextest-integration> at <unknown source file>:<unknown line>
  516. 257.59 s gammaloop-nextest-integration> 35: <std[bcb96dfbba0ab899]::sys::thread::unix::Thread>::new::thread_start<unknown>
  517. 257.59 s gammaloop-nextest-integration> at <unknown source file>:<unknown line>
  518. 257.59 s gammaloop-nextest-integration> 36: start_thread<unknown>
  519. 257.59 s gammaloop-nextest-integration> at <unknown source file>:<unknown line>
  520. 257.59 s gammaloop-nextest-integration> 37: __clone3<unknown>
  521. 257.59 s gammaloop-nextest-integration> at <unknown source file>:<unknown line>
  522. 257.59 s gammaloop-nextest-integration>
  523. 257.59 s gammaloop-nextest-integration> Run with COLORBT_SHOW_HIDDEN=1 environment variable to disable frame filtering.
  524. 257.59 s gammaloop-nextest-integration> Run with RUST_BACKTRACE=full to include source snippets.
  525. 257.59 s gammaloop-nextest-integration> Warning: SpanTrace capture is Unsupported.
  526. 257.59 s gammaloop-nextest-integration> Ensure that you've setup a tracing-error ErrorLayer and the semver versions are compatible
  527. 257.59 s gammaloop-nextest-integration>
  528. 257.81 s gammaloop-nextest-integration> error: test run failed
  529. 257.84 s gammaloop-nextest-integration>
  530. 257.84 s gammaloop-nextest-integration> ========== nextest test summary ==========
  531. 257.84 s gammaloop-nextest-integration> report: target/nextest/ci_gammaloop/junit.xml
  532. 257.84 s gammaloop-nextest-integration> tests: 169, failures: 2, errors: 0
  533. 257.84 s gammaloop-nextest-integration>
  534. 257.84 s gammaloop-nextest-integration> 1. gammaloop-integration-tests::test_runs::aa_aa::important::aa_aa_local_inspect_backend_consistency
  535. 257.84 s gammaloop-nextest-integration> failure: test failure with exit code 101
  536. 257.84 s gammaloop-nextest-integration> system-out
  537. 257.84 s gammaloop-nextest-integration> running 1 test
  538. 257.84 s gammaloop-nextest-integration> test aa_aa::important::aa_aa_local_inspect_backend_consistency ... FAILED
  539. 257.84 s gammaloop-nextest-integration>
  540. 257.84 s gammaloop-nextest-integration> failures:
  541. 257.84 s gammaloop-nextest-integration>
  542. 257.84 s gammaloop-nextest-integration> failures:
  543. 257.84 s gammaloop-nextest-integration> aa_aa::important::aa_aa_local_inspect_backend_consistency
  544. 257.84 s gammaloop-nextest-integration>
  545. 257.84 s gammaloop-nextest-integration> test result: FAILED. 0 passed; 1 failed; 0 ignored; 0 measured; 273 filtered out; finished in 3.19s
  546. 257.84 s gammaloop-nextest-integration> system-err
  547. 257.84 s gammaloop-nextest-integration> [2026-09-15 21:45:34.897] @gammaloop_api::se... INFO : Running command import model sm-default.json
  548. 257.84 s gammaloop-nextest-integration> [2026-09-15 21:45:34.897] @import::model INFO : Loading built-in JSON model sm-default
  549. 257.84 s gammaloop-nextest-integration> [2026-09-15 21:45:34.920] @gammalooprs::model INFO : The following 15 external parameters were forced to zero by the restriction card:
  550. 257.84 s gammaloop-nextest-integration> lamWS, AWS, rhoWS, etaWS, ymc, yme, ymm, MC, Me, MM, WTau, muQ, muLe, muLmu, muLtau
  551. 257.84 s gammaloop-nextest-integration> [2026-09-15 21:45:34.920] @gammalooprs::model INFO : The following 34 vertex rules were removed by the restriction card:
  552. 257.84 s gammaloop-nextest-integration> V_82 -> (c~, d, G+) | V_83 -> (t~, d, G+) | V_84 -> (c~, s, G+) | V_85 -> (t~, s, G+) | V_86 -> (u~, b, G+) | V_87 -> (c~, b, G+) | V_90 -> (c~, d, W+) | V_91 -> (t~, d, W+) | V_92 -> (u~, s, W+) | V_94 -> (t~, s, W+) | V_95 -> (u~, b, W+) | V_96 -> (c~, b, W+) | V_101 -> (e+, e-, G0) | V_102 -> (mu+, mu-, G0) | V_104 -> (e+, e-, H) | V_105 -> (mu+, mu-, H) | V_110 -> (ve~, e-, G+) | V_111 -> (vm~, mu-, G+) | V_116 -> (b~, u, G-) | V_117 -> (d~, c, G-) | V_118 -> (s~, c, G-) | V_119 -> (b~, c, G-) | V_120 -> (d~, t, G-) | V_121 -> (s~, t, G-) | V_124 -> (s~, u, W-) | V_125 -> (b~, u, W-) | V_126 -> (d~, c, W-) | V_128 -> (b~, c, W-) | V_129 -> (d~, t, W-) | V_130 -> (s~, t, W-) | V_138 -> (c~, c, G0) | V_140 -> (c~, c, H) | V_145 -> (e+, ve, G-) | V_146 -> (mu+, vm, G-)
  553. 257.84 s gammaloop-nextest-integration> [2026-09-15 21:45:34.920] @gammalooprs::model INFO : The following 36 couplings were removed by the restriction card:
  554. 257.84 s gammaloop-nextest-integration> GC_13, GC_14, GC_16, GC_17, GC_18, GC_19, GC_20, GC_22, GC_23, GC_24, GC_25, GC_26, GC_28, GC_29, GC_42, GC_43, GC_44, GC_46, GC_47, GC_48, GC_84, GC_85, GC_86, GC_87, GC_88, GC_89, GC_90, GC_91, GC_92, GC_93, GC_101, GC_102, GC_103, GC_105, GC_106, GC_107
  555. 257.84 s gammaloop-nextest-integration> [2026-09-15 21:45:34.921] @gammaloop_api::se... INFO : Running command run set_model_parameters
  556. 257.84 s gammaloop-nextest-integration> [2026-09-15 21:45:34.921] @gammaloop_api::se... INFO : Starting command block set_model_parameters
  557. 257.84 s gammaloop-nextest-integration> [2026-09-15 21:45:34.921] @gammaloop_api::se... INFO : Running command set model MT=173.0
  558. 257.84 s gammaloop-nextest-integration> [2026-09-15 21:45:34.926] @gammaloop_api::se... INFO : Running command set model WT=0.0
  559. 257.84 s gammaloop-nextest-integration> [2026-09-15 21:45:34.931] @gammaloop_api::se... INFO : Running command set model ymt=173.0
  560. 257.84 s gammaloop-nextest-integration> [2026-09-15 21:45:34.936] @gammaloop_api::se... INFO : Running command set model aS=0.118
  561. 257.84 s gammaloop-nextest-integration> [2026-09-15 21:45:34.940] @gammaloop_api::se... INFO : Running command set model aEWM1=137.036
  562. 257.84 s gammaloop-nextest-integration> [2026-09-15 21:45:34.945] @gammaloop_api::se... INFO : Running command set model Gf=1.166390e-05
  563. 257.84 s gammaloop-nextest-integration> [2026-09-15 21:45:34.950] @gammaloop_api::se... INFO : Running command set model MZ=91.188
  564. 257.84 s gammaloop-nextest-integration> [2026-09-15 21:45:34.955] @gammaloop_api::se... INFO : Running command set global string '
  565. 257.84 s gammaloop-nextest-integration> [global.generation.compile]
  566. 257.84 s gammaloop-nextest-integration> compilation_mode = "symjit"
  567. 257.84 s gammaloop-nextest-integration> optimization_level = "O0"
  568. 257.84 s gammaloop-nextest-integration> fast_math = false
  569. 257.84 s gammaloop-nextest-integration> [...]
  570. 257.84 s gammaloop-nextest-integration> [2026-09-15 21:45:34.956] @gammaloop_api::se... INFO : Running command import graphs ./examples/cli/aa_aa/1L/aa_aa_1L.dot -p aa_aa_all_helicities -i 1L_ppmm -o
  571. 257.84 s gammaloop-nextest-integration> [2026-09-15 21:45:34.956] @commands::import INFO : Loading graphs from '/build/source/examples/cli/aa_aa/1L/aa_aa_1L.dot'
  572. 257.84 s gammaloop-nextest-integration> [2026-09-15 21:45:34.965] @gammaloop_api::se... INFO : Running command generate existing -p aa_aa_all_helicities
  573. 257.84 s gammaloop-nextest-integration> The application panicked (crashed).
  574. 257.84 s gammaloop-nextest-integration> Message: label _func_power_ not found
  575. 257.84 s gammaloop-nextest-integration> Location: /nix/store/n9w914kh1cm59xx3spcs831cdyb56m32-vendor-cargo-deps/c19b7c6f923b580ac259164a89f2577984ad5ab09ee9d583b888f934adbbe8d0/symjit-2.25.6/src/symjit/assembler.rs:77
  576. 257.84 s gammaloop-nextest-integration>
  577. 257.84 s gammaloop-nextest-integration> ━━━━━━━━━━━━━━━━━━━━━━━━━━━━━━━━━━ BACKTRACE ━━━━━━━━━━━━━━━━━━━━━━━━━━━━━━━━━━━
  578. 257.84 s gammaloop-nextest-integration> 1: <color_eyre[51793ea62743adbd]::config::PanicHook>::panic_report<unknown>
  579. 257.84 s gammaloop-nextest-integration> at <unknown source file>:<unknown line>
  580. 257.84 s gammaloop-nextest-integration> 2: <color_eyre[51793ea62743adbd]::config::PanicHook>::into_panic_hook::{closure#0}<unknown>
  581. 257.84 s gammaloop-nextest-integration> at <unknown source file>:<unknown line>
  582. 257.84 s gammaloop-nextest-integration> 3: std[bcb96dfbba0ab899]::panicking::panic_with_hook<unknown>
  583. 257.84 s gammaloop-nextest-integration> at <unknown source file>:<unknown line>
  584. 257.84 s gammaloop-nextest-integration> 4: std[bcb96dfbba0ab899]::panicking::panic_handler::{closure#0}<unknown>
  585. 257.84 s gammaloop-nextest-integration> at <unknown source file>:<unknown line>
  586. 257.84 s gammaloop-nextest-integration> 5: std[bcb96dfbba0ab899]::sys::backtrace::__rust_end_short_backtrace::<std[bcb96dfbba0ab899]::panicking::panic_handler::{closure#0}, !><unknown>
  587. 257.84 s gammaloop-nextest-integration> at <unknown source file>:<unknown line>
  588. 257.84 s gammaloop-nextest-integration> 6: __rustc[6c289b9f9c454d21]::rust_begin_unwind<unknown>
  589. 257.84 s gammaloop-nextest-integration> at <unknown source file>:<unknown line>
  590. 257.84 s gammaloop-nextest-integration> 7: core[940e698046960fd5]::panicking::panic_fmt<unknown>
  591. 257.84 s gammaloop-nextest-integration> at <unknown source file>:<unknown line>
  592. 257.84 s gammaloop-nextest-integration> 8: <symjit[e408de789c333cd]::symjit::assembler::Assembler>::apply_jumps<unknown>
  593. 257.84 s gammaloop-nextest-integration> at <unknown source file>:<unknown line>
  594. 257.84 s gammaloop-nextest-integration> 9: <symjit[e408de789c333cd]::symjit::builder::Builder>::compile_from_mir::<symjit[e408de789c333cd]::symjit::amd::complex::AmdComplexGenerator><unknown>
  595. 257.84 s gammaloop-nextest-integration> at <unknown source file>:<unknown line>
  596. 257.84 s gammaloop-nextest-integration> 10: <symjit[e408de789c333cd]::symjit::runnable::Application>::compile_ty<unknown>
  597. 257.84 s gammaloop-nextest-integration> at <unknown source file>:<unknown line>
  598. 257.84 s gammaloop-nextest-integration> 11: <symjit[e408de789c333cd]::symjit::runnable::Application>::with_mir<unknown>
  599. 257.84 s gammaloop-nextest-integration> at <unknown source file>:<unknown line>
  600. 257.84 s gammaloop-nextest-integration> 12: <symjit[e408de789c333cd]::symjit::composer::DirectTranslator as symjit[e408de789c333cd]::symjit::composer::Composer>::compile<unknown>
  601. 257.84 s gammaloop-nextest-integration> at <unknown source file>:<unknown line>
  602. 257.84 s gammaloop-nextest-integration> 13: <symjit[e408de789c333cd]::symjit::compiler::Translator as symjit[e408de789c333cd]::symjit::composer::Composer>::compile<unknown>
  603. 257.84 s gammaloop-nextest-integration> at <unknown source file>:<unknown line>
  604. 257.84 s gammaloop-nextest-integration> 14: <numerica[124dab8567f4861e]::domains::float::complex::Complex<f64> as symbolica[10e259bab675d243]::evaluate::backend::JITCompiledNumber>::jit_compile<unknown>
  605. 257.84 s gammaloop-nextest-integration> at <unknown source file>:<unknown line>
  606. 257.84 s gammaloop-nextest-integration> 15: <symbolica[10e259bab675d243]::evaluate::evaluator::ExpressionEvaluator<numerica[124dab8567f4861e]::domains::float::complex::Complex<f64>>>::jit_compile<unknown>
  607. 257.84 s gammaloop-nextest-integration> at <unknown source file>:<unknown line>
  608. 257.84 s gammaloop-nextest-integration> 16: <gammalooprs[917cbd3df9e68f8f]::integrands::process::evaluators::GenericEvaluator>::activate_symjit<unknown>
  609. 257.84 s gammaloop-nextest-integration> at <unknown source file>:<unknown line>
  610. 257.84 s gammaloop-nextest-integration> 17: <gammalooprs[917cbd3df9e68f8f]::integrands::process::amplitude::AmplitudeIntegrand>::prepare_runtime_backends_after_generation_with_compile_times<unknown>
  611. 257.84 s gammaloop-nextest-integration> at <unknown source file>:<unknown line>
  612. 257.84 s gammaloop-nextest-integration> 18: <gammalooprs[917cbd3df9e68f8f]::processes::amplitude::Amplitude>::build_integrand<unknown>
  613. 257.84 s gammaloop-nextest-integration> at <unknown source file>:<unknown line>
  614. 257.84 s gammaloop-nextest-integration> 19: <gammalooprs[917cbd3df9e68f8f]::processes::process::Process>::generate_integrands<unknown>
  615. 257.84 s gammaloop-nextest-integration> at <unknown source file>:<unknown line>
  616. 257.84 s gammaloop-nextest-integration> 20: <gammaloop_api[9ebf6628f97aeb57]::state::State>::generate_integrand<unknown>
  617. 257.84 s gammaloop-nextest-integration> at <unknown source file>:<unknown line>
  618. 257.84 s gammaloop-nextest-integration> 21: <gammaloop_api[9ebf6628f97aeb57]::commands::generate::Generate>::run::<&std[bcb96dfbba0ab899]::path::PathBuf><unknown>
  619. 257.84 s gammaloop-nextest-integration> at <unknown source file>:<unknown line>
  620. 257.84 s gammaloop-nextest-integration> 22: <gammaloop_api[9ebf6628f97aeb57]::commands::Commands>::run<unknown>
  621. 257.84 s gammaloop-nextest-integration> at <unknown source file>:<unknown line>
  622. 257.84 s gammaloop-nextest-integration> 23: <gammaloop_api[9ebf6628f97aeb57]::session::CliSession>::execute_prepared<unknown>
  623. 257.84 s gammaloop-nextest-integration> at <unknown source file>:<unknown line>
  624. 257.84 s gammaloop-nextest-integration> 24: <gammaloop_api[9ebf6628f97aeb57]::session::CliSession>::execute_command<unknown>
  625. 257.84 s gammaloop-nextest-integration> at <unknown source file>:<unknown line>
  626. 257.84 s gammaloop-nextest-integration> 25: <gammaloop_integration_tests[191607b70c61cd5a]::CLIState>::run_command<unknown>
  627. 257.84 s gammaloop-nextest-integration> at <unknown source file>:<unknown line>
  628. 257.84 s gammaloop-nextest-integration> 26: test_runs[9b7e2dc2dc4f29b0]::aa_aa::generate_aa_aa_helicity_family<unknown>
  629. 257.84 s gammaloop-nextest-integration> at <unknown source file>:<unknown line>
  630. 257.84 s gammaloop-nextest-integration> 27: <test_runs[9b7e2dc2dc4f29b0]::aa_aa::important::aa_aa_local_inspect_backend_consistency::{closure#0} as core[940e698046960fd5]::ops::function::FnOnce<()>>::call_once<unknown>
  631. 257.84 s gammaloop-nextest-integration> at <unknown source file>:<unknown line>
  632. 257.84 s gammaloop-nextest-integration> 28: serial_test[cd99724524a2f1c0]::serial_code_lock::local_serial_core_with_return::<(), eyre[cb2fd339c0c40fca]::Report><unknown>
  633. 257.84 s gammaloop-nextest-integration> at <unknown source file>:<unknown line>
  634. 257.84 s gammaloop-nextest-integration> 29: <test_runs[9b7e2dc2dc4f29b0]::aa_aa::important::aa_aa_local_inspect_backend_consistency::{closure#0} as core[940e698046960fd5]::ops::function::FnOnce<()>>::call_once<unknown>
  635. 257.84 s gammaloop-nextest-integration> at <unknown source file>:<unknown line>
  636. 257.84 s gammaloop-nextest-integration> 30: test[75d6903177b1d7e9]::__rust_begin_short_backtrace::<core[940e698046960fd5]::result::Result<(), alloc[2ea6bcb46fca0c42]::string::String>, fn() -> core[940e698046960fd5]::result::Result<(), alloc[2ea6bcb46fca0c42]::string::String>><unknown>
  637. 257.84 s gammaloop-nextest-integration> at <unknown source file>:<unknown line>
  638. 257.84 s gammaloop-nextest-integration> 31: test[75d6903177b1d7e9]::run_test::{closure#0}<unknown>
  639. 257.84 s gammaloop-nextest-integration> at <unknown source file>:<unknown line>
  640. 257.84 s gammaloop-nextest-integration> 32: std[bcb96dfbba0ab899]::sys::backtrace::__rust_begin_short_backtrace::<test[75d6903177b1d7e9]::run_test::{closure#1}, ()><unknown>
  641. 257.84 s gammaloop-nextest-integration> at <unknown source file>:<unknown line>
  642. 257.84 s gammaloop-nextest-integration> 33: <std[bcb96dfbba0ab899]::thread::lifecycle::spawn_unchecked<test[75d6903177b1d7e9]::run_test::{closure#1}, ()>::{closure#1} as core[940e698046960fd5]::ops::function::FnOnce<()>>::call_once::{shim:vtable#0}<unknown>
  643. 257.84 s gammaloop-nextest-integration> at <unknown source file>:<unknown line>
  644. 257.84 s gammaloop-nextest-integration> 34: <std[bcb96dfbba0ab899]::sys::thread::unix::Thread>::new::thread_start<unknown>
  645. 257.84 s gammaloop-nextest-integration> at <unknown source file>:<unknown line>
  646. 257.84 s gammaloop-nextest-integration> 35: start_thread<unknown>
  647. 257.84 s gammaloop-nextest-integration> at <unknown source file>:<unknown line>
  648. 257.84 s gammaloop-nextest-integration> 36: __clone3<unknown>
  649. 257.84 s gammaloop-nextest-integration> at <unknown source file>:<unknown line>
  650. 257.84 s gammaloop-nextest-integration>
  651. 257.84 s gammaloop-nextest-integration> Run with COLORBT_SHOW_HIDDEN=1 environment variable to disable frame filtering.
  652. 257.84 s gammaloop-nextest-integration> Run with RUST_BACKTRACE=full to include source snippets.
  653. 257.84 s gammaloop-nextest-integration> Warning: SpanTrace capture is Unsupported.
  654. 257.84 s gammaloop-nextest-integration> Ensure that you've setup a tracing-error ErrorLayer and the semver versions are compatible
  655. 257.84 s gammaloop-nextest-integration>
  656. 257.84 s gammaloop-nextest-integration> 2. gammaloop-integration-tests::uv::thermal_sunrise_uv
  657. 257.84 s gammaloop-nextest-integration> failure: test failure with exit code 101
  658. 257.84 s gammaloop-nextest-integration> system-out
  659. 257.84 s gammaloop-nextest-integration> running 1 test
  660. 257.84 s gammaloop-nextest-integration> test thermal_sunrise_uv ... FAILED
  661. 257.84 s gammaloop-nextest-integration>
  662. 257.84 s gammaloop-nextest-integration> failures:
  663. 257.84 s gammaloop-nextest-integration>
  664. 257.84 s gammaloop-nextest-integration> failures:
  665. 257.84 s gammaloop-nextest-integration> thermal_sunrise_uv
  666. 257.84 s gammaloop-nextest-integration>
  667. 257.84 s gammaloop-nextest-integration> test result: FAILED. 0 passed; 1 failed; 0 ignored; 0 measured; 31 filtered out; finished in 3.06s
  668. 257.84 s gammaloop-nextest-integration> system-err
  669. 257.84 s gammaloop-nextest-integration> [2026-09-15 21:46:37.168] @gammaloop_api::se... INFO : Running command run generate
  670. 257.84 s gammaloop-nextest-integration> [2026-09-15 21:46:37.168] @gammaloop_api::se... INFO : Starting command block generate
  671. 257.84 s gammaloop-nextest-integration> [2026-09-15 21:46:37.168] @gammaloop_api::se... INFO : Running command import model sm-default.json
  672. 257.84 s gammaloop-nextest-integration> [2026-09-15 21:46:37.168] @import::model INFO : Loading built-in JSON model sm-default
  673. 257.84 s gammaloop-nextest-integration> [2026-09-15 21:46:37.366] @gammalooprs::model INFO : The following 15 external parameters were forced to zero by the restriction card:
  674. 257.84 s gammaloop-nextest-integration> lamWS, AWS, rhoWS, etaWS, ymc, yme, ymm, MC, Me, MM, WTau, muQ, muLe, muLmu, muLtau
  675. 257.84 s gammaloop-nextest-integration> [2026-09-15 21:46:37.366] @gammalooprs::model INFO : The following 34 vertex rules were removed by the restriction card:
  676. 257.84 s gammaloop-nextest-integration> V_82 -> (c~, d, G+) | V_83 -> (t~, d, G+) | V_84 -> (c~, s, G+) | V_85 -> (t~, s, G+) | V_86 -> (u~, b, G+) | V_87 -> (c~, b, G+) | V_90 -> (c~, d, W+) | V_91 -> (t~, d, W+) | V_92 -> (u~, s, W+) | V_94 -> (t~, s, W+) | V_95 -> (u~, b, W+) | V_96 -> (c~, b, W+) | V_101 -> (e+, e-, G0) | V_102 -> (mu+, mu-, G0) | V_104 -> (e+, e-, H) | V_105 -> (mu+, mu-, H) | V_110 -> (ve~, e-, G+) | V_111 -> (vm~, mu-, G+) | V_116 -> (b~, u, G-) | V_117 -> (d~, c, G-) | V_118 -> (s~, c, G-) | V_119 -> (b~, c, G-) | V_120 -> (d~, t, G-) | V_121 -> (s~, t, G-) | V_124 -> (s~, u, W-) | V_125 -> (b~, u, W-) | V_126 -> (d~, c, W-) | V_128 -> (b~, c, W-) | V_129 -> (d~, t, W-) | V_130 -> (s~, t, W-) | V_138 -> (c~, c, G0) | V_140 -> (c~, c, H) | V_145 -> (e+, ve, G-) | V_146 -> (mu+, vm, G-)
  677. 257.84 s gammaloop-nextest-integration> [2026-09-15 21:46:37.366] @gammalooprs::model INFO : The following 36 couplings were removed by the restriction card:
  678. 257.84 s gammaloop-nextest-integration> GC_13, GC_14, GC_16, GC_17, GC_18, GC_19, GC_20, GC_22, GC_23, GC_24, GC_25, GC_26, GC_28, GC_29, GC_42, GC_43, GC_44, GC_46, GC_47, GC_48, GC_84, GC_85, GC_86, GC_87, GC_88, GC_89, GC_90, GC_91, GC_92, GC_93, GC_101, GC_102, GC_103, GC_105, GC_106, GC_107
  679. 257.84 s gammaloop-nextest-integration> [2026-09-15 21:46:37.367] @gammaloop_api::se... INFO : Running command remove processes
  680. 257.84 s gammaloop-nextest-integration> [2026-09-15 21:46:37.367] @gammaloop_api::se... INFO : Running command generate amp {} > {} [{2}] | g u
  681. 257.84 s gammaloop-nextest-integration> --numerator-grouping group_identical_graphs_up_to_scalar_rescaling
  682. 257.84 s gammaloop-nextest-integration> --max-n-bridges 0
  683. 257.84 s gammaloop-nextest-integration> --number-of-factorized-loop-subtopologies 1 1
  684. 257.84 s gammaloop-nextest-integration> --number-of-anticommutating-loops 1 1
  685. 257.84 s gammaloop-nextest-integration> [...]
  686. 257.84 s gammaloop-nextest-integration> [2026-09-15 21:46:37.368] @feyngen::diagram_... INFO : 0s | Δ=0s | Starting Feynman graph generation with Symbolica...
  687. 257.84 s gammaloop-nextest-integration> [2026-09-15 21:46:37.369] @feyngen::diagram_... INFO : 0s | Δ=0s | Number of graphs resulting from Symbolica generation: 3
  688. 257.84 s gammaloop-nextest-integration> [2026-09-15 21:46:37.386] @feyngen::diagram_... INFO : 0s | Δ=0s | Number of graphs retained after removal of vetoed topologies: 2
  689. 257.84 s gammaloop-nextest-integration> [2026-09-15 21:46:37.389] @feyngen::diagram_... INFO : 0s | Δ=0s | Number of graphs after vertex info assignment: 2
  690. 257.84 s gammaloop-nextest-integration> [2026-09-15 21:46:37.389] @feyngen::diagram_... INFO : 0s | Δ=0s | Number of graphs after all complete graphs filters are applied: 2
  691. 257.84 s gammaloop-nextest-integration> [2026-09-15 21:46:37.389] @feyngen::diagram_... INFO : 0s | Δ=0s | Number of graphs after closed anticommutating chains analysis: 1
  692. 257.84 s gammaloop-nextest-integration> [2026-09-15 21:46:37.389] @feyngen::diagram_... INFO : 0s | Δ=0s | Number of graphs after symmetrization of external states: 1
  693. 257.84 s gammaloop-nextest-integration> [2026-09-15 21:46:37.392] @feyngen::diagram_... INFO : 0s | Δ=0s | Number of graphs after canonization of vertices, edges and flows (graph labels assigned here): 1
  694. 257.84 s gammaloop-nextest-integration> [2026-09-15 21:46:37.406] @feyngen::diagram_... INFO : 0s | Δ=0s | Number of graphs after numerator-aware grouping with strategy 'up to a scalar rescaling': 1 (1 isomorphically unique graph, 0 color zero, 0 lorentz zero, 0 grouped and 0 cancellation)
  695. 257.84 s gammaloop-nextest-integration> [2026-09-15 21:46:37.406] @feyngen::diagram_... INFO : ( Sum of the symmetry factors from each graph generated = -1/2 )
  696. 257.84 s gammaloop-nextest-integration> [2026-09-15 21:46:37.406] @commands::generate INFO : Generated amplitude 1 graphs.
  697. 257.84 s gammaloop-nextest-integration> [2026-09-15 21:46:37.406] @commands::generate INFO : Only diagram generation was requested, skipping integrand generation. You can generate integrands later using the 'generate existing <options>' command.
  698. 257.84 s gammaloop-nextest-integration> [2026-09-15 21:46:37.406] @gammaloop_api::se... INFO : Running command generate
  699. 257.84 s gammaloop-nextest-integration> The application panicked (crashed).
  700. 257.84 s gammaloop-nextest-integration> Message: label _func_power_ not found
  701. 257.84 s gammaloop-nextest-integration> Location: /nix/store/n9w914kh1cm59xx3spcs831cdyb56m32-vendor-cargo-deps/c19b7c6f923b580ac259164a89f2577984ad5ab09ee9d583b888f934adbbe8d0/symjit-2.25.6/src/symjit/assembler.rs:77
  702. 257.84 s gammaloop-nextest-integration>
  703. 257.84 s gammaloop-nextest-integration> ━━━━━━━━━━━━━━━━━━━━━━━━━━━━━━━━━━ BACKTRACE ━━━━━━━━━━━━━━━━━━━━━━━━━━━━━━━━━━━
  704. 257.84 s gammaloop-nextest-integration> 1: <color_eyre[51793ea62743adbd]::config::PanicHook>::panic_report<unknown>
  705. 257.84 s gammaloop-nextest-integration> at <unknown source file>:<unknown line>
  706. 257.84 s gammaloop-nextest-integration> 2: <color_eyre[51793ea62743adbd]::config::PanicHook>::into_panic_hook::{closure#0}<unknown>
  707. 257.84 s gammaloop-nextest-integration> at <unknown source file>:<unknown line>
  708. 257.84 s gammaloop-nextest-integration> 3: std[bcb96dfbba0ab899]::panicking::panic_with_hook<unknown>
  709. 257.84 s gammaloop-nextest-integration> at <unknown source file>:<unknown line>
  710. 257.84 s gammaloop-nextest-integration> 4: std[bcb96dfbba0ab899]::panicking::panic_handler::{closure#0}<unknown>
  711. 257.84 s gammaloop-nextest-integration> at <unknown source file>:<unknown line>
  712. 257.84 s gammaloop-nextest-integration> 5: std[bcb96dfbba0ab899]::sys::backtrace::__rust_end_short_backtrace::<std[bcb96dfbba0ab899]::panicking::panic_handler::{closure#0}, !><unknown>
  713. 257.84 s gammaloop-nextest-integration> at <unknown source file>:<unknown line>
  714. 257.84 s gammaloop-nextest-integration> 6: __rustc[6c289b9f9c454d21]::rust_begin_unwind<unknown>
  715. 257.84 s gammaloop-nextest-integration> at <unknown source file>:<unknown line>
  716. 257.84 s gammaloop-nextest-integration> 7: core[940e698046960fd5]::panicking::panic_fmt<unknown>
  717. 257.84 s gammaloop-nextest-integration> at <unknown source file>:<unknown line>
  718. 257.84 s gammaloop-nextest-integration> 8: <symjit[e408de789c333cd]::symjit::assembler::Assembler>::apply_jumps<unknown>
  719. 257.84 s gammaloop-nextest-integration> at <unknown source file>:<unknown line>
  720. 257.84 s gammaloop-nextest-integration> 9: <symjit[e408de789c333cd]::symjit::builder::Builder>::compile_from_mir::<symjit[e408de789c333cd]::symjit::amd::complex::AmdComplexGenerator><unknown>
  721. 257.84 s gammaloop-nextest-integration> at <unknown source file>:<unknown line>
  722. 257.84 s gammaloop-nextest-integration> 10: <symjit[e408de789c333cd]::symjit::runnable::Application>::compile_ty<unknown>
  723. 257.84 s gammaloop-nextest-integration> at <unknown source file>:<unknown line>
  724. 257.84 s gammaloop-nextest-integration> 11: <symjit[e408de789c333cd]::symjit::runnable::Application>::with_mir<unknown>
  725. 257.84 s gammaloop-nextest-integration> at <unknown source file>:<unknown line>
  726. 257.84 s gammaloop-nextest-integration> 12: <symjit[e408de789c333cd]::symjit::composer::DirectTranslator as symjit[e408de789c333cd]::symjit::composer::Composer>::compile<unknown>
  727. 257.84 s gammaloop-nextest-integration> at <unknown source file>:<unknown line>
  728. 257.84 s gammaloop-nextest-integration> 13: <symjit[e408de789c333cd]::symjit::compiler::Translator as symjit[e408de789c333cd]::symjit::composer::Composer>::compile<unknown>
  729. 257.84 s gammaloop-nextest-integration> at <unknown source file>:<unknown line>
  730. 257.84 s gammaloop-nextest-integration> 14: <numerica[124dab8567f4861e]::domains::float::complex::Complex<f64> as symbolica[10e259bab675d243]::evaluate::backend::JITCompiledNumber>::jit_compile<unknown>
  731. 257.84 s gammaloop-nextest-integration> at <unknown source file>:<unknown line>
  732. 257.84 s gammaloop-nextest-integration> 15: <symbolica[10e259bab675d243]::evaluate::evaluator::ExpressionEvaluator<numerica[124dab8567f4861e]::domains::float::complex::Complex<f64>>>::jit_compile<unknown>
  733. 257.84 s gammaloop-nextest-integration> at <unknown source file>:<unknown line>
  734. 257.84 s gammaloop-nextest-integration> 16: <gammalooprs[917cbd3df9e68f8f]::integrands::process::evaluators::GenericEvaluator>::activate_symjit<unknown>
  735. 257.84 s gammaloop-nextest-integration> at <unknown source file>:<unknown line>
  736. 257.84 s gammaloop-nextest-integration> 17: <gammalooprs[917cbd3df9e68f8f]::integrands::process::amplitude::AmplitudeIntegrand>::prepare_runtime_backends_after_generation_with_compile_times<unknown>
  737. 257.84 s gammaloop-nextest-integration> at <unknown source file>:<unknown line>
  738. 257.84 s gammaloop-nextest-integration> 18: <gammalooprs[917cbd3df9e68f8f]::processes::amplitude::Amplitude>::build_integrand<unknown>
  739. 257.84 s gammaloop-nextest-integration> at <unknown source file>:<unknown line>
  740. 257.84 s gammaloop-nextest-integration> 19: <gammalooprs[917cbd3df9e68f8f]::processes::process::Process>::generate_integrands<unknown>
  741. 257.84 s gammaloop-nextest-integration> at <unknown source file>:<unknown line>
  742. 257.84 s gammaloop-nextest-integration> 20: <gammalooprs[917cbd3df9e68f8f]::processes::ProcessList>::generate_integrands<unknown>
  743. 257.84 s gammaloop-nextest-integration> at <unknown source file>:<unknown line>
  744. 257.84 s gammaloop-nextest-integration> 21: <gammaloop_api[9ebf6628f97aeb57]::state::State>::generate_integrands<unknown>
  745. 257.84 s gammaloop-nextest-integration> at <unknown source file>:<unknown line>
  746. 257.84 s gammaloop-nextest-integration> 22: <gammaloop_api[9ebf6628f97aeb57]::commands::generate::Generate>::run::<&std[bcb96dfbba0ab899]::path::PathBuf><unknown>
  747. 257.84 s gammaloop-nextest-integration> at <unknown source file>:<unknown line>
  748. 257.84 s gammaloop-nextest-integration> 23: <gammaloop_api[9ebf6628f97aeb57]::commands::Commands>::run<unknown>
  749. 257.84 s gammaloop-nextest-integration> at <unknown source file>:<unknown line>
  750. 257.84 s gammaloop-nextest-integration> 24: <gammaloop_api[9ebf6628f97aeb57]::session::CliSession>::execute_prepared<unknown>
  751. 257.84 s gammaloop-nextest-integration> at <unknown source file>:<unknown line>
  752. 257.84 s gammaloop-nextest-integration> 25: <gammaloop_api[9ebf6628f97aeb57]::session::CliSession>::execute_prepared_commands<unknown>
  753. 257.84 s gammaloop-nextest-integration> at <unknown source file>:<unknown line>
  754. 257.84 s gammaloop-nextest-integration> 26: <gammaloop_api[9ebf6628f97aeb57]::session::CliSession>::execute_prepared<unknown>
  755. 257.84 s gammaloop-nextest-integration> at <unknown source file>:<unknown line>
  756. 257.84 s gammaloop-nextest-integration> 27: <gammaloop_api[9ebf6628f97aeb57]::session::CliSession>::execute_command<unknown>
  757. 257.84 s gammaloop-nextest-integration> at <unknown source file>:<unknown line>
  758. 257.84 s gammaloop-nextest-integration> 28: <gammaloop_integration_tests[191607b70c61cd5a]::CLIState>::run_command<unknown>
  759. 257.84 s gammaloop-nextest-integration> at <unknown source file>:<unknown line>
  760. 257.84 s gammaloop-nextest-integration> 29: uv[3c7454ef256d6487]::run_single_integrated_uv_case<unknown>
  761. 257.84 s gammaloop-nextest-integration> at <unknown source file>:<unknown line>
  762. 257.84 s gammaloop-nextest-integration> 30: <uv[3c7454ef256d6487]::thermal_sunrise_uv::{closure#0} as core[940e698046960fd5]::ops::function::FnOnce<()>>::call_once<unknown>
  763. 257.84 s gammaloop-nextest-integration> at <unknown source file>:<unknown line>
  764. 257.84 s gammaloop-nextest-integration> 31: test[75d6903177b1d7e9]::__rust_begin_short_backtrace::<core[940e698046960fd5]::result::Result<(), alloc[2ea6bcb46fca0c42]::string::String>, fn() -> core[940e698046960fd5]::result::Result<(), alloc[2ea6bcb46fca0c42]::string::String>><unknown>
  765. 257.84 s gammaloop-nextest-integration> at <unknown source file>:<unknown line>
  766. 257.84 s gammaloop-nextest-integration> 32: test[75d6903177b1d7e9]::run_test::{closure#0}<unknown>
  767. 257.84 s gammaloop-nextest-integration> at <unknown source file>:<unknown line>
  768. 257.84 s gammaloop-nextest-integration> 33: std[bcb96dfbba0ab899]::sys::backtrace::__rust_begin_short_backtrace::<test[75d6903177b1d7e9]::run_test::{closure#1}, ()><unknown>
  769. 257.84 s gammaloop-nextest-integration> at <unknown source file>:<unknown line>
  770. 257.84 s gammaloop-nextest-integration> 34: <std[bcb96dfbba0ab899]::thread::lifecycle::spawn_unchecked<test[75d6903177b1d7e9]::run_test::{closure#1}, ()>::{closure#1} as core[940e698046960fd5]::ops::function::FnOnce<()>>::call_once::{shim:vtable#0}<unknown>
  771. 257.84 s gammaloop-nextest-integration> at <unknown source file>:<unknown line>
  772. 257.84 s gammaloop-nextest-integration> 35: <std[bcb96dfbba0ab899]::sys::thread::unix::Thread>::new::thread_start<unknown>
  773. 257.84 s gammaloop-nextest-integration> at <unknown source file>:<unknown line>
  774. 257.84 s gammaloop-nextest-integration> 36: start_thread<unknown>
  775. 257.84 s gammaloop-nextest-integration> at <unknown source file>:<unknown line>
  776. 257.84 s gammaloop-nextest-integration> 37: __clone3<unknown>
  777. 257.84 s gammaloop-nextest-integration> at <unknown source file>:<unknown line>
  778. 257.84 s gammaloop-nextest-integration>
  779. 257.84 s gammaloop-nextest-integration> Run with COLORBT_SHOW_HIDDEN=1 environment variable to disable frame filtering.
  780. 257.84 s gammaloop-nextest-integration> Run with RUST_BACKTRACE=full to include source snippets.
  781. 257.84 s gammaloop-nextest-integration> Warning: SpanTrace capture is Unsupported.
  782. 257.84 s gammaloop-nextest-integration> Ensure that you've setup a tracing-error ErrorLayer and the semver versions are compatible
  783. 257.84 s gammaloop-nextest-integration> =========================================
  784. 257.96 s error: Cannot build '/nix/store/mzkwykiwpnc2c1k4w0h0d3936pcxgvpd-gammaloop-nextest-integration.drv'.
  785. 257.96 s Reason: builder failed with exit code 100.
  786. 257.96 s Output paths:
  787. 257.96 s /nix/store/k0617kixhfk502xp29s91hm2a8dm72mc-gammaloop-nextest-integration
  788. 257.96 s Last 767 log lines:
  789. 257.96 s > Extracting 13 binaries, 1 build script output directory, and 3 linked paths to /build/nextest-archive-9nWrbi
  790. 257.96 s > Extracted 30 files to /build/nextest-archive-9nWrbi in 2.56s
  791. 257.96 s > ------------
  792. 257.96 s > Nextest run ID 1b091131-1a5a-47b6-aad5-776d976e7c2c with nextest profile: ci_gammaloop
  793. 257.96 s > Starting 169 tests across 13 binaries (209 tests skipped, including 208 tests via profile.ci_gammaloop.default-filter)
  794. 257.96 s > FAIL [ 3.204s] ( 55/169) gammaloop-integration-tests::test_runs aa_aa::important::aa_aa_local_inspect_backend_consistency
  795. 257.96 s > stdout ---
  796. 257.96 s >
  797. 257.96 s > running 1 test
  798. 257.96 s > test aa_aa::important::aa_aa_local_inspect_backend_consistency ... FAILED
  799. 257.96 s >
  800. 257.96 s > failures:
  801. 257.96 s >
  802. 257.96 s > failures:
  803. 257.96 s > aa_aa::important::aa_aa_local_inspect_backend_consistency
  804. 257.96 s >
  805. 257.96 s > test result: FAILED. 0 passed; 1 failed; 0 ignored; 0 measured; 273 filtered out; finished in 3.19s
  806. 257.96 s >
  807. 257.96 s > stderr ---
  808. 257.96 s > [2026-09-15 21:45:34.897] @gammaloop_api::se... INFO : Running command import model sm-default.json
  809. 257.96 s > [2026-09-15 21:45:34.897] @import::model INFO : Loading built-in JSON model sm-default
  810. 257.96 s > [2026-09-15 21:45:34.920] @gammalooprs::model INFO : The following 15 external parameters were forced to zero by the restriction card:
  811. 257.96 s > lamWS, AWS, rhoWS, etaWS, ymc, yme, ymm, MC, Me, MM, WTau, muQ, muLe, muLmu, muLtau
  812. 257.96 s > [2026-09-15 21:45:34.920] @gammalooprs::model INFO : The following 34 vertex rules were removed by the restriction card:
  813. 257.96 s > V_82 -> (c~, d, G+) | V_83 -> (t~, d, G+) | V_84 -> (c~, s, G+) | V_85 -> (t~, s, G+) | V_86 -> (u~, b, G+) | V_87 -> (c~, b, G+) | V_90 -> (c~, d, W+) | V_91 -> (t~, d, W+) | V_92 -> (u~, s, W+) | V_94 -> (t~, s, W+) | V_95 -> (u~, b, W+) | V_96 -> (c~, b, W+) | V_101 -> (e+, e-, G0) | V_102 -> (mu+, mu-, G0) | V_104 -> (e+, e-, H) | V_105 -> (mu+, mu-, H) | V_110 -> (ve~, e-, G+) | V_111 -> (vm~, mu-, G+) | V_116 -> (b~, u, G-) | V_117 -> (d~, c, G-) | V_118 -> (s~, c, G-) | V_119 -> (b~, c, G-) | V_120 -> (d~, t, G-) | V_121 -> (s~, t, G-) | V_124 -> (s~, u, W-) | V_125 -> (b~, u, W-) | V_126 -> (d~, c, W-) | V_128 -> (b~, c, W-) | V_129 -> (d~, t, W-) | V_130 -> (s~, t, W-) | V_138 -> (c~, c, G0) | V_140 -> (c~, c, H) | V_145 -> (e+, ve, G-) | V_146 -> (mu+, vm, G-)
  814. 257.96 s > [2026-09-15 21:45:34.920] @gammalooprs::model INFO : The following 36 couplings were removed by the restriction card:
  815. 257.96 s > GC_13, GC_14, GC_16, GC_17, GC_18, GC_19, GC_20, GC_22, GC_23, GC_24, GC_25, GC_26, GC_28, GC_29, GC_42, GC_43, GC_44, GC_46, GC_47, GC_48, GC_84, GC_85, GC_86, GC_87, GC_88, GC_89, GC_90, GC_91, GC_92, GC_93, GC_101, GC_102, GC_103, GC_105, GC_106, GC_107
  816. 257.96 s > [2026-09-15 21:45:34.921] @gammaloop_api::se... INFO : Running command run set_model_parameters
  817. 257.96 s > [2026-09-15 21:45:34.921] @gammaloop_api::se... INFO : Starting command block set_model_parameters
  818. 257.96 s > [2026-09-15 21:45:34.921] @gammaloop_api::se... INFO : Running command set model MT=173.0
  819. 257.96 s > [2026-09-15 21:45:34.926] @gammaloop_api::se... INFO : Running command set model WT=0.0
  820. 257.96 s > [2026-09-15 21:45:34.931] @gammaloop_api::se... INFO : Running command set model ymt=173.0
  821. 257.96 s > [2026-09-15 21:45:34.936] @gammaloop_api::se... INFO : Running command set model aS=0.118
  822. 257.96 s > [2026-09-15 21:45:34.940] @gammaloop_api::se... INFO : Running command set model aEWM1=137.036
  823. 257.96 s > [2026-09-15 21:45:34.945] @gammaloop_api::se... INFO : Running command set model Gf=1.166390e-05
  824. 257.96 s > [2026-09-15 21:45:34.950] @gammaloop_api::se... INFO : Running command set model MZ=91.188
  825. 257.96 s > [2026-09-15 21:45:34.955] @gammaloop_api::se... INFO : Running command set global string '
  826. 257.96 s > [global.generation.compile]
  827. 257.96 s > compilation_mode = "symjit"
  828. 257.96 s > optimization_level = "O0"
  829. 257.96 s > fast_math = false
  830. 257.96 s > [...]
  831. 257.96 s > [2026-09-15 21:45:34.956] @gammaloop_api::se... INFO : Running command import graphs ./examples/cli/aa_aa/1L/aa_aa_1L.dot -p aa_aa_all_helicities -i 1L_ppmm -o
  832. 257.96 s > [2026-09-15 21:45:34.956] @commands::import INFO : Loading graphs from '/build/source/examples/cli/aa_aa/1L/aa_aa_1L.dot'
  833. 257.96 s > [2026-09-15 21:45:34.965] @gammaloop_api::se... INFO : Running command generate existing -p aa_aa_all_helicities
  834. 257.96 s > The application panicked (crashed).
  835. 257.96 s > Message: label _func_power_ not found
  836. 257.96 s > Location: /nix/store/n9w914kh1cm59xx3spcs831cdyb56m32-vendor-cargo-deps/c19b7c6f923b580ac259164a89f2577984ad5ab09ee9d583b888f934adbbe8d0/symjit-2.25.6/src/symjit/assembler.rs:77
  837. 257.96 s >
  838. 257.96 s > ━━━━━━━━━━━━━━━━━━━━━━━━━━━━━━━━━━ BACKTRACE ━━━━━━━━━━━━━━━━━━━━━━━━━━━━━━━━━━━
  839. 257.96 s > 1: <color_eyre[51793ea62743adbd]::config::PanicHook>::panic_report<unknown>
  840. 257.96 s > at <unknown source file>:<unknown line>
  841. 257.96 s > 2: <color_eyre[51793ea62743adbd]::config::PanicHook>::into_panic_hook::{closure#0}<unknown>
  842. 257.96 s > at <unknown source file>:<unknown line>
  843. 257.96 s > 3: std[bcb96dfbba0ab899]::panicking::panic_with_hook<unknown>
  844. 257.96 s > at <unknown source file>:<unknown line>
  845. 257.96 s > 4: std[bcb96dfbba0ab899]::panicking::panic_handler::{closure#0}<unknown>
  846. 257.96 s > at <unknown source file>:<unknown line>
  847. 257.96 s > 5: std[bcb96dfbba0ab899]::sys::backtrace::__rust_end_short_backtrace::<std[bcb96dfbba0ab899]::panicking::panic_handler::{closure#0}, !><unknown>
  848. 257.96 s > at <unknown source file>:<unknown line>
  849. 257.96 s > 6: __rustc[6c289b9f9c454d21]::rust_begin_unwind<unknown>
  850. 257.96 s > at <unknown source file>:<unknown line>
  851. 257.96 s > 7: core[940e698046960fd5]::panicking::panic_fmt<unknown>
  852. 257.96 s > at <unknown source file>:<unknown line>
  853. 257.96 s > 8: <symjit[e408de789c333cd]::symjit::assembler::Assembler>::apply_jumps<unknown>
  854. 257.96 s > at <unknown source file>:<unknown line>
  855. 257.96 s > 9: <symjit[e408de789c333cd]::symjit::builder::Builder>::compile_from_mir::<symjit[e408de789c333cd]::symjit::amd::complex::AmdComplexGenerator><unknown>
  856. 257.96 s > at <unknown source file>:<unknown line>
  857. 257.96 s > 10: <symjit[e408de789c333cd]::symjit::runnable::Application>::compile_ty<unknown>
  858. 257.96 s > at <unknown source file>:<unknown line>
  859. 257.96 s > 11: <symjit[e408de789c333cd]::symjit::runnable::Application>::with_mir<unknown>
  860. 257.96 s > at <unknown source file>:<unknown line>
  861. 257.96 s > 12: <symjit[e408de789c333cd]::symjit::composer::DirectTranslator as symjit[e408de789c333cd]::symjit::composer::Composer>::compile<unknown>
  862. 257.96 s > at <unknown source file>:<unknown line>
  863. 257.96 s > 13: <symjit[e408de789c333cd]::symjit::compiler::Translator as symjit[e408de789c333cd]::symjit::composer::Composer>::compile<unknown>
  864. 257.96 s > at <unknown source file>:<unknown line>
  865. 257.96 s > 14: <numerica[124dab8567f4861e]::domains::float::complex::Complex<f64> as symbolica[10e259bab675d243]::evaluate::backend::JITCompiledNumber>::jit_compile<unknown>
  866. 257.96 s > at <unknown source file>:<unknown line>
  867. 257.96 s > 15: <symbolica[10e259bab675d243]::evaluate::evaluator::ExpressionEvaluator<numerica[124dab8567f4861e]::domains::float::complex::Complex<f64>>>::jit_compile<unknown>
  868. 257.96 s > at <unknown source file>:<unknown line>
  869. 257.96 s > 16: <gammalooprs[917cbd3df9e68f8f]::integrands::process::evaluators::GenericEvaluator>::activate_symjit<unknown>
  870. 257.96 s > at <unknown source file>:<unknown line>
  871. 257.96 s > 17: <gammalooprs[917cbd3df9e68f8f]::integrands::process::amplitude::AmplitudeIntegrand>::prepare_runtime_backends_after_generation_with_compile_times<unknown>
  872. 257.96 s > at <unknown source file>:<unknown line>
  873. 257.96 s > 18: <gammalooprs[917cbd3df9e68f8f]::processes::amplitude::Amplitude>::build_integrand<unknown>
  874. 257.96 s > at <unknown source file>:<unknown line>
  875. 257.96 s > 19: <gammalooprs[917cbd3df9e68f8f]::processes::process::Process>::generate_integrands<unknown>
  876. 257.96 s > at <unknown source file>:<unknown line>
  877. 257.96 s > 20: <gammaloop_api[9ebf6628f97aeb57]::state::State>::generate_integrand<unknown>
  878. 257.96 s > at <unknown source file>:<unknown line>
  879. 257.96 s > 21: <gammaloop_api[9ebf6628f97aeb57]::commands::generate::Generate>::run::<&std[bcb96dfbba0ab899]::path::PathBuf><unknown>
  880. 257.96 s > at <unknown source file>:<unknown line>
  881. 257.96 s > 22: <gammaloop_api[9ebf6628f97aeb57]::commands::Commands>::run<unknown>
  882. 257.96 s > at <unknown source file>:<unknown line>
  883. 257.96 s > 23: <gammaloop_api[9ebf6628f97aeb57]::session::CliSession>::execute_prepared<unknown>
  884. 257.96 s > at <unknown source file>:<unknown line>
  885. 257.96 s > 24: <gammaloop_api[9ebf6628f97aeb57]::session::CliSession>::execute_command<unknown>
  886. 257.96 s > at <unknown source file>:<unknown line>
  887. 257.96 s > 25: <gammaloop_integration_tests[191607b70c61cd5a]::CLIState>::run_command<unknown>
  888. 257.96 s > at <unknown source file>:<unknown line>
  889. 257.96 s > 26: test_runs[9b7e2dc2dc4f29b0]::aa_aa::generate_aa_aa_helicity_family<unknown>
  890. 257.96 s > at <unknown source file>:<unknown line>
  891. 257.96 s > 27: <test_runs[9b7e2dc2dc4f29b0]::aa_aa::important::aa_aa_local_inspect_backend_consistency::{closure#0} as core[940e698046960fd5]::ops::function::FnOnce<()>>::call_once<unknown>
  892. 257.96 s > at <unknown source file>:<unknown line>
  893. 257.96 s > 28: serial_test[cd99724524a2f1c0]::serial_code_lock::local_serial_core_with_return::<(), eyre[cb2fd339c0c40fca]::Report><unknown>
  894. 257.96 s > at <unknown source file>:<unknown line>
  895. 257.96 s > 29: <test_runs[9b7e2dc2dc4f29b0]::aa_aa::important::aa_aa_local_inspect_backend_consistency::{closure#0} as core[940e698046960fd5]::ops::function::FnOnce<()>>::call_once<unknown>
  896. 257.96 s > at <unknown source file>:<unknown line>
  897. 257.96 s > 30: test[75d6903177b1d7e9]::__rust_begin_short_backtrace::<core[940e698046960fd5]::result::Result<(), alloc[2ea6bcb46fca0c42]::string::String>, fn() -> core[940e698046960fd5]::result::Result<(), alloc[2ea6bcb46fca0c42]::string::String>><unknown>
  898. 257.96 s > at <unknown source file>:<unknown line>
  899. 257.96 s > 31: test[75d6903177b1d7e9]::run_test::{closure#0}<unknown>
  900. 257.96 s > at <unknown source file>:<unknown line>
  901. 257.96 s > 32: std[bcb96dfbba0ab899]::sys::backtrace::__rust_begin_short_backtrace::<test[75d6903177b1d7e9]::run_test::{closure#1}, ()><unknown>
  902. 257.96 s > at <unknown source file>:<unknown line>
  903. 257.96 s > 33: <std[bcb96dfbba0ab899]::thread::lifecycle::spawn_unchecked<test[75d6903177b1d7e9]::run_test::{closure#1}, ()>::{closure#1} as core[940e698046960fd5]::ops::function::FnOnce<()>>::call_once::{shim:vtable#0}<unknown>
  904. 257.96 s > at <unknown source file>:<unknown line>
  905. 257.96 s > 34: <std[bcb96dfbba0ab899]::sys::thread::unix::Thread>::new::thread_start<unknown>
  906. 257.96 s > at <unknown source file>:<unknown line>
  907. 257.96 s > 35: start_thread<unknown>
  908. 257.96 s > at <unknown source file>:<unknown line>
  909. 257.96 s > 36: __clone3<unknown>
  910. 257.96 s > at <unknown source file>:<unknown line>
  911. 257.96 s >
  912. 257.96 s > Run with COLORBT_SHOW_HIDDEN=1 environment variable to disable frame filtering.
  913. 257.96 s > Run with RUST_BACKTRACE=full to include source snippets.
  914. 257.96 s > Warning: SpanTrace capture is Unsupported.
  915. 257.96 s > Ensure that you've setup a tracing-error ErrorLayer and the semver versions are compatible
  916. 257.96 s >
  917. 257.96 s > FAIL [ 3.097s] (158/169) gammaloop-integration-tests::uv thermal_sunrise_uv
  918. 257.96 s > stdout ---
  919. 257.96 s >
  920. 257.96 s > running 1 test
  921. 257.96 s > test thermal_sunrise_uv ... FAILED
  922. 257.96 s >
  923. 257.96 s > failures:
  924. 257.96 s >
  925. 257.96 s > failures:
  926. 257.96 s > thermal_sunrise_uv
  927. 257.96 s >
  928. 257.96 s > test result: FAILED. 0 passed; 1 failed; 0 ignored; 0 measured; 31 filtered out; finished in 3.06s
  929. 257.96 s >
  930. 257.96 s > stderr ---
  931. 257.96 s > [2026-09-15 21:46:37.168] @gammaloop_api::se... INFO : Running command run generate
  932. 257.96 s > [2026-09-15 21:46:37.168] @gammaloop_api::se... INFO : Starting command block generate
  933. 257.96 s > [2026-09-15 21:46:37.168] @gammaloop_api::se... INFO : Running command import model sm-default.json
  934. 257.96 s > [2026-09-15 21:46:37.168] @import::model INFO : Loading built-in JSON model sm-default
  935. 257.96 s > [2026-09-15 21:46:37.366] @gammalooprs::model INFO : The following 15 external parameters were forced to zero by the restriction card:
  936. 257.96 s > lamWS, AWS, rhoWS, etaWS, ymc, yme, ymm, MC, Me, MM, WTau, muQ, muLe, muLmu, muLtau
  937. 257.96 s > [2026-09-15 21:46:37.366] @gammalooprs::model INFO : The following 34 vertex rules were removed by the restriction card:
  938. 257.96 s > V_82 -> (c~, d, G+) | V_83 -> (t~, d, G+) | V_84 -> (c~, s, G+) | V_85 -> (t~, s, G+) | V_86 -> (u~, b, G+) | V_87 -> (c~, b, G+) | V_90 -> (c~, d, W+) | V_91 -> (t~, d, W+) | V_92 -> (u~, s, W+) | V_94 -> (t~, s, W+) | V_95 -> (u~, b, W+) | V_96 -> (c~, b, W+) | V_101 -> (e+, e-, G0) | V_102 -> (mu+, mu-, G0) | V_104 -> (e+, e-, H) | V_105 -> (mu+, mu-, H) | V_110 -> (ve~, e-, G+) | V_111 -> (vm~, mu-, G+) | V_116 -> (b~, u, G-) | V_117 -> (d~, c, G-) | V_118 -> (s~, c, G-) | V_119 -> (b~, c, G-) | V_120 -> (d~, t, G-) | V_121 -> (s~, t, G-) | V_124 -> (s~, u, W-) | V_125 -> (b~, u, W-) | V_126 -> (d~, c, W-) | V_128 -> (b~, c, W-) | V_129 -> (d~, t, W-) | V_130 -> (s~, t, W-) | V_138 -> (c~, c, G0) | V_140 -> (c~, c, H) | V_145 -> (e+, ve, G-) | V_146 -> (mu+, vm, G-)
  939. 257.96 s > [2026-09-15 21:46:37.366] @gammalooprs::model INFO : The following 36 couplings were removed by the restriction card:
  940. 257.96 s > GC_13, GC_14, GC_16, GC_17, GC_18, GC_19, GC_20, GC_22, GC_23, GC_24, GC_25, GC_26, GC_28, GC_29, GC_42, GC_43, GC_44, GC_46, GC_47, GC_48, GC_84, GC_85, GC_86, GC_87, GC_88, GC_89, GC_90, GC_91, GC_92, GC_93, GC_101, GC_102, GC_103, GC_105, GC_106, GC_107
  941. 257.96 s > [2026-09-15 21:46:37.367] @gammaloop_api::se... INFO : Running command remove processes
  942. 257.96 s > [2026-09-15 21:46:37.367] @gammaloop_api::se... INFO : Running command generate amp {} > {} [{2}] | g u
  943. 257.96 s > --numerator-grouping group_identical_graphs_up_to_scalar_rescaling
  944. 257.96 s > --max-n-bridges 0
  945. 257.96 s > --number-of-factorized-loop-subtopologies 1 1
  946. 257.96 s > --number-of-anticommutating-loops 1 1
  947. 257.96 s > [...]
  948. 257.96 s > [2026-09-15 21:46:37.368] @feyngen::diagram_... INFO : 0s | Δ=0s | Starting Feynman graph generation with Symbolica...
  949. 257.96 s > [2026-09-15 21:46:37.369] @feyngen::diagram_... INFO : 0s | Δ=0s | Number of graphs resulting from Symbolica generation: 3
  950. 257.96 s > [2026-09-15 21:46:37.386] @feyngen::diagram_... INFO : 0s | Δ=0s | Number of graphs retained after removal of vetoed topologies: 2
  951. 257.96 s > [2026-09-15 21:46:37.389] @feyngen::diagram_... INFO : 0s | Δ=0s | Number of graphs after vertex info assignment: 2
  952. 257.96 s > [2026-09-15 21:46:37.389] @feyngen::diagram_... INFO : 0s | Δ=0s | Number of graphs after all complete graphs filters are applied: 2
  953. 257.96 s > [2026-09-15 21:46:37.389] @feyngen::diagram_... INFO : 0s | Δ=0s | Number of graphs after closed anticommutating chains analysis: 1
  954. 257.96 s > [2026-09-15 21:46:37.389] @feyngen::diagram_... INFO : 0s | Δ=0s | Number of graphs after symmetrization of external states: 1
  955. 257.96 s > [2026-09-15 21:46:37.392] @feyngen::diagram_... INFO : 0s | Δ=0s | Number of graphs after canonization of vertices, edges and flows (graph labels assigned here): 1
  956. 257.96 s > [2026-09-15 21:46:37.406] @feyngen::diagram_... INFO : 0s | Δ=0s | Number of graphs after numerator-aware grouping with strategy 'up to a scalar rescaling': 1 (1 isomorphically unique graph, 0 color zero, 0 lorentz zero, 0 grouped and 0 cancellation)
  957. 257.96 s > [2026-09-15 21:46:37.406] @feyngen::diagram_... INFO : ( Sum of the symmetry factors from each graph generated = -1/2 )
  958. 257.96 s > [2026-09-15 21:46:37.406] @commands::generate INFO : Generated amplitude 1 graphs.
  959. 257.96 s > [2026-09-15 21:46:37.406] @commands::generate INFO : Only diagram generation was requested, skipping integrand generation. You can generate integrands later using the 'generate existing <options>' command.
  960. 257.96 s > [2026-09-15 21:46:37.406] @gammaloop_api::se... INFO : Running command generate
  961. 257.96 s > The application panicked (crashed).
  962. 257.96 s > Message: label _func_power_ not found
  963. 257.96 s > Location: /nix/store/n9w914kh1cm59xx3spcs831cdyb56m32-vendor-cargo-deps/c19b7c6f923b580ac259164a89f2577984ad5ab09ee9d583b888f934adbbe8d0/symjit-2.25.6/src/symjit/assembler.rs:77
  964. 257.96 s >
  965. 257.96 s > ━━━━━━━━━━━━━━━━━━━━━━━━━━━━━━━━━━ BACKTRACE ━━━━━━━━━━━━━━━━━━━━━━━━━━━━━━━━━━━
  966. 257.96 s > 1: <color_eyre[51793ea62743adbd]::config::PanicHook>::panic_report<unknown>
  967. 257.96 s > at <unknown source file>:<unknown line>
  968. 257.96 s > 2: <color_eyre[51793ea62743adbd]::config::PanicHook>::into_panic_hook::{closure#0}<unknown>
  969. 257.96 s > at <unknown source file>:<unknown line>
  970. 257.96 s > 3: std[bcb96dfbba0ab899]::panicking::panic_with_hook<unknown>
  971. 257.96 s > at <unknown source file>:<unknown line>
  972. 257.96 s > 4: std[bcb96dfbba0ab899]::panicking::panic_handler::{closure#0}<unknown>
  973. 257.96 s > at <unknown source file>:<unknown line>
  974. 257.96 s > 5: std[bcb96dfbba0ab899]::sys::backtrace::__rust_end_short_backtrace::<std[bcb96dfbba0ab899]::panicking::panic_handler::{closure#0}, !><unknown>
  975. 257.96 s > at <unknown source file>:<unknown line>
  976. 257.96 s > 6: __rustc[6c289b9f9c454d21]::rust_begin_unwind<unknown>
  977. 257.96 s > at <unknown source file>:<unknown line>
  978. 257.96 s > 7: core[940e698046960fd5]::panicking::panic_fmt<unknown>
  979. 257.96 s > at <unknown source file>:<unknown line>
  980. 257.96 s > 8: <symjit[e408de789c333cd]::symjit::assembler::Assembler>::apply_jumps<unknown>
  981. 257.96 s > at <unknown source file>:<unknown line>
  982. 257.96 s > 9: <symjit[e408de789c333cd]::symjit::builder::Builder>::compile_from_mir::<symjit[e408de789c333cd]::symjit::amd::complex::AmdComplexGenerator><unknown>
  983. 257.96 s > at <unknown source file>:<unknown line>
  984. 257.96 s > 10: <symjit[e408de789c333cd]::symjit::runnable::Application>::compile_ty<unknown>
  985. 257.96 s > at <unknown source file>:<unknown line>
  986. 257.96 s > 11: <symjit[e408de789c333cd]::symjit::runnable::Application>::with_mir<unknown>
  987. 257.96 s > at <unknown source file>:<unknown line>
  988. 257.96 s > 12: <symjit[e408de789c333cd]::symjit::composer::DirectTranslator as symjit[e408de789c333cd]::symjit::composer::Composer>::compile<unknown>
  989. 257.96 s > at <unknown source file>:<unknown line>
  990. 257.96 s > 13: <symjit[e408de789c333cd]::symjit::compiler::Translator as symjit[e408de789c333cd]::symjit::composer::Composer>::compile<unknown>
  991. 257.96 s > at <unknown source file>:<unknown line>
  992. 257.96 s > 14: <numerica[124dab8567f4861e]::domains::float::complex::Complex<f64> as symbolica[10e259bab675d243]::evaluate::backend::JITCompiledNumber>::jit_compile<unknown>
  993. 257.96 s > at <unknown source file>:<unknown line>
  994. 257.96 s > 15: <symbolica[10e259bab675d243]::evaluate::evaluator::ExpressionEvaluator<numerica[124dab8567f4861e]::domains::float::complex::Complex<f64>>>::jit_compile<unknown>
  995. 257.96 s > at <unknown source file>:<unknown line>
  996. 257.96 s > 16: <gammalooprs[917cbd3df9e68f8f]::integrands::process::evaluators::GenericEvaluator>::activate_symjit<unknown>
  997. 257.96 s > at <unknown source file>:<unknown line>
  998. 257.96 s > 17: <gammalooprs[917cbd3df9e68f8f]::integrands::process::amplitude::AmplitudeIntegrand>::prepare_runtime_backends_after_generation_with_compile_times<unknown>
  999. 257.96 s > at <unknown source file>:<unknown line>
  1000. 257.96 s > 18: <gammalooprs[917cbd3df9e68f8f]::processes::amplitude::Amplitude>::build_integrand<unknown>
  1001. 257.96 s > at <unknown source file>:<unknown line>
  1002. 257.96 s > 19: <gammalooprs[917cbd3df9e68f8f]::processes::process::Process>::generate_integrands<unknown>
  1003. 257.96 s > at <unknown source file>:<unknown line>
  1004. 257.96 s > 20: <gammalooprs[917cbd3df9e68f8f]::processes::ProcessList>::generate_integrands<unknown>
  1005. 257.96 s > at <unknown source file>:<unknown line>
  1006. 257.96 s > 21: <gammaloop_api[9ebf6628f97aeb57]::state::State>::generate_integrands<unknown>
  1007. 257.96 s > at <unknown source file>:<unknown line>
  1008. 257.96 s > 22: <gammaloop_api[9ebf6628f97aeb57]::commands::generate::Generate>::run::<&std[bcb96dfbba0ab899]::path::PathBuf><unknown>
  1009. 257.96 s > at <unknown source file>:<unknown line>
  1010. 257.96 s > 23: <gammaloop_api[9ebf6628f97aeb57]::commands::Commands>::run<unknown>
  1011. 257.96 s > at <unknown source file>:<unknown line>
  1012. 257.96 s > 24: <gammaloop_api[9ebf6628f97aeb57]::session::CliSession>::execute_prepared<unknown>
  1013. 257.96 s > at <unknown source file>:<unknown line>
  1014. 257.96 s > 25: <gammaloop_api[9ebf6628f97aeb57]::session::CliSession>::execute_prepared_commands<unknown>
  1015. 257.96 s > at <unknown source file>:<unknown line>
  1016. 257.96 s > 26: <gammaloop_api[9ebf6628f97aeb57]::session::CliSession>::execute_prepared<unknown>
  1017. 257.96 s > at <unknown source file>:<unknown line>
  1018. 257.96 s > 27: <gammaloop_api[9ebf6628f97aeb57]::session::CliSession>::execute_command<unknown>
  1019. 257.96 s > at <unknown source file>:<unknown line>
  1020. 257.96 s > 28: <gammaloop_integration_tests[191607b70c61cd5a]::CLIState>::run_command<unknown>
  1021. 257.96 s > at <unknown source file>:<unknown line>
  1022. 257.96 s > 29: uv[3c7454ef256d6487]::run_single_integrated_uv_case<unknown>
  1023. 257.96 s > at <unknown source file>:<unknown line>
  1024. 257.96 s > 30: <uv[3c7454ef256d6487]::thermal_sunrise_uv::{closure#0} as core[940e698046960fd5]::ops::function::FnOnce<()>>::call_once<unknown>
  1025. 257.96 s > at <unknown source file>:<unknown line>
  1026. 257.96 s > 31: test[75d6903177b1d7e9]::__rust_begin_short_backtrace::<core[940e698046960fd5]::result::Result<(), alloc[2ea6bcb46fca0c42]::string::String>, fn() -> core[940e698046960fd5]::result::Result<(), alloc[2ea6bcb46fca0c42]::string::String>><unknown>
  1027. 257.96 s > at <unknown source file>:<unknown line>
  1028. 257.96 s > 32: test[75d6903177b1d7e9]::run_test::{closure#0}<unknown>
  1029. 257.96 s > at <unknown source file>:<unknown line>
  1030. 257.96 s > 33: std[bcb96dfbba0ab899]::sys::backtrace::__rust_begin_short_backtrace::<test[75d6903177b1d7e9]::run_test::{closure#1}, ()><unknown>
  1031. 257.96 s > at <unknown source file>:<unknown line>
  1032. 257.96 s > 34: <std[bcb96dfbba0ab899]::thread::lifecycle::spawn_unchecked<test[75d6903177b1d7e9]::run_test::{closure#1}, ()>::{closure#1} as core[940e698046960fd5]::ops::function::FnOnce<()>>::call_once::{shim:vtable#0}<unknown>
  1033. 257.96 s > at <unknown source file>:<unknown line>
  1034. 257.96 s > 35: <std[bcb96dfbba0ab899]::sys::thread::unix::Thread>::new::thread_start<unknown>
  1035. 257.96 s > at <unknown source file>:<unknown line>
  1036. 257.96 s > 36: start_thread<unknown>
  1037. 257.96 s > at <unknown source file>:<unknown line>
  1038. 257.96 s > 37: __clone3<unknown>
  1039. 257.96 s > at <unknown source file>:<unknown line>
  1040. 257.96 s >
  1041. 257.96 s > Run with COLORBT_SHOW_HIDDEN=1 environment variable to disable frame filtering.
  1042. 257.96 s > Run with RUST_BACKTRACE=full to include source snippets.
  1043. 257.96 s > Warning: SpanTrace capture is Unsupported.
  1044. 257.96 s > Ensure that you've setup a tracing-error ErrorLayer and the semver versions are compatible
  1045. 257.96 s >
  1046. 257.96 s > ------------
  1047. 257.96 s > Summary [ 227.631s] 169 tests run: 167 passed, 2 failed, 209 skipped
  1048. 257.96 s > FAIL [ 3.204s] ( 55/169) gammaloop-integration-tests::test_runs aa_aa::important::aa_aa_local_inspect_backend_consistency
  1049. 257.96 s > stdout ---
  1050. 257.96 s >
  1051. 257.96 s > running 1 test
  1052. 257.96 s > test aa_aa::important::aa_aa_local_inspect_backend_consistency ... FAILED
  1053. 257.96 s >
  1054. 257.96 s > failures:
  1055. 257.96 s >
  1056. 257.96 s > failures:
  1057. 257.96 s > aa_aa::important::aa_aa_local_inspect_backend_consistency
  1058. 257.96 s >
  1059. 257.96 s > test result: FAILED. 0 passed; 1 failed; 0 ignored; 0 measured; 273 filtered out; finished in 3.19s
  1060. 257.96 s >
  1061. 257.96 s > stderr ---
  1062. 257.96 s > [2026-09-15 21:45:34.897] @gammaloop_api::se... INFO : Running command import model sm-default.json
  1063. 257.96 s > [2026-09-15 21:45:34.897] @import::model INFO : Loading built-in JSON model sm-default
  1064. 257.96 s > [2026-09-15 21:45:34.920] @gammalooprs::model INFO : The following 15 external parameters were forced to zero by the restriction card:
  1065. 257.96 s > lamWS, AWS, rhoWS, etaWS, ymc, yme, ymm, MC, Me, MM, WTau, muQ, muLe, muLmu, muLtau
  1066. 257.96 s > [2026-09-15 21:45:34.920] @gammalooprs::model INFO : The following 34 vertex rules were removed by the restriction card:
  1067. 257.96 s > V_82 -> (c~, d, G+) | V_83 -> (t~, d, G+) | V_84 -> (c~, s, G+) | V_85 -> (t~, s, G+) | V_86 -> (u~, b, G+) | V_87 -> (c~, b, G+) | V_90 -> (c~, d, W+) | V_91 -> (t~, d, W+) | V_92 -> (u~, s, W+) | V_94 -> (t~, s, W+) | V_95 -> (u~, b, W+) | V_96 -> (c~, b, W+) | V_101 -> (e+, e-, G0) | V_102 -> (mu+, mu-, G0) | V_104 -> (e+, e-, H) | V_105 -> (mu+, mu-, H) | V_110 -> (ve~, e-, G+) | V_111 -> (vm~, mu-, G+) | V_116 -> (b~, u, G-) | V_117 -> (d~, c, G-) | V_118 -> (s~, c, G-) | V_119 -> (b~, c, G-) | V_120 -> (d~, t, G-) | V_121 -> (s~, t, G-) | V_124 -> (s~, u, W-) | V_125 -> (b~, u, W-) | V_126 -> (d~, c, W-) | V_128 -> (b~, c, W-) | V_129 -> (d~, t, W-) | V_130 -> (s~, t, W-) | V_138 -> (c~, c, G0) | V_140 -> (c~, c, H) | V_145 -> (e+, ve, G-) | V_146 -> (mu+, vm, G-)
  1068. 257.96 s > [2026-09-15 21:45:34.920] @gammalooprs::model INFO : The following 36 couplings were removed by the restriction card:
  1069. 257.96 s > GC_13, GC_14, GC_16, GC_17, GC_18, GC_19, GC_20, GC_22, GC_23, GC_24, GC_25, GC_26, GC_28, GC_29, GC_42, GC_43, GC_44, GC_46, GC_47, GC_48, GC_84, GC_85, GC_86, GC_87, GC_88, GC_89, GC_90, GC_91, GC_92, GC_93, GC_101, GC_102, GC_103, GC_105, GC_106, GC_107
  1070. 257.96 s > [2026-09-15 21:45:34.921] @gammaloop_api::se... INFO : Running command run set_model_parameters
  1071. 257.96 s > [2026-09-15 21:45:34.921] @gammaloop_api::se... INFO : Starting command block set_model_parameters
  1072. 257.96 s > [2026-09-15 21:45:34.921] @gammaloop_api::se... INFO : Running command set model MT=173.0
  1073. 257.96 s > [2026-09-15 21:45:34.926] @gammaloop_api::se... INFO : Running command set model WT=0.0
  1074. 257.96 s > [2026-09-15 21:45:34.931] @gammaloop_api::se... INFO : Running command set model ymt=173.0
  1075. 257.96 s > [2026-09-15 21:45:34.936] @gammaloop_api::se... INFO : Running command set model aS=0.118
  1076. 257.96 s > [2026-09-15 21:45:34.940] @gammaloop_api::se... INFO : Running command set model aEWM1=137.036
  1077. 257.96 s > [2026-09-15 21:45:34.945] @gammaloop_api::se... INFO : Running command set model Gf=1.166390e-05
  1078. 257.96 s > [2026-09-15 21:45:34.950] @gammaloop_api::se... INFO : Running command set model MZ=91.188
  1079. 257.96 s > [2026-09-15 21:45:34.955] @gammaloop_api::se... INFO : Running command set global string '
  1080. 257.96 s > [global.generation.compile]
  1081. 257.96 s > compilation_mode = "symjit"
  1082. 257.96 s > optimization_level = "O0"
  1083. 257.96 s > fast_math = false
  1084. 257.96 s > [...]
  1085. 257.96 s > [2026-09-15 21:45:34.956] @gammaloop_api::se... INFO : Running command import graphs ./examples/cli/aa_aa/1L/aa_aa_1L.dot -p aa_aa_all_helicities -i 1L_ppmm -o
  1086. 257.96 s > [2026-09-15 21:45:34.956] @commands::import INFO : Loading graphs from '/build/source/examples/cli/aa_aa/1L/aa_aa_1L.dot'
  1087. 257.96 s > [2026-09-15 21:45:34.965] @gammaloop_api::se... INFO : Running command generate existing -p aa_aa_all_helicities
  1088. 257.96 s > The application panicked (crashed).
  1089. 257.96 s > Message: label _func_power_ not found
  1090. 257.96 s > Location: /nix/store/n9w914kh1cm59xx3spcs831cdyb56m32-vendor-cargo-deps/c19b7c6f923b580ac259164a89f2577984ad5ab09ee9d583b888f934adbbe8d0/symjit-2.25.6/src/symjit/assembler.rs:77
  1091. 257.96 s >
  1092. 257.96 s > ━━━━━━━━━━━━━━━━━━━━━━━━━━━━━━━━━━ BACKTRACE ━━━━━━━━━━━━━━━━━━━━━━━━━━━━━━━━━━━
  1093. 257.96 s > 1: <color_eyre[51793ea62743adbd]::config::PanicHook>::panic_report<unknown>
  1094. 257.96 s > at <unknown source file>:<unknown line>
  1095. 257.96 s > 2: <color_eyre[51793ea62743adbd]::config::PanicHook>::into_panic_hook::{closure#0}<unknown>
  1096. 257.96 s > at <unknown source file>:<unknown line>
  1097. 257.96 s > 3: std[bcb96dfbba0ab899]::panicking::panic_with_hook<unknown>
  1098. 257.96 s > at <unknown source file>:<unknown line>
  1099. 257.96 s > 4: std[bcb96dfbba0ab899]::panicking::panic_handler::{closure#0}<unknown>
  1100. 257.96 s > at <unknown source file>:<unknown line>
  1101. 257.96 s > 5: std[bcb96dfbba0ab899]::sys::backtrace::__rust_end_short_backtrace::<std[bcb96dfbba0ab899]::panicking::panic_handler::{closure#0}, !><unknown>
  1102. 257.96 s > at <unknown source file>:<unknown line>
  1103. 257.96 s > 6: __rustc[6c289b9f9c454d21]::rust_begin_unwind<unknown>
  1104. 257.96 s > at <unknown source file>:<unknown line>
  1105. 257.96 s > 7: core[940e698046960fd5]::panicking::panic_fmt<unknown>
  1106. 257.96 s > at <unknown source file>:<unknown line>
  1107. 257.96 s > 8: <symjit[e408de789c333cd]::symjit::assembler::Assembler>::apply_jumps<unknown>
  1108. 257.96 s > at <unknown source file>:<unknown line>
  1109. 257.96 s > 9: <symjit[e408de789c333cd]::symjit::builder::Builder>::compile_from_mir::<symjit[e408de789c333cd]::symjit::amd::complex::AmdComplexGenerator><unknown>
  1110. 257.96 s > at <unknown source file>:<unknown line>
  1111. 257.96 s > 10: <symjit[e408de789c333cd]::symjit::runnable::Application>::compile_ty<unknown>
  1112. 257.96 s > at <unknown source file>:<unknown line>
  1113. 257.96 s > 11: <symjit[e408de789c333cd]::symjit::runnable::Application>::with_mir<unknown>
  1114. 257.96 s > at <unknown source file>:<unknown line>
  1115. 257.96 s > 12: <symjit[e408de789c333cd]::symjit::composer::DirectTranslator as symjit[e408de789c333cd]::symjit::composer::Composer>::compile<unknown>
  1116. 257.96 s > at <unknown source file>:<unknown line>
  1117. 257.96 s > 13: <symjit[e408de789c333cd]::symjit::compiler::Translator as symjit[e408de789c333cd]::symjit::composer::Composer>::compile<unknown>
  1118. 257.96 s > at <unknown source file>:<unknown line>
  1119. 257.96 s > 14: <numerica[124dab8567f4861e]::domains::float::complex::Complex<f64> as symbolica[10e259bab675d243]::evaluate::backend::JITCompiledNumber>::jit_compile<unknown>
  1120. 257.96 s > at <unknown source file>:<unknown line>
  1121. 257.96 s > 15: <symbolica[10e259bab675d243]::evaluate::evaluator::ExpressionEvaluator<numerica[124dab8567f4861e]::domains::float::complex::Complex<f64>>>::jit_compile<unknown>
  1122. 257.96 s > at <unknown source file>:<unknown line>
  1123. 257.96 s > 16: <gammalooprs[917cbd3df9e68f8f]::integrands::process::evaluators::GenericEvaluator>::activate_symjit<unknown>
  1124. 257.96 s > at <unknown source file>:<unknown line>
  1125. 257.96 s > 17: <gammalooprs[917cbd3df9e68f8f]::integrands::process::amplitude::AmplitudeIntegrand>::prepare_runtime_backends_after_generation_with_compile_times<unknown>
  1126. 257.96 s > at <unknown source file>:<unknown line>
  1127. 257.96 s > 18: <gammalooprs[917cbd3df9e68f8f]::processes::amplitude::Amplitude>::build_integrand<unknown>
  1128. 257.96 s > at <unknown source file>:<unknown line>
  1129. 257.96 s > 19: <gammalooprs[917cbd3df9e68f8f]::processes::process::Process>::generate_integrands<unknown>
  1130. 257.96 s > at <unknown source file>:<unknown line>
  1131. 257.96 s > 20: <gammaloop_api[9ebf6628f97aeb57]::state::State>::generate_integrand<unknown>
  1132. 257.96 s > at <unknown source file>:<unknown line>
  1133. 257.96 s > 21: <gammaloop_api[9ebf6628f97aeb57]::commands::generate::Generate>::run::<&std[bcb96dfbba0ab899]::path::PathBuf><unknown>
  1134. 257.96 s > at <unknown source file>:<unknown line>
  1135. 257.96 s > 22: <gammaloop_api[9ebf6628f97aeb57]::commands::Commands>::run<unknown>
  1136. 257.96 s > at <unknown source file>:<unknown line>
  1137. 257.96 s > 23: <gammaloop_api[9ebf6628f97aeb57]::session::CliSession>::execute_prepared<unknown>
  1138. 257.96 s > at <unknown source file>:<unknown line>
  1139. 257.96 s > 24: <gammaloop_api[9ebf6628f97aeb57]::session::CliSession>::execute_command<unknown>
  1140. 257.96 s > at <unknown source file>:<unknown line>
  1141. 257.96 s > 25: <gammaloop_integration_tests[191607b70c61cd5a]::CLIState>::run_command<unknown>
  1142. 257.96 s > at <unknown source file>:<unknown line>
  1143. 257.96 s > 26: test_runs[9b7e2dc2dc4f29b0]::aa_aa::generate_aa_aa_helicity_family<unknown>
  1144. 257.96 s > at <unknown source file>:<unknown line>
  1145. 257.96 s > 27: <test_runs[9b7e2dc2dc4f29b0]::aa_aa::important::aa_aa_local_inspect_backend_consistency::{closure#0} as core[940e698046960fd5]::ops::function::FnOnce<()>>::call_once<unknown>
  1146. 257.96 s > at <unknown source file>:<unknown line>
  1147. 257.96 s > 28: serial_test[cd99724524a2f1c0]::serial_code_lock::local_serial_core_with_return::<(), eyre[cb2fd339c0c40fca]::Report><unknown>
  1148. 257.96 s > at <unknown source file>:<unknown line>
  1149. 257.96 s > 29: <test_runs[9b7e2dc2dc4f29b0]::aa_aa::important::aa_aa_local_inspect_backend_consistency::{closure#0} as core[940e698046960fd5]::ops::function::FnOnce<()>>::call_once<unknown>
  1150. 257.96 s > at <unknown source file>:<unknown line>
  1151. 257.96 s > 30: test[75d6903177b1d7e9]::__rust_begin_short_backtrace::<core[940e698046960fd5]::result::Result<(), alloc[2ea6bcb46fca0c42]::string::String>, fn() -> core[940e698046960fd5]::result::Result<(), alloc[2ea6bcb46fca0c42]::string::String>><unknown>
  1152. 257.96 s > at <unknown source file>:<unknown line>
  1153. 257.96 s > 31: test[75d6903177b1d7e9]::run_test::{closure#0}<unknown>
  1154. 257.96 s > at <unknown source file>:<unknown line>
  1155. 257.96 s > 32: std[bcb96dfbba0ab899]::sys::backtrace::__rust_begin_short_backtrace::<test[75d6903177b1d7e9]::run_test::{closure#1}, ()><unknown>
  1156. 257.96 s > at <unknown source file>:<unknown line>
  1157. 257.96 s > 33: <std[bcb96dfbba0ab899]::thread::lifecycle::spawn_unchecked<test[75d6903177b1d7e9]::run_test::{closure#1}, ()>::{closure#1} as core[940e698046960fd5]::ops::function::FnOnce<()>>::call_once::{shim:vtable#0}<unknown>
  1158. 257.96 s > at <unknown source file>:<unknown line>
  1159. 257.96 s > 34: <std[bcb96dfbba0ab899]::sys::thread::unix::Thread>::new::thread_start<unknown>
  1160. 257.96 s > at <unknown source file>:<unknown line>
  1161. 257.96 s > 35: start_thread<unknown>
  1162. 257.96 s > at <unknown source file>:<unknown line>
  1163. 257.96 s > 36: __clone3<unknown>
  1164. 257.96 s > at <unknown source file>:<unknown line>
  1165. 257.96 s >
  1166. 257.96 s > Run with COLORBT_SHOW_HIDDEN=1 environment variable to disable frame filtering.
  1167. 257.96 s > Run with RUST_BACKTRACE=full to include source snippets.
  1168. 257.96 s > Warning: SpanTrace capture is Unsupported.
  1169. 257.96 s > Ensure that you've setup a tracing-error ErrorLayer and the semver versions are compatible
  1170. 257.96 s >
  1171. 257.96 s > FAIL [ 3.097s] (158/169) gammaloop-integration-tests::uv thermal_sunrise_uv
  1172. 257.96 s > stdout ---
  1173. 257.96 s >
  1174. 257.96 s > running 1 test
  1175. 257.96 s > test thermal_sunrise_uv ... FAILED
  1176. 257.96 s >
  1177. 257.96 s > failures:
  1178. 257.96 s >
  1179. 257.96 s > failures:
  1180. 257.96 s > thermal_sunrise_uv
  1181. 257.96 s >
  1182. 257.96 s > test result: FAILED. 0 passed; 1 failed; 0 ignored; 0 measured; 31 filtered out; finished in 3.06s
  1183. 257.96 s >
  1184. 257.96 s > stderr ---
  1185. 257.96 s > [2026-09-15 21:46:37.168] @gammaloop_api::se... INFO : Running command run generate
  1186. 257.96 s > [2026-09-15 21:46:37.168] @gammaloop_api::se... INFO : Starting command block generate
  1187. 257.96 s > [2026-09-15 21:46:37.168] @gammaloop_api::se... INFO : Running command import model sm-default.json
  1188. 257.96 s > [2026-09-15 21:46:37.168] @import::model INFO : Loading built-in JSON model sm-default
  1189. 257.96 s > [2026-09-15 21:46:37.366] @gammalooprs::model INFO : The following 15 external parameters were forced to zero by the restriction card:
  1190. 257.96 s > lamWS, AWS, rhoWS, etaWS, ymc, yme, ymm, MC, Me, MM, WTau, muQ, muLe, muLmu, muLtau
  1191. 257.96 s > [2026-09-15 21:46:37.366] @gammalooprs::model INFO : The following 34 vertex rules were removed by the restriction card:
  1192. 257.96 s > V_82 -> (c~, d, G+) | V_83 -> (t~, d, G+) | V_84 -> (c~, s, G+) | V_85 -> (t~, s, G+) | V_86 -> (u~, b, G+) | V_87 -> (c~, b, G+) | V_90 -> (c~, d, W+) | V_91 -> (t~, d, W+) | V_92 -> (u~, s, W+) | V_94 -> (t~, s, W+) | V_95 -> (u~, b, W+) | V_96 -> (c~, b, W+) | V_101 -> (e+, e-, G0) | V_102 -> (mu+, mu-, G0) | V_104 -> (e+, e-, H) | V_105 -> (mu+, mu-, H) | V_110 -> (ve~, e-, G+) | V_111 -> (vm~, mu-, G+) | V_116 -> (b~, u, G-) | V_117 -> (d~, c, G-) | V_118 -> (s~, c, G-) | V_119 -> (b~, c, G-) | V_120 -> (d~, t, G-) | V_121 -> (s~, t, G-) | V_124 -> (s~, u, W-) | V_125 -> (b~, u, W-) | V_126 -> (d~, c, W-) | V_128 -> (b~, c, W-) | V_129 -> (d~, t, W-) | V_130 -> (s~, t, W-) | V_138 -> (c~, c, G0) | V_140 -> (c~, c, H) | V_145 -> (e+, ve, G-) | V_146 -> (mu+, vm, G-)
  1193. 257.96 s > [2026-09-15 21:46:37.366] @gammalooprs::model INFO : The following 36 couplings were removed by the restriction card:
  1194. 257.96 s > GC_13, GC_14, GC_16, GC_17, GC_18, GC_19, GC_20, GC_22, GC_23, GC_24, GC_25, GC_26, GC_28, GC_29, GC_42, GC_43, GC_44, GC_46, GC_47, GC_48, GC_84, GC_85, GC_86, GC_87, GC_88, GC_89, GC_90, GC_91, GC_92, GC_93, GC_101, GC_102, GC_103, GC_105, GC_106, GC_107
  1195. 257.96 s > [2026-09-15 21:46:37.367] @gammaloop_api::se... INFO : Running command remove processes
  1196. 257.96 s > [2026-09-15 21:46:37.367] @gammaloop_api::se... INFO : Running command generate amp {} > {} [{2}] | g u
  1197. 257.96 s > --numerator-grouping group_identical_graphs_up_to_scalar_rescaling
  1198. 257.96 s > --max-n-bridges 0
  1199. 257.96 s > --number-of-factorized-loop-subtopologies 1 1
  1200. 257.96 s > --number-of-anticommutating-loops 1 1
  1201. 257.96 s > [...]
  1202. 257.96 s > [2026-09-15 21:46:37.368] @feyngen::diagram_... INFO : 0s | Δ=0s | Starting Feynman graph generation with Symbolica...
  1203. 257.96 s > [2026-09-15 21:46:37.369] @feyngen::diagram_... INFO : 0s | Δ=0s | Number of graphs resulting from Symbolica generation: 3
  1204. 257.96 s > [2026-09-15 21:46:37.386] @feyngen::diagram_... INFO : 0s | Δ=0s | Number of graphs retained after removal of vetoed topologies: 2
  1205. 257.96 s > [2026-09-15 21:46:37.389] @feyngen::diagram_... INFO : 0s | Δ=0s | Number of graphs after vertex info assignment: 2
  1206. 257.96 s > [2026-09-15 21:46:37.389] @feyngen::diagram_... INFO : 0s | Δ=0s | Number of graphs after all complete graphs filters are applied: 2
  1207. 257.96 s > [2026-09-15 21:46:37.389] @feyngen::diagram_... INFO : 0s | Δ=0s | Number of graphs after closed anticommutating chains analysis: 1
  1208. 257.96 s > [2026-09-15 21:46:37.389] @feyngen::diagram_... INFO : 0s | Δ=0s | Number of graphs after symmetrization of external states: 1
  1209. 257.96 s > [2026-09-15 21:46:37.392] @feyngen::diagram_... INFO : 0s | Δ=0s | Number of graphs after canonization of vertices, edges and flows (graph labels assigned here): 1
  1210. 257.96 s > [2026-09-15 21:46:37.406] @feyngen::diagram_... INFO : 0s | Δ=0s | Number of graphs after numerator-aware grouping with strategy 'up to a scalar rescaling': 1 (1 isomorphically unique graph, 0 color zero, 0 lorentz zero, 0 grouped and 0 cancellation)
  1211. 257.96 s > [2026-09-15 21:46:37.406] @feyngen::diagram_... INFO : ( Sum of the symmetry factors from each graph generated = -1/2 )
  1212. 257.96 s > [2026-09-15 21:46:37.406] @commands::generate INFO : Generated amplitude 1 graphs.
  1213. 257.96 s > [2026-09-15 21:46:37.406] @commands::generate INFO : Only diagram generation was requested, skipping integrand generation. You can generate integrands later using the 'generate existing <options>' command.
  1214. 257.96 s > [2026-09-15 21:46:37.406] @gammaloop_api::se... INFO : Running command generate
  1215. 257.96 s > The application panicked (crashed).
  1216. 257.96 s > Message: label _func_power_ not found
  1217. 257.96 s > Location: /nix/store/n9w914kh1cm59xx3spcs831cdyb56m32-vendor-cargo-deps/c19b7c6f923b580ac259164a89f2577984ad5ab09ee9d583b888f934adbbe8d0/symjit-2.25.6/src/symjit/assembler.rs:77
  1218. 257.96 s >
  1219. 257.96 s > ━━━━━━━━━━━━━━━━━━━━━━━━━━━━━━━━━━ BACKTRACE ━━━━━━━━━━━━━━━━━━━━━━━━━━━━━━━━━━━
  1220. 257.96 s > 1: <color_eyre[51793ea62743adbd]::config::PanicHook>::panic_report<unknown>
  1221. 257.96 s > at <unknown source file>:<unknown line>
  1222. 257.96 s > 2: <color_eyre[51793ea62743adbd]::config::PanicHook>::into_panic_hook::{closure#0}<unknown>
  1223. 257.96 s > at <unknown source file>:<unknown line>
  1224. 257.96 s > 3: std[bcb96dfbba0ab899]::panicking::panic_with_hook<unknown>
  1225. 257.96 s > at <unknown source file>:<unknown line>
  1226. 257.96 s > 4: std[bcb96dfbba0ab899]::panicking::panic_handler::{closure#0}<unknown>
  1227. 257.96 s > at <unknown source file>:<unknown line>
  1228. 257.96 s > 5: std[bcb96dfbba0ab899]::sys::backtrace::__rust_end_short_backtrace::<std[bcb96dfbba0ab899]::panicking::panic_handler::{closure#0}, !><unknown>
  1229. 257.96 s > at <unknown source file>:<unknown line>
  1230. 257.96 s > 6: __rustc[6c289b9f9c454d21]::rust_begin_unwind<unknown>
  1231. 257.96 s > at <unknown source file>:<unknown line>
  1232. 257.96 s > 7: core[940e698046960fd5]::panicking::panic_fmt<unknown>
  1233. 257.96 s > at <unknown source file>:<unknown line>
  1234. 257.96 s > 8: <symjit[e408de789c333cd]::symjit::assembler::Assembler>::apply_jumps<unknown>
  1235. 257.96 s > at <unknown source file>:<unknown line>
  1236. 257.96 s > 9: <symjit[e408de789c333cd]::symjit::builder::Builder>::compile_from_mir::<symjit[e408de789c333cd]::symjit::amd::complex::AmdComplexGenerator><unknown>
  1237. 257.96 s > at <unknown source file>:<unknown line>
  1238. 257.96 s > 10: <symjit[e408de789c333cd]::symjit::runnable::Application>::compile_ty<unknown>
  1239. 257.96 s > at <unknown source file>:<unknown line>
  1240. 257.96 s > 11: <symjit[e408de789c333cd]::symjit::runnable::Application>::with_mir<unknown>
  1241. 257.96 s > at <unknown source file>:<unknown line>
  1242. 257.96 s > 12: <symjit[e408de789c333cd]::symjit::composer::DirectTranslator as symjit[e408de789c333cd]::symjit::composer::Composer>::compile<unknown>
  1243. 257.96 s > at <unknown source file>:<unknown line>
  1244. 257.96 s > 13: <symjit[e408de789c333cd]::symjit::compiler::Translator as symjit[e408de789c333cd]::symjit::composer::Composer>::compile<unknown>
  1245. 257.96 s > at <unknown source file>:<unknown line>
  1246. 257.96 s > 14: <numerica[124dab8567f4861e]::domains::float::complex::Complex<f64> as symbolica[10e259bab675d243]::evaluate::backend::JITCompiledNumber>::jit_compile<unknown>
  1247. 257.96 s > at <unknown source file>:<unknown line>
  1248. 257.96 s > 15: <symbolica[10e259bab675d243]::evaluate::evaluator::ExpressionEvaluator<numerica[124dab8567f4861e]::domains::float::complex::Complex<f64>>>::jit_compile<unknown>
  1249. 257.96 s > at <unknown source file>:<unknown line>
  1250. 257.96 s > 16: <gammalooprs[917cbd3df9e68f8f]::integrands::process::evaluators::GenericEvaluator>::activate_symjit<unknown>
  1251. 257.96 s > at <unknown source file>:<unknown line>
  1252. 257.96 s > 17: <gammalooprs[917cbd3df9e68f8f]::integrands::process::amplitude::AmplitudeIntegrand>::prepare_runtime_backends_after_generation_with_compile_times<unknown>
  1253. 257.96 s > at <unknown source file>:<unknown line>
  1254. 257.96 s > 18: <gammalooprs[917cbd3df9e68f8f]::processes::amplitude::Amplitude>::build_integrand<unknown>
  1255. 257.96 s > at <unknown source file>:<unknown line>
  1256. 257.96 s > 19: <gammalooprs[917cbd3df9e68f8f]::processes::process::Process>::generate_integrands<unknown>
  1257. 257.96 s > at <unknown source file>:<unknown line>
  1258. 257.96 s > 20: <gammalooprs[917cbd3df9e68f8f]::processes::ProcessList>::generate_integrands<unknown>
  1259. 257.96 s > at <unknown source file>:<unknown line>
  1260. 257.96 s > 21: <gammaloop_api[9ebf6628f97aeb57]::state::State>::generate_integrands<unknown>
  1261. 257.96 s > at <unknown source file>:<unknown line>
  1262. 257.96 s > 22: <gammaloop_api[9ebf6628f97aeb57]::commands::generate::Generate>::run::<&std[bcb96dfbba0ab899]::path::PathBuf><unknown>
  1263. 257.96 s > at <unknown source file>:<unknown line>
  1264. 257.96 s > 23: <gammaloop_api[9ebf6628f97aeb57]::commands::Commands>::run<unknown>
  1265. 257.96 s > at <unknown source file>:<unknown line>
  1266. 257.96 s > 24: <gammaloop_api[9ebf6628f97aeb57]::session::CliSession>::execute_prepared<unknown>
  1267. 257.96 s > at <unknown source file>:<unknown line>
  1268. 257.96 s > 25: <gammaloop_api[9ebf6628f97aeb57]::session::CliSession>::execute_prepared_commands<unknown>
  1269. 257.96 s > at <unknown source file>:<unknown line>
  1270. 257.96 s > 26: <gammaloop_api[9ebf6628f97aeb57]::session::CliSession>::execute_prepared<unknown>
  1271. 257.96 s > at <unknown source file>:<unknown line>
  1272. 257.96 s > 27: <gammaloop_api[9ebf6628f97aeb57]::session::CliSession>::execute_command<unknown>
  1273. 257.96 s > at <unknown source file>:<unknown line>
  1274. 257.96 s > 28: <gammaloop_integration_tests[191607b70c61cd5a]::CLIState>::run_command<unknown>
  1275. 257.96 s > at <unknown source file>:<unknown line>
  1276. 257.96 s > 29: uv[3c7454ef256d6487]::run_single_integrated_uv_case<unknown>
  1277. 257.96 s > at <unknown source file>:<unknown line>
  1278. 257.96 s > 30: <uv[3c7454ef256d6487]::thermal_sunrise_uv::{closure#0} as core[940e698046960fd5]::ops::function::FnOnce<()>>::call_once<unknown>
  1279. 257.96 s > at <unknown source file>:<unknown line>
  1280. 257.96 s > 31: test[75d6903177b1d7e9]::__rust_begin_short_backtrace::<core[940e698046960fd5]::result::Result<(), alloc[2ea6bcb46fca0c42]::string::String>, fn() -> core[940e698046960fd5]::result::Result<(), alloc[2ea6bcb46fca0c42]::string::String>><unknown>
  1281. 257.96 s > at <unknown source file>:<unknown line>
  1282. 257.96 s > 32: test[75d6903177b1d7e9]::run_test::{closure#0}<unknown>
  1283. 257.96 s > at <unknown source file>:<unknown line>
  1284. 257.96 s > 33: std[bcb96dfbba0ab899]::sys::backtrace::__rust_begin_short_backtrace::<test[75d6903177b1d7e9]::run_test::{closure#1}, ()><unknown>
  1285. 257.96 s > at <unknown source file>:<unknown line>
  1286. 257.96 s > 34: <std[bcb96dfbba0ab899]::thread::lifecycle::spawn_unchecked<test[75d6903177b1d7e9]::run_test::{closure#1}, ()>::{closure#1} as core[940e698046960fd5]::ops::function::FnOnce<()>>::call_once::{shim:vtable#0}<unknown>
  1287. 257.96 s > at <unknown source file>:<unknown line>
  1288. 257.96 s > 35: <std[bcb96dfbba0ab899]::sys::thread::unix::Thread>::new::thread_start<unknown>
  1289. 257.96 s > at <unknown source file>:<unknown line>
  1290. 257.96 s > 36: start_thread<unknown>
  1291. 257.96 s > at <unknown source file>:<unknown line>
  1292. 257.96 s > 37: __clone3<unknown>
  1293. 257.96 s > at <unknown source file>:<unknown line>
  1294. 257.96 s >
  1295. 257.96 s > Run with COLORBT_SHOW_HIDDEN=1 environment variable to disable frame filtering.
  1296. 257.96 s > Run with RUST_BACKTRACE=full to include source snippets.
  1297. 257.96 s > Warning: SpanTrace capture is Unsupported.
  1298. 257.96 s > Ensure that you've setup a tracing-error ErrorLayer and the semver versions are compatible
  1299. 257.96 s >
  1300. 257.96 s > error: test run failed
  1301. 257.96 s >
  1302. 257.96 s > ========== nextest test summary ==========
  1303. 257.96 s > report: target/nextest/ci_gammaloop/junit.xml
  1304. 257.96 s > tests: 169, failures: 2, errors: 0
  1305. 257.96 s >
  1306. 257.96 s > 1. gammaloop-integration-tests::test_runs::aa_aa::important::aa_aa_local_inspect_backend_consistency
  1307. 257.96 s > failure: test failure with exit code 101
  1308. 257.96 s > system-out
  1309. 257.96 s > running 1 test
  1310. 257.96 s > test aa_aa::important::aa_aa_local_inspect_backend_consistency ... FAILED
  1311. 257.96 s >
  1312. 257.96 s > failures:
  1313. 257.96 s >
  1314. 257.96 s > failures:
  1315. 257.96 s > aa_aa::important::aa_aa_local_inspect_backend_consistency
  1316. 257.96 s >
  1317. 257.96 s > test result: FAILED. 0 passed; 1 failed; 0 ignored; 0 measured; 273 filtered out; finished in 3.19s
  1318. 257.96 s > system-err
  1319. 257.96 s > [2026-09-15 21:45:34.897] @gammaloop_api::se... INFO : Running command import model sm-default.json
  1320. 257.96 s > [2026-09-15 21:45:34.897] @import::model INFO : Loading built-in JSON model sm-default
  1321. 257.96 s > [2026-09-15 21:45:34.920] @gammalooprs::model INFO : The following 15 external parameters were forced to zero by the restriction card:
  1322. 257.96 s > lamWS, AWS, rhoWS, etaWS, ymc, yme, ymm, MC, Me, MM, WTau, muQ, muLe, muLmu, muLtau
  1323. 257.96 s > [2026-09-15 21:45:34.920] @gammalooprs::model INFO : The following 34 vertex rules were removed by the restriction card:
  1324. 257.96 s > V_82 -> (c~, d, G+) | V_83 -> (t~, d, G+) | V_84 -> (c~, s, G+) | V_85 -> (t~, s, G+) | V_86 -> (u~, b, G+) | V_87 -> (c~, b, G+) | V_90 -> (c~, d, W+) | V_91 -> (t~, d, W+) | V_92 -> (u~, s, W+) | V_94 -> (t~, s, W+) | V_95 -> (u~, b, W+) | V_96 -> (c~, b, W+) | V_101 -> (e+, e-, G0) | V_102 -> (mu+, mu-, G0) | V_104 -> (e+, e-, H) | V_105 -> (mu+, mu-, H) | V_110 -> (ve~, e-, G+) | V_111 -> (vm~, mu-, G+) | V_116 -> (b~, u, G-) | V_117 -> (d~, c, G-) | V_118 -> (s~, c, G-) | V_119 -> (b~, c, G-) | V_120 -> (d~, t, G-) | V_121 -> (s~, t, G-) | V_124 -> (s~, u, W-) | V_125 -> (b~, u, W-) | V_126 -> (d~, c, W-) | V_128 -> (b~, c, W-) | V_129 -> (d~, t, W-) | V_130 -> (s~, t, W-) | V_138 -> (c~, c, G0) | V_140 -> (c~, c, H) | V_145 -> (e+, ve, G-) | V_146 -> (mu+, vm, G-)
  1325. 257.96 s > [2026-09-15 21:45:34.920] @gammalooprs::model INFO : The following 36 couplings were removed by the restriction card:
  1326. 257.96 s > GC_13, GC_14, GC_16, GC_17, GC_18, GC_19, GC_20, GC_22, GC_23, GC_24, GC_25, GC_26, GC_28, GC_29, GC_42, GC_43, GC_44, GC_46, GC_47, GC_48, GC_84, GC_85, GC_86, GC_87, GC_88, GC_89, GC_90, GC_91, GC_92, GC_93, GC_101, GC_102, GC_103, GC_105, GC_106, GC_107
  1327. 257.96 s > [2026-09-15 21:45:34.921] @gammaloop_api::se... INFO : Running command run set_model_parameters
  1328. 257.96 s > [2026-09-15 21:45:34.921] @gammaloop_api::se... INFO : Starting command block set_model_parameters
  1329. 257.96 s > [2026-09-15 21:45:34.921] @gammaloop_api::se... INFO : Running command set model MT=173.0
  1330. 257.96 s > [2026-09-15 21:45:34.926] @gammaloop_api::se... INFO : Running command set model WT=0.0
  1331. 257.96 s > [2026-09-15 21:45:34.931] @gammaloop_api::se... INFO : Running command set model ymt=173.0
  1332. 257.96 s > [2026-09-15 21:45:34.936] @gammaloop_api::se... INFO : Running command set model aS=0.118
  1333. 257.96 s > [2026-09-15 21:45:34.940] @gammaloop_api::se... INFO : Running command set model aEWM1=137.036
  1334. 257.96 s > [2026-09-15 21:45:34.945] @gammaloop_api::se... INFO : Running command set model Gf=1.166390e-05
  1335. 257.96 s > [2026-09-15 21:45:34.950] @gammaloop_api::se... INFO : Running command set model MZ=91.188
  1336. 257.96 s > [2026-09-15 21:45:34.955] @gammaloop_api::se... INFO : Running command set global string '
  1337. 257.96 s > [global.generation.compile]
  1338. 257.96 s > compilation_mode = "symjit"
  1339. 257.96 s > optimization_level = "O0"
  1340. 257.96 s > fast_math = false
  1341. 257.96 s > [...]
  1342. 257.96 s > [2026-09-15 21:45:34.956] @gammaloop_api::se... INFO : Running command import graphs ./examples/cli/aa_aa/1L/aa_aa_1L.dot -p aa_aa_all_helicities -i 1L_ppmm -o
  1343. 257.96 s > [2026-09-15 21:45:34.956] @commands::import INFO : Loading graphs from '/build/source/examples/cli/aa_aa/1L/aa_aa_1L.dot'
  1344. 257.96 s > [2026-09-15 21:45:34.965] @gammaloop_api::se... INFO : Running command generate existing -p aa_aa_all_helicities
  1345. 257.96 s > The application panicked (crashed).
  1346. 257.96 s > Message: label _func_power_ not found
  1347. 257.96 s > Location: /nix/store/n9w914kh1cm59xx3spcs831cdyb56m32-vendor-cargo-deps/c19b7c6f923b580ac259164a89f2577984ad5ab09ee9d583b888f934adbbe8d0/symjit-2.25.6/src/symjit/assembler.rs:77
  1348. 257.96 s >
  1349. 257.96 s > ━━━━━━━━━━━━━━━━━━━━━━━━━━━━━━━━━━ BACKTRACE ━━━━━━━━━━━━━━━━━━━━━━━━━━━━━━━━━━━
  1350. 257.96 s > 1: <color_eyre[51793ea62743adbd]::config::PanicHook>::panic_report<unknown>
  1351. 257.96 s > at <unknown source file>:<unknown line>
  1352. 257.96 s > 2: <color_eyre[51793ea62743adbd]::config::PanicHook>::into_panic_hook::{closure#0}<unknown>
  1353. 257.96 s > at <unknown source file>:<unknown line>
  1354. 257.96 s > 3: std[bcb96dfbba0ab899]::panicking::panic_with_hook<unknown>
  1355. 257.96 s > at <unknown source file>:<unknown line>
  1356. 257.96 s > 4: std[bcb96dfbba0ab899]::panicking::panic_handler::{closure#0}<unknown>
  1357. 257.96 s > at <unknown source file>:<unknown line>
  1358. 257.96 s > 5: std[bcb96dfbba0ab899]::sys::backtrace::__rust_end_short_backtrace::<std[bcb96dfbba0ab899]::panicking::panic_handler::{closure#0}, !><unknown>
  1359. 257.96 s > at <unknown source file>:<unknown line>
  1360. 257.96 s > 6: __rustc[6c289b9f9c454d21]::rust_begin_unwind<unknown>
  1361. 257.96 s > at <unknown source file>:<unknown line>
  1362. 257.96 s > 7: core[940e698046960fd5]::panicking::panic_fmt<unknown>
  1363. 257.96 s > at <unknown source file>:<unknown line>
  1364. 257.96 s > 8: <symjit[e408de789c333cd]::symjit::assembler::Assembler>::apply_jumps<unknown>
  1365. 257.96 s > at <unknown source file>:<unknown line>
  1366. 257.96 s > 9: <symjit[e408de789c333cd]::symjit::builder::Builder>::compile_from_mir::<symjit[e408de789c333cd]::symjit::amd::complex::AmdComplexGenerator><unknown>
  1367. 257.96 s > at <unknown source file>:<unknown line>
  1368. 257.96 s > 10: <symjit[e408de789c333cd]::symjit::runnable::Application>::compile_ty<unknown>
  1369. 257.96 s > at <unknown source file>:<unknown line>
  1370. 257.96 s > 11: <symjit[e408de789c333cd]::symjit::runnable::Application>::with_mir<unknown>
  1371. 257.96 s > at <unknown source file>:<unknown line>
  1372. 257.96 s > 12: <symjit[e408de789c333cd]::symjit::composer::DirectTranslator as symjit[e408de789c333cd]::symjit::composer::Composer>::compile<unknown>
  1373. 257.96 s > at <unknown source file>:<unknown line>
  1374. 257.96 s > 13: <symjit[e408de789c333cd]::symjit::compiler::Translator as symjit[e408de789c333cd]::symjit::composer::Composer>::compile<unknown>
  1375. 257.96 s > at <unknown source file>:<unknown line>
  1376. 257.96 s > 14: <numerica[124dab8567f4861e]::domains::float::complex::Complex<f64> as symbolica[10e259bab675d243]::evaluate::backend::JITCompiledNumber>::jit_compile<unknown>
  1377. 257.96 s > at <unknown source file>:<unknown line>
  1378. 257.96 s > 15: <symbolica[10e259bab675d243]::evaluate::evaluator::ExpressionEvaluator<numerica[124dab8567f4861e]::domains::float::complex::Complex<f64>>>::jit_compile<unknown>
  1379. 257.96 s > at <unknown source file>:<unknown line>
  1380. 257.96 s > 16: <gammalooprs[917cbd3df9e68f8f]::integrands::process::evaluators::GenericEvaluator>::activate_symjit<unknown>
  1381. 257.96 s > at <unknown source file>:<unknown line>
  1382. 257.96 s > 17: <gammalooprs[917cbd3df9e68f8f]::integrands::process::amplitude::AmplitudeIntegrand>::prepare_runtime_backends_after_generation_with_compile_times<unknown>
  1383. 257.96 s > at <unknown source file>:<unknown line>
  1384. 257.96 s > 18: <gammalooprs[917cbd3df9e68f8f]::processes::amplitude::Amplitude>::build_integrand<unknown>
  1385. 257.96 s > at <unknown source file>:<unknown line>
  1386. 257.96 s > 19: <gammalooprs[917cbd3df9e68f8f]::processes::process::Process>::generate_integrands<unknown>
  1387. 257.96 s > at <unknown source file>:<unknown line>
  1388. 257.96 s > 20: <gammaloop_api[9ebf6628f97aeb57]::state::State>::generate_integrand<unknown>
  1389. 257.96 s > at <unknown source file>:<unknown line>
  1390. 257.96 s > 21: <gammaloop_api[9ebf6628f97aeb57]::commands::generate::Generate>::run::<&std[bcb96dfbba0ab899]::path::PathBuf><unknown>
  1391. 257.96 s > at <unknown source file>:<unknown line>
  1392. 257.96 s > 22: <gammaloop_api[9ebf6628f97aeb57]::commands::Commands>::run<unknown>
  1393. 257.96 s > at <unknown source file>:<unknown line>
  1394. 257.96 s > 23: <gammaloop_api[9ebf6628f97aeb57]::session::CliSession>::execute_prepared<unknown>
  1395. 257.96 s > at <unknown source file>:<unknown line>
  1396. 257.96 s > 24: <gammaloop_api[9ebf6628f97aeb57]::session::CliSession>::execute_command<unknown>
  1397. 257.96 s > at <unknown source file>:<unknown line>
  1398. 257.96 s > 25: <gammaloop_integration_tests[191607b70c61cd5a]::CLIState>::run_command<unknown>
  1399. 257.96 s > at <unknown source file>:<unknown line>
  1400. 257.96 s > 26: test_runs[9b7e2dc2dc4f29b0]::aa_aa::generate_aa_aa_helicity_family<unknown>
  1401. 257.96 s > at <unknown source file>:<unknown line>
  1402. 257.96 s > 27: <test_runs[9b7e2dc2dc4f29b0]::aa_aa::important::aa_aa_local_inspect_backend_consistency::{closure#0} as core[940e698046960fd5]::ops::function::FnOnce<()>>::call_once<unknown>
  1403. 257.96 s > at <unknown source file>:<unknown line>
  1404. 257.96 s > 28: serial_test[cd99724524a2f1c0]::serial_code_lock::local_serial_core_with_return::<(), eyre[cb2fd339c0c40fca]::Report><unknown>
  1405. 257.96 s > at <unknown source file>:<unknown line>
  1406. 257.96 s > 29: <test_runs[9b7e2dc2dc4f29b0]::aa_aa::important::aa_aa_local_inspect_backend_consistency::{closure#0} as core[940e698046960fd5]::ops::function::FnOnce<()>>::call_once<unknown>
  1407. 257.96 s > at <unknown source file>:<unknown line>
  1408. 257.96 s > 30: test[75d6903177b1d7e9]::__rust_begin_short_backtrace::<core[940e698046960fd5]::result::Result<(), alloc[2ea6bcb46fca0c42]::string::String>, fn() -> core[940e698046960fd5]::result::Result<(), alloc[2ea6bcb46fca0c42]::string::String>><unknown>
  1409. 257.96 s > at <unknown source file>:<unknown line>
  1410. 257.96 s > 31: test[75d6903177b1d7e9]::run_test::{closure#0}<unknown>
  1411. 257.96 s > at <unknown source file>:<unknown line>
  1412. 257.96 s > 32: std[bcb96dfbba0ab899]::sys::backtrace::__rust_begin_short_backtrace::<test[75d6903177b1d7e9]::run_test::{closure#1}, ()><unknown>
  1413. 257.96 s > at <unknown source file>:<unknown line>
  1414. 257.96 s > 33: <std[bcb96dfbba0ab899]::thread::lifecycle::spawn_unchecked<test[75d6903177b1d7e9]::run_test::{closure#1}, ()>::{closure#1} as core[940e698046960fd5]::ops::function::FnOnce<()>>::call_once::{shim:vtable#0}<unknown>
  1415. 257.96 s > at <unknown source file>:<unknown line>
  1416. 257.96 s > 34: <std[bcb96dfbba0ab899]::sys::thread::unix::Thread>::new::thread_start<unknown>
  1417. 257.96 s > at <unknown source file>:<unknown line>
  1418. 257.96 s > 35: start_thread<unknown>
  1419. 257.96 s > at <unknown source file>:<unknown line>
  1420. 257.96 s > 36: __clone3<unknown>
  1421. 257.96 s > at <unknown source file>:<unknown line>
  1422. 257.96 s >
  1423. 257.96 s > Run with COLORBT_SHOW_HIDDEN=1 environment variable to disable frame filtering.
  1424. 257.96 s > Run with RUST_BACKTRACE=full to include source snippets.
  1425. 257.96 s > Warning: SpanTrace capture is Unsupported.
  1426. 257.96 s > Ensure that you've setup a tracing-error ErrorLayer and the semver versions are compatible
  1427. 257.96 s >
  1428. 257.96 s > 2. gammaloop-integration-tests::uv::thermal_sunrise_uv
  1429. 257.96 s > failure: test failure with exit code 101
  1430. 257.96 s > system-out
  1431. 257.96 s > running 1 test
  1432. 257.96 s > test thermal_sunrise_uv ... FAILED
  1433. 257.96 s >
  1434. 257.96 s > failures:
  1435. 257.96 s >
  1436. 257.96 s > failures:
  1437. 257.96 s > thermal_sunrise_uv
  1438. 257.96 s >
  1439. 257.96 s > test result: FAILED. 0 passed; 1 failed; 0 ignored; 0 measured; 31 filtered out; finished in 3.06s
  1440. 257.96 s > system-err
  1441. 257.96 s > [2026-09-15 21:46:37.168] @gammaloop_api::se... INFO : Running command run generate
  1442. 257.96 s > [2026-09-15 21:46:37.168] @gammaloop_api::se... INFO : Starting command block generate
  1443. 257.96 s > [2026-09-15 21:46:37.168] @gammaloop_api::se... INFO : Running command import model sm-default.json
  1444. 257.96 s > [2026-09-15 21:46:37.168] @import::model INFO : Loading built-in JSON model sm-default
  1445. 257.96 s > [2026-09-15 21:46:37.366] @gammalooprs::model INFO : The following 15 external parameters were forced to zero by the restriction card:
  1446. 257.96 s > lamWS, AWS, rhoWS, etaWS, ymc, yme, ymm, MC, Me, MM, WTau, muQ, muLe, muLmu, muLtau
  1447. 257.96 s > [2026-09-15 21:46:37.366] @gammalooprs::model INFO : The following 34 vertex rules were removed by the restriction card:
  1448. 257.96 s > V_82 -> (c~, d, G+) | V_83 -> (t~, d, G+) | V_84 -> (c~, s, G+) | V_85 -> (t~, s, G+) | V_86 -> (u~, b, G+) | V_87 -> (c~, b, G+) | V_90 -> (c~, d, W+) | V_91 -> (t~, d, W+) | V_92 -> (u~, s, W+) | V_94 -> (t~, s, W+) | V_95 -> (u~, b, W+) | V_96 -> (c~, b, W+) | V_101 -> (e+, e-, G0) | V_102 -> (mu+, mu-, G0) | V_104 -> (e+, e-, H) | V_105 -> (mu+, mu-, H) | V_110 -> (ve~, e-, G+) | V_111 -> (vm~, mu-, G+) | V_116 -> (b~, u, G-) | V_117 -> (d~, c, G-) | V_118 -> (s~, c, G-) | V_119 -> (b~, c, G-) | V_120 -> (d~, t, G-) | V_121 -> (s~, t, G-) | V_124 -> (s~, u, W-) | V_125 -> (b~, u, W-) | V_126 -> (d~, c, W-) | V_128 -> (b~, c, W-) | V_129 -> (d~, t, W-) | V_130 -> (s~, t, W-) | V_138 -> (c~, c, G0) | V_140 -> (c~, c, H) | V_145 -> (e+, ve, G-) | V_146 -> (mu+, vm, G-)
  1449. 257.96 s > [2026-09-15 21:46:37.366] @gammalooprs::model INFO : The following 36 couplings were removed by the restriction card:
  1450. 257.96 s > GC_13, GC_14, GC_16, GC_17, GC_18, GC_19, GC_20, GC_22, GC_23, GC_24, GC_25, GC_26, GC_28, GC_29, GC_42, GC_43, GC_44, GC_46, GC_47, GC_48, GC_84, GC_85, GC_86, GC_87, GC_88, GC_89, GC_90, GC_91, GC_92, GC_93, GC_101, GC_102, GC_103, GC_105, GC_106, GC_107
  1451. 257.96 s > [2026-09-15 21:46:37.367] @gammaloop_api::se... INFO : Running command remove processes
  1452. 257.96 s > [2026-09-15 21:46:37.367] @gammaloop_api::se... INFO : Running command generate amp {} > {} [{2}] | g u
  1453. 257.96 s > --numerator-grouping group_identical_graphs_up_to_scalar_rescaling
  1454. 257.96 s > --max-n-bridges 0
  1455. 257.96 s > --number-of-factorized-loop-subtopologies 1 1
  1456. 257.96 s > --number-of-anticommutating-loops 1 1
  1457. 257.96 s > [...]
  1458. 257.96 s > [2026-09-15 21:46:37.368] @feyngen::diagram_... INFO : 0s | Δ=0s | Starting Feynman graph generation with Symbolica...
  1459. 257.96 s > [2026-09-15 21:46:37.369] @feyngen::diagram_... INFO : 0s | Δ=0s | Number of graphs resulting from Symbolica generation: 3
  1460. 257.96 s > [2026-09-15 21:46:37.386] @feyngen::diagram_... INFO : 0s | Δ=0s | Number of graphs retained after removal of vetoed topologies: 2
  1461. 257.96 s > [2026-09-15 21:46:37.389] @feyngen::diagram_... INFO : 0s | Δ=0s | Number of graphs after vertex info assignment: 2
  1462. 257.96 s > [2026-09-15 21:46:37.389] @feyngen::diagram_... INFO : 0s | Δ=0s | Number of graphs after all complete graphs filters are applied: 2
  1463. 257.96 s > [2026-09-15 21:46:37.389] @feyngen::diagram_... INFO : 0s | Δ=0s | Number of graphs after closed anticommutating chains analysis: 1
  1464. 257.96 s > [2026-09-15 21:46:37.389] @feyngen::diagram_... INFO : 0s | Δ=0s | Number of graphs after symmetrization of external states: 1
  1465. 257.96 s > [2026-09-15 21:46:37.392] @feyngen::diagram_... INFO : 0s | Δ=0s | Number of graphs after canonization of vertices, edges and flows (graph labels assigned here): 1
  1466. 257.96 s > [2026-09-15 21:46:37.406] @feyngen::diagram_... INFO : 0s | Δ=0s | Number of graphs after numerator-aware grouping with strategy 'up to a scalar rescaling': 1 (1 isomorphically unique graph, 0 color zero, 0 lorentz zero, 0 grouped and 0 cancellation)
  1467. 257.96 s > [2026-09-15 21:46:37.406] @feyngen::diagram_... INFO : ( Sum of the symmetry factors from each graph generated = -1/2 )
  1468. 257.96 s > [2026-09-15 21:46:37.406] @commands::generate INFO : Generated amplitude 1 graphs.
  1469. 257.96 s > [2026-09-15 21:46:37.406] @commands::generate INFO : Only diagram generation was requested, skipping integrand generation. You can generate integrands later using the 'generate existing <options>' command.
  1470. 257.96 s > [2026-09-15 21:46:37.406] @gammaloop_api::se... INFO : Running command generate
  1471. 257.96 s > The application panicked (crashed).
  1472. 257.96 s > Message: label _func_power_ not found
  1473. 257.96 s > Location: /nix/store/n9w914kh1cm59xx3spcs831cdyb56m32-vendor-cargo-deps/c19b7c6f923b580ac259164a89f2577984ad5ab09ee9d583b888f934adbbe8d0/symjit-2.25.6/src/symjit/assembler.rs:77
  1474. 257.96 s >
  1475. 257.96 s > ━━━━━━━━━━━━━━━━━━━━━━━━━━━━━━━━━━ BACKTRACE ━━━━━━━━━━━━━━━━━━━━━━━━━━━━━━━━━━━
  1476. 257.96 s > 1: <color_eyre[51793ea62743adbd]::config::PanicHook>::panic_report<unknown>
  1477. 257.96 s > at <unknown source file>:<unknown line>
  1478. 257.96 s > 2: <color_eyre[51793ea62743adbd]::config::PanicHook>::into_panic_hook::{closure#0}<unknown>
  1479. 257.96 s > at <unknown source file>:<unknown line>
  1480. 257.96 s > 3: std[bcb96dfbba0ab899]::panicking::panic_with_hook<unknown>
  1481. 257.96 s > at <unknown source file>:<unknown line>
  1482. 257.96 s > 4: std[bcb96dfbba0ab899]::panicking::panic_handler::{closure#0}<unknown>
  1483. 257.96 s > at <unknown source file>:<unknown line>
  1484. 257.96 s > 5: std[bcb96dfbba0ab899]::sys::backtrace::__rust_end_short_backtrace::<std[bcb96dfbba0ab899]::panicking::panic_handler::{closure#0}, !><unknown>
  1485. 257.96 s > at <unknown source file>:<unknown line>
  1486. 257.96 s > 6: __rustc[6c289b9f9c454d21]::rust_begin_unwind<unknown>
  1487. 257.96 s > at <unknown source file>:<unknown line>
  1488. 257.96 s > 7: core[940e698046960fd5]::panicking::panic_fmt<unknown>
  1489. 257.96 s > at <unknown source file>:<unknown line>
  1490. 257.96 s > 8: <symjit[e408de789c333cd]::symjit::assembler::Assembler>::apply_jumps<unknown>
  1491. 257.96 s > at <unknown source file>:<unknown line>
  1492. 257.96 s > 9: <symjit[e408de789c333cd]::symjit::builder::Builder>::compile_from_mir::<symjit[e408de789c333cd]::symjit::amd::complex::AmdComplexGenerator><unknown>
  1493. 257.96 s > at <unknown source file>:<unknown line>
  1494. 257.96 s > 10: <symjit[e408de789c333cd]::symjit::runnable::Application>::compile_ty<unknown>
  1495. 257.96 s > at <unknown source file>:<unknown line>
  1496. 257.96 s > 11: <symjit[e408de789c333cd]::symjit::runnable::Application>::with_mir<unknown>
  1497. 257.96 s > at <unknown source file>:<unknown line>
  1498. 257.96 s > 12: <symjit[e408de789c333cd]::symjit::composer::DirectTranslator as symjit[e408de789c333cd]::symjit::composer::Composer>::compile<unknown>
  1499. 257.96 s > at <unknown source file>:<unknown line>
  1500. 257.96 s > 13: <symjit[e408de789c333cd]::symjit::compiler::Translator as symjit[e408de789c333cd]::symjit::composer::Composer>::compile<unknown>
  1501. 257.96 s > at <unknown source file>:<unknown line>
  1502. 257.96 s > 14: <numerica[124dab8567f4861e]::domains::float::complex::Complex<f64> as symbolica[10e259bab675d243]::evaluate::backend::JITCompiledNumber>::jit_compile<unknown>
  1503. 257.96 s > at <unknown source file>:<unknown line>
  1504. 257.96 s > 15: <symbolica[10e259bab675d243]::evaluate::evaluator::ExpressionEvaluator<numerica[124dab8567f4861e]::domains::float::complex::Complex<f64>>>::jit_compile<unknown>
  1505. 257.96 s > at <unknown source file>:<unknown line>
  1506. 257.96 s > 16: <gammalooprs[917cbd3df9e68f8f]::integrands::process::evaluators::GenericEvaluator>::activate_symjit<unknown>
  1507. 257.96 s > at <unknown source file>:<unknown line>
  1508. 257.96 s > 17: <gammalooprs[917cbd3df9e68f8f]::integrands::process::amplitude::AmplitudeIntegrand>::prepare_runtime_backends_after_generation_with_compile_times<unknown>
  1509. 257.96 s > at <unknown source file>:<unknown line>
  1510. 257.96 s > 18: <gammalooprs[917cbd3df9e68f8f]::processes::amplitude::Amplitude>::build_integrand<unknown>
  1511. 257.96 s > at <unknown source file>:<unknown line>
  1512. 257.96 s > 19: <gammalooprs[917cbd3df9e68f8f]::processes::process::Process>::generate_integrands<unknown>
  1513. 257.96 s > at <unknown source file>:<unknown line>
  1514. 257.96 s > 20: <gammalooprs[917cbd3df9e68f8f]::processes::ProcessList>::generate_integrands<unknown>
  1515. 257.96 s > at <unknown source file>:<unknown line>
  1516. 257.96 s > 21: <gammaloop_api[9ebf6628f97aeb57]::state::State>::generate_integrands<unknown>
  1517. 257.96 s > at <unknown source file>:<unknown line>
  1518. 257.96 s > 22: <gammaloop_api[9ebf6628f97aeb57]::commands::generate::Generate>::run::<&std[bcb96dfbba0ab899]::path::PathBuf><unknown>
  1519. 257.96 s > at <unknown source file>:<unknown line>
  1520. 257.96 s > 23: <gammaloop_api[9ebf6628f97aeb57]::commands::Commands>::run<unknown>
  1521. 257.96 s > at <unknown source file>:<unknown line>
  1522. 257.96 s > 24: <gammaloop_api[9ebf6628f97aeb57]::session::CliSession>::execute_prepared<unknown>
  1523. 257.96 s > at <unknown source file>:<unknown line>
  1524. 257.96 s > 25: <gammaloop_api[9ebf6628f97aeb57]::session::CliSession>::execute_prepared_commands<unknown>
  1525. 257.96 s > at <unknown source file>:<unknown line>
  1526. 257.96 s > 26: <gammaloop_api[9ebf6628f97aeb57]::session::CliSession>::execute_prepared<unknown>
  1527. 257.96 s > at <unknown source file>:<unknown line>
  1528. 257.96 s > 27: <gammaloop_api[9ebf6628f97aeb57]::session::CliSession>::execute_command<unknown>
  1529. 257.96 s > at <unknown source file>:<unknown line>
  1530. 257.96 s > 28: <gammaloop_integration_tests[191607b70c61cd5a]::CLIState>::run_command<unknown>
  1531. 257.96 s > at <unknown source file>:<unknown line>
  1532. 257.96 s > 29: uv[3c7454ef256d6487]::run_single_integrated_uv_case<unknown>
  1533. 257.96 s > at <unknown source file>:<unknown line>
  1534. 257.96 s > 30: <uv[3c7454ef256d6487]::thermal_sunrise_uv::{closure#0} as core[940e698046960fd5]::ops::function::FnOnce<()>>::call_once<unknown>
  1535. 257.96 s > at <unknown source file>:<unknown line>
  1536. 257.96 s > 31: test[75d6903177b1d7e9]::__rust_begin_short_backtrace::<core[940e698046960fd5]::result::Result<(), alloc[2ea6bcb46fca0c42]::string::String>, fn() -> core[940e698046960fd5]::result::Result<(), alloc[2ea6bcb46fca0c42]::string::String>><unknown>
  1537. 257.96 s > at <unknown source file>:<unknown line>
  1538. 257.96 s > 32: test[75d6903177b1d7e9]::run_test::{closure#0}<unknown>
  1539. 257.96 s > at <unknown source file>:<unknown line>
  1540. 257.96 s > 33: std[bcb96dfbba0ab899]::sys::backtrace::__rust_begin_short_backtrace::<test[75d6903177b1d7e9]::run_test::{closure#1}, ()><unknown>
  1541. 257.96 s > at <unknown source file>:<unknown line>
  1542. 257.96 s > 34: <std[bcb96dfbba0ab899]::thread::lifecycle::spawn_unchecked<test[75d6903177b1d7e9]::run_test::{closure#1}, ()>::{closure#1} as core[940e698046960fd5]::ops::function::FnOnce<()>>::call_once::{shim:vtable#0}<unknown>
  1543. 257.96 s > at <unknown source file>:<unknown line>
  1544. 257.96 s > 35: <std[bcb96dfbba0ab899]::sys::thread::unix::Thread>::new::thread_start<unknown>
  1545. 257.96 s > at <unknown source file>:<unknown line>
  1546. 257.96 s > 36: start_thread<unknown>
  1547. 257.96 s > at <unknown source file>:<unknown line>
  1548. 257.96 s > 37: __clone3<unknown>
  1549. 257.96 s > at <unknown source file>:<unknown line>
  1550. 257.96 s >
  1551. 257.96 s > Run with COLORBT_SHOW_HIDDEN=1 environment variable to disable frame filtering.
  1552. 257.96 s > Run with RUST_BACKTRACE=full to include source snippets.
  1553. 257.96 s > Warning: SpanTrace capture is Unsupported.
  1554. 257.96 s > Ensure that you've setup a tracing-error ErrorLayer and the semver versions are compatible
  1555. 257.96 s > =========================================
  1556. 257.96 s For full logs, run:
  1557. 257.96 s nix log /nix/store/mzkwykiwpnc2c1k4w0h0d3936pcxgvpd-gammaloop-nextest-integration.drv
  1558. 258.10 s [0 built (1 failed)]Run failed.