1. 0.01 s $ /nix/store/61685rbaxmpigwi3z23i33sv3jyfl70q-coreutils-9.11/bin/timeout --kill-after=15s 7200s /nix/store/wknkybkzrc16r11vk5vrykh4wmw7a353-nix-2.34.8/bin/nix --extra-experimental-features nix-command --extra-experimental-features flakes flake clone git+https://github.com/alphal00p/gammaloop --dest /tmp/nix-ci-worker/stable-pwd/repo/
  2. 0.10 s Cloning into '/tmp/nix-ci-worker/stable-pwd/repo'...
  3. 0.94 s remote: Enumerating objects: 103390, done.
  4. 1.06 s remote: Counting objects: 0% (1/10013) remote: Counting objects: 1% (101/10013) remote: Counting objects: 2% (201/10013) remote: Counting objects: 3% (301/10013) remote: Counting objects: 4% (401/10013) remote: Counting objects: 5% (501/10013) remote: Counting objects: 6% (601/10013) remote: Counting objects: 7% (701/10013) remote: Counting objects: 8% (802/10013) remote: Counting objects: 9% (902/10013) remote: Counting objects: 10% (1002/10013) remote: Counting objects: 11% (1102/10013) remote: Counting objects: 12% (1202/10013) remote: Counting objects: 13% (1302/10013) remote: Counting objects: 14% (1402/10013) remote: Counting objects: 15% (1502/10013) remote: Counting objects: 16% (1603/10013) remote: Counting objects: 17% (1703/10013) remote: Counting objects: 18% (1803/10013) remote: Counting objects: 19% (1903/10013) remote: Counting objects: 20% (2003/10013) remote: Counting objects: 21% (2103/10013) remote: Counting objects: 22% (2203/10013) remote: Counting objects: 23% (2303/10013) remote: Counting objects: 24% (2404/10013) remote: Counting objects: 25% (2504/10013) remote: Counting objects: 26% (2604/10013) remote: Counting objects: 27% (2704/10013) remote: Counting objects: 28% (2804/10013) remote: Counting objects: 29% (2904/10013) remote: Counting objects: 30% (3004/10013) remote: Counting objects: 31% (3105/10013) remote: Counting objects: 32% (3205/10013) remote: Counting objects: 33% (3305/10013) remote: Counting objects: 34% (3405/10013) remote: Counting objects: 35% (3505/10013) remote: Counting objects: 36% (3605/10013) remote: Counting objects: 37% (3705/10013) remote: Counting objects: 38% (3805/10013) remote: Counting objects: 39% (3906/10013) remote: Counting objects: 40% (4006/10013) remote: Counting objects: 41% (4106/10013) remote: Counting objects: 42% (4206/10013) remote: Counting objects: 43% (4306/10013) remote: Counting objects: 44% (4406/10013) remote: Counting objects: 45% (4506/10013) remote: Counting objects: 46% (4606/10013) remote: Counting objects: 47% (4707/10013) remote: Counting objects: 48% (4807/10013) remote: Counting objects: 49% (4907/10013) remote: Counting objects: 50% (5007/10013) remote: Counting objects: 51% (5107/10013) remote: Counting objects: 52% (5207/10013) remote: Counting objects: 53% (5307/10013) remote: Counting objects: 54% (5408/10013) remote: Counting objects: 55% (5508/10013) remote: Counting objects: 56% (5608/10013) remote: Counting objects: 57% (5708/10013) remote: Counting objects: 58% (5808/10013) remote: Counting objects: 59% (5908/10013) remote: Counting objects: 60% (6008/10013) remote: Counting objects: 61% (6108/10013) remote: Counting objects: 62% (6209/10013) remote: Counting objects: 63% (6309/10013) remote: Counting objects: 64% (6409/10013) remote: Counting objects: 65% (6509/10013) remote: Counting objects: 66% (6609/10013) remote: Counting objects: 67% (6709/10013) remote: Counting objects: 68% (6809/10013) remote: Counting objects: 69% (6909/10013) remote: Counting objects: 70% (7010/10013) remote: Counting objects: 71% (7110/10013) remote: Counting objects: 72% (7210/10013) remote: Counting objects: 73% (7310/10013) remote: Counting objects: 74% (7410/10013) remote: Counting objects: 75% (7510/10013) remote: Counting objects: 76% (7610/10013) remote: Counting objects: 77% (7711/10013) remote: Counting objects: 78% (7811/10013) remote: Counting objects: 79% (7911/10013) remote: Counting objects: 80% (8011/10013) remote: Counting objects: 81% (8111/10013) remote: Counting objects: 82% (8211/10013) remote: Counting objects: 83% (8311/10013) remote: Counting objects: 84% (8411/10013) remote: Counting objects: 85% (8512/10013) remote: Counting objects: 86% (8612/10013) remote: Counting objects: 87% (8712/10013) remote: Counting objects: 88% (8812/10013) remote: Counting objects: 89% (8912/10013) remote: Counting objects: 90% (9012/10013) remote: Counting objects: 91% (9112/10013) remote: Counting objects: 92% (9212/10013) remote: Counting objects: 93% (9313/10013) remote: Counting objects: 94% (9413/10013) remote: Counting objects: 95% (9513/10013) remote: Counting objects: 96% (9613/10013) remote: Counting objects: 97% (9713/10013) remote: Counting objects: 98% (9813/10013) remote: Counting objects: 99% (9913/10013) remote: Counting objects: 100% (10013/10013) remote: Counting objects: 100% (10013/10013), done.
  5. 3.38 s remote: Compressing objects: 0% (1/2212) remote: Compressing objects: 1% (23/2212) remote: Compressing objects: 2% (45/2212) remote: Compressing objects: 3% (67/2212) remote: Compressing objects: 4% (89/2212) remote: Compressing objects: 5% (111/2212) remote: Compressing objects: 6% (133/2212) remote: Compressing objects: 7% (155/2212) remote: Compressing objects: 8% (177/2212) remote: Compressing objects: 9% (200/2212) remote: Compressing objects: 9% (204/2212) remote: Compressing objects: 10% (222/2212) remote: Compressing objects: 11% (244/2212) remote: Compressing objects: 12% (266/2212) remote: Compressing objects: 13% (288/2212) remote: Compressing objects: 14% (310/2212) remote: Compressing objects: 15% (332/2212) remote: Compressing objects: 16% (354/2212) remote: Compressing objects: 17% (377/2212) remote: Compressing objects: 18% (399/2212) remote: Compressing objects: 19% (421/2212) remote: Compressing objects: 19% (439/2212) remote: Compressing objects: 20% (443/2212) remote: Compressing objects: 21% (465/2212) remote: Compressing objects: 22% (487/2212) remote: Compressing objects: 23% (509/2212) remote: Compressing objects: 24% (531/2212) remote: Compressing objects: 25% (553/2212) remote: Compressing objects: 26% (576/2212) remote: Compressing objects: 27% (598/2212) remote: Compressing objects: 28% (620/2212) remote: Compressing objects: 29% (642/2212) remote: Compressing objects: 30% (664/2212) remote: Compressing objects: 31% (686/2212) remote: Compressing objects: 32% (708/2212) remote: Compressing objects: 33% (730/2212) remote: Compressing objects: 34% (753/2212) remote: Compressing objects: 35% (775/2212) remote: Compressing objects: 36% (797/2212) remote: Compressing objects: 37% (819/2212) remote: Compressing objects: 38% (841/2212) remote: Compressing objects: 39% (863/2212) remote: Compressing objects: 40% (885/2212) remote: Compressing objects: 41% (907/2212) remote: Compressing objects: 42% (930/2212) remote: Compressing objects: 43% (952/2212) remote: Compressing objects: 44% (974/2212) remote: Compressing objects: 45% (996/2212) remote: Compressing objects: 46% (1018/2212) remote: Compressing objects: 47% (1040/2212) remote: Compressing objects: 48% (1062/2212) remote: Compressing objects: 49% (1084/2212) remote: Compressing objects: 50% (1106/2212) remote: Compressing objects: 51% (1129/2212) remote: Compressing objects: 52% (1151/2212) remote: Compressing objects: 53% (1173/2212) remote: Compressing objects: 54% (1195/2212) remote: Compressing objects: 55% (1217/2212) remote: Compressing objects: 56% (1239/2212) remote: Compressing objects: 57% (1261/2212) remote: Compressing objects: 58% (1283/2212) remote: Compressing objects: 59% (1306/2212) remote: Compressing objects: 60% (1328/2212) remote: Compressing objects: 61% (1350/2212) remote: Compressing objects: 62% (1372/2212) remote: Compressing objects: 63% (1394/2212) remote: Compressing objects: 64% (1416/2212) remote: Compressing objects: 65% (1438/2212) remote: Compressing objects: 66% (1460/2212) remote: Compressing objects: 67% (1483/2212) remote: Compressing objects: 68% (1505/2212) remote: Compressing objects: 69% (1527/2212) remote: Compressing objects: 70% (1549/2212) remote: Compressing objects: 71% (1571/2212) remote: Compressing objects: 72% (1593/2212) remote: Compressing objects: 73% (1615/2212) remote: Compressing objects: 74% (1637/2212) remote: Compressing objects: 75% (1659/2212) remote: Compressing objects: 76% (1682/2212) remote: Compressing objects: 77% (1704/2212) remote: Compressing objects: 78% (1726/2212) remote: Compressing objects: 79% (1748/2212) remote: Compressing objects: 80% (1770/2212) remote: Compressing objects: 81% (1792/2212) remote: Compressing objects: 82% (1814/2212) remote: Compressing objects: 83% (1836/2212) remote: Compressing objects: 84% (1859/2212) remote: Compressing objects: 85% (1881/2212) remote: Compressing objects: 86% (1903/2212) remote: Compressing objects: 87% (1925/2212) remote: Compressing objects: 88% (1947/2212) remote: Compressing objects: 89% (1969/2212) remote: Compressing objects: 90% (1991/2212) remote: Compressing objects: 91% (2013/2212) remote: Compressing objects: 92% (2036/2212) remote: Compressing objects: 93% (2058/2212) remote: Compressing objects: 94% (2080/2212) remote: Compressing objects: 95% (2102/2212) remote: Compressing objects: 96% (2124/2212) remote: Compressing objects: 97% (2146/2212) remote: Compressing objects: 98% (2168/2212) remote: Compressing objects: 99% (2190/2212) remote: Compressing objects: 100% (2212/2212) remote: Compressing objects: 100% (2212/2212), done.
  6. 18.71 s Receiving objects: 0% (1/103390) Receiving objects: 1% (1034/103390) Receiving objects: 2% (2068/103390) Receiving objects: 3% (3102/103390) Receiving objects: 4% (4136/103390) Receiving objects: 5% (5170/103390), 8.82 MiB | 17.62 MiB/s Receiving objects: 6% (6204/103390), 8.82 MiB | 17.62 MiB/s Receiving objects: 7% (7238/103390), 8.82 MiB | 17.62 MiB/s Receiving objects: 8% (8272/103390), 8.82 MiB | 17.62 MiB/s Receiving objects: 9% (9306/103390), 8.82 MiB | 17.62 MiB/s Receiving objects: 10% (10339/103390), 8.82 MiB | 17.62 MiB/s Receiving objects: 11% (11373/103390), 8.82 MiB | 17.62 MiB/s Receiving objects: 12% (12407/103390), 8.82 MiB | 17.62 MiB/s Receiving objects: 13% (13441/103390), 8.82 MiB | 17.62 MiB/s Receiving objects: 14% (14475/103390), 8.82 MiB | 17.62 MiB/s Receiving objects: 15% (15509/103390), 8.82 MiB | 17.62 MiB/s Receiving objects: 16% (16543/103390), 8.82 MiB | 17.62 MiB/s Receiving objects: 17% (17577/103390), 8.82 MiB | 17.62 MiB/s Receiving objects: 18% (18611/103390), 8.82 MiB | 17.62 MiB/s Receiving objects: 19% (19645/103390), 8.82 MiB | 17.62 MiB/s Receiving objects: 19% (20591/103390), 8.82 MiB | 17.62 MiB/s Receiving objects: 20% (20678/103390), 22.33 MiB | 22.32 MiB/s Receiving objects: 21% (21712/103390), 22.33 MiB | 22.32 MiB/s Receiving objects: 22% (22746/103390), 22.33 MiB | 22.32 MiB/s Receiving objects: 23% (23780/103390), 22.33 MiB | 22.32 MiB/s Receiving objects: 24% (24814/103390), 22.33 MiB | 22.32 MiB/s Receiving objects: 25% (25848/103390), 22.33 MiB | 22.32 MiB/s Receiving objects: 26% (26882/103390), 22.33 MiB | 22.32 MiB/s Receiving objects: 27% (27916/103390), 22.33 MiB | 22.32 MiB/s Receiving objects: 28% (28950/103390), 22.33 MiB | 22.32 MiB/s Receiving objects: 29% (29984/103390), 22.33 MiB | 22.32 MiB/s Receiving objects: 30% (31017/103390), 22.33 MiB | 22.32 MiB/s Receiving objects: 31% (32051/103390), 22.33 MiB | 22.32 MiB/s Receiving objects: 32% (33085/103390), 22.33 MiB | 22.32 MiB/s Receiving objects: 33% (34119/103390), 22.33 MiB | 22.32 MiB/s Receiving objects: 34% (35153/103390), 34.64 MiB | 23.07 MiB/s Receiving objects: 35% (36187/103390), 34.64 MiB | 23.07 MiB/s Receiving objects: 36% (37221/103390), 34.64 MiB | 23.07 MiB/s Receiving objects: 37% (38255/103390), 34.64 MiB | 23.07 MiB/s Receiving objects: 38% (39289/103390), 34.64 MiB | 23.07 MiB/s Receiving objects: 38% (39618/103390), 46.10 MiB | 23.02 MiB/s Receiving objects: 39% (40323/103390), 46.10 MiB | 23.02 MiB/s Receiving objects: 40% (41356/103390), 46.10 MiB | 23.02 MiB/s Receiving objects: 41% (42390/103390), 46.10 MiB | 23.02 MiB/s Receiving objects: 42% (43424/103390), 46.10 MiB | 23.02 MiB/s Receiving objects: 43% (44458/103390), 46.10 MiB | 23.02 MiB/s Receiving objects: 44% (45492/103390), 46.10 MiB | 23.02 MiB/s Receiving objects: 45% (46526/103390), 57.33 MiB | 22.91 MiB/s Receiving objects: 46% (47560/103390), 57.33 MiB | 22.91 MiB/s Receiving objects: 47% (48594/103390), 57.33 MiB | 22.91 MiB/s Receiving objects: 48% (49628/103390), 57.33 MiB | 22.91 MiB/s Receiving objects: 48% (50041/103390), 57.33 MiB | 22.91 MiB/s Receiving objects: 49% (50662/103390), 69.44 MiB | 23.13 MiB/s Receiving objects: 50% (51695/103390), 69.44 MiB | 23.13 MiB/s Receiving objects: 51% (52729/103390), 69.44 MiB | 23.13 MiB/s Receiving objects: 52% (53763/103390), 69.44 MiB | 23.13 MiB/s Receiving objects: 53% (54797/103390), 69.44 MiB | 23.13 MiB/s Receiving objects: 54% (55831/103390), 69.44 MiB | 23.13 MiB/s Receiving objects: 55% (56865/103390), 81.29 MiB | 23.21 MiB/s Receiving objects: 55% (57064/103390), 94.24 MiB | 23.54 MiB/s Receiving objects: 55% (57119/103390), 108.01 MiB | 23.98 MiB/s Receiving objects: 55% (57227/103390), 150.56 MiB | 25.75 MiB/s Receiving objects: 56% (57899/103390), 150.56 MiB | 25.75 MiB/s Receiving objects: 57% (58933/103390), 163.93 MiB | 26.17 MiB/s Receiving objects: 58% (59967/103390), 163.93 MiB | 26.17 MiB/s Receiving objects: 59% (61001/103390), 163.93 MiB | 26.17 MiB/s Receiving objects: 60% (62034/103390), 163.93 MiB | 26.17 MiB/s Receiving objects: 61% (63068/103390), 163.93 MiB | 26.17 MiB/s Receiving objects: 61% (63487/103390), 178.14 MiB | 26.83 MiB/s Receiving objects: 62% (64102/103390), 178.14 MiB | 26.83 MiB/s Receiving objects: 63% (65136/103390), 178.14 MiB | 26.83 MiB/s Receiving objects: 64% (66170/103390), 190.49 MiB | 26.89 MiB/s Receiving objects: 65% (67204/103390), 190.49 MiB | 26.89 MiB/s Receiving objects: 66% (68238/103390), 190.49 MiB | 26.89 MiB/s Receiving objects: 67% (69272/103390), 190.49 MiB | 26.89 MiB/s Receiving objects: 68% (70306/103390), 190.49 MiB | 26.89 MiB/s Receiving objects: 69% (71340/103390), 190.49 MiB | 26.89 MiB/s Receiving objects: 70% (72373/103390), 190.49 MiB | 26.89 MiB/s Receiving objects: 71% (73407/103390), 190.49 MiB | 26.89 MiB/s Receiving objects: 72% (74441/103390), 190.49 MiB | 26.89 MiB/s Receiving objects: 73% (75475/103390), 190.49 MiB | 26.89 MiB/s Receiving objects: 73% (75687/103390), 205.23 MiB | 27.53 MiB/s Receiving objects: 74% (76509/103390), 205.23 MiB | 27.53 MiB/s Receiving objects: 75% (77543/103390), 220.22 MiB | 27.99 MiB/s Receiving objects: 76% (78577/103390), 220.22 MiB | 27.99 MiB/s Receiving objects: 76% (79581/103390), 235.51 MiB | 28.33 MiB/s Receiving objects: 77% (79611/103390), 235.51 MiB | 28.33 MiB/s Receiving objects: 78% (80645/103390), 235.51 MiB | 28.33 MiB/s Receiving objects: 79% (81679/103390), 235.51 MiB | 28.33 MiB/s Receiving objects: 80% (82712/103390), 235.51 MiB | 28.33 MiB/s Receiving objects: 81% (83746/103390), 247.91 MiB | 28.14 MiB/s Receiving objects: 81% (84182/103390), 261.79 MiB | 28.08 MiB/s Receiving objects: 81% (84502/103390), 286.30 MiB | 27.19 MiB/s Receiving objects: 81% (84515/103390), 307.40 MiB | 25.97 MiB/s Receiving objects: 82% (84780/103390), 307.40 MiB | 25.97 MiB/s Receiving objects: 83% (85814/103390), 316.34 MiB | 24.68 MiB/s Receiving objects: 84% (86848/103390), 316.34 MiB | 24.68 MiB/s Receiving objects: 84% (87375/103390), 316.34 MiB | 24.68 MiB/s Receiving objects: 85% (87882/103390), 327.08 MiB | 23.74 MiB/s Receiving objects: 86% (88916/103390), 327.08 MiB | 23.74 MiB/s Receiving objects: 87% (89950/103390), 327.08 MiB | 23.74 MiB/s Receiving objects: 88% (90984/103390), 340.87 MiB | 23.41 MiB/s Receiving objects: 88% (91425/103390), 355.68 MiB | 23.94 MiB/s Receiving objects: 89% (92018/103390), 368.69 MiB | 23.75 MiB/s Receiving objects: 89% (92596/103390), 382.68 MiB | 23.90 MiB/s Receiving objects: 90% (93051/103390), 382.68 MiB | 23.90 MiB/s Receiving objects: 91% (94085/103390), 382.68 MiB | 23.90 MiB/s Receiving objects: 92% (95119/103390), 382.68 MiB | 23.90 MiB/s Receiving objects: 93% (96153/103390), 382.68 MiB | 23.90 MiB/s Receiving objects: 94% (97187/103390), 382.68 MiB | 23.90 MiB/s Receiving objects: 95% (98221/103390), 382.68 MiB | 23.90 MiB/s Receiving objects: 96% (99255/103390), 382.68 MiB | 23.90 MiB/s Receiving objects: 97% (100289/103390), 382.68 MiB | 23.90 MiB/s Receiving objects: 98% (101323/103390), 382.68 MiB | 23.90 MiB/s Receiving objects: 99% (102357/103390), 382.68 MiB | 23.90 MiB/s remote: Total 103390 (delta 8556), reused 7986 (delta 7776), pack-reused 93377 (from 4)
  7. 18.71 s Receiving objects: 100% (103390/103390), 382.68 MiB | 23.90 MiB/s Receiving objects: 100% (103390/103390), 391.79 MiB | 25.56 MiB/s, done.
  8. 20.13 s Resolving deltas: 0% (0/67744) Resolving deltas: 1% (678/67744) Resolving deltas: 2% (1355/67744) Resolving deltas: 3% (2033/67744) Resolving deltas: 4% (2710/67744) Resolving deltas: 5% (3388/67744) Resolving deltas: 6% (4065/67744) Resolving deltas: 7% (4743/67744) Resolving deltas: 8% (5420/67744) Resolving deltas: 9% (6099/67744) Resolving deltas: 10% (6775/67744) Resolving deltas: 11% (7452/67744) Resolving deltas: 12% (8130/67744) Resolving deltas: 13% (8807/67744) Resolving deltas: 14% (9488/67744) Resolving deltas: 15% (10162/67744) Resolving deltas: 16% (10841/67744) Resolving deltas: 17% (11517/67744) Resolving deltas: 18% (12194/67744) Resolving deltas: 19% (12872/67744) Resolving deltas: 20% (13549/67744) Resolving deltas: 21% (14227/67744) Resolving deltas: 22% (14904/67744) Resolving deltas: 23% (15582/67744) Resolving deltas: 24% (16260/67744) Resolving deltas: 25% (16937/67744) Resolving deltas: 26% (17615/67744) Resolving deltas: 27% (18291/67744) Resolving deltas: 28% (18971/67744) Resolving deltas: 29% (19646/67744) Resolving deltas: 30% (20324/67744) Resolving deltas: 31% (21002/67744) Resolving deltas: 32% (21679/67744) Resolving deltas: 33% (22358/67744) Resolving deltas: 34% (23033/67744) Resolving deltas: 35% (23711/67744) Resolving deltas: 36% (24389/67744) Resolving deltas: 37% (25066/67744) Resolving deltas: 38% (25743/67744) Resolving deltas: 39% (26421/67744) Resolving deltas: 40% (27098/67744) Resolving deltas: 41% (27776/67744) Resolving deltas: 42% (28453/67744) Resolving deltas: 43% (29130/67744) Resolving deltas: 44% (29808/67744) Resolving deltas: 45% (30485/67744) Resolving deltas: 46% (31163/67744) Resolving deltas: 47% (31841/67744) Resolving deltas: 48% (32518/67744) Resolving deltas: 49% (33195/67744) Resolving deltas: 50% (33873/67744) Resolving deltas: 51% (34550/67744) Resolving deltas: 52% (35227/67744) Resolving deltas: 53% (35905/67744) Resolving deltas: 54% (36582/67744) Resolving deltas: 55% (37260/67744) Resolving deltas: 56% (37937/67744) Resolving deltas: 57% (38615/67744) Resolving deltas: 58% (39292/67744) Resolving deltas: 59% (39969/67744) Resolving deltas: 60% (40647/67744) Resolving deltas: 61% (41324/67744) Resolving deltas: 62% (42002/67744) Resolving deltas: 63% (42679/67744) Resolving deltas: 64% (43357/67744) Resolving deltas: 65% (44034/67744) Resolving deltas: 66% (44714/67744) Resolving deltas: 67% (45389/67744) Resolving deltas: 68% (46066/67744) Resolving deltas: 69% (46744/67744) Resolving deltas: 70% (47421/67744) Resolving deltas: 71% (48099/67744) Resolving deltas: 72% (48776/67744) Resolving deltas: 73% (49454/67744) Resolving deltas: 74% (50133/67744) Resolving deltas: 74% (50496/67744) Resolving deltas: 75% (50809/67744) Resolving deltas: 76% (51487/67744) Resolving deltas: 77% (52165/67744) Resolving deltas: 78% (52842/67744) Resolving deltas: 79% (53518/67744) Resolving deltas: 80% (54196/67744) Resolving deltas: 81% (54873/67744) Resolving deltas: 82% (55551/67744) Resolving deltas: 83% (56228/67744) Resolving deltas: 84% (56906/67744) Resolving deltas: 85% (57583/67744) Resolving deltas: 86% (58260/67744) Resolving deltas: 87% (58938/67744) Resolving deltas: 88% (59615/67744) Resolving deltas: 89% (60293/67744) Resolving deltas: 90% (60970/67744) Resolving deltas: 91% (61649/67744) Resolving deltas: 92% (62325/67744) Resolving deltas: 93% (63003/67744) Resolving deltas: 94% (63680/67744) Resolving deltas: 95% (64357/67744) Resolving deltas: 96% (65036/67744) Resolving deltas: 97% (65712/67744) Resolving deltas: 98% (66390/67744) Resolving deltas: 99% (67068/67744) Resolving deltas: 100% (67744/67744) Resolving deltas: 100% (67744/67744), done.
  9. 20.72 s Fetching commit 7ece86a8ed6a8193d0a29f5672536ac83359c492 for finite_T_and_mu ...
  10. 20.72 s $ /nix/store/5vpcfsdx1lcnlb2y4k7xyc74shp5qwbh-git-2.54.0/bin/git fetch origin 7ece86a8ed6a8193d0a29f5672536ac83359c492
  11. 21.27 s From https://github.com/alphal00p/gammaloop
  12. 21.27 s * branch 7ece86a8ed6a8193d0a29f5672536ac83359c492 -> FETCH_HEAD
  13. 21.28 s $ /nix/store/61685rbaxmpigwi3z23i33sv3jyfl70q-coreutils-9.11/bin/timeout --kill-after=15s 7200s /nix/store/5vpcfsdx1lcnlb2y4k7xyc74shp5qwbh-git-2.54.0/bin/git -c advice.detachedHead=false checkout 7ece86a8ed6a8193d0a29f5672536ac83359c492
  14. 21.60 s HEAD is now at 7ece86a8e extend thermal 3drep tests to cover higher-order distribution derivatives
  15. 21.60 s $ /nix/store/61685rbaxmpigwi3z23i33sv3jyfl70q-coreutils-9.11/bin/timeout --kill-after=15s 7200s /nix/store/wknkybkzrc16r11vk5vrykh4wmw7a353-nix-2.34.8/bin/nix --extra-experimental-features nix-command --extra-experimental-features flakes --log-format internal-json run .#packages.x86_64-linux.nix-ci-check-gammaloop-nextest-integration --print-build-logs
  16. 22.10 s
  17. 23.14 s Downloading cached source from https://cache.nix-ci.com
  18. 30.73 s Downloaded cached source (199.4 MiB) in 7.5s
  19. 30.74 s Progress: 1 of 1 downloaded from cache
  20. 39.12 s fetching Git repository 'https://github.com/alphal00p/symbolica'
  21. 39.94 s remote: Enumerating objects: 11155, done.
  22. 40.05 s remote: Counting objects: 0% (1/2928) remote: Counting objects: 1% (30/2928) remote: Counting objects: 2% (59/2928) remote: Counting objects: 3% (88/2928) remote: Counting objects: 4% (118/2928) remote: Counting objects: 5% (147/2928) remote: Counting objects: 6% (176/2928) remote: Counting objects: 7% (205/2928) remote: Counting objects: 8% (235/2928) remote: Counting objects: 9% (264/2928) remote: Counting objects: 10% (293/2928) remote: Counting objects: 11% (323/2928) remote: Counting objects: 12% (352/2928) remote: Counting objects: 13% (381/2928) remote: Counting objects: 14% (410/2928) remote: Counting objects: 15% (440/2928) remote: Counting objects: 16% (469/2928) remote: Counting objects: 17% (498/2928) remote: Counting objects: 18% (528/2928) remote: Counting objects: 19% (557/2928) remote: Counting objects: 20% (586/2928) remote: Counting objects: 21% (615/2928) remote: Counting objects: 22% (645/2928) remote: Counting objects: 23% (674/2928) remote: Counting objects: 24% (703/2928) remote: Counting objects: 25% (732/2928) remote: Counting objects: 26% (762/2928) remote: Counting objects: 27% (791/2928) remote: Counting objects: 28% (820/2928) remote: Counting objects: 29% (850/2928) remote: Counting objects: 30% (879/2928) remote: Counting objects: 31% (908/2928) remote: Counting objects: 32% (937/2928) remote: Counting objects: 33% (967/2928) remote: Counting objects: 34% (996/2928) remote: Counting objects: 35% (1025/2928) remote: Counting objects: 36% (1055/2928) remote: Counting objects: 37% (1084/2928) remote: Counting objects: 38% (1113/2928) remote: Counting objects: 39% (1142/2928) remote: Counting objects: 40% (1172/2928) remote: Counting objects: 41% (1201/2928) remote: Counting objects: 42% (1230/2928) remote: Counting objects: 43% (1260/2928) remote: Counting objects: 44% (1289/2928) remote: Counting objects: 45% (1318/2928) remote: Counting objects: 46% (1347/2928) remote: Counting objects: 47% (1377/2928) remote: Counting objects: 48% (1406/2928) remote: Counting objects: 49% (1435/2928) remote: Counting objects: 50% (1464/2928) remote: Counting objects: 51% (1494/2928) remote: Counting objects: 52% (1523/2928) remote: Counting objects: 53% (1552/2928) remote: Counting objects: 54% (1582/2928) remote: Counting objects: 55% (1611/2928) remote: Counting objects: 56% (1640/2928) remote: Counting objects: 57% (1669/2928) remote: Counting objects: 58% (1699/2928) remote: Counting objects: 59% (1728/2928) remote: Counting objects: 60% (1757/2928) remote: Counting objects: 61% (1787/2928) remote: Counting objects: 62% (1816/2928) remote: Counting objects: 63% (1845/2928) remote: Counting objects: 64% (1874/2928) remote: Counting objects: 65% (1904/2928) remote: Counting objects: 66% (1933/2928) remote: Counting objects: 67% (1962/2928) remote: Counting objects: 68% (1992/2928) remote: Counting objects: 69% (2021/2928) remote: Counting objects: 70% (2050/2928) remote: Counting objects: 71% (2079/2928) remote: Counting objects: 72% (2109/2928) remote: Counting objects: 73% (2138/2928) remote: Counting objects: 74% (2167/2928) remote: Counting objects: 75% (2196/2928) remote: Counting objects: 76% (2226/2928) remote: Counting objects: 77% (2255/2928) remote: Counting objects: 78% (2284/2928) remote: Counting objects: 79% (2314/2928) remote: Counting objects: 80% (2343/2928) remote: Counting objects: 81% (2372/2928) remote: Counting objects: 82% (2401/2928) remote: Counting objects: 83% (2431/2928) remote: Counting objects: 84% (2460/2928) remote: Counting objects: 85% (2489/2928) remote: Counting objects: 86% (2519/2928) remote: Counting objects: 87% (2548/2928) remote: Counting objects: 88% (2577/2928) remote: Counting objects: 89% (2606/2928) remote: Counting objects: 90% (2636/2928) remote: Counting objects: 91% (2665/2928) remote: Counting objects: 92% (2694/2928) remote: Counting objects: 93% (2724/2928) remote: Counting objects: 94% (2753/2928) remote: Counting objects: 95% (2782/2928) remote: Counting objects: 96% (2811/2928) remote: Counting objects: 97% (2841/2928) remote: Counting objects: 98% (2870/2928) remote: Counting objects: 99% (2899/2928) remote: Counting objects: 100% (2928/2928) remote: Counting objects: 100% (2928/2928), done.
  23. 40.56 s remote: Compressing objects: 0% (1/206) remote: Compressing objects: 1% (3/206) remote: Compressing objects: 2% (5/206) remote: Compressing objects: 3% (7/206) remote: Compressing objects: 4% (9/206) remote: Compressing objects: 5% (11/206) remote: Compressing objects: 6% (13/206) remote: Compressing objects: 7% (15/206) remote: Compressing objects: 8% (17/206) remote: Compressing objects: 9% (19/206) remote: Compressing objects: 10% (21/206) remote: Compressing objects: 11% (23/206) remote: Compressing objects: 12% (25/206) remote: Compressing objects: 13% (27/206) remote: Compressing objects: 14% (29/206) remote: Compressing objects: 15% (31/206) remote: Compressing objects: 16% (33/206) remote: Compressing objects: 17% (36/206) remote: Compressing objects: 18% (38/206) remote: Compressing objects: 19% (40/206) remote: Compressing objects: 20% (42/206) remote: Compressing objects: 21% (44/206) remote: Compressing objects: 22% (46/206) remote: Compressing objects: 23% (48/206) remote: Compressing objects: 24% (50/206) remote: Compressing objects: 25% (52/206) remote: Compressing objects: 26% (54/206) remote: Compressing objects: 27% (56/206) remote: Compressing objects: 28% (58/206) remote: Compressing objects: 29% (60/206) remote: Compressing objects: 30% (62/206) remote: Compressing objects: 31% (64/206) remote: Compressing objects: 32% (66/206) remote: Compressing objects: 33% (68/206) remote: Compressing objects: 34% (71/206) remote: Compressing objects: 35% (73/206) remote: Compressing objects: 36% (75/206) remote: Compressing objects: 37% (77/206) remote: Compressing objects: 38% (79/206) remote: Compressing objects: 39% (81/206) remote: Compressing objects: 40% (83/206) remote: Compressing objects: 41% (85/206) remote: Compressing objects: 42% (87/206) remote: Compressing objects: 43% (89/206) remote: Compressing objects: 44% (91/206) remote: Compressing objects: 45% (93/206) remote: Compressing objects: 46% (95/206) remote: Compressing objects: 47% (97/206) remote: Compressing objects: 48% (99/206) remote: Compressing objects: 49% (101/206) remote: Compressing objects: 50% (103/206) remote: Compressing objects: 51% (106/206) remote: Compressing objects: 52% (108/206) remote: Compressing objects: 53% (110/206) remote: Compressing objects: 54% (112/206) remote: Compressing objects: 55% (114/206) remote: Compressing objects: 56% (116/206) remote: Compressing objects: 57% (118/206) remote: Compressing objects: 58% (120/206) remote: Compressing objects: 59% (122/206) remote: Compressing objects: 60% (124/206) remote: Compressing objects: 61% (126/206) remote: Compressing objects: 62% (128/206) remote: Compressing objects: 63% (130/206) remote: Compressing objects: 64% (132/206) remote: Compressing objects: 65% (134/206) remote: Compressing objects: 66% (136/206) remote: Compressing objects: 67% (139/206) remote: Compressing objects: 68% (141/206) remote: Compressing objects: 69% (143/206) remote: Compressing objects: 70% (145/206) remote: Compressing objects: 71% (147/206) remote: Compressing objects: 72% (149/206) remote: Compressing objects: 73% (151/206) remote: Compressing objects: 74% (153/206) remote: Compressing objects: 75% (155/206) remote: Compressing objects: 76% (157/206) remote: Compressing objects: 77% (159/206) remote: Compressing objects: 78% (161/206) remote: Compressing objects: 79% (163/206) remote: Compressing objects: 80% (165/206) remote: Compressing objects: 81% (167/206) remote: Compressing objects: 82% (169/206) remote: Compressing objects: 83% (171/206) remote: Compressing objects: 84% (174/206) remote: Compressing objects: 85% (176/206) remote: Compressing objects: 86% (178/206) remote: Compressing objects: 87% (180/206) remote: Compressing objects: 88% (182/206) remote: Compressing objects: 89% (184/206) remote: Compressing objects: 90% (186/206) remote: Compressing objects: 91% (188/206) remote: Compressing objects: 92% (190/206) remote: Compressing objects: 93% (192/206) remote: Compressing objects: 94% (194/206) remote: Compressing objects: 95% (196/206) remote: Compressing objects: 96% (198/206) remote: Compressing objects: 97% (200/206) remote: Compressing objects: 98% (202/206) remote: Compressing objects: 99% (204/206) remote: Compressing objects: 100% (206/206) remote: Compressing objects: 100% (206/206), done.
  24. 40.87 s Receiving objects: 0% (1/11155) Receiving objects: 1% (112/11155) Receiving objects: 2% (224/11155) Receiving objects: 3% (335/11155) Receiving objects: 4% (447/11155) Receiving objects: 5% (558/11155) Receiving objects: 6% (670/11155) Receiving objects: 7% (781/11155) Receiving objects: 8% (893/11155) Receiving objects: 9% (1004/11155) Receiving objects: 10% (1116/11155) Receiving objects: 11% (1228/11155) Receiving objects: 12% (1339/11155) Receiving objects: 13% (1451/11155) Receiving objects: 14% (1562/11155) Receiving objects: 15% (1674/11155) Receiving objects: 16% (1785/11155) Receiving objects: 17% (1897/11155) Receiving objects: 18% (2008/11155) Receiving objects: 19% (2120/11155) Receiving objects: 20% (2231/11155) Receiving objects: 21% (2343/11155) Receiving objects: 22% (2455/11155) Receiving objects: 23% (2566/11155) Receiving objects: 24% (2678/11155) Receiving objects: 25% (2789/11155) Receiving objects: 26% (2901/11155) Receiving objects: 27% (3012/11155) Receiving objects: 28% (3124/11155) Receiving objects: 29% (3235/11155) Receiving objects: 30% (3347/11155) Receiving objects: 31% (3459/11155) Receiving objects: 32% (3570/11155) Receiving objects: 33% (3682/11155) Receiving objects: 34% (3793/11155) Receiving objects: 35% (3905/11155) Receiving objects: 36% (4016/11155) Receiving objects: 37% (4128/11155) Receiving objects: 38% (4239/11155) Receiving objects: 39% (4351/11155) Receiving objects: 40% (4462/11155) Receiving objects: 41% (4574/11155) Receiving objects: 42% (4686/11155) Receiving objects: 43% (4797/11155) Receiving objects: 44% (4909/11155) Receiving objects: 45% (5020/11155) Receiving objects: 46% (5132/11155) Receiving objects: 47% (5243/11155) Receiving objects: 48% (5355/11155) Receiving objects: 49% (5466/11155) Receiving objects: 50% (5578/11155) Receiving objects: 51% (5690/11155) Receiving objects: 52% (5801/11155) Receiving objects: 53% (5913/11155) Receiving objects: 54% (6024/11155) Receiving objects: 55% (6136/11155) Receiving objects: 56% (6247/11155) Receiving objects: 57% (6359/11155) Receiving objects: 58% (6470/11155) Receiving objects: 59% (6582/11155) Receiving objects: 60% (6693/11155) Receiving objects: 61% (6805/11155) Receiving objects: 62% (6917/11155) Receiving objects: 63% (7028/11155) Receiving objects: 64% (7140/11155) Receiving objects: 65% (7251/11155) Receiving objects: 66% (7363/11155) Receiving objects: 67% (7474/11155) Receiving objects: 68% (7586/11155) Receiving objects: 69% (7697/11155) Receiving objects: 70% (7809/11155) Receiving objects: 71% (7921/11155) Receiving objects: 72% (8032/11155) Receiving objects: 73% (8144/11155) Receiving objects: 74% (8255/11155) Receiving objects: 75% (8367/11155) Receiving objects: 76% (8478/11155) Receiving objects: 77% (8590/11155) Receiving objects: 78% (8701/11155) Receiving objects: 79% (8813/11155) Receiving objects: 80% (8924/11155) Receiving objects: 81% (9036/11155) Receiving objects: 82% (9148/11155) Receiving objects: 83% (9259/11155) Receiving objects: 84% (9371/11155) Receiving objects: 85% (9482/11155) Receiving objects: 86% (9594/11155) Receiving objects: 87% (9705/11155) Receiving objects: 88% (9817/11155) Receiving objects: 89% (9928/11155) Receiving objects: 90% (10040/11155) Receiving objects: 91% (10152/11155) Receiving objects: 92% (10263/11155) Receiving objects: 93% (10375/11155) Receiving objects: 94% (10486/11155) Receiving objects: 95% (10598/11155) Receiving objects: 96% (10709/11155) Receiving objects: 97% (10821/11155) Receiving objects: 98% (10932/11155) Receiving objects: 99% (11044/11155) remote: Total 11155 (delta 2810), reused 2722 (delta 2722), pack-reused 8227 (from 2)
  25. 40.87 s Receiving objects: 100% (11155/11155) Receiving objects: 100% (11155/11155), 5.82 MiB | 20.98 MiB/s, done.
  26. 41.05 s Resolving deltas: 0% (0/8818) Resolving deltas: 1% (89/8818) Resolving deltas: 2% (177/8818) Resolving deltas: 3% (265/8818) Resolving deltas: 4% (353/8818) Resolving deltas: 5% (441/8818) Resolving deltas: 6% (530/8818) Resolving deltas: 7% (618/8818) Resolving deltas: 8% (706/8818) Resolving deltas: 9% (796/8818) Resolving deltas: 10% (882/8818) Resolving deltas: 11% (970/8818) Resolving deltas: 12% (1060/8818) Resolving deltas: 13% (1147/8818) Resolving deltas: 14% (1235/8818) Resolving deltas: 15% (1323/8818) Resolving deltas: 16% (1412/8818) Resolving deltas: 17% (1500/8818) Resolving deltas: 18% (1588/8818) Resolving deltas: 19% (1676/8818) Resolving deltas: 20% (1765/8818) Resolving deltas: 21% (1852/8818) Resolving deltas: 22% (1940/8818) Resolving deltas: 23% (2029/8818) Resolving deltas: 24% (2117/8818) Resolving deltas: 25% (2205/8818) Resolving deltas: 26% (2293/8818) Resolving deltas: 27% (2381/8818) Resolving deltas: 28% (2470/8818) Resolving deltas: 29% (2558/8818) Resolving deltas: 30% (2646/8818) Resolving deltas: 31% (2734/8818) Resolving deltas: 32% (2822/8818) Resolving deltas: 33% (2910/8818) Resolving deltas: 34% (2999/8818) Resolving deltas: 35% (3087/8818) Resolving deltas: 36% (3175/8818) Resolving deltas: 37% (3263/8818) Resolving deltas: 38% (3351/8818) Resolving deltas: 39% (3440/8818) Resolving deltas: 40% (3528/8818) Resolving deltas: 41% (3616/8818) Resolving deltas: 42% (3704/8818) Resolving deltas: 43% (3793/8818) Resolving deltas: 44% (3880/8818) Resolving deltas: 45% (3969/8818) Resolving deltas: 46% (4057/8818) Resolving deltas: 47% (4146/8818) Resolving deltas: 48% (4233/8818) Resolving deltas: 49% (4321/8818) Resolving deltas: 50% (4410/8818) Resolving deltas: 51% (4499/8818) Resolving deltas: 52% (4586/8818) Resolving deltas: 53% (4674/8818) Resolving deltas: 54% (4762/8818) Resolving deltas: 55% (4850/8818) Resolving deltas: 56% (4939/8818) Resolving deltas: 57% (5027/8818) Resolving deltas: 58% (5115/8818) Resolving deltas: 59% (5203/8818) Resolving deltas: 60% (5291/8818) Resolving deltas: 61% (5379/8818) Resolving deltas: 62% (5468/8818) Resolving deltas: 63% (5557/8818) Resolving deltas: 64% (5645/8818) Resolving deltas: 65% (5732/8818) Resolving deltas: 66% (5822/8818) Resolving deltas: 67% (5909/8818) Resolving deltas: 68% (5997/8818) Resolving deltas: 69% (6086/8818) Resolving deltas: 70% (6173/8818) Resolving deltas: 71% (6262/8818) Resolving deltas: 72% (6349/8818) Resolving deltas: 73% (6438/8818) Resolving deltas: 74% (6526/8818) Resolving deltas: 75% (6614/8818) Resolving deltas: 76% (6702/8818) Resolving deltas: 77% (6790/8818) Resolving deltas: 78% (6879/8818) Resolving deltas: 79% (6967/8818) Resolving deltas: 80% (7055/8818) Resolving deltas: 81% (7144/8818) Resolving deltas: 82% (7231/8818) Resolving deltas: 83% (7319/8818) Resolving deltas: 84% (7408/8818) Resolving deltas: 85% (7496/8818) Resolving deltas: 86% (7584/8818) Resolving deltas: 87% (7672/8818) Resolving deltas: 88% (7760/8818) Resolving deltas: 89% (7849/8818) Resolving deltas: 90% (7937/8818) Resolving deltas: 91% (8025/8818) Resolving deltas: 92% (8113/8818) Resolving deltas: 93% (8202/8818) Resolving deltas: 94% (8289/8818) Resolving deltas: 95% (8378/8818) Resolving deltas: 96% (8466/8818) Resolving deltas: 97% (8554/8818) Resolving deltas: 98% (8642/8818) Resolving deltas: 99% (8730/8818) Resolving deltas: 100% (8818/8818) Resolving deltas: 100% (8818/8818), done.
  27. 41.09 s From https://github.com/alphal00p/symbolica
  28. 41.09 s * [new branch] codex/gl638-evaluator-constant-merge -> codex/gl638-evaluator-constant-merge
  29. 41.09 s * [new branch] codex/kirapy-state-registry -> codex/kirapy-state-registry
  30. 41.09 s * [new branch] codex/kirapy-state-registry-dev-2026-08-25 -> codex/kirapy-state-registry-dev-2026-08-25
  31. 41.09 s * [new branch] codex/phase-fix-nested-tensor-counters -> codex/phase-fix-nested-tensor-counters
  32. 41.09 s * [new branch] codex/state-import-d6bb961 -> codex/state-import-d6bb961
  33. 41.09 s * [new branch] evaluate -> evaluate
  34. 41.09 s * [new branch] main -> main
  35. 41.09 s * [new branch] nested_symmetrize -> nested_symmetrize
  36. 41.09 s * [new branch] no_namespace -> no_namespace
  37. 41.09 s * [new branch] packed_exp -> packed_exp
  38. 41.09 s * [new branch] random -> random
  39. 41.09 s * [new branch] rat_parser -> rat_parser
  40. 41.09 s * [new branch] symbolica_fork_for_v0_3_3 -> symbolica_fork_for_v0_3_3
  41. 41.09 s * [new branch] transformer -> transformer
  42. 41.09 s * [new ref] refs/pull/1/head -> refs/pull/1/head
  43. 41.09 s * [new ref] refs/pull/2/head -> refs/pull/2/head
  44. 41.09 s * [new tag] v0.1.0 -> v0.1.0
  45. 43.43 s
  46. 43.44 s Downloading cached gammaloop-nextest-binaries-integration-gammaloop-integration-tests from https://cache.nix-ci.com
  47. 43.44 s Downloading cached xgcc-15.2.0-libgcc from https://cache.nix-ci.com
  48. 43.44 s Downloading cached busybox from https://cache.nix-ci.com
  49. 43.44 s Downloading cached gcc-15.2.0-libgcc from https://cache.nix-ci.com
  50. 43.44 s Downloading cached libunistring from https://cache.nix-ci.com
  51. 43.45 s Downloading cached publicsuffix-list-0-unstable-2026-05 from https://cache.nix-ci.com
  52. 43.60 s Downloaded cached xgcc-15.2.0-libgcc (193 KiB) in 159ms
  53. 43.60 s Progress: 0 of 1 built, 1 of 68 downloaded from cache (5 downloading)
  54. 43.60 s Downloaded cached gcc-15.2.0-libgcc (193 KiB) in 159ms
  55. 43.60 s Progress: 0 of 1 built, 2 of 68 downloaded from cache (4 downloading)
  56. 43.60 s Downloaded cached busybox (230 KiB) in 160ms
  57. 43.60 s Progress: 0 of 1 built, 3 of 68 downloaded from cache (3 downloading)
  58. 43.61 s Downloaded cached publicsuffix-list-0-unstable-2026-05 (329 KiB) in 160ms
  59. 43.61 s Progress: 0 of 1 built, 4 of 68 downloaded from cache (2 downloading)
  60. 43.62 s Downloaded cached libunistring (2 MiB) in 175ms
  61. 43.62 s Progress: 0 of 1 built, 5 of 68 downloaded from cache (1 downloading)
  62. 43.62 s Downloading cached libidn2 from https://cache.nix-ci.com
  63. 43.70 s Downloaded cached libidn2 (359 KiB) in 82ms
  64. 43.70 s Progress: 0 of 1 built, 6 of 68 downloaded from cache (1 downloading)
  65. 43.70 s Downloading cached glibc-2.42 from https://cache.nix-ci.com
  66. 44.17 s Downloaded cached glibc-2.42 (33.5 MiB) in 470ms
  67. 44.17 s Progress: 0 of 1 built, 7 of 68 downloaded from cache (1 downloading)
  68. 44.17 s Downloading cached attr from https://cache.nix-ci.com
  69. 44.17 s Downloading cached aws-c-common from https://cache.nix-ci.com
  70. 44.17 s Downloading cached bash from https://cache.nix-ci.com
  71. 44.17 s Downloading cached brotli-1.2.0-lib from https://cache.nix-ci.com
  72. 44.17 s Downloading cached bzip2 from https://cache.nix-ci.com
  73. 44.17 s Downloading cached editline-1.17.1-unstable-2025-05 from https://cache.nix-ci.com
  74. 44.17 s Downloading cached hwloc-2.14.0-lib from https://cache.nix-ci.com
  75. 44.17 s Downloading cached keyutils-1.6.3-lib from https://cache.nix-ci.com
  76. 44.17 s Downloading cached libcpuid from https://cache.nix-ci.com
  77. 44.17 s Downloading cached libpsl from https://cache.nix-ci.com
  78. 44.17 s Downloading cached libseccomp-2.6.0-lib from https://cache.nix-ci.com
  79. 44.17 s Downloading cached libsodium-1.0.22-unstable-2026-04 from https://cache.nix-ci.com
  80. 44.17 s Downloading cached gcc-15.2.0-lib from https://cache.nix-ci.com
  81. 44.17 s Downloading cached llhttp from https://cache.nix-ci.com
  82. 44.17 s Downloading cached libxml2 from https://cache.nix-ci.com
  83. 44.26 s Downloaded cached keyutils-1.6.3-lib (41 KiB) in 82ms
  84. 44.26 s Progress: 0 of 1 built, 8 of 68 downloaded from cache (15 downloading)
  85. 44.26 s Downloading cached lowdown-3.0.1-lib from https://cache.nix-ci.com
  86. 44.26 s Downloaded cached editline-1.17.1-unstable-2025-05 (58 KiB) in 84ms
  87. 44.26 s Progress: 0 of 1 built, 9 of 68 downloaded from cache (15 downloading)
  88. 44.26 s Downloading cached nghttp2-1.69.0-lib from https://cache.nix-ci.com
  89. 44.32 s Downloaded cached bzip2 (86 KiB) in 150ms
  90. 44.32 s Progress: 0 of 1 built, 10 of 68 downloaded from cache (15 downloading)
  91. 44.32 s Downloading cached nghttp3 from https://cache.nix-ci.com
  92. 44.33 s Downloaded cached attr (90 KiB) in 152ms
  93. 44.33 s Progress: 0 of 1 built, 11 of 68 downloaded from cache (15 downloading)
  94. 44.33 s Downloading cached openssl from https://cache.nix-ci.com
  95. 44.33 s Downloaded cached aws-c-common (1.1 MiB) in 155ms
  96. 44.33 s Progress: 0 of 1 built, 12 of 68 downloaded from cache (15 downloading)
  97. 44.33 s Downloading cached acl from https://cache.nix-ci.com
  98. 44.33 s Downloaded cached libpsl (114 KiB) in 157ms
  99. 44.33 s Progress: 0 of 1 built, 13 of 68 downloaded from cache (15 downloading)
  100. 44.33 s Downloading cached aws-c-compression from https://cache.nix-ci.com
  101. 44.34 s Downloaded cached libseccomp-2.6.0-lib (193 KiB) in 165ms
  102. 44.34 s Progress: 0 of 1 built, 14 of 68 downloaded from cache (15 downloading)
  103. 44.34 s Downloading cached aws-c-sdkutils from https://cache.nix-ci.com
  104. 44.34 s Downloaded cached bash (1.8 MiB) in 170ms
  105. 44.34 s Progress: 0 of 1 built, 15 of 68 downloaded from cache (15 downloading)
  106. 44.34 s Downloading cached aws-checksums from https://cache.nix-ci.com
  107. 44.35 s Downloaded cached hwloc-2.14.0-lib (459 KiB) in 177ms
  108. 44.35 s Progress: 0 of 1 built, 16 of 68 downloaded from cache (15 downloading)
  109. 44.35 s Downloading cached pcre2 from https://cache.nix-ci.com
  110. 44.36 s Downloaded cached libsodium-1.0.22-unstable-2026-04 (666 KiB) in 181ms
  111. 44.36 s Progress: 0 of 1 built, 17 of 68 downloaded from cache (15 downloading)
  112. 44.36 s Downloading cached xz from https://cache.nix-ci.com
  113. 44.37 s Downloaded cached llhttp (89 KiB) in 191ms
  114. 44.37 s Progress: 0 of 1 built, 18 of 68 downloaded from cache (15 downloading)
  115. 44.37 s Downloading cached zlib from https://cache.nix-ci.com
  116. 44.37 s Downloaded cached libcpuid (326 KiB) in 200ms
  117. 44.37 s Progress: 0 of 1 built, 19 of 68 downloaded from cache (15 downloading)
  118. 44.38 s Downloaded cached brotli-1.2.0-lib (961 KiB) in 211ms
  119. 44.38 s Progress: 0 of 1 built, 20 of 68 downloaded from cache (14 downloading)
  120. 44.41 s Downloaded cached nghttp2-1.69.0-lib (225 KiB) in 154ms
  121. 44.41 s Progress: 0 of 1 built, 21 of 68 downloaded from cache (13 downloading)
  122. 44.41 s Downloaded cached lowdown-3.0.1-lib (341 KiB) in 156ms
  123. 44.41 s Progress: 0 of 1 built, 22 of 68 downloaded from cache (12 downloading)
  124. 44.42 s Downloaded cached libxml2 (1.4 MiB) in 247ms
  125. 44.42 s Progress: 0 of 1 built, 23 of 68 downloaded from cache (11 downloading)
  126. 44.45 s Downloaded cached aws-checksums (86 KiB) in 108ms
  127. 44.45 s Progress: 0 of 1 built, 24 of 68 downloaded from cache (10 downloading)
  128. 44.46 s Downloaded cached nghttp3 (228 KiB) in 131ms
  129. 44.46 s Progress: 0 of 1 built, 25 of 68 downloaded from cache (9 downloading)
  130. 44.46 s Downloaded cached aws-c-compression (31 KiB) in 125ms
  131. 44.46 s Progress: 0 of 1 built, 26 of 68 downloaded from cache (8 downloading)
  132. 44.46 s Downloaded cached acl (125 KiB) in 131ms
  133. 44.46 s Progress: 0 of 1 built, 27 of 68 downloaded from cache (7 downloading)
  134. 44.46 s Downloaded cached gcc-15.2.0-lib (9.8 MiB) in 289ms
  135. 44.46 s Progress: 0 of 1 built, 28 of 68 downloaded from cache (6 downloading)
  136. 44.46 s Downloading cached boehm-gc from https://cache.nix-ci.com
  137. 44.46 s Downloading cached icu4c from https://cache.nix-ci.com
  138. 44.46 s Downloading cached onetbb from https://cache.nix-ci.com
  139. 44.46 s Downloading cached zstd from https://cache.nix-ci.com
  140. 44.52 s Downloaded cached xz (837 KiB) in 161ms
  141. 44.52 s Progress: 0 of 1 built, 29 of 68 downloaded from cache (9 downloading)
  142. 44.53 s Downloaded cached zlib (129 KiB) in 164ms
  143. 44.53 s Progress: 0 of 1 built, 30 of 68 downloaded from cache (8 downloading)
  144. 44.53 s Downloading cached sqlite from https://cache.nix-ci.com
  145. 44.54 s Downloaded cached pcre2 (2 MiB) in 186ms
  146. 44.54 s Progress: 0 of 1 built, 31 of 68 downloaded from cache (8 downloading)
  147. 44.58 s Downloaded cached aws-c-sdkutils (155 KiB) in 235ms
  148. 44.58 s Progress: 0 of 1 built, 32 of 68 downloaded from cache (7 downloading)
  149. 44.60 s Downloaded cached boehm-gc (312 KiB) in 135ms
  150. 44.60 s Progress: 0 of 1 built, 33 of 68 downloaded from cache (6 downloading)
  151. 44.61 s Downloaded cached openssl (8.9 MiB) in 279ms
  152. 44.61 s Progress: 0 of 1 built, 34 of 68 downloaded from cache (5 downloading)
  153. 44.61 s Downloading cached aws-c-cal from https://cache.nix-ci.com
  154. 44.61 s Downloading cached krb5-1.22.2-lib from https://cache.nix-ci.com
  155. 44.61 s Downloading cached libssh2 from https://cache.nix-ci.com
  156. 44.61 s Downloading cached ngtcp2 from https://cache.nix-ci.com
  157. 44.61 s Downloading cached s2n-tls from https://cache.nix-ci.com
  158. 44.61 s Downloaded cached onetbb (626 KiB) in 145ms
  159. 44.61 s Progress: 0 of 1 built, 35 of 68 downloaded from cache (9 downloading)
  160. 44.61 s Downloading cached libblake3 from https://cache.nix-ci.com
  161. 44.64 s Downloaded cached zstd (1.1 MiB) in 179ms
  162. 44.64 s Progress: 0 of 1 built, 36 of 68 downloaded from cache (9 downloading)
  163. 44.64 s Downloading cached libarchive-3.8.8-lib from https://cache.nix-ci.com
  164. 44.73 s Downloaded cached libblake3 (117 KiB) in 124ms
  165. 44.73 s Progress: 0 of 1 built, 37 of 68 downloaded from cache (9 downloading)
  166. 44.74 s Downloaded cached aws-c-cal (158 KiB) in 131ms
  167. 44.74 s Progress: 0 of 1 built, 38 of 68 downloaded from cache (8 downloading)
  168. 44.75 s Downloaded cached libssh2 (330 KiB) in 147ms
  169. 44.75 s Progress: 0 of 1 built, 39 of 68 downloaded from cache (7 downloading)
  170. 44.75 s Downloading cached libgit2-1.9.4-lib from https://cache.nix-ci.com
  171. 44.77 s Downloaded cached ngtcp2 (515 KiB) in 163ms
  172. 44.77 s Progress: 0 of 1 built, 40 of 68 downloaded from cache (7 downloading)
  173. 44.79 s Downloaded cached s2n-tls (1.3 MiB) in 183ms
  174. 44.79 s Progress: 0 of 1 built, 41 of 68 downloaded from cache (6 downloading)
  175. 44.79 s Downloading cached aws-c-io from https://cache.nix-ci.com
  176. 44.83 s Downloaded cached libarchive-3.8.8-lib (953 KiB) in 184ms
  177. 44.83 s Progress: 0 of 1 built, 42 of 68 downloaded from cache (6 downloading)
  178. 44.88 s Downloaded cached krb5-1.22.2-lib (2.7 MiB) in 270ms
  179. 44.88 s Progress: 0 of 1 built, 43 of 68 downloaded from cache (5 downloading)
  180. 44.88 s Downloading cached curl from https://cache.nix-ci.com
  181. 44.91 s Downloaded cached sqlite (5.7 MiB) in 374ms
  182. 44.91 s Progress: 0 of 1 built, 44 of 68 downloaded from cache (5 downloading)
  183. 44.93 s Downloaded cached libgit2-1.9.4-lib (1.6 MiB) in 177ms
  184. 44.93 s Progress: 0 of 1 built, 45 of 68 downloaded from cache (4 downloading)
  185. 45.01 s Downloaded cached aws-c-io (648 KiB) in 219ms
  186. 45.01 s Progress: 0 of 1 built, 46 of 68 downloaded from cache (3 downloading)
  187. 45.01 s Downloading cached aws-c-event-stream from https://cache.nix-ci.com
  188. 45.01 s Downloading cached aws-c-http from https://cache.nix-ci.com
  189. 45.13 s Downloaded cached curl (1.2 MiB) in 247ms
  190. 45.13 s Progress: 0 of 1 built, 47 of 68 downloaded from cache (4 downloading)
  191. 45.24 s Downloaded cached aws-c-event-stream (176 KiB) in 231ms
  192. 45.24 s Progress: 0 of 1 built, 48 of 68 downloaded from cache (3 downloading)
  193. 45.25 s Downloaded cached aws-c-http (641 KiB) in 241ms
  194. 45.25 s Progress: 0 of 1 built, 49 of 68 downloaded from cache (2 downloading)
  195. 45.25 s Downloading cached aws-c-auth from https://cache.nix-ci.com
  196. 45.25 s Downloading cached aws-c-mqtt from https://cache.nix-ci.com
  197. 45.29 s Downloaded cached icu4c (38.2 MiB) in 828ms
  198. 45.29 s Progress: 0 of 1 built, 50 of 68 downloaded from cache (3 downloading)
  199. 45.29 s Downloading cached boost from https://cache.nix-ci.com
  200. 45.43 s Downloaded cached aws-c-auth (387 KiB) in 176ms
  201. 45.43 s Progress: 0 of 1 built, 51 of 68 downloaded from cache (3 downloading)
  202. 45.43 s Downloading cached aws-c-s3 from https://cache.nix-ci.com
  203. 45.43 s Downloaded cached aws-c-mqtt (557 KiB) in 179ms
  204. 45.43 s Progress: 0 of 1 built, 52 of 68 downloaded from cache (3 downloading)
  205. 45.57 s Downloaded cached boost (14.5 MiB) in 280ms
  206. 45.57 s Progress: 0 of 1 built, 53 of 68 downloaded from cache (2 downloading)
  207. 45.57 s Downloading cached nix-util from https://cache.nix-ci.com
  208. 45.60 s Downloaded cached aws-c-s3 (384 KiB) in 166ms
  209. 45.60 s Progress: 0 of 1 built, 54 of 68 downloaded from cache (2 downloading)
  210. 45.60 s Downloading cached aws-crt-cpp from https://cache.nix-ci.com
  211. 45.75 s Downloaded cached nix-util (2.4 MiB) in 175ms
  212. 45.75 s Progress: 0 of 1 built, 55 of 68 downloaded from cache (2 downloading)
  213. 45.75 s Downloading cached nix-nswrapper from https://cache.nix-ci.com
  214. 45.77 s Downloaded cached aws-crt-cpp (979 KiB) in 171ms
  215. 45.77 s Progress: 0 of 1 built, 56 of 68 downloaded from cache (2 downloading)
  216. 45.77 s Downloading cached nix-store from https://cache.nix-ci.com
  217. 45.91 s Downloaded cached nix-nswrapper (131 KiB) in 163ms
  218. 45.91 s Progress: 0 of 1 built, 57 of 68 downloaded from cache (2 downloading)
  219. 45.98 s Downloaded cached nix-store (5.8 MiB) in 213ms
  220. 45.98 s Progress: 0 of 1 built, 58 of 68 downloaded from cache (1 downloading)
  221. 45.98 s Downloading cached nix-fetchers from https://cache.nix-ci.com
  222. 45.98 s Downloading cached nix-main from https://cache.nix-ci.com
  223. 46.18 s Downloaded cached nix-main (393 KiB) in 198ms
  224. 46.18 s Progress: 0 of 1 built, 59 of 68 downloaded from cache (2 downloading)
  225. 46.21 s Downloaded cached nix-fetchers (1.5 MiB) in 223ms
  226. 46.21 s Progress: 0 of 1 built, 60 of 68 downloaded from cache (1 downloading)
  227. 46.21 s Downloading cached nix-expr from https://cache.nix-ci.com
  228. 46.43 s Downloaded cached nix-expr (3.3 MiB) in 220ms
  229. 46.43 s Progress: 0 of 1 built, 61 of 68 downloaded from cache (1 downloading)
  230. 46.43 s Downloading cached nix-flake from https://cache.nix-ci.com
  231. 46.62 s Downloaded cached nix-flake (956 KiB) in 192ms
  232. 46.62 s Progress: 0 of 1 built, 62 of 68 downloaded from cache (1 downloading)
  233. 46.62 s Downloading cached nix-cmd from https://cache.nix-ci.com
  234. 46.83 s Downloaded cached nix-cmd (1 MiB) in 211ms
  235. 46.83 s Progress: 0 of 1 built, 63 of 68 downloaded from cache (1 downloading)
  236. 46.83 s Downloading cached nix from https://cache.nix-ci.com
  237. 47.07 s Downloaded cached nix (3.9 MiB) in 236ms
  238. 47.07 s Progress: 0 of 1 built, 64 of 68 downloaded from cache (1 downloading)
  239. 47.07 s Downloading cached nix from https://cache.nix-ci.com
  240. 47.24 s Downloaded cached nix (8848 B) in 175ms
  241. 47.24 s Progress: 0 of 1 built, 65 of 68 downloaded from cache (1 downloading)
  242. 53.71 s Downloaded cached gammaloop-nextest-binaries-integration-gammaloop-integration-tests (424.4 MiB) in 10.2s
  243. 53.71 s Progress: 0 of 1 built, 66 of 68 downloaded from cache
  244. 53.71 s Downloading cached gammaloop-nextest-binaries-integration from https://cache.nix-ci.com
  245. 53.75 s Downloaded cached gammaloop-nextest-binaries-integration (528 B) in 38ms
  246. 53.75 s Progress: 0 of 1 built, 67 of 68 downloaded from cache
  247. 53.75 s Downloading cached nix-ci-check-gammaloop-nextest-integration from https://cache.nix-ci.com
  248. 53.79 s Downloaded cached nix-ci-check-gammaloop-nextest-integration (1032 B) in 38ms
  249. 53.79 s Progress: 0 of 1 built, 68 of 68 downloaded from cache
  250. 59.68 s evaluating derivation 'g copying '/nix/store/q9yd evaluating derivation 'g copying '/nix/store/q9yd evaluating derivation 'g copying '/nix/store/q9yd evaluating derivation 'g copying '/nix/store/q9yd evaluating derivation 'g copying '/nix/store/q9yd evaluating derivation 'g copying '/nix/store/q9yd evaluating derivation 'g querying gammaloop-nexte querying info about miss querying gammaloop-nexte [0.0 KiB DL] querying ll [5.3 KiB DL] querying gz [25.9 KiB DL] querying m [42.3 KiB DL] querying m [45.4 KiB DL] querying g [48.1 KiB DL] [0/22 built, 16/0/63 cop [0/22 built, 16/7/63 cop [0/21 built, 16/11/63 co [0/21 built, 16/14/63 co [0/21 built, 15/15/63 co [0/20 built, 16/24/63 co [0/20 built, 16/26/63 co [0/20 built, 16/27/63 co [0/20 built, 16/28/63 co [0/19 built, 16/29/63 co [0/19 built, 16/31/63 co [0/18 built, 16/33/63 co [0/18 built, 16/35/63 co [0/18 built, 16/36/63 co [0/17 built, 15/39/63 co [0/16 built, 12/43/63 co [0/16 built, 9/47/63 cop [0/16 built, 8/50/63 cop [0/15 built, 7/51/63 cop [1/0/15 built, 7/51/63 c [2/0/14 built, 6/52/63 ccrane-dummy-cargo-target.rs (post)> Uploading to the NixCI cache: /nix/store/hd50hqi25fymr09a2w4xdiy5jmb2cfl5-crane-dummy-cargo-target.rs
  251. 59.73 s crane-dummy-cargo-target.rs (post)> warning: 'warn-short-path-literals' is deprecated, use 'lint-short-path-literals = ignore' instead
  252. 59.85 s crane-dummy-cargo-target.rs (post)> copying 0 paths...
  253. 59.92 s crane-dummy-cargo-target.rs (post)> warning: 'warn-short-path-literals' is deprecated, use 'lint-short-path-literals = ignore' instead
  254. 60.77 s crane-dummy-cargo-target.rs (post)> copying 0 paths...
  255. 60.81 s crane-dummy-proc-macro-cargo-target.rs (post)> Uploading to the NixCI cache: /nix/store/z0b4s6pznqwlbyw5v4bbq7k1kp721g19-crane-dummy-proc-macro-cargo-target.rs
  256. 60.85 s [1/1/14 built, 4/54/63 ccrane-dummy-proc-macro-cargo-target.rs (post)> warning: 'warn-short-path-literals' is deprecated, use 'lint-short-path-literals = ignore' instead
  257. 61.05 s crane-dummy-proc-macro-cargo-target.rs (post)> copying 0 paths...
  258. 61.11 s crane-dummy-proc-macro-cargo-target.rs (post)> warning: 'warn-short-path-literals' is deprecated, use 'lint-short-path-literals = ignore' instead
  259. 61.33 s crane-dummy-proc-macro-cargo-target.rs (post)> copying 0 paths...
  260. 63.71 s [2/14 built, 5/54/63 cop [2/13 built, 5/55/63 cop [2/12 built, 4/56/63 cop [2/11 built, 4/57/63 cop [2/11 built, 4/58/63 cop [2/10 built, 3/59/63 cop [2/9 built, 2/60/63 copi [2/8 built, 1/61/63 copi [2/7 built, 1/62/63 copi [2/2/7 built, 1/62/63 co [2/2/6 built, 63 copied rust-stable-with-std (post)> Uploading to the NixCI cache: /nix/store/imnwv6nazijihjlgf2h3l1qm63m7l9wk-rust-stable-with-std-2026-07-09
  261. 63.75 s rust-stable-with-std (post)> warning: 'warn-short-path-literals' is deprecated, use 'lint-short-path-literals = ignore' instead
  262. 63.87 s rust-stable-with-std (post)> copying 0 paths...
  263. 63.92 s rust-stable-with-std (post)> warning: 'warn-short-path-literals' is deprecated, use 'lint-short-path-literals = ignore' instead
  264. 64.14 s rust-stable-with-std (post)> copying 0 paths...
  265. 64.31 s [1/3/7 built, 63 copied clippy-stable-with-std (post)> Uploading to the NixCI cache: /nix/store/r4bjy93lvnfma1awpi480n2mz3af0adx-clippy-stable-with-std-2026-07-09
  266. 64.35 s clippy-stable-with-std (post)> warning: 'warn-short-path-literals' is deprecated, use 'lint-short-path-literals = ignore' instead
  267. 64.48 s clippy-stable-with-std (post)> copying 0 paths...
  268. 64.53 s clippy-stable-with-std (post)> warning: 'warn-short-path-literals' is deprecated, use 'lint-short-path-literals = ignore' instead
  269. 64.67 s clippy-stable-with-std (post)> copying 0 paths...
  270. 64.76 s [4/7 built, 63 copied (1 [1/4/6 built, 63 copied rust-stable-with-components> /nix/store/imnwv6nazijihjlgf2h3l1qm63m7l9wk-rust-stable-with-std-2026-07-09/lib:
  271. 64.76 s rust-stable-with-components> librustc_driver-a39fc8bf9e61dbb9.so: Keeping existing link to /nix/store/r4bjy93lvnfma1awpi480n2mz3af0adx-clippy-stable-with-std-2026-07-09/lib/librustc_driver-a39fc8bf9e61dbb9.so
  272. 64.76 s rust-stable-with-components> /nix/store/imnwv6nazijihjlgf2h3l1qm63m7l9wk-rust-stable-with-std-2026-07-09/bin:
  273. 64.76 s rust-stable-with-components> rustc: Keeping existing link to /nix/store/r4bjy93lvnfma1awpi480n2mz3af0adx-clippy-stable-with-std-2026-07-09/bin/rustc
  274. 64.76 s rust-stable-with-components> rustdoc: Keeping existing link to /nix/store/r4bjy93lvnfma1awpi480n2mz3af0adx-clippy-stable-with-std-2026-07-09/bin/rustdoc
  275. 64.76 s rust-stable-with-components> rust-lldb: Keeping existing link to /nix/store/r4bjy93lvnfma1awpi480n2mz3af0adx-clippy-stable-with-std-2026-07-09/bin/rust-lldb
  276. 64.76 s rust-stable-with-components> rust-gdbgui: Keeping existing link to /nix/store/r4bjy93lvnfma1awpi480n2mz3af0adx-clippy-stable-with-std-2026-07-09/bin/rust-gdbgui
  277. 64.76 s rust-stable-with-components> rust-gdb: Keeping existing link to /nix/store/r4bjy93lvnfma1awpi480n2mz3af0adx-clippy-stable-with-std-2026-07-09/bin/rust-gdb
  278. 65.26 s rust-stable-with-components (post)> Uploading to the NixCI cache: /nix/store/9pb4ikjdw4gp766ayxl6gg3b7hqm6ds4-rust-stable-with-components-2026-07-09
  279. 65.31 s rust-stable-with-components (post)> warning: 'warn-short-path-literals' is deprecated, use 'lint-short-path-literals = ignore' instead
  280. 65.43 s rust-stable-with-components (post)> copying 0 paths...
  281. 65.49 s rust-stable-with-components (post)> warning: 'warn-short-path-literals' is deprecated, use 'lint-short-path-literals = ignore' instead
  282. 65.64 s rust-stable-with-components (post)> copying 0 paths...
  283. 66.07 s [5/7 built, 63 copied (1 [1/5/6 built, 63 copied gammaloop-nextest-integration> Extracting 13 binaries, 1 build script output directory, and 3 linked paths to /build/nextest-archive-8dLRNL
  284. 68.60 s gammaloop-nextest-integration> Extracted 30 files to /build/nextest-archive-8dLRNL in 2.53s
  285. 68.63 s gammaloop-nextest-integration> ------------
  286. 68.63 s gammaloop-nextest-integration> Nextest run ID 16c26a88-e889-46e2-8268-1df770c17995 with nextest profile: ci_gammaloop
  287. 68.63 s gammaloop-nextest-integration> Starting 170 tests across 13 binaries (209 tests skipped, including 208 tests via profile.ci_gammaloop.default-filter)
  288. 173.96 s gammaloop-nextest-integration> FAIL [ 2.807s] ( 55/170) gammaloop-integration-tests::test_runs aa_aa::important::aa_aa_local_inspect_backend_consistency
  289. 173.96 s gammaloop-nextest-integration> stdout ---
  290. 173.96 s gammaloop-nextest-integration>
  291. 173.96 s gammaloop-nextest-integration> running 1 test
  292. 173.96 s gammaloop-nextest-integration> test aa_aa::important::aa_aa_local_inspect_backend_consistency ... FAILED
  293. 173.96 s gammaloop-nextest-integration>
  294. 173.96 s gammaloop-nextest-integration> failures:
  295. 173.96 s gammaloop-nextest-integration>
  296. 173.96 s gammaloop-nextest-integration> failures:
  297. 173.96 s gammaloop-nextest-integration> aa_aa::important::aa_aa_local_inspect_backend_consistency
  298. 173.96 s gammaloop-nextest-integration>
  299. 173.96 s gammaloop-nextest-integration> test result: FAILED. 0 passed; 1 failed; 0 ignored; 0 measured; 274 filtered out; finished in 2.79s
  300. 173.96 s gammaloop-nextest-integration>
  301. 173.96 s gammaloop-nextest-integration> stderr ---
  302. 173.96 s gammaloop-nextest-integration> [2026-09-18 17:10:15.861] @gammaloop_api::se... INFO : Running command import model sm-default.json
  303. 173.96 s gammaloop-nextest-integration> [2026-09-18 17:10:15.861] @import::model INFO : Loading built-in JSON model sm-default
  304. 173.96 s gammaloop-nextest-integration> [2026-09-18 17:10:15.883] @gammalooprs::model INFO : The following 15 external parameters were forced to zero by the restriction card:
  305. 173.96 s gammaloop-nextest-integration> lamWS, AWS, rhoWS, etaWS, ymc, yme, ymm, MC, Me, MM, WTau, muQ, muLe, muLmu, muLtau
  306. 173.96 s gammaloop-nextest-integration> [2026-09-18 17:10:15.883] @gammalooprs::model INFO : The following 34 vertex rules were removed by the restriction card:
  307. 173.96 s gammaloop-nextest-integration> V_82 -> (c~, d, G+) | V_83 -> (t~, d, G+) | V_84 -> (c~, s, G+) | V_85 -> (t~, s, G+) | V_86 -> (u~, b, G+) | V_87 -> (c~, b, G+) | V_90 -> (c~, d, W+) | V_91 -> (t~, d, W+) | V_92 -> (u~, s, W+) | V_94 -> (t~, s, W+) | V_95 -> (u~, b, W+) | V_96 -> (c~, b, W+) | V_101 -> (e+, e-, G0) | V_102 -> (mu+, mu-, G0) | V_104 -> (e+, e-, H) | V_105 -> (mu+, mu-, H) | V_110 -> (ve~, e-, G+) | V_111 -> (vm~, mu-, G+) | V_116 -> (b~, u, G-) | V_117 -> (d~, c, G-) | V_118 -> (s~, c, G-) | V_119 -> (b~, c, G-) | V_120 -> (d~, t, G-) | V_121 -> (s~, t, G-) | V_124 -> (s~, u, W-) | V_125 -> (b~, u, W-) | V_126 -> (d~, c, W-) | V_128 -> (b~, c, W-) | V_129 -> (d~, t, W-) | V_130 -> (s~, t, W-) | V_138 -> (c~, c, G0) | V_140 -> (c~, c, H) | V_145 -> (e+, ve, G-) | V_146 -> (mu+, vm, G-)
  308. 173.96 s gammaloop-nextest-integration> [2026-09-18 17:10:15.883] @gammalooprs::model INFO : The following 36 couplings were removed by the restriction card:
  309. 173.96 s gammaloop-nextest-integration> GC_13, GC_14, GC_16, GC_17, GC_18, GC_19, GC_20, GC_22, GC_23, GC_24, GC_25, GC_26, GC_28, GC_29, GC_42, GC_43, GC_44, GC_46, GC_47, GC_48, GC_84, GC_85, GC_86, GC_87, GC_88, GC_89, GC_90, GC_91, GC_92, GC_93, GC_101, GC_102, GC_103, GC_105, GC_106, GC_107
  310. 173.96 s gammaloop-nextest-integration> [2026-09-18 17:10:15.884] @gammaloop_api::se... INFO : Running command run set_model_parameters
  311. 173.96 s gammaloop-nextest-integration> [2026-09-18 17:10:15.884] @gammaloop_api::se... INFO : Starting command block set_model_parameters
  312. 173.96 s gammaloop-nextest-integration> [2026-09-18 17:10:15.884] @gammaloop_api::se... INFO : Running command set model MT=173.0
  313. 173.96 s gammaloop-nextest-integration> [2026-09-18 17:10:15.888] @gammaloop_api::se... INFO : Running command set model WT=0.0
  314. 173.96 s gammaloop-nextest-integration> [2026-09-18 17:10:15.893] @gammaloop_api::se... INFO : Running command set model ymt=173.0
  315. 173.96 s gammaloop-nextest-integration> [2026-09-18 17:10:15.897] @gammaloop_api::se... INFO : Running command set model aS=0.118
  316. 173.96 s gammaloop-nextest-integration> [2026-09-18 17:10:15.902] @gammaloop_api::se... INFO : Running command set model aEWM1=137.036
  317. 173.96 s gammaloop-nextest-integration> [2026-09-18 17:10:15.906] @gammaloop_api::se... INFO : Running command set model Gf=1.166390e-05
  318. 173.96 s gammaloop-nextest-integration> [2026-09-18 17:10:15.911] @gammaloop_api::se... INFO : Running command set model MZ=91.188
  319. 173.96 s gammaloop-nextest-integration> [2026-09-18 17:10:15.917] @gammaloop_api::se... INFO : Running command set global string '
  320. 173.96 s gammaloop-nextest-integration> [global.generation.compile]
  321. 173.96 s gammaloop-nextest-integration> compilation_mode = "symjit"
  322. 173.96 s gammaloop-nextest-integration> optimization_level = "O0"
  323. 173.96 s gammaloop-nextest-integration> fast_math = false
  324. 173.96 s gammaloop-nextest-integration> [...]
  325. 173.96 s gammaloop-nextest-integration> [2026-09-18 17:10:15.918] @gammaloop_api::se... INFO : Running command import graphs ./examples/cli/aa_aa/1L/aa_aa_1L.dot -p aa_aa_all_helicities -i 1L_ppmm -o
  326. 173.96 s gammaloop-nextest-integration> [2026-09-18 17:10:15.918] @commands::import INFO : Loading graphs from '/build/source/examples/cli/aa_aa/1L/aa_aa_1L.dot'
  327. 173.96 s gammaloop-nextest-integration> [2026-09-18 17:10:15.930] @gammaloop_api::se... INFO : Running command generate existing -p aa_aa_all_helicities
  328. 173.96 s gammaloop-nextest-integration> The application panicked (crashed).
  329. 173.96 s gammaloop-nextest-integration> Message: label _func_power_ not found
  330. 173.96 s gammaloop-nextest-integration> Location: /nix/store/n9w914kh1cm59xx3spcs831cdyb56m32-vendor-cargo-deps/c19b7c6f923b580ac259164a89f2577984ad5ab09ee9d583b888f934adbbe8d0/symjit-2.25.6/src/symjit/assembler.rs:77
  331. 173.96 s gammaloop-nextest-integration>
  332. 173.96 s gammaloop-nextest-integration> ━━━━━━━━━━━━━━━━━━━━━━━━━━━━━━━━━━ BACKTRACE ━━━━━━━━━━━━━━━━━━━━━━━━━━━━━━━━━━━
  333. 173.96 s gammaloop-nextest-integration> 1: <color_eyre[51793ea62743adbd]::config::PanicHook>::panic_report<unknown>
  334. 173.96 s gammaloop-nextest-integration> at <unknown source file>:<unknown line>
  335. 173.96 s gammaloop-nextest-integration> 2: <color_eyre[51793ea62743adbd]::config::PanicHook>::into_panic_hook::{closure#0}<unknown>
  336. 173.96 s gammaloop-nextest-integration> at <unknown source file>:<unknown line>
  337. 173.96 s gammaloop-nextest-integration> 3: std[bcb96dfbba0ab899]::panicking::panic_with_hook<unknown>
  338. 173.96 s gammaloop-nextest-integration> at <unknown source file>:<unknown line>
  339. 173.96 s gammaloop-nextest-integration> 4: std[bcb96dfbba0ab899]::panicking::panic_handler::{closure#0}<unknown>
  340. 173.96 s gammaloop-nextest-integration> at <unknown source file>:<unknown line>
  341. 173.96 s gammaloop-nextest-integration> 5: std[bcb96dfbba0ab899]::sys::backtrace::__rust_end_short_backtrace::<std[bcb96dfbba0ab899]::panicking::panic_handler::{closure#0}, !><unknown>
  342. 173.96 s gammaloop-nextest-integration> at <unknown source file>:<unknown line>
  343. 173.96 s gammaloop-nextest-integration> 6: __rustc[6c289b9f9c454d21]::rust_begin_unwind<unknown>
  344. 173.96 s gammaloop-nextest-integration> at <unknown source file>:<unknown line>
  345. 173.96 s gammaloop-nextest-integration> 7: core[940e698046960fd5]::panicking::panic_fmt<unknown>
  346. 173.96 s gammaloop-nextest-integration> at <unknown source file>:<unknown line>
  347. 173.96 s gammaloop-nextest-integration> 8: <symjit[e408de789c333cd]::symjit::assembler::Assembler>::apply_jumps<unknown>
  348. 173.96 s gammaloop-nextest-integration> at <unknown source file>:<unknown line>
  349. 173.96 s gammaloop-nextest-integration> 9: <symjit[e408de789c333cd]::symjit::builder::Builder>::compile_from_mir::<symjit[e408de789c333cd]::symjit::amd::complex::AmdComplexGenerator><unknown>
  350. 173.96 s gammaloop-nextest-integration> at <unknown source file>:<unknown line>
  351. 173.96 s gammaloop-nextest-integration> 10: <symjit[e408de789c333cd]::symjit::runnable::Application>::compile_ty<unknown>
  352. 173.96 s gammaloop-nextest-integration> at <unknown source file>:<unknown line>
  353. 173.96 s gammaloop-nextest-integration> 11: <symjit[e408de789c333cd]::symjit::runnable::Application>::with_mir<unknown>
  354. 173.96 s gammaloop-nextest-integration> at <unknown source file>:<unknown line>
  355. 173.96 s gammaloop-nextest-integration> 12: <symjit[e408de789c333cd]::symjit::composer::DirectTranslator as symjit[e408de789c333cd]::symjit::composer::Composer>::compile<unknown>
  356. 173.96 s gammaloop-nextest-integration> at <unknown source file>:<unknown line>
  357. 173.96 s gammaloop-nextest-integration> 13: <symjit[e408de789c333cd]::symjit::compiler::Translator as symjit[e408de789c333cd]::symjit::composer::Composer>::compile<unknown>
  358. 173.96 s gammaloop-nextest-integration> at <unknown source file>:<unknown line>
  359. 173.96 s gammaloop-nextest-integration> 14: <numerica[124dab8567f4861e]::domains::float::complex::Complex<f64> as symbolica[10e259bab675d243]::evaluate::backend::JITCompiledNumber>::jit_compile<unknown>
  360. 173.96 s gammaloop-nextest-integration> at <unknown source file>:<unknown line>
  361. 173.96 s gammaloop-nextest-integration> 15: <gammalooprs[917cbd3df9e68f8f]::integrands::process::evaluators::GenericEvaluator>::activate_symjit<unknown>
  362. 173.96 s gammaloop-nextest-integration> at <unknown source file>:<unknown line>
  363. 173.96 s gammaloop-nextest-integration> 16: <gammalooprs[917cbd3df9e68f8f]::integrands::process::amplitude::AmplitudeIntegrand>::prepare_runtime_backends_after_generation_with_compile_times<unknown>
  364. 173.96 s gammaloop-nextest-integration> at <unknown source file>:<unknown line>
  365. 173.96 s gammaloop-nextest-integration> 17: <gammalooprs[917cbd3df9e68f8f]::processes::amplitude::Amplitude>::build_integrand<unknown>
  366. 173.96 s gammaloop-nextest-integration> at <unknown source file>:<unknown line>
  367. 173.96 s gammaloop-nextest-integration> 18: <gammalooprs[917cbd3df9e68f8f]::processes::process::Process>::generate_integrands<unknown>
  368. 173.96 s gammaloop-nextest-integration> at <unknown source file>:<unknown line>
  369. 173.96 s gammaloop-nextest-integration> 19: <gammaloop_api[9ebf6628f97aeb57]::state::State>::generate_integrand<unknown>
  370. 173.96 s gammaloop-nextest-integration> at <unknown source file>:<unknown line>
  371. 173.96 s gammaloop-nextest-integration> 20: <gammaloop_api[9ebf6628f97aeb57]::commands::generate::Generate>::run::<&std[bcb96dfbba0ab899]::path::PathBuf><unknown>
  372. 173.96 s gammaloop-nextest-integration> at <unknown source file>:<unknown line>
  373. 173.96 s gammaloop-nextest-integration> 21: <gammaloop_api[9ebf6628f97aeb57]::commands::Commands>::run<unknown>
  374. 173.96 s gammaloop-nextest-integration> at <unknown source file>:<unknown line>
  375. 173.96 s gammaloop-nextest-integration> 22: <gammaloop_api[9ebf6628f97aeb57]::session::CliSession>::execute_prepared<unknown>
  376. 173.96 s gammaloop-nextest-integration> at <unknown source file>:<unknown line>
  377. 173.96 s gammaloop-nextest-integration> 23: <gammaloop_api[9ebf6628f97aeb57]::session::CliSession>::execute_command<unknown>
  378. 173.96 s gammaloop-nextest-integration> at <unknown source file>:<unknown line>
  379. 173.96 s gammaloop-nextest-integration> 24: <gammaloop_integration_tests[191607b70c61cd5a]::CLIState>::run_command<unknown>
  380. 173.96 s gammaloop-nextest-integration> at <unknown source file>:<unknown line>
  381. 173.96 s gammaloop-nextest-integration> 25: test_runs[9b7e2dc2dc4f29b0]::aa_aa::generate_aa_aa_helicity_family<unknown>
  382. 173.96 s gammaloop-nextest-integration> at <unknown source file>:<unknown line>
  383. 173.96 s gammaloop-nextest-integration> 26: <test_runs[9b7e2dc2dc4f29b0]::aa_aa::important::aa_aa_local_inspect_backend_consistency::{closure#0} as core[940e698046960fd5]::ops::function::FnOnce<()>>::call_once<unknown>
  384. 173.96 s gammaloop-nextest-integration> at <unknown source file>:<unknown line>
  385. 173.96 s gammaloop-nextest-integration> 27: serial_test[cd99724524a2f1c0]::serial_code_lock::local_serial_core_with_return::<(), eyre[cb2fd339c0c40fca]::Report><unknown>
  386. 173.96 s gammaloop-nextest-integration> at <unknown source file>:<unknown line>
  387. 173.96 s gammaloop-nextest-integration> 28: <test_runs[9b7e2dc2dc4f29b0]::aa_aa::important::aa_aa_local_inspect_backend_consistency::{closure#0} as core[940e698046960fd5]::ops::function::FnOnce<()>>::call_once<unknown>
  388. 173.96 s gammaloop-nextest-integration> at <unknown source file>:<unknown line>
  389. 173.96 s gammaloop-nextest-integration> 29: test[75d6903177b1d7e9]::__rust_begin_short_backtrace::<core[940e698046960fd5]::result::Result<(), alloc[2ea6bcb46fca0c42]::string::String>, fn() -> core[940e698046960fd5]::result::Result<(), alloc[2ea6bcb46fca0c42]::string::String>><unknown>
  390. 173.96 s gammaloop-nextest-integration> at <unknown source file>:<unknown line>
  391. 173.96 s gammaloop-nextest-integration> 30: test[75d6903177b1d7e9]::run_test::{closure#0}<unknown>
  392. 173.96 s gammaloop-nextest-integration> at <unknown source file>:<unknown line>
  393. 173.96 s gammaloop-nextest-integration> 31: std[bcb96dfbba0ab899]::sys::backtrace::__rust_begin_short_backtrace::<test[75d6903177b1d7e9]::run_test::{closure#1}, ()><unknown>
  394. 173.96 s gammaloop-nextest-integration> at <unknown source file>:<unknown line>
  395. 173.96 s gammaloop-nextest-integration> 32: <std[bcb96dfbba0ab899]::thread::lifecycle::spawn_unchecked<test[75d6903177b1d7e9]::run_test::{closure#1}, ()>::{closure#1} as core[940e698046960fd5]::ops::function::FnOnce<()>>::call_once::{shim:vtable#0}<unknown>
  396. 173.96 s gammaloop-nextest-integration> at <unknown source file>:<unknown line>
  397. 173.96 s gammaloop-nextest-integration> 33: <std[bcb96dfbba0ab899]::sys::thread::unix::Thread>::new::thread_start<unknown>
  398. 173.96 s gammaloop-nextest-integration> at <unknown source file>:<unknown line>
  399. 173.96 s gammaloop-nextest-integration> 34: start_thread<unknown>
  400. 173.96 s gammaloop-nextest-integration> at <unknown source file>:<unknown line>
  401. 173.96 s gammaloop-nextest-integration> 35: __clone3<unknown>
  402. 173.96 s gammaloop-nextest-integration> at <unknown source file>:<unknown line>
  403. 173.96 s gammaloop-nextest-integration>
  404. 173.96 s gammaloop-nextest-integration> Run with COLORBT_SHOW_HIDDEN=1 environment variable to disable frame filtering.
  405. 173.96 s gammaloop-nextest-integration> Run with RUST_BACKTRACE=full to include source snippets.
  406. 173.96 s gammaloop-nextest-integration> Warning: SpanTrace capture is Unsupported.
  407. 173.96 s gammaloop-nextest-integration> Ensure that you've setup a tracing-error ErrorLayer and the semver versions are compatible
  408. 173.96 s gammaloop-nextest-integration>
  409. 222.29 s gammaloop-nextest-integration> FAIL [ 3.760s] (158/170) gammaloop-integration-tests::uv thermal_sunrise_uv
  410. 222.29 s gammaloop-nextest-integration> stdout ---
  411. 222.29 s gammaloop-nextest-integration>
  412. 222.29 s gammaloop-nextest-integration> running 1 test
  413. 222.29 s gammaloop-nextest-integration> test thermal_sunrise_uv ... FAILED
  414. 222.29 s gammaloop-nextest-integration>
  415. 222.29 s gammaloop-nextest-integration> failures:
  416. 222.29 s gammaloop-nextest-integration>
  417. 222.29 s gammaloop-nextest-integration> failures:
  418. 222.29 s gammaloop-nextest-integration> thermal_sunrise_uv
  419. 222.29 s gammaloop-nextest-integration>
  420. 222.29 s gammaloop-nextest-integration> test result: FAILED. 0 passed; 1 failed; 0 ignored; 0 measured; 31 filtered out; finished in 3.74s
  421. 222.29 s gammaloop-nextest-integration>
  422. 222.29 s gammaloop-nextest-integration> stderr ---
  423. 222.29 s gammaloop-nextest-integration> [2026-09-18 17:11:03.336] @gammaloop_api::se... INFO : Running command run generate
  424. 222.29 s gammaloop-nextest-integration> [2026-09-18 17:11:03.336] @gammaloop_api::se... INFO : Starting command block generate
  425. 222.29 s gammaloop-nextest-integration> [2026-09-18 17:11:03.337] @gammaloop_api::se... INFO : Running command import model sm-default.json
  426. 222.29 s gammaloop-nextest-integration> [2026-09-18 17:11:03.337] @import::model INFO : Loading built-in JSON model sm-default
  427. 222.29 s gammaloop-nextest-integration> [2026-09-18 17:11:03.386] @gammalooprs::model INFO : The following 15 external parameters were forced to zero by the restriction card:
  428. 222.29 s gammaloop-nextest-integration> lamWS, AWS, rhoWS, etaWS, ymc, yme, ymm, MC, Me, MM, WTau, muQ, muLe, muLmu, muLtau
  429. 222.29 s gammaloop-nextest-integration> [2026-09-18 17:11:03.386] @gammalooprs::model INFO : The following 34 vertex rules were removed by the restriction card:
  430. 222.29 s gammaloop-nextest-integration> V_82 -> (c~, d, G+) | V_83 -> (t~, d, G+) | V_84 -> (c~, s, G+) | V_85 -> (t~, s, G+) | V_86 -> (u~, b, G+) | V_87 -> (c~, b, G+) | V_90 -> (c~, d, W+) | V_91 -> (t~, d, W+) | V_92 -> (u~, s, W+) | V_94 -> (t~, s, W+) | V_95 -> (u~, b, W+) | V_96 -> (c~, b, W+) | V_101 -> (e+, e-, G0) | V_102 -> (mu+, mu-, G0) | V_104 -> (e+, e-, H) | V_105 -> (mu+, mu-, H) | V_110 -> (ve~, e-, G+) | V_111 -> (vm~, mu-, G+) | V_116 -> (b~, u, G-) | V_117 -> (d~, c, G-) | V_118 -> (s~, c, G-) | V_119 -> (b~, c, G-) | V_120 -> (d~, t, G-) | V_121 -> (s~, t, G-) | V_124 -> (s~, u, W-) | V_125 -> (b~, u, W-) | V_126 -> (d~, c, W-) | V_128 -> (b~, c, W-) | V_129 -> (d~, t, W-) | V_130 -> (s~, t, W-) | V_138 -> (c~, c, G0) | V_140 -> (c~, c, H) | V_145 -> (e+, ve, G-) | V_146 -> (mu+, vm, G-)
  431. 222.29 s gammaloop-nextest-integration> [2026-09-18 17:11:03.386] @gammalooprs::model INFO : The following 36 couplings were removed by the restriction card:
  432. 222.29 s gammaloop-nextest-integration> GC_13, GC_14, GC_16, GC_17, GC_18, GC_19, GC_20, GC_22, GC_23, GC_24, GC_25, GC_26, GC_28, GC_29, GC_42, GC_43, GC_44, GC_46, GC_47, GC_48, GC_84, GC_85, GC_86, GC_87, GC_88, GC_89, GC_90, GC_91, GC_92, GC_93, GC_101, GC_102, GC_103, GC_105, GC_106, GC_107
  433. 222.29 s gammaloop-nextest-integration> [2026-09-18 17:11:03.387] @gammaloop_api::se... INFO : Running command remove processes
  434. 222.29 s gammaloop-nextest-integration> [2026-09-18 17:11:03.387] @gammaloop_api::se... INFO : Running command generate amp {} > {} [{2}] | g u
  435. 222.29 s gammaloop-nextest-integration> --numerator-grouping group_identical_graphs_up_to_scalar_rescaling
  436. 222.29 s gammaloop-nextest-integration> --max-n-bridges 0
  437. 222.29 s gammaloop-nextest-integration> --number-of-factorized-loop-subtopologies 1 1
  438. 222.29 s gammaloop-nextest-integration> --number-of-anticommutating-loops 1 1
  439. 222.29 s gammaloop-nextest-integration> [...]
  440. 222.29 s gammaloop-nextest-integration> [2026-09-18 17:11:03.389] @feyngen::diagram_... INFO : 0s | Δ=0s | Starting Feynman graph generation with Symbolica...
  441. 222.29 s gammaloop-nextest-integration> [2026-09-18 17:11:03.389] @feyngen::diagram_... INFO : 0s | Δ=0s | Number of graphs resulting from Symbolica generation: 3
  442. 222.29 s gammaloop-nextest-integration> [2026-09-18 17:11:03.389] @feyngen::diagram_... INFO : 0s | Δ=0s | Number of graphs retained after removal of vetoed topologies: 2
  443. 222.29 s gammaloop-nextest-integration> [2026-09-18 17:11:03.390] @feyngen::diagram_... INFO : 0s | Δ=0s | Number of graphs after vertex info assignment: 2
  444. 222.29 s gammaloop-nextest-integration> [2026-09-18 17:11:03.390] @feyngen::diagram_... INFO : 0s | Δ=0s | Number of graphs after all complete graphs filters are applied: 2
  445. 222.29 s gammaloop-nextest-integration> [2026-09-18 17:11:03.390] @feyngen::diagram_... INFO : 0s | Δ=0s | Number of graphs after closed anticommutating chains analysis: 1
  446. 222.29 s gammaloop-nextest-integration> [2026-09-18 17:11:03.390] @feyngen::diagram_... INFO : 0s | Δ=0s | Number of graphs after symmetrization of external states: 1
  447. 222.29 s gammaloop-nextest-integration> [2026-09-18 17:11:03.390] @feyngen::diagram_... INFO : 0s | Δ=0s | Number of graphs after canonization of vertices, edges and flows (graph labels assigned here): 1
  448. 222.29 s gammaloop-nextest-integration> [2026-09-18 17:11:03.413] @feyngen::diagram_... INFO : 0s | Δ=0s | Number of graphs after numerator-aware grouping with strategy 'up to a scalar rescaling': 1 (1 isomorphically unique graph, 0 color zero, 0 lorentz zero, 0 grouped and 0 cancellation)
  449. 222.29 s gammaloop-nextest-integration> [2026-09-18 17:11:03.413] @feyngen::diagram_... INFO : ( Sum of the symmetry factors from each graph generated = -1/2 )
  450. 222.29 s gammaloop-nextest-integration> [2026-09-18 17:11:03.413] @commands::generate INFO : Generated amplitude 1 graphs.
  451. 222.29 s gammaloop-nextest-integration> [2026-09-18 17:11:03.414] @commands::generate INFO : Only diagram generation was requested, skipping integrand generation. You can generate integrands later using the 'generate existing <options>' command.
  452. 222.29 s gammaloop-nextest-integration> [2026-09-18 17:11:03.414] @gammaloop_api::se... INFO : Running command generate
  453. 222.29 s gammaloop-nextest-integration> The application panicked (crashed).
  454. 222.29 s gammaloop-nextest-integration> Message: label _func_power_ not found
  455. 222.29 s gammaloop-nextest-integration> Location: /nix/store/n9w914kh1cm59xx3spcs831cdyb56m32-vendor-cargo-deps/c19b7c6f923b580ac259164a89f2577984ad5ab09ee9d583b888f934adbbe8d0/symjit-2.25.6/src/symjit/assembler.rs:77
  456. 222.29 s gammaloop-nextest-integration>
  457. 222.29 s gammaloop-nextest-integration> ━━━━━━━━━━━━━━━━━━━━━━━━━━━━━━━━━━ BACKTRACE ━━━━━━━━━━━━━━━━━━━━━━━━━━━━━━━━━━━
  458. 222.29 s gammaloop-nextest-integration> 1: <color_eyre[51793ea62743adbd]::config::PanicHook>::panic_report<unknown>
  459. 222.29 s gammaloop-nextest-integration> at <unknown source file>:<unknown line>
  460. 222.29 s gammaloop-nextest-integration> 2: <color_eyre[51793ea62743adbd]::config::PanicHook>::into_panic_hook::{closure#0}<unknown>
  461. 222.29 s gammaloop-nextest-integration> at <unknown source file>:<unknown line>
  462. 222.29 s gammaloop-nextest-integration> 3: std[bcb96dfbba0ab899]::panicking::panic_with_hook<unknown>
  463. 222.29 s gammaloop-nextest-integration> at <unknown source file>:<unknown line>
  464. 222.29 s gammaloop-nextest-integration> 4: std[bcb96dfbba0ab899]::panicking::panic_handler::{closure#0}<unknown>
  465. 222.29 s gammaloop-nextest-integration> at <unknown source file>:<unknown line>
  466. 222.29 s gammaloop-nextest-integration> 5: std[bcb96dfbba0ab899]::sys::backtrace::__rust_end_short_backtrace::<std[bcb96dfbba0ab899]::panicking::panic_handler::{closure#0}, !><unknown>
  467. 222.29 s gammaloop-nextest-integration> at <unknown source file>:<unknown line>
  468. 222.29 s gammaloop-nextest-integration> 6: __rustc[6c289b9f9c454d21]::rust_begin_unwind<unknown>
  469. 222.29 s gammaloop-nextest-integration> at <unknown source file>:<unknown line>
  470. 222.29 s gammaloop-nextest-integration> 7: core[940e698046960fd5]::panicking::panic_fmt<unknown>
  471. 222.29 s gammaloop-nextest-integration> at <unknown source file>:<unknown line>
  472. 222.29 s gammaloop-nextest-integration> 8: <symjit[e408de789c333cd]::symjit::assembler::Assembler>::apply_jumps<unknown>
  473. 222.29 s gammaloop-nextest-integration> at <unknown source file>:<unknown line>
  474. 222.29 s gammaloop-nextest-integration> 9: <symjit[e408de789c333cd]::symjit::builder::Builder>::compile_from_mir::<symjit[e408de789c333cd]::symjit::amd::complex::AmdComplexGenerator><unknown>
  475. 222.29 s gammaloop-nextest-integration> at <unknown source file>:<unknown line>
  476. 222.29 s gammaloop-nextest-integration> 10: <symjit[e408de789c333cd]::symjit::runnable::Application>::compile_ty<unknown>
  477. 222.29 s gammaloop-nextest-integration> at <unknown source file>:<unknown line>
  478. 222.29 s gammaloop-nextest-integration> 11: <symjit[e408de789c333cd]::symjit::runnable::Application>::with_mir<unknown>
  479. 222.29 s gammaloop-nextest-integration> at <unknown source file>:<unknown line>
  480. 222.29 s gammaloop-nextest-integration> 12: <symjit[e408de789c333cd]::symjit::composer::DirectTranslator as symjit[e408de789c333cd]::symjit::composer::Composer>::compile<unknown>
  481. 222.29 s gammaloop-nextest-integration> at <unknown source file>:<unknown line>
  482. 222.29 s gammaloop-nextest-integration> 13: <symjit[e408de789c333cd]::symjit::compiler::Translator as symjit[e408de789c333cd]::symjit::composer::Composer>::compile<unknown>
  483. 222.29 s gammaloop-nextest-integration> at <unknown source file>:<unknown line>
  484. 222.29 s gammaloop-nextest-integration> 14: <numerica[124dab8567f4861e]::domains::float::complex::Complex<f64> as symbolica[10e259bab675d243]::evaluate::backend::JITCompiledNumber>::jit_compile<unknown>
  485. 222.30 s gammaloop-nextest-integration> at <unknown source file>:<unknown line>
  486. 222.30 s gammaloop-nextest-integration> 15: <gammalooprs[917cbd3df9e68f8f]::integrands::process::evaluators::GenericEvaluator>::activate_symjit<unknown>
  487. 222.30 s gammaloop-nextest-integration> at <unknown source file>:<unknown line>
  488. 222.30 s gammaloop-nextest-integration> 16: <gammalooprs[917cbd3df9e68f8f]::integrands::process::amplitude::AmplitudeIntegrand>::prepare_runtime_backends_after_generation_with_compile_times<unknown>
  489. 222.30 s gammaloop-nextest-integration> at <unknown source file>:<unknown line>
  490. 222.30 s gammaloop-nextest-integration> 17: <gammalooprs[917cbd3df9e68f8f]::processes::amplitude::Amplitude>::build_integrand<unknown>
  491. 222.30 s gammaloop-nextest-integration> at <unknown source file>:<unknown line>
  492. 222.30 s gammaloop-nextest-integration> 18: <gammalooprs[917cbd3df9e68f8f]::processes::process::Process>::generate_integrands<unknown>
  493. 222.30 s gammaloop-nextest-integration> at <unknown source file>:<unknown line>
  494. 222.30 s gammaloop-nextest-integration> 19: <gammalooprs[917cbd3df9e68f8f]::processes::ProcessList>::generate_integrands<unknown>
  495. 222.30 s gammaloop-nextest-integration> at <unknown source file>:<unknown line>
  496. 222.30 s gammaloop-nextest-integration> 20: <gammaloop_api[9ebf6628f97aeb57]::state::State>::generate_integrands<unknown>
  497. 222.30 s gammaloop-nextest-integration> at <unknown source file>:<unknown line>
  498. 222.30 s gammaloop-nextest-integration> 21: <gammaloop_api[9ebf6628f97aeb57]::commands::generate::Generate>::run::<&std[bcb96dfbba0ab899]::path::PathBuf><unknown>
  499. 222.30 s gammaloop-nextest-integration> at <unknown source file>:<unknown line>
  500. 222.30 s gammaloop-nextest-integration> 22: <gammaloop_api[9ebf6628f97aeb57]::commands::Commands>::run<unknown>
  501. 222.30 s gammaloop-nextest-integration> at <unknown source file>:<unknown line>
  502. 222.30 s gammaloop-nextest-integration> 23: <gammaloop_api[9ebf6628f97aeb57]::session::CliSession>::execute_prepared<unknown>
  503. 222.30 s gammaloop-nextest-integration> at <unknown source file>:<unknown line>
  504. 222.30 s gammaloop-nextest-integration> 24: <gammaloop_api[9ebf6628f97aeb57]::session::CliSession>::execute_prepared_commands<unknown>
  505. 222.30 s gammaloop-nextest-integration> at <unknown source file>:<unknown line>
  506. 222.30 s gammaloop-nextest-integration> 25: <gammaloop_api[9ebf6628f97aeb57]::session::CliSession>::execute_prepared<unknown>
  507. 222.30 s gammaloop-nextest-integration> at <unknown source file>:<unknown line>
  508. 222.30 s gammaloop-nextest-integration> 26: <gammaloop_api[9ebf6628f97aeb57]::session::CliSession>::execute_command<unknown>
  509. 222.30 s gammaloop-nextest-integration> at <unknown source file>:<unknown line>
  510. 222.30 s gammaloop-nextest-integration> 27: <gammaloop_integration_tests[191607b70c61cd5a]::CLIState>::run_command<unknown>
  511. 222.30 s gammaloop-nextest-integration> at <unknown source file>:<unknown line>
  512. 222.30 s gammaloop-nextest-integration> 28: uv[3c7454ef256d6487]::run_single_integrated_uv_case<unknown>
  513. 222.30 s gammaloop-nextest-integration> at <unknown source file>:<unknown line>
  514. 222.30 s gammaloop-nextest-integration> 29: <uv[3c7454ef256d6487]::thermal_sunrise_uv::{closure#0} as core[940e698046960fd5]::ops::function::FnOnce<()>>::call_once<unknown>
  515. 222.30 s gammaloop-nextest-integration> at <unknown source file>:<unknown line>
  516. 222.30 s gammaloop-nextest-integration> 30: test[75d6903177b1d7e9]::__rust_begin_short_backtrace::<core[940e698046960fd5]::result::Result<(), alloc[2ea6bcb46fca0c42]::string::String>, fn() -> core[940e698046960fd5]::result::Result<(), alloc[2ea6bcb46fca0c42]::string::String>><unknown>
  517. 222.30 s gammaloop-nextest-integration> at <unknown source file>:<unknown line>
  518. 222.30 s gammaloop-nextest-integration> 31: test[75d6903177b1d7e9]::run_test::{closure#0}<unknown>
  519. 222.30 s gammaloop-nextest-integration> at <unknown source file>:<unknown line>
  520. 222.30 s gammaloop-nextest-integration> 32: std[bcb96dfbba0ab899]::sys::backtrace::__rust_begin_short_backtrace::<test[75d6903177b1d7e9]::run_test::{closure#1}, ()><unknown>
  521. 222.30 s gammaloop-nextest-integration> at <unknown source file>:<unknown line>
  522. 222.30 s gammaloop-nextest-integration> 33: <std[bcb96dfbba0ab899]::thread::lifecycle::spawn_unchecked<test[75d6903177b1d7e9]::run_test::{closure#1}, ()>::{closure#1} as core[940e698046960fd5]::ops::function::FnOnce<()>>::call_once::{shim:vtable#0}<unknown>
  523. 222.30 s gammaloop-nextest-integration> at <unknown source file>:<unknown line>
  524. 222.30 s gammaloop-nextest-integration> 34: <std[bcb96dfbba0ab899]::sys::thread::unix::Thread>::new::thread_start<unknown>
  525. 222.30 s gammaloop-nextest-integration> at <unknown source file>:<unknown line>
  526. 222.30 s gammaloop-nextest-integration> 35: start_thread<unknown>
  527. 222.30 s gammaloop-nextest-integration> at <unknown source file>:<unknown line>
  528. 222.30 s gammaloop-nextest-integration> 36: __clone3<unknown>
  529. 222.30 s gammaloop-nextest-integration> at <unknown source file>:<unknown line>
  530. 222.30 s gammaloop-nextest-integration>
  531. 222.30 s gammaloop-nextest-integration> Run with COLORBT_SHOW_HIDDEN=1 environment variable to disable frame filtering.
  532. 222.30 s gammaloop-nextest-integration> Run with RUST_BACKTRACE=full to include source snippets.
  533. 222.30 s gammaloop-nextest-integration> Warning: SpanTrace capture is Unsupported.
  534. 222.30 s gammaloop-nextest-integration> Ensure that you've setup a tracing-error ErrorLayer and the semver versions are compatible
  535. 222.30 s gammaloop-nextest-integration>
  536. 289.45 s gammaloop-nextest-integration> ------------
  537. 289.45 s gammaloop-nextest-integration> Summary [ 220.826s] 170 tests run: 168 passed, 2 failed, 209 skipped
  538. 289.45 s gammaloop-nextest-integration> FAIL [ 2.807s] ( 55/170) gammaloop-integration-tests::test_runs aa_aa::important::aa_aa_local_inspect_backend_consistency
  539. 289.45 s gammaloop-nextest-integration> stdout ---
  540. 289.45 s gammaloop-nextest-integration>
  541. 289.45 s gammaloop-nextest-integration> running 1 test
  542. 289.45 s gammaloop-nextest-integration> test aa_aa::important::aa_aa_local_inspect_backend_consistency ... FAILED
  543. 289.45 s gammaloop-nextest-integration>
  544. 289.45 s gammaloop-nextest-integration> failures:
  545. 289.45 s gammaloop-nextest-integration>
  546. 289.45 s gammaloop-nextest-integration> failures:
  547. 289.45 s gammaloop-nextest-integration> aa_aa::important::aa_aa_local_inspect_backend_consistency
  548. 289.45 s gammaloop-nextest-integration>
  549. 289.45 s gammaloop-nextest-integration> test result: FAILED. 0 passed; 1 failed; 0 ignored; 0 measured; 274 filtered out; finished in 2.79s
  550. 289.45 s gammaloop-nextest-integration>
  551. 289.45 s gammaloop-nextest-integration> stderr ---
  552. 289.45 s gammaloop-nextest-integration> [2026-09-18 17:10:15.861] @gammaloop_api::se... INFO : Running command import model sm-default.json
  553. 289.45 s gammaloop-nextest-integration> [2026-09-18 17:10:15.861] @import::model INFO : Loading built-in JSON model sm-default
  554. 289.45 s gammaloop-nextest-integration> [2026-09-18 17:10:15.883] @gammalooprs::model INFO : The following 15 external parameters were forced to zero by the restriction card:
  555. 289.45 s gammaloop-nextest-integration> lamWS, AWS, rhoWS, etaWS, ymc, yme, ymm, MC, Me, MM, WTau, muQ, muLe, muLmu, muLtau
  556. 289.45 s gammaloop-nextest-integration> [2026-09-18 17:10:15.883] @gammalooprs::model INFO : The following 34 vertex rules were removed by the restriction card:
  557. 289.45 s gammaloop-nextest-integration> V_82 -> (c~, d, G+) | V_83 -> (t~, d, G+) | V_84 -> (c~, s, G+) | V_85 -> (t~, s, G+) | V_86 -> (u~, b, G+) | V_87 -> (c~, b, G+) | V_90 -> (c~, d, W+) | V_91 -> (t~, d, W+) | V_92 -> (u~, s, W+) | V_94 -> (t~, s, W+) | V_95 -> (u~, b, W+) | V_96 -> (c~, b, W+) | V_101 -> (e+, e-, G0) | V_102 -> (mu+, mu-, G0) | V_104 -> (e+, e-, H) | V_105 -> (mu+, mu-, H) | V_110 -> (ve~, e-, G+) | V_111 -> (vm~, mu-, G+) | V_116 -> (b~, u, G-) | V_117 -> (d~, c, G-) | V_118 -> (s~, c, G-) | V_119 -> (b~, c, G-) | V_120 -> (d~, t, G-) | V_121 -> (s~, t, G-) | V_124 -> (s~, u, W-) | V_125 -> (b~, u, W-) | V_126 -> (d~, c, W-) | V_128 -> (b~, c, W-) | V_129 -> (d~, t, W-) | V_130 -> (s~, t, W-) | V_138 -> (c~, c, G0) | V_140 -> (c~, c, H) | V_145 -> (e+, ve, G-) | V_146 -> (mu+, vm, G-)
  558. 289.45 s gammaloop-nextest-integration> [2026-09-18 17:10:15.883] @gammalooprs::model INFO : The following 36 couplings were removed by the restriction card:
  559. 289.45 s gammaloop-nextest-integration> GC_13, GC_14, GC_16, GC_17, GC_18, GC_19, GC_20, GC_22, GC_23, GC_24, GC_25, GC_26, GC_28, GC_29, GC_42, GC_43, GC_44, GC_46, GC_47, GC_48, GC_84, GC_85, GC_86, GC_87, GC_88, GC_89, GC_90, GC_91, GC_92, GC_93, GC_101, GC_102, GC_103, GC_105, GC_106, GC_107
  560. 289.45 s gammaloop-nextest-integration> [2026-09-18 17:10:15.884] @gammaloop_api::se... INFO : Running command run set_model_parameters
  561. 289.45 s gammaloop-nextest-integration> [2026-09-18 17:10:15.884] @gammaloop_api::se... INFO : Starting command block set_model_parameters
  562. 289.45 s gammaloop-nextest-integration> [2026-09-18 17:10:15.884] @gammaloop_api::se... INFO : Running command set model MT=173.0
  563. 289.45 s gammaloop-nextest-integration> [2026-09-18 17:10:15.888] @gammaloop_api::se... INFO : Running command set model WT=0.0
  564. 289.45 s gammaloop-nextest-integration> [2026-09-18 17:10:15.893] @gammaloop_api::se... INFO : Running command set model ymt=173.0
  565. 289.45 s gammaloop-nextest-integration> [2026-09-18 17:10:15.897] @gammaloop_api::se... INFO : Running command set model aS=0.118
  566. 289.45 s gammaloop-nextest-integration> [2026-09-18 17:10:15.902] @gammaloop_api::se... INFO : Running command set model aEWM1=137.036
  567. 289.45 s gammaloop-nextest-integration> [2026-09-18 17:10:15.906] @gammaloop_api::se... INFO : Running command set model Gf=1.166390e-05
  568. 289.45 s gammaloop-nextest-integration> [2026-09-18 17:10:15.911] @gammaloop_api::se... INFO : Running command set model MZ=91.188
  569. 289.45 s gammaloop-nextest-integration> [2026-09-18 17:10:15.917] @gammaloop_api::se... INFO : Running command set global string '
  570. 289.45 s gammaloop-nextest-integration> [global.generation.compile]
  571. 289.45 s gammaloop-nextest-integration> compilation_mode = "symjit"
  572. 289.45 s gammaloop-nextest-integration> optimization_level = "O0"
  573. 289.45 s gammaloop-nextest-integration> fast_math = false
  574. 289.45 s gammaloop-nextest-integration> [...]
  575. 289.45 s gammaloop-nextest-integration> [2026-09-18 17:10:15.918] @gammaloop_api::se... INFO : Running command import graphs ./examples/cli/aa_aa/1L/aa_aa_1L.dot -p aa_aa_all_helicities -i 1L_ppmm -o
  576. 289.45 s gammaloop-nextest-integration> [2026-09-18 17:10:15.918] @commands::import INFO : Loading graphs from '/build/source/examples/cli/aa_aa/1L/aa_aa_1L.dot'
  577. 289.45 s gammaloop-nextest-integration> [2026-09-18 17:10:15.930] @gammaloop_api::se... INFO : Running command generate existing -p aa_aa_all_helicities
  578. 289.45 s gammaloop-nextest-integration> The application panicked (crashed).
  579. 289.45 s gammaloop-nextest-integration> Message: label _func_power_ not found
  580. 289.45 s gammaloop-nextest-integration> Location: /nix/store/n9w914kh1cm59xx3spcs831cdyb56m32-vendor-cargo-deps/c19b7c6f923b580ac259164a89f2577984ad5ab09ee9d583b888f934adbbe8d0/symjit-2.25.6/src/symjit/assembler.rs:77
  581. 289.45 s gammaloop-nextest-integration>
  582. 289.45 s gammaloop-nextest-integration> ━━━━━━━━━━━━━━━━━━━━━━━━━━━━━━━━━━ BACKTRACE ━━━━━━━━━━━━━━━━━━━━━━━━━━━━━━━━━━━
  583. 289.45 s gammaloop-nextest-integration> 1: <color_eyre[51793ea62743adbd]::config::PanicHook>::panic_report<unknown>
  584. 289.45 s gammaloop-nextest-integration> at <unknown source file>:<unknown line>
  585. 289.45 s gammaloop-nextest-integration> 2: <color_eyre[51793ea62743adbd]::config::PanicHook>::into_panic_hook::{closure#0}<unknown>
  586. 289.45 s gammaloop-nextest-integration> at <unknown source file>:<unknown line>
  587. 289.45 s gammaloop-nextest-integration> 3: std[bcb96dfbba0ab899]::panicking::panic_with_hook<unknown>
  588. 289.45 s gammaloop-nextest-integration> at <unknown source file>:<unknown line>
  589. 289.45 s gammaloop-nextest-integration> 4: std[bcb96dfbba0ab899]::panicking::panic_handler::{closure#0}<unknown>
  590. 289.45 s gammaloop-nextest-integration> at <unknown source file>:<unknown line>
  591. 289.45 s gammaloop-nextest-integration> 5: std[bcb96dfbba0ab899]::sys::backtrace::__rust_end_short_backtrace::<std[bcb96dfbba0ab899]::panicking::panic_handler::{closure#0}, !><unknown>
  592. 289.45 s gammaloop-nextest-integration> at <unknown source file>:<unknown line>
  593. 289.45 s gammaloop-nextest-integration> 6: __rustc[6c289b9f9c454d21]::rust_begin_unwind<unknown>
  594. 289.45 s gammaloop-nextest-integration> at <unknown source file>:<unknown line>
  595. 289.45 s gammaloop-nextest-integration> 7: core[940e698046960fd5]::panicking::panic_fmt<unknown>
  596. 289.45 s gammaloop-nextest-integration> at <unknown source file>:<unknown line>
  597. 289.45 s gammaloop-nextest-integration> 8: <symjit[e408de789c333cd]::symjit::assembler::Assembler>::apply_jumps<unknown>
  598. 289.45 s gammaloop-nextest-integration> at <unknown source file>:<unknown line>
  599. 289.45 s gammaloop-nextest-integration> 9: <symjit[e408de789c333cd]::symjit::builder::Builder>::compile_from_mir::<symjit[e408de789c333cd]::symjit::amd::complex::AmdComplexGenerator><unknown>
  600. 289.45 s gammaloop-nextest-integration> at <unknown source file>:<unknown line>
  601. 289.45 s gammaloop-nextest-integration> 10: <symjit[e408de789c333cd]::symjit::runnable::Application>::compile_ty<unknown>
  602. 289.45 s gammaloop-nextest-integration> at <unknown source file>:<unknown line>
  603. 289.45 s gammaloop-nextest-integration> 11: <symjit[e408de789c333cd]::symjit::runnable::Application>::with_mir<unknown>
  604. 289.45 s gammaloop-nextest-integration> at <unknown source file>:<unknown line>
  605. 289.45 s gammaloop-nextest-integration> 12: <symjit[e408de789c333cd]::symjit::composer::DirectTranslator as symjit[e408de789c333cd]::symjit::composer::Composer>::compile<unknown>
  606. 289.45 s gammaloop-nextest-integration> at <unknown source file>:<unknown line>
  607. 289.45 s gammaloop-nextest-integration> 13: <symjit[e408de789c333cd]::symjit::compiler::Translator as symjit[e408de789c333cd]::symjit::composer::Composer>::compile<unknown>
  608. 289.45 s gammaloop-nextest-integration> at <unknown source file>:<unknown line>
  609. 289.45 s gammaloop-nextest-integration> 14: <numerica[124dab8567f4861e]::domains::float::complex::Complex<f64> as symbolica[10e259bab675d243]::evaluate::backend::JITCompiledNumber>::jit_compile<unknown>
  610. 289.45 s gammaloop-nextest-integration> at <unknown source file>:<unknown line>
  611. 289.45 s gammaloop-nextest-integration> 15: <gammalooprs[917cbd3df9e68f8f]::integrands::process::evaluators::GenericEvaluator>::activate_symjit<unknown>
  612. 289.45 s gammaloop-nextest-integration> at <unknown source file>:<unknown line>
  613. 289.45 s gammaloop-nextest-integration> 16: <gammalooprs[917cbd3df9e68f8f]::integrands::process::amplitude::AmplitudeIntegrand>::prepare_runtime_backends_after_generation_with_compile_times<unknown>
  614. 289.45 s gammaloop-nextest-integration> at <unknown source file>:<unknown line>
  615. 289.45 s gammaloop-nextest-integration> 17: <gammalooprs[917cbd3df9e68f8f]::processes::amplitude::Amplitude>::build_integrand<unknown>
  616. 289.45 s gammaloop-nextest-integration> at <unknown source file>:<unknown line>
  617. 289.45 s gammaloop-nextest-integration> 18: <gammalooprs[917cbd3df9e68f8f]::processes::process::Process>::generate_integrands<unknown>
  618. 289.45 s gammaloop-nextest-integration> at <unknown source file>:<unknown line>
  619. 289.45 s gammaloop-nextest-integration> 19: <gammaloop_api[9ebf6628f97aeb57]::state::State>::generate_integrand<unknown>
  620. 289.45 s gammaloop-nextest-integration> at <unknown source file>:<unknown line>
  621. 289.45 s gammaloop-nextest-integration> 20: <gammaloop_api[9ebf6628f97aeb57]::commands::generate::Generate>::run::<&std[bcb96dfbba0ab899]::path::PathBuf><unknown>
  622. 289.45 s gammaloop-nextest-integration> at <unknown source file>:<unknown line>
  623. 289.45 s gammaloop-nextest-integration> 21: <gammaloop_api[9ebf6628f97aeb57]::commands::Commands>::run<unknown>
  624. 289.45 s gammaloop-nextest-integration> at <unknown source file>:<unknown line>
  625. 289.45 s gammaloop-nextest-integration> 22: <gammaloop_api[9ebf6628f97aeb57]::session::CliSession>::execute_prepared<unknown>
  626. 289.45 s gammaloop-nextest-integration> at <unknown source file>:<unknown line>
  627. 289.45 s gammaloop-nextest-integration> 23: <gammaloop_api[9ebf6628f97aeb57]::session::CliSession>::execute_command<unknown>
  628. 289.45 s gammaloop-nextest-integration> at <unknown source file>:<unknown line>
  629. 289.45 s gammaloop-nextest-integration> 24: <gammaloop_integration_tests[191607b70c61cd5a]::CLIState>::run_command<unknown>
  630. 289.45 s gammaloop-nextest-integration> at <unknown source file>:<unknown line>
  631. 289.45 s gammaloop-nextest-integration> 25: test_runs[9b7e2dc2dc4f29b0]::aa_aa::generate_aa_aa_helicity_family<unknown>
  632. 289.45 s gammaloop-nextest-integration> at <unknown source file>:<unknown line>
  633. 289.45 s gammaloop-nextest-integration> 26: <test_runs[9b7e2dc2dc4f29b0]::aa_aa::important::aa_aa_local_inspect_backend_consistency::{closure#0} as core[940e698046960fd5]::ops::function::FnOnce<()>>::call_once<unknown>
  634. 289.45 s gammaloop-nextest-integration> at <unknown source file>:<unknown line>
  635. 289.45 s gammaloop-nextest-integration> 27: serial_test[cd99724524a2f1c0]::serial_code_lock::local_serial_core_with_return::<(), eyre[cb2fd339c0c40fca]::Report><unknown>
  636. 289.45 s gammaloop-nextest-integration> at <unknown source file>:<unknown line>
  637. 289.45 s gammaloop-nextest-integration> 28: <test_runs[9b7e2dc2dc4f29b0]::aa_aa::important::aa_aa_local_inspect_backend_consistency::{closure#0} as core[940e698046960fd5]::ops::function::FnOnce<()>>::call_once<unknown>
  638. 289.45 s gammaloop-nextest-integration> at <unknown source file>:<unknown line>
  639. 289.46 s gammaloop-nextest-integration> 29: test[75d6903177b1d7e9]::__rust_begin_short_backtrace::<core[940e698046960fd5]::result::Result<(), alloc[2ea6bcb46fca0c42]::string::String>, fn() -> core[940e698046960fd5]::result::Result<(), alloc[2ea6bcb46fca0c42]::string::String>><unknown>
  640. 289.46 s gammaloop-nextest-integration> at <unknown source file>:<unknown line>
  641. 289.46 s gammaloop-nextest-integration> 30: test[75d6903177b1d7e9]::run_test::{closure#0}<unknown>
  642. 289.46 s gammaloop-nextest-integration> at <unknown source file>:<unknown line>
  643. 289.46 s gammaloop-nextest-integration> 31: std[bcb96dfbba0ab899]::sys::backtrace::__rust_begin_short_backtrace::<test[75d6903177b1d7e9]::run_test::{closure#1}, ()><unknown>
  644. 289.46 s gammaloop-nextest-integration> at <unknown source file>:<unknown line>
  645. 289.46 s gammaloop-nextest-integration> 32: <std[bcb96dfbba0ab899]::thread::lifecycle::spawn_unchecked<test[75d6903177b1d7e9]::run_test::{closure#1}, ()>::{closure#1} as core[940e698046960fd5]::ops::function::FnOnce<()>>::call_once::{shim:vtable#0}<unknown>
  646. 289.46 s gammaloop-nextest-integration> at <unknown source file>:<unknown line>
  647. 289.46 s gammaloop-nextest-integration> 33: <std[bcb96dfbba0ab899]::sys::thread::unix::Thread>::new::thread_start<unknown>
  648. 289.46 s gammaloop-nextest-integration> at <unknown source file>:<unknown line>
  649. 289.46 s gammaloop-nextest-integration> 34: start_thread<unknown>
  650. 289.46 s gammaloop-nextest-integration> at <unknown source file>:<unknown line>
  651. 289.46 s gammaloop-nextest-integration> 35: __clone3<unknown>
  652. 289.46 s gammaloop-nextest-integration> at <unknown source file>:<unknown line>
  653. 289.46 s gammaloop-nextest-integration>
  654. 289.46 s gammaloop-nextest-integration> Run with COLORBT_SHOW_HIDDEN=1 environment variable to disable frame filtering.
  655. 289.46 s gammaloop-nextest-integration> Run with RUST_BACKTRACE=full to include source snippets.
  656. 289.46 s gammaloop-nextest-integration> Warning: SpanTrace capture is Unsupported.
  657. 289.46 s gammaloop-nextest-integration> Ensure that you've setup a tracing-error ErrorLayer and the semver versions are compatible
  658. 289.46 s gammaloop-nextest-integration>
  659. 289.46 s gammaloop-nextest-integration> FAIL [ 3.760s] (158/170) gammaloop-integration-tests::uv thermal_sunrise_uv
  660. 289.46 s gammaloop-nextest-integration> stdout ---
  661. 289.46 s gammaloop-nextest-integration>
  662. 289.46 s gammaloop-nextest-integration> running 1 test
  663. 289.46 s gammaloop-nextest-integration> test thermal_sunrise_uv ... FAILED
  664. 289.46 s gammaloop-nextest-integration>
  665. 289.46 s gammaloop-nextest-integration> failures:
  666. 289.46 s gammaloop-nextest-integration>
  667. 289.46 s gammaloop-nextest-integration> failures:
  668. 289.46 s gammaloop-nextest-integration> thermal_sunrise_uv
  669. 289.46 s gammaloop-nextest-integration>
  670. 289.46 s gammaloop-nextest-integration> test result: FAILED. 0 passed; 1 failed; 0 ignored; 0 measured; 31 filtered out; finished in 3.74s
  671. 289.46 s gammaloop-nextest-integration>
  672. 289.46 s gammaloop-nextest-integration> stderr ---
  673. 289.46 s gammaloop-nextest-integration> [2026-09-18 17:11:03.336] @gammaloop_api::se... INFO : Running command run generate
  674. 289.46 s gammaloop-nextest-integration> [2026-09-18 17:11:03.336] @gammaloop_api::se... INFO : Starting command block generate
  675. 289.46 s gammaloop-nextest-integration> [2026-09-18 17:11:03.337] @gammaloop_api::se... INFO : Running command import model sm-default.json
  676. 289.46 s gammaloop-nextest-integration> [2026-09-18 17:11:03.337] @import::model INFO : Loading built-in JSON model sm-default
  677. 289.46 s gammaloop-nextest-integration> [2026-09-18 17:11:03.386] @gammalooprs::model INFO : The following 15 external parameters were forced to zero by the restriction card:
  678. 289.46 s gammaloop-nextest-integration> lamWS, AWS, rhoWS, etaWS, ymc, yme, ymm, MC, Me, MM, WTau, muQ, muLe, muLmu, muLtau
  679. 289.46 s gammaloop-nextest-integration> [2026-09-18 17:11:03.386] @gammalooprs::model INFO : The following 34 vertex rules were removed by the restriction card:
  680. 289.46 s gammaloop-nextest-integration> V_82 -> (c~, d, G+) | V_83 -> (t~, d, G+) | V_84 -> (c~, s, G+) | V_85 -> (t~, s, G+) | V_86 -> (u~, b, G+) | V_87 -> (c~, b, G+) | V_90 -> (c~, d, W+) | V_91 -> (t~, d, W+) | V_92 -> (u~, s, W+) | V_94 -> (t~, s, W+) | V_95 -> (u~, b, W+) | V_96 -> (c~, b, W+) | V_101 -> (e+, e-, G0) | V_102 -> (mu+, mu-, G0) | V_104 -> (e+, e-, H) | V_105 -> (mu+, mu-, H) | V_110 -> (ve~, e-, G+) | V_111 -> (vm~, mu-, G+) | V_116 -> (b~, u, G-) | V_117 -> (d~, c, G-) | V_118 -> (s~, c, G-) | V_119 -> (b~, c, G-) | V_120 -> (d~, t, G-) | V_121 -> (s~, t, G-) | V_124 -> (s~, u, W-) | V_125 -> (b~, u, W-) | V_126 -> (d~, c, W-) | V_128 -> (b~, c, W-) | V_129 -> (d~, t, W-) | V_130 -> (s~, t, W-) | V_138 -> (c~, c, G0) | V_140 -> (c~, c, H) | V_145 -> (e+, ve, G-) | V_146 -> (mu+, vm, G-)
  681. 289.46 s gammaloop-nextest-integration> [2026-09-18 17:11:03.386] @gammalooprs::model INFO : The following 36 couplings were removed by the restriction card:
  682. 289.46 s gammaloop-nextest-integration> GC_13, GC_14, GC_16, GC_17, GC_18, GC_19, GC_20, GC_22, GC_23, GC_24, GC_25, GC_26, GC_28, GC_29, GC_42, GC_43, GC_44, GC_46, GC_47, GC_48, GC_84, GC_85, GC_86, GC_87, GC_88, GC_89, GC_90, GC_91, GC_92, GC_93, GC_101, GC_102, GC_103, GC_105, GC_106, GC_107
  683. 289.46 s gammaloop-nextest-integration> [2026-09-18 17:11:03.387] @gammaloop_api::se... INFO : Running command remove processes
  684. 289.46 s gammaloop-nextest-integration> [2026-09-18 17:11:03.387] @gammaloop_api::se... INFO : Running command generate amp {} > {} [{2}] | g u
  685. 289.46 s gammaloop-nextest-integration> --numerator-grouping group_identical_graphs_up_to_scalar_rescaling
  686. 289.46 s gammaloop-nextest-integration> --max-n-bridges 0
  687. 289.46 s gammaloop-nextest-integration> --number-of-factorized-loop-subtopologies 1 1
  688. 289.46 s gammaloop-nextest-integration> --number-of-anticommutating-loops 1 1
  689. 289.46 s gammaloop-nextest-integration> [...]
  690. 289.46 s gammaloop-nextest-integration> [2026-09-18 17:11:03.389] @feyngen::diagram_... INFO : 0s | Δ=0s | Starting Feynman graph generation with Symbolica...
  691. 289.46 s gammaloop-nextest-integration> [2026-09-18 17:11:03.389] @feyngen::diagram_... INFO : 0s | Δ=0s | Number of graphs resulting from Symbolica generation: 3
  692. 289.46 s gammaloop-nextest-integration> [2026-09-18 17:11:03.389] @feyngen::diagram_... INFO : 0s | Δ=0s | Number of graphs retained after removal of vetoed topologies: 2
  693. 289.46 s gammaloop-nextest-integration> [2026-09-18 17:11:03.390] @feyngen::diagram_... INFO : 0s | Δ=0s | Number of graphs after vertex info assignment: 2
  694. 289.46 s gammaloop-nextest-integration> [2026-09-18 17:11:03.390] @feyngen::diagram_... INFO : 0s | Δ=0s | Number of graphs after all complete graphs filters are applied: 2
  695. 289.46 s gammaloop-nextest-integration> [2026-09-18 17:11:03.390] @feyngen::diagram_... INFO : 0s | Δ=0s | Number of graphs after closed anticommutating chains analysis: 1
  696. 289.46 s gammaloop-nextest-integration> [2026-09-18 17:11:03.390] @feyngen::diagram_... INFO : 0s | Δ=0s | Number of graphs after symmetrization of external states: 1
  697. 289.46 s gammaloop-nextest-integration> [2026-09-18 17:11:03.390] @feyngen::diagram_... INFO : 0s | Δ=0s | Number of graphs after canonization of vertices, edges and flows (graph labels assigned here): 1
  698. 289.46 s gammaloop-nextest-integration> [2026-09-18 17:11:03.413] @feyngen::diagram_... INFO : 0s | Δ=0s | Number of graphs after numerator-aware grouping with strategy 'up to a scalar rescaling': 1 (1 isomorphically unique graph, 0 color zero, 0 lorentz zero, 0 grouped and 0 cancellation)
  699. 289.46 s gammaloop-nextest-integration> [2026-09-18 17:11:03.413] @feyngen::diagram_... INFO : ( Sum of the symmetry factors from each graph generated = -1/2 )
  700. 289.46 s gammaloop-nextest-integration> [2026-09-18 17:11:03.413] @commands::generate INFO : Generated amplitude 1 graphs.
  701. 289.46 s gammaloop-nextest-integration> [2026-09-18 17:11:03.414] @commands::generate INFO : Only diagram generation was requested, skipping integrand generation. You can generate integrands later using the 'generate existing <options>' command.
  702. 289.46 s gammaloop-nextest-integration> [2026-09-18 17:11:03.414] @gammaloop_api::se... INFO : Running command generate
  703. 289.46 s gammaloop-nextest-integration> The application panicked (crashed).
  704. 289.46 s gammaloop-nextest-integration> Message: label _func_power_ not found
  705. 289.46 s gammaloop-nextest-integration> Location: /nix/store/n9w914kh1cm59xx3spcs831cdyb56m32-vendor-cargo-deps/c19b7c6f923b580ac259164a89f2577984ad5ab09ee9d583b888f934adbbe8d0/symjit-2.25.6/src/symjit/assembler.rs:77
  706. 289.46 s gammaloop-nextest-integration>
  707. 289.46 s gammaloop-nextest-integration> ━━━━━━━━━━━━━━━━━━━━━━━━━━━━━━━━━━ BACKTRACE ━━━━━━━━━━━━━━━━━━━━━━━━━━━━━━━━━━━
  708. 289.46 s gammaloop-nextest-integration> 1: <color_eyre[51793ea62743adbd]::config::PanicHook>::panic_report<unknown>
  709. 289.46 s gammaloop-nextest-integration> at <unknown source file>:<unknown line>
  710. 289.46 s gammaloop-nextest-integration> 2: <color_eyre[51793ea62743adbd]::config::PanicHook>::into_panic_hook::{closure#0}<unknown>
  711. 289.46 s gammaloop-nextest-integration> at <unknown source file>:<unknown line>
  712. 289.46 s gammaloop-nextest-integration> 3: std[bcb96dfbba0ab899]::panicking::panic_with_hook<unknown>
  713. 289.46 s gammaloop-nextest-integration> at <unknown source file>:<unknown line>
  714. 289.46 s gammaloop-nextest-integration> 4: std[bcb96dfbba0ab899]::panicking::panic_handler::{closure#0}<unknown>
  715. 289.46 s gammaloop-nextest-integration> at <unknown source file>:<unknown line>
  716. 289.46 s gammaloop-nextest-integration> 5: std[bcb96dfbba0ab899]::sys::backtrace::__rust_end_short_backtrace::<std[bcb96dfbba0ab899]::panicking::panic_handler::{closure#0}, !><unknown>
  717. 289.46 s gammaloop-nextest-integration> at <unknown source file>:<unknown line>
  718. 289.46 s gammaloop-nextest-integration> 6: __rustc[6c289b9f9c454d21]::rust_begin_unwind<unknown>
  719. 289.46 s gammaloop-nextest-integration> at <unknown source file>:<unknown line>
  720. 289.46 s gammaloop-nextest-integration> 7: core[940e698046960fd5]::panicking::panic_fmt<unknown>
  721. 289.46 s gammaloop-nextest-integration> at <unknown source file>:<unknown line>
  722. 289.46 s gammaloop-nextest-integration> 8: <symjit[e408de789c333cd]::symjit::assembler::Assembler>::apply_jumps<unknown>
  723. 289.46 s gammaloop-nextest-integration> at <unknown source file>:<unknown line>
  724. 289.46 s gammaloop-nextest-integration> 9: <symjit[e408de789c333cd]::symjit::builder::Builder>::compile_from_mir::<symjit[e408de789c333cd]::symjit::amd::complex::AmdComplexGenerator><unknown>
  725. 289.46 s gammaloop-nextest-integration> at <unknown source file>:<unknown line>
  726. 289.46 s gammaloop-nextest-integration> 10: <symjit[e408de789c333cd]::symjit::runnable::Application>::compile_ty<unknown>
  727. 289.46 s gammaloop-nextest-integration> at <unknown source file>:<unknown line>
  728. 289.46 s gammaloop-nextest-integration> 11: <symjit[e408de789c333cd]::symjit::runnable::Application>::with_mir<unknown>
  729. 289.46 s gammaloop-nextest-integration> at <unknown source file>:<unknown line>
  730. 289.46 s gammaloop-nextest-integration> 12: <symjit[e408de789c333cd]::symjit::composer::DirectTranslator as symjit[e408de789c333cd]::symjit::composer::Composer>::compile<unknown>
  731. 289.46 s gammaloop-nextest-integration> at <unknown source file>:<unknown line>
  732. 289.46 s gammaloop-nextest-integration> 13: <symjit[e408de789c333cd]::symjit::compiler::Translator as symjit[e408de789c333cd]::symjit::composer::Composer>::compile<unknown>
  733. 289.46 s gammaloop-nextest-integration> at <unknown source file>:<unknown line>
  734. 289.46 s gammaloop-nextest-integration> 14: <numerica[124dab8567f4861e]::domains::float::complex::Complex<f64> as symbolica[10e259bab675d243]::evaluate::backend::JITCompiledNumber>::jit_compile<unknown>
  735. 289.46 s gammaloop-nextest-integration> at <unknown source file>:<unknown line>
  736. 289.46 s gammaloop-nextest-integration> 15: <gammalooprs[917cbd3df9e68f8f]::integrands::process::evaluators::GenericEvaluator>::activate_symjit<unknown>
  737. 289.46 s gammaloop-nextest-integration> at <unknown source file>:<unknown line>
  738. 289.46 s gammaloop-nextest-integration> 16: <gammalooprs[917cbd3df9e68f8f]::integrands::process::amplitude::AmplitudeIntegrand>::prepare_runtime_backends_after_generation_with_compile_times<unknown>
  739. 289.46 s gammaloop-nextest-integration> at <unknown source file>:<unknown line>
  740. 289.46 s gammaloop-nextest-integration> 17: <gammalooprs[917cbd3df9e68f8f]::processes::amplitude::Amplitude>::build_integrand<unknown>
  741. 289.46 s gammaloop-nextest-integration> at <unknown source file>:<unknown line>
  742. 289.46 s gammaloop-nextest-integration> 18: <gammalooprs[917cbd3df9e68f8f]::processes::process::Process>::generate_integrands<unknown>
  743. 289.46 s gammaloop-nextest-integration> at <unknown source file>:<unknown line>
  744. 289.46 s gammaloop-nextest-integration> 19: <gammalooprs[917cbd3df9e68f8f]::processes::ProcessList>::generate_integrands<unknown>
  745. 289.46 s gammaloop-nextest-integration> at <unknown source file>:<unknown line>
  746. 289.46 s gammaloop-nextest-integration> 20: <gammaloop_api[9ebf6628f97aeb57]::state::State>::generate_integrands<unknown>
  747. 289.46 s gammaloop-nextest-integration> at <unknown source file>:<unknown line>
  748. 289.46 s gammaloop-nextest-integration> 21: <gammaloop_api[9ebf6628f97aeb57]::commands::generate::Generate>::run::<&std[bcb96dfbba0ab899]::path::PathBuf><unknown>
  749. 289.46 s gammaloop-nextest-integration> at <unknown source file>:<unknown line>
  750. 289.46 s gammaloop-nextest-integration> 22: <gammaloop_api[9ebf6628f97aeb57]::commands::Commands>::run<unknown>
  751. 289.46 s gammaloop-nextest-integration> at <unknown source file>:<unknown line>
  752. 289.46 s gammaloop-nextest-integration> 23: <gammaloop_api[9ebf6628f97aeb57]::session::CliSession>::execute_prepared<unknown>
  753. 289.46 s gammaloop-nextest-integration> at <unknown source file>:<unknown line>
  754. 289.46 s gammaloop-nextest-integration> 24: <gammaloop_api[9ebf6628f97aeb57]::session::CliSession>::execute_prepared_commands<unknown>
  755. 289.46 s gammaloop-nextest-integration> at <unknown source file>:<unknown line>
  756. 289.46 s gammaloop-nextest-integration> 25: <gammaloop_api[9ebf6628f97aeb57]::session::CliSession>::execute_prepared<unknown>
  757. 289.46 s gammaloop-nextest-integration> at <unknown source file>:<unknown line>
  758. 289.46 s gammaloop-nextest-integration> 26: <gammaloop_api[9ebf6628f97aeb57]::session::CliSession>::execute_command<unknown>
  759. 289.46 s gammaloop-nextest-integration> at <unknown source file>:<unknown line>
  760. 289.46 s gammaloop-nextest-integration> 27: <gammaloop_integration_tests[191607b70c61cd5a]::CLIState>::run_command<unknown>
  761. 289.46 s gammaloop-nextest-integration> at <unknown source file>:<unknown line>
  762. 289.46 s gammaloop-nextest-integration> 28: uv[3c7454ef256d6487]::run_single_integrated_uv_case<unknown>
  763. 289.46 s gammaloop-nextest-integration> at <unknown source file>:<unknown line>
  764. 289.46 s gammaloop-nextest-integration> 29: <uv[3c7454ef256d6487]::thermal_sunrise_uv::{closure#0} as core[940e698046960fd5]::ops::function::FnOnce<()>>::call_once<unknown>
  765. 289.46 s gammaloop-nextest-integration> at <unknown source file>:<unknown line>
  766. 289.46 s gammaloop-nextest-integration> 30: test[75d6903177b1d7e9]::__rust_begin_short_backtrace::<core[940e698046960fd5]::result::Result<(), alloc[2ea6bcb46fca0c42]::string::String>, fn() -> core[940e698046960fd5]::result::Result<(), alloc[2ea6bcb46fca0c42]::string::String>><unknown>
  767. 289.46 s gammaloop-nextest-integration> at <unknown source file>:<unknown line>
  768. 289.46 s gammaloop-nextest-integration> 31: test[75d6903177b1d7e9]::run_test::{closure#0}<unknown>
  769. 289.46 s gammaloop-nextest-integration> at <unknown source file>:<unknown line>
  770. 289.46 s gammaloop-nextest-integration> 32: std[bcb96dfbba0ab899]::sys::backtrace::__rust_begin_short_backtrace::<test[75d6903177b1d7e9]::run_test::{closure#1}, ()><unknown>
  771. 289.46 s gammaloop-nextest-integration> at <unknown source file>:<unknown line>
  772. 289.46 s gammaloop-nextest-integration> 33: <std[bcb96dfbba0ab899]::thread::lifecycle::spawn_unchecked<test[75d6903177b1d7e9]::run_test::{closure#1}, ()>::{closure#1} as core[940e698046960fd5]::ops::function::FnOnce<()>>::call_once::{shim:vtable#0}<unknown>
  773. 289.46 s gammaloop-nextest-integration> at <unknown source file>:<unknown line>
  774. 289.46 s gammaloop-nextest-integration> 34: <std[bcb96dfbba0ab899]::sys::thread::unix::Thread>::new::thread_start<unknown>
  775. 289.46 s gammaloop-nextest-integration> at <unknown source file>:<unknown line>
  776. 289.46 s gammaloop-nextest-integration> 35: start_thread<unknown>
  777. 289.46 s gammaloop-nextest-integration> at <unknown source file>:<unknown line>
  778. 289.46 s gammaloop-nextest-integration> 36: __clone3<unknown>
  779. 289.46 s gammaloop-nextest-integration> at <unknown source file>:<unknown line>
  780. 289.46 s gammaloop-nextest-integration>
  781. 289.46 s gammaloop-nextest-integration> Run with COLORBT_SHOW_HIDDEN=1 environment variable to disable frame filtering.
  782. 289.46 s gammaloop-nextest-integration> Run with RUST_BACKTRACE=full to include source snippets.
  783. 289.46 s gammaloop-nextest-integration> Warning: SpanTrace capture is Unsupported.
  784. 289.46 s gammaloop-nextest-integration> Ensure that you've setup a tracing-error ErrorLayer and the semver versions are compatible
  785. 289.46 s gammaloop-nextest-integration>
  786. 289.73 s gammaloop-nextest-integration> error: test run failed
  787. 289.77 s gammaloop-nextest-integration>
  788. 289.77 s gammaloop-nextest-integration> ========== nextest test summary ==========
  789. 289.77 s gammaloop-nextest-integration> report: target/nextest/ci_gammaloop/junit.xml
  790. 289.77 s gammaloop-nextest-integration> tests: 170, failures: 2, errors: 0
  791. 289.77 s gammaloop-nextest-integration>
  792. 289.77 s gammaloop-nextest-integration> 1. gammaloop-integration-tests::test_runs::aa_aa::important::aa_aa_local_inspect_backend_consistency
  793. 289.77 s gammaloop-nextest-integration> failure: test failure with exit code 101
  794. 289.77 s gammaloop-nextest-integration> system-out
  795. 289.77 s gammaloop-nextest-integration> running 1 test
  796. 289.77 s gammaloop-nextest-integration> test aa_aa::important::aa_aa_local_inspect_backend_consistency ... FAILED
  797. 289.77 s gammaloop-nextest-integration>
  798. 289.77 s gammaloop-nextest-integration> failures:
  799. 289.77 s gammaloop-nextest-integration>
  800. 289.77 s gammaloop-nextest-integration> failures:
  801. 289.77 s gammaloop-nextest-integration> aa_aa::important::aa_aa_local_inspect_backend_consistency
  802. 289.77 s gammaloop-nextest-integration>
  803. 289.77 s gammaloop-nextest-integration> test result: FAILED. 0 passed; 1 failed; 0 ignored; 0 measured; 274 filtered out; finished in 2.79s
  804. 289.77 s gammaloop-nextest-integration> system-err
  805. 289.77 s gammaloop-nextest-integration> [2026-09-18 17:10:15.861] @gammaloop_api::se... INFO : Running command import model sm-default.json
  806. 289.77 s gammaloop-nextest-integration> [2026-09-18 17:10:15.861] @import::model INFO : Loading built-in JSON model sm-default
  807. 289.77 s gammaloop-nextest-integration> [2026-09-18 17:10:15.883] @gammalooprs::model INFO : The following 15 external parameters were forced to zero by the restriction card:
  808. 289.77 s gammaloop-nextest-integration> lamWS, AWS, rhoWS, etaWS, ymc, yme, ymm, MC, Me, MM, WTau, muQ, muLe, muLmu, muLtau
  809. 289.77 s gammaloop-nextest-integration> [2026-09-18 17:10:15.883] @gammalooprs::model INFO : The following 34 vertex rules were removed by the restriction card:
  810. 289.77 s gammaloop-nextest-integration> V_82 -> (c~, d, G+) | V_83 -> (t~, d, G+) | V_84 -> (c~, s, G+) | V_85 -> (t~, s, G+) | V_86 -> (u~, b, G+) | V_87 -> (c~, b, G+) | V_90 -> (c~, d, W+) | V_91 -> (t~, d, W+) | V_92 -> (u~, s, W+) | V_94 -> (t~, s, W+) | V_95 -> (u~, b, W+) | V_96 -> (c~, b, W+) | V_101 -> (e+, e-, G0) | V_102 -> (mu+, mu-, G0) | V_104 -> (e+, e-, H) | V_105 -> (mu+, mu-, H) | V_110 -> (ve~, e-, G+) | V_111 -> (vm~, mu-, G+) | V_116 -> (b~, u, G-) | V_117 -> (d~, c, G-) | V_118 -> (s~, c, G-) | V_119 -> (b~, c, G-) | V_120 -> (d~, t, G-) | V_121 -> (s~, t, G-) | V_124 -> (s~, u, W-) | V_125 -> (b~, u, W-) | V_126 -> (d~, c, W-) | V_128 -> (b~, c, W-) | V_129 -> (d~, t, W-) | V_130 -> (s~, t, W-) | V_138 -> (c~, c, G0) | V_140 -> (c~, c, H) | V_145 -> (e+, ve, G-) | V_146 -> (mu+, vm, G-)
  811. 289.77 s gammaloop-nextest-integration> [2026-09-18 17:10:15.883] @gammalooprs::model INFO : The following 36 couplings were removed by the restriction card:
  812. 289.77 s gammaloop-nextest-integration> GC_13, GC_14, GC_16, GC_17, GC_18, GC_19, GC_20, GC_22, GC_23, GC_24, GC_25, GC_26, GC_28, GC_29, GC_42, GC_43, GC_44, GC_46, GC_47, GC_48, GC_84, GC_85, GC_86, GC_87, GC_88, GC_89, GC_90, GC_91, GC_92, GC_93, GC_101, GC_102, GC_103, GC_105, GC_106, GC_107
  813. 289.77 s gammaloop-nextest-integration> [2026-09-18 17:10:15.884] @gammaloop_api::se... INFO : Running command run set_model_parameters
  814. 289.77 s gammaloop-nextest-integration> [2026-09-18 17:10:15.884] @gammaloop_api::se... INFO : Starting command block set_model_parameters
  815. 289.77 s gammaloop-nextest-integration> [2026-09-18 17:10:15.884] @gammaloop_api::se... INFO : Running command set model MT=173.0
  816. 289.77 s gammaloop-nextest-integration> [2026-09-18 17:10:15.888] @gammaloop_api::se... INFO : Running command set model WT=0.0
  817. 289.77 s gammaloop-nextest-integration> [2026-09-18 17:10:15.893] @gammaloop_api::se... INFO : Running command set model ymt=173.0
  818. 289.77 s gammaloop-nextest-integration> [2026-09-18 17:10:15.897] @gammaloop_api::se... INFO : Running command set model aS=0.118
  819. 289.77 s gammaloop-nextest-integration> [2026-09-18 17:10:15.902] @gammaloop_api::se... INFO : Running command set model aEWM1=137.036
  820. 289.77 s gammaloop-nextest-integration> [2026-09-18 17:10:15.906] @gammaloop_api::se... INFO : Running command set model Gf=1.166390e-05
  821. 289.77 s gammaloop-nextest-integration> [2026-09-18 17:10:15.911] @gammaloop_api::se... INFO : Running command set model MZ=91.188
  822. 289.77 s gammaloop-nextest-integration> [2026-09-18 17:10:15.917] @gammaloop_api::se... INFO : Running command set global string '
  823. 289.77 s gammaloop-nextest-integration> [global.generation.compile]
  824. 289.77 s gammaloop-nextest-integration> compilation_mode = "symjit"
  825. 289.77 s gammaloop-nextest-integration> optimization_level = "O0"
  826. 289.77 s gammaloop-nextest-integration> fast_math = false
  827. 289.77 s gammaloop-nextest-integration> [...]
  828. 289.77 s gammaloop-nextest-integration> [2026-09-18 17:10:15.918] @gammaloop_api::se... INFO : Running command import graphs ./examples/cli/aa_aa/1L/aa_aa_1L.dot -p aa_aa_all_helicities -i 1L_ppmm -o
  829. 289.77 s gammaloop-nextest-integration> [2026-09-18 17:10:15.918] @commands::import INFO : Loading graphs from '/build/source/examples/cli/aa_aa/1L/aa_aa_1L.dot'
  830. 289.77 s gammaloop-nextest-integration> [2026-09-18 17:10:15.930] @gammaloop_api::se... INFO : Running command generate existing -p aa_aa_all_helicities
  831. 289.77 s gammaloop-nextest-integration> The application panicked (crashed).
  832. 289.77 s gammaloop-nextest-integration> Message: label _func_power_ not found
  833. 289.77 s gammaloop-nextest-integration> Location: /nix/store/n9w914kh1cm59xx3spcs831cdyb56m32-vendor-cargo-deps/c19b7c6f923b580ac259164a89f2577984ad5ab09ee9d583b888f934adbbe8d0/symjit-2.25.6/src/symjit/assembler.rs:77
  834. 289.77 s gammaloop-nextest-integration>
  835. 289.77 s gammaloop-nextest-integration> ━━━━━━━━━━━━━━━━━━━━━━━━━━━━━━━━━━ BACKTRACE ━━━━━━━━━━━━━━━━━━━━━━━━━━━━━━━━━━━
  836. 289.77 s gammaloop-nextest-integration> 1: <color_eyre[51793ea62743adbd]::config::PanicHook>::panic_report<unknown>
  837. 289.77 s gammaloop-nextest-integration> at <unknown source file>:<unknown line>
  838. 289.77 s gammaloop-nextest-integration> 2: <color_eyre[51793ea62743adbd]::config::PanicHook>::into_panic_hook::{closure#0}<unknown>
  839. 289.77 s gammaloop-nextest-integration> at <unknown source file>:<unknown line>
  840. 289.77 s gammaloop-nextest-integration> 3: std[bcb96dfbba0ab899]::panicking::panic_with_hook<unknown>
  841. 289.77 s gammaloop-nextest-integration> at <unknown source file>:<unknown line>
  842. 289.77 s gammaloop-nextest-integration> 4: std[bcb96dfbba0ab899]::panicking::panic_handler::{closure#0}<unknown>
  843. 289.77 s gammaloop-nextest-integration> at <unknown source file>:<unknown line>
  844. 289.77 s gammaloop-nextest-integration> 5: std[bcb96dfbba0ab899]::sys::backtrace::__rust_end_short_backtrace::<std[bcb96dfbba0ab899]::panicking::panic_handler::{closure#0}, !><unknown>
  845. 289.77 s gammaloop-nextest-integration> at <unknown source file>:<unknown line>
  846. 289.77 s gammaloop-nextest-integration> 6: __rustc[6c289b9f9c454d21]::rust_begin_unwind<unknown>
  847. 289.77 s gammaloop-nextest-integration> at <unknown source file>:<unknown line>
  848. 289.77 s gammaloop-nextest-integration> 7: core[940e698046960fd5]::panicking::panic_fmt<unknown>
  849. 289.77 s gammaloop-nextest-integration> at <unknown source file>:<unknown line>
  850. 289.77 s gammaloop-nextest-integration> 8: <symjit[e408de789c333cd]::symjit::assembler::Assembler>::apply_jumps<unknown>
  851. 289.77 s gammaloop-nextest-integration> at <unknown source file>:<unknown line>
  852. 289.77 s gammaloop-nextest-integration> 9: <symjit[e408de789c333cd]::symjit::builder::Builder>::compile_from_mir::<symjit[e408de789c333cd]::symjit::amd::complex::AmdComplexGenerator><unknown>
  853. 289.77 s gammaloop-nextest-integration> at <unknown source file>:<unknown line>
  854. 289.77 s gammaloop-nextest-integration> 10: <symjit[e408de789c333cd]::symjit::runnable::Application>::compile_ty<unknown>
  855. 289.77 s gammaloop-nextest-integration> at <unknown source file>:<unknown line>
  856. 289.77 s gammaloop-nextest-integration> 11: <symjit[e408de789c333cd]::symjit::runnable::Application>::with_mir<unknown>
  857. 289.77 s gammaloop-nextest-integration> at <unknown source file>:<unknown line>
  858. 289.77 s gammaloop-nextest-integration> 12: <symjit[e408de789c333cd]::symjit::composer::DirectTranslator as symjit[e408de789c333cd]::symjit::composer::Composer>::compile<unknown>
  859. 289.77 s gammaloop-nextest-integration> at <unknown source file>:<unknown line>
  860. 289.77 s gammaloop-nextest-integration> 13: <symjit[e408de789c333cd]::symjit::compiler::Translator as symjit[e408de789c333cd]::symjit::composer::Composer>::compile<unknown>
  861. 289.77 s gammaloop-nextest-integration> at <unknown source file>:<unknown line>
  862. 289.77 s gammaloop-nextest-integration> 14: <numerica[124dab8567f4861e]::domains::float::complex::Complex<f64> as symbolica[10e259bab675d243]::evaluate::backend::JITCompiledNumber>::jit_compile<unknown>
  863. 289.77 s gammaloop-nextest-integration> at <unknown source file>:<unknown line>
  864. 289.77 s gammaloop-nextest-integration> 15: <gammalooprs[917cbd3df9e68f8f]::integrands::process::evaluators::GenericEvaluator>::activate_symjit<unknown>
  865. 289.77 s gammaloop-nextest-integration> at <unknown source file>:<unknown line>
  866. 289.77 s gammaloop-nextest-integration> 16: <gammalooprs[917cbd3df9e68f8f]::integrands::process::amplitude::AmplitudeIntegrand>::prepare_runtime_backends_after_generation_with_compile_times<unknown>
  867. 289.77 s gammaloop-nextest-integration> at <unknown source file>:<unknown line>
  868. 289.77 s gammaloop-nextest-integration> 17: <gammalooprs[917cbd3df9e68f8f]::processes::amplitude::Amplitude>::build_integrand<unknown>
  869. 289.77 s gammaloop-nextest-integration> at <unknown source file>:<unknown line>
  870. 289.77 s gammaloop-nextest-integration> 18: <gammalooprs[917cbd3df9e68f8f]::processes::process::Process>::generate_integrands<unknown>
  871. 289.77 s gammaloop-nextest-integration> at <unknown source file>:<unknown line>
  872. 289.77 s gammaloop-nextest-integration> 19: <gammaloop_api[9ebf6628f97aeb57]::state::State>::generate_integrand<unknown>
  873. 289.77 s gammaloop-nextest-integration> at <unknown source file>:<unknown line>
  874. 289.77 s gammaloop-nextest-integration> 20: <gammaloop_api[9ebf6628f97aeb57]::commands::generate::Generate>::run::<&std[bcb96dfbba0ab899]::path::PathBuf><unknown>
  875. 289.77 s gammaloop-nextest-integration> at <unknown source file>:<unknown line>
  876. 289.77 s gammaloop-nextest-integration> 21: <gammaloop_api[9ebf6628f97aeb57]::commands::Commands>::run<unknown>
  877. 289.77 s gammaloop-nextest-integration> at <unknown source file>:<unknown line>
  878. 289.77 s gammaloop-nextest-integration> 22: <gammaloop_api[9ebf6628f97aeb57]::session::CliSession>::execute_prepared<unknown>
  879. 289.77 s gammaloop-nextest-integration> at <unknown source file>:<unknown line>
  880. 289.77 s gammaloop-nextest-integration> 23: <gammaloop_api[9ebf6628f97aeb57]::session::CliSession>::execute_command<unknown>
  881. 289.77 s gammaloop-nextest-integration> at <unknown source file>:<unknown line>
  882. 289.77 s gammaloop-nextest-integration> 24: <gammaloop_integration_tests[191607b70c61cd5a]::CLIState>::run_command<unknown>
  883. 289.77 s gammaloop-nextest-integration> at <unknown source file>:<unknown line>
  884. 289.77 s gammaloop-nextest-integration> 25: test_runs[9b7e2dc2dc4f29b0]::aa_aa::generate_aa_aa_helicity_family<unknown>
  885. 289.77 s gammaloop-nextest-integration> at <unknown source file>:<unknown line>
  886. 289.77 s gammaloop-nextest-integration> 26: <test_runs[9b7e2dc2dc4f29b0]::aa_aa::important::aa_aa_local_inspect_backend_consistency::{closure#0} as core[940e698046960fd5]::ops::function::FnOnce<()>>::call_once<unknown>
  887. 289.77 s gammaloop-nextest-integration> at <unknown source file>:<unknown line>
  888. 289.77 s gammaloop-nextest-integration> 27: serial_test[cd99724524a2f1c0]::serial_code_lock::local_serial_core_with_return::<(), eyre[cb2fd339c0c40fca]::Report><unknown>
  889. 289.77 s gammaloop-nextest-integration> at <unknown source file>:<unknown line>
  890. 289.77 s gammaloop-nextest-integration> 28: <test_runs[9b7e2dc2dc4f29b0]::aa_aa::important::aa_aa_local_inspect_backend_consistency::{closure#0} as core[940e698046960fd5]::ops::function::FnOnce<()>>::call_once<unknown>
  891. 289.77 s gammaloop-nextest-integration> at <unknown source file>:<unknown line>
  892. 289.77 s gammaloop-nextest-integration> 29: test[75d6903177b1d7e9]::__rust_begin_short_backtrace::<core[940e698046960fd5]::result::Result<(), alloc[2ea6bcb46fca0c42]::string::String>, fn() -> core[940e698046960fd5]::result::Result<(), alloc[2ea6bcb46fca0c42]::string::String>><unknown>
  893. 289.77 s gammaloop-nextest-integration> at <unknown source file>:<unknown line>
  894. 289.77 s gammaloop-nextest-integration> 30: test[75d6903177b1d7e9]::run_test::{closure#0}<unknown>
  895. 289.77 s gammaloop-nextest-integration> at <unknown source file>:<unknown line>
  896. 289.77 s gammaloop-nextest-integration> 31: std[bcb96dfbba0ab899]::sys::backtrace::__rust_begin_short_backtrace::<test[75d6903177b1d7e9]::run_test::{closure#1}, ()><unknown>
  897. 289.77 s gammaloop-nextest-integration> at <unknown source file>:<unknown line>
  898. 289.77 s gammaloop-nextest-integration> 32: <std[bcb96dfbba0ab899]::thread::lifecycle::spawn_unchecked<test[75d6903177b1d7e9]::run_test::{closure#1}, ()>::{closure#1} as core[940e698046960fd5]::ops::function::FnOnce<()>>::call_once::{shim:vtable#0}<unknown>
  899. 289.77 s gammaloop-nextest-integration> at <unknown source file>:<unknown line>
  900. 289.77 s gammaloop-nextest-integration> 33: <std[bcb96dfbba0ab899]::sys::thread::unix::Thread>::new::thread_start<unknown>
  901. 289.77 s gammaloop-nextest-integration> at <unknown source file>:<unknown line>
  902. 289.77 s gammaloop-nextest-integration> 34: start_thread<unknown>
  903. 289.77 s gammaloop-nextest-integration> at <unknown source file>:<unknown line>
  904. 289.77 s gammaloop-nextest-integration> 35: __clone3<unknown>
  905. 289.77 s gammaloop-nextest-integration> at <unknown source file>:<unknown line>
  906. 289.77 s gammaloop-nextest-integration>
  907. 289.77 s gammaloop-nextest-integration> Run with COLORBT_SHOW_HIDDEN=1 environment variable to disable frame filtering.
  908. 289.77 s gammaloop-nextest-integration> Run with RUST_BACKTRACE=full to include source snippets.
  909. 289.77 s gammaloop-nextest-integration> Warning: SpanTrace capture is Unsupported.
  910. 289.77 s gammaloop-nextest-integration> Ensure that you've setup a tracing-error ErrorLayer and the semver versions are compatible
  911. 289.77 s gammaloop-nextest-integration>
  912. 289.77 s gammaloop-nextest-integration> 2. gammaloop-integration-tests::uv::thermal_sunrise_uv
  913. 289.77 s gammaloop-nextest-integration> failure: test failure with exit code 101
  914. 289.77 s gammaloop-nextest-integration> system-out
  915. 289.77 s gammaloop-nextest-integration> running 1 test
  916. 289.77 s gammaloop-nextest-integration> test thermal_sunrise_uv ... FAILED
  917. 289.77 s gammaloop-nextest-integration>
  918. 289.77 s gammaloop-nextest-integration> failures:
  919. 289.77 s gammaloop-nextest-integration>
  920. 289.77 s gammaloop-nextest-integration> failures:
  921. 289.77 s gammaloop-nextest-integration> thermal_sunrise_uv
  922. 289.77 s gammaloop-nextest-integration>
  923. 289.77 s gammaloop-nextest-integration> test result: FAILED. 0 passed; 1 failed; 0 ignored; 0 measured; 31 filtered out; finished in 3.74s
  924. 289.77 s gammaloop-nextest-integration> system-err
  925. 289.77 s gammaloop-nextest-integration> [2026-09-18 17:11:03.336] @gammaloop_api::se... INFO : Running command run generate
  926. 289.77 s gammaloop-nextest-integration> [2026-09-18 17:11:03.336] @gammaloop_api::se... INFO : Starting command block generate
  927. 289.77 s gammaloop-nextest-integration> [2026-09-18 17:11:03.337] @gammaloop_api::se... INFO : Running command import model sm-default.json
  928. 289.77 s gammaloop-nextest-integration> [2026-09-18 17:11:03.337] @import::model INFO : Loading built-in JSON model sm-default
  929. 289.77 s gammaloop-nextest-integration> [2026-09-18 17:11:03.386] @gammalooprs::model INFO : The following 15 external parameters were forced to zero by the restriction card:
  930. 289.77 s gammaloop-nextest-integration> lamWS, AWS, rhoWS, etaWS, ymc, yme, ymm, MC, Me, MM, WTau, muQ, muLe, muLmu, muLtau
  931. 289.77 s gammaloop-nextest-integration> [2026-09-18 17:11:03.386] @gammalooprs::model INFO : The following 34 vertex rules were removed by the restriction card:
  932. 289.77 s gammaloop-nextest-integration> V_82 -> (c~, d, G+) | V_83 -> (t~, d, G+) | V_84 -> (c~, s, G+) | V_85 -> (t~, s, G+) | V_86 -> (u~, b, G+) | V_87 -> (c~, b, G+) | V_90 -> (c~, d, W+) | V_91 -> (t~, d, W+) | V_92 -> (u~, s, W+) | V_94 -> (t~, s, W+) | V_95 -> (u~, b, W+) | V_96 -> (c~, b, W+) | V_101 -> (e+, e-, G0) | V_102 -> (mu+, mu-, G0) | V_104 -> (e+, e-, H) | V_105 -> (mu+, mu-, H) | V_110 -> (ve~, e-, G+) | V_111 -> (vm~, mu-, G+) | V_116 -> (b~, u, G-) | V_117 -> (d~, c, G-) | V_118 -> (s~, c, G-) | V_119 -> (b~, c, G-) | V_120 -> (d~, t, G-) | V_121 -> (s~, t, G-) | V_124 -> (s~, u, W-) | V_125 -> (b~, u, W-) | V_126 -> (d~, c, W-) | V_128 -> (b~, c, W-) | V_129 -> (d~, t, W-) | V_130 -> (s~, t, W-) | V_138 -> (c~, c, G0) | V_140 -> (c~, c, H) | V_145 -> (e+, ve, G-) | V_146 -> (mu+, vm, G-)
  933. 289.77 s gammaloop-nextest-integration> [2026-09-18 17:11:03.386] @gammalooprs::model INFO : The following 36 couplings were removed by the restriction card:
  934. 289.77 s gammaloop-nextest-integration> GC_13, GC_14, GC_16, GC_17, GC_18, GC_19, GC_20, GC_22, GC_23, GC_24, GC_25, GC_26, GC_28, GC_29, GC_42, GC_43, GC_44, GC_46, GC_47, GC_48, GC_84, GC_85, GC_86, GC_87, GC_88, GC_89, GC_90, GC_91, GC_92, GC_93, GC_101, GC_102, GC_103, GC_105, GC_106, GC_107
  935. 289.77 s gammaloop-nextest-integration> [2026-09-18 17:11:03.387] @gammaloop_api::se... INFO : Running command remove processes
  936. 289.77 s gammaloop-nextest-integration> [2026-09-18 17:11:03.387] @gammaloop_api::se... INFO : Running command generate amp {} > {} [{2}] | g u
  937. 289.77 s gammaloop-nextest-integration> --numerator-grouping group_identical_graphs_up_to_scalar_rescaling
  938. 289.77 s gammaloop-nextest-integration> --max-n-bridges 0
  939. 289.77 s gammaloop-nextest-integration> --number-of-factorized-loop-subtopologies 1 1
  940. 289.77 s gammaloop-nextest-integration> --number-of-anticommutating-loops 1 1
  941. 289.77 s gammaloop-nextest-integration> [...]
  942. 289.77 s gammaloop-nextest-integration> [2026-09-18 17:11:03.389] @feyngen::diagram_... INFO : 0s | Δ=0s | Starting Feynman graph generation with Symbolica...
  943. 289.77 s gammaloop-nextest-integration> [2026-09-18 17:11:03.389] @feyngen::diagram_... INFO : 0s | Δ=0s | Number of graphs resulting from Symbolica generation: 3
  944. 289.77 s gammaloop-nextest-integration> [2026-09-18 17:11:03.389] @feyngen::diagram_... INFO : 0s | Δ=0s | Number of graphs retained after removal of vetoed topologies: 2
  945. 289.77 s gammaloop-nextest-integration> [2026-09-18 17:11:03.390] @feyngen::diagram_... INFO : 0s | Δ=0s | Number of graphs after vertex info assignment: 2
  946. 289.77 s gammaloop-nextest-integration> [2026-09-18 17:11:03.390] @feyngen::diagram_... INFO : 0s | Δ=0s | Number of graphs after all complete graphs filters are applied: 2
  947. 289.77 s gammaloop-nextest-integration> [2026-09-18 17:11:03.390] @feyngen::diagram_... INFO : 0s | Δ=0s | Number of graphs after closed anticommutating chains analysis: 1
  948. 289.77 s gammaloop-nextest-integration> [2026-09-18 17:11:03.390] @feyngen::diagram_... INFO : 0s | Δ=0s | Number of graphs after symmetrization of external states: 1
  949. 289.77 s gammaloop-nextest-integration> [2026-09-18 17:11:03.390] @feyngen::diagram_... INFO : 0s | Δ=0s | Number of graphs after canonization of vertices, edges and flows (graph labels assigned here): 1
  950. 289.77 s gammaloop-nextest-integration> [2026-09-18 17:11:03.413] @feyngen::diagram_... INFO : 0s | Δ=0s | Number of graphs after numerator-aware grouping with strategy 'up to a scalar rescaling': 1 (1 isomorphically unique graph, 0 color zero, 0 lorentz zero, 0 grouped and 0 cancellation)
  951. 289.77 s gammaloop-nextest-integration> [2026-09-18 17:11:03.413] @feyngen::diagram_... INFO : ( Sum of the symmetry factors from each graph generated = -1/2 )
  952. 289.77 s gammaloop-nextest-integration> [2026-09-18 17:11:03.413] @commands::generate INFO : Generated amplitude 1 graphs.
  953. 289.77 s gammaloop-nextest-integration> [2026-09-18 17:11:03.414] @commands::generate INFO : Only diagram generation was requested, skipping integrand generation. You can generate integrands later using the 'generate existing <options>' command.
  954. 289.77 s gammaloop-nextest-integration> [2026-09-18 17:11:03.414] @gammaloop_api::se... INFO : Running command generate
  955. 289.77 s gammaloop-nextest-integration> The application panicked (crashed).
  956. 289.77 s gammaloop-nextest-integration> Message: label _func_power_ not found
  957. 289.77 s gammaloop-nextest-integration> Location: /nix/store/n9w914kh1cm59xx3spcs831cdyb56m32-vendor-cargo-deps/c19b7c6f923b580ac259164a89f2577984ad5ab09ee9d583b888f934adbbe8d0/symjit-2.25.6/src/symjit/assembler.rs:77
  958. 289.77 s gammaloop-nextest-integration>
  959. 289.77 s gammaloop-nextest-integration> ━━━━━━━━━━━━━━━━━━━━━━━━━━━━━━━━━━ BACKTRACE ━━━━━━━━━━━━━━━━━━━━━━━━━━━━━━━━━━━
  960. 289.77 s gammaloop-nextest-integration> 1: <color_eyre[51793ea62743adbd]::config::PanicHook>::panic_report<unknown>
  961. 289.77 s gammaloop-nextest-integration> at <unknown source file>:<unknown line>
  962. 289.77 s gammaloop-nextest-integration> 2: <color_eyre[51793ea62743adbd]::config::PanicHook>::into_panic_hook::{closure#0}<unknown>
  963. 289.77 s gammaloop-nextest-integration> at <unknown source file>:<unknown line>
  964. 289.77 s gammaloop-nextest-integration> 3: std[bcb96dfbba0ab899]::panicking::panic_with_hook<unknown>
  965. 289.77 s gammaloop-nextest-integration> at <unknown source file>:<unknown line>
  966. 289.77 s gammaloop-nextest-integration> 4: std[bcb96dfbba0ab899]::panicking::panic_handler::{closure#0}<unknown>
  967. 289.77 s gammaloop-nextest-integration> at <unknown source file>:<unknown line>
  968. 289.77 s gammaloop-nextest-integration> 5: std[bcb96dfbba0ab899]::sys::backtrace::__rust_end_short_backtrace::<std[bcb96dfbba0ab899]::panicking::panic_handler::{closure#0}, !><unknown>
  969. 289.77 s gammaloop-nextest-integration> at <unknown source file>:<unknown line>
  970. 289.77 s gammaloop-nextest-integration> 6: __rustc[6c289b9f9c454d21]::rust_begin_unwind<unknown>
  971. 289.77 s gammaloop-nextest-integration> at <unknown source file>:<unknown line>
  972. 289.77 s gammaloop-nextest-integration> 7: core[940e698046960fd5]::panicking::panic_fmt<unknown>
  973. 289.77 s gammaloop-nextest-integration> at <unknown source file>:<unknown line>
  974. 289.77 s gammaloop-nextest-integration> 8: <symjit[e408de789c333cd]::symjit::assembler::Assembler>::apply_jumps<unknown>
  975. 289.77 s gammaloop-nextest-integration> at <unknown source file>:<unknown line>
  976. 289.77 s gammaloop-nextest-integration> 9: <symjit[e408de789c333cd]::symjit::builder::Builder>::compile_from_mir::<symjit[e408de789c333cd]::symjit::amd::complex::AmdComplexGenerator><unknown>
  977. 289.77 s gammaloop-nextest-integration> at <unknown source file>:<unknown line>
  978. 289.77 s gammaloop-nextest-integration> 10: <symjit[e408de789c333cd]::symjit::runnable::Application>::compile_ty<unknown>
  979. 289.77 s gammaloop-nextest-integration> at <unknown source file>:<unknown line>
  980. 289.77 s gammaloop-nextest-integration> 11: <symjit[e408de789c333cd]::symjit::runnable::Application>::with_mir<unknown>
  981. 289.77 s gammaloop-nextest-integration> at <unknown source file>:<unknown line>
  982. 289.77 s gammaloop-nextest-integration> 12: <symjit[e408de789c333cd]::symjit::composer::DirectTranslator as symjit[e408de789c333cd]::symjit::composer::Composer>::compile<unknown>
  983. 289.77 s gammaloop-nextest-integration> at <unknown source file>:<unknown line>
  984. 289.77 s gammaloop-nextest-integration> 13: <symjit[e408de789c333cd]::symjit::compiler::Translator as symjit[e408de789c333cd]::symjit::composer::Composer>::compile<unknown>
  985. 289.77 s gammaloop-nextest-integration> at <unknown source file>:<unknown line>
  986. 289.77 s gammaloop-nextest-integration> 14: <numerica[124dab8567f4861e]::domains::float::complex::Complex<f64> as symbolica[10e259bab675d243]::evaluate::backend::JITCompiledNumber>::jit_compile<unknown>
  987. 289.77 s gammaloop-nextest-integration> at <unknown source file>:<unknown line>
  988. 289.77 s gammaloop-nextest-integration> 15: <gammalooprs[917cbd3df9e68f8f]::integrands::process::evaluators::GenericEvaluator>::activate_symjit<unknown>
  989. 289.77 s gammaloop-nextest-integration> at <unknown source file>:<unknown line>
  990. 289.77 s gammaloop-nextest-integration> 16: <gammalooprs[917cbd3df9e68f8f]::integrands::process::amplitude::AmplitudeIntegrand>::prepare_runtime_backends_after_generation_with_compile_times<unknown>
  991. 289.77 s gammaloop-nextest-integration> at <unknown source file>:<unknown line>
  992. 289.77 s gammaloop-nextest-integration> 17: <gammalooprs[917cbd3df9e68f8f]::processes::amplitude::Amplitude>::build_integrand<unknown>
  993. 289.77 s gammaloop-nextest-integration> at <unknown source file>:<unknown line>
  994. 289.77 s gammaloop-nextest-integration> 18: <gammalooprs[917cbd3df9e68f8f]::processes::process::Process>::generate_integrands<unknown>
  995. 289.77 s gammaloop-nextest-integration> at <unknown source file>:<unknown line>
  996. 289.77 s gammaloop-nextest-integration> 19: <gammalooprs[917cbd3df9e68f8f]::processes::ProcessList>::generate_integrands<unknown>
  997. 289.77 s gammaloop-nextest-integration> at <unknown source file>:<unknown line>
  998. 289.77 s gammaloop-nextest-integration> 20: <gammaloop_api[9ebf6628f97aeb57]::state::State>::generate_integrands<unknown>
  999. 289.77 s gammaloop-nextest-integration> at <unknown source file>:<unknown line>
  1000. 289.77 s gammaloop-nextest-integration> 21: <gammaloop_api[9ebf6628f97aeb57]::commands::generate::Generate>::run::<&std[bcb96dfbba0ab899]::path::PathBuf><unknown>
  1001. 289.77 s gammaloop-nextest-integration> at <unknown source file>:<unknown line>
  1002. 289.77 s gammaloop-nextest-integration> 22: <gammaloop_api[9ebf6628f97aeb57]::commands::Commands>::run<unknown>
  1003. 289.77 s gammaloop-nextest-integration> at <unknown source file>:<unknown line>
  1004. 289.77 s gammaloop-nextest-integration> 23: <gammaloop_api[9ebf6628f97aeb57]::session::CliSession>::execute_prepared<unknown>
  1005. 289.77 s gammaloop-nextest-integration> at <unknown source file>:<unknown line>
  1006. 289.77 s gammaloop-nextest-integration> 24: <gammaloop_api[9ebf6628f97aeb57]::session::CliSession>::execute_prepared_commands<unknown>
  1007. 289.77 s gammaloop-nextest-integration> at <unknown source file>:<unknown line>
  1008. 289.77 s gammaloop-nextest-integration> 25: <gammaloop_api[9ebf6628f97aeb57]::session::CliSession>::execute_prepared<unknown>
  1009. 289.77 s gammaloop-nextest-integration> at <unknown source file>:<unknown line>
  1010. 289.77 s gammaloop-nextest-integration> 26: <gammaloop_api[9ebf6628f97aeb57]::session::CliSession>::execute_command<unknown>
  1011. 289.77 s gammaloop-nextest-integration> at <unknown source file>:<unknown line>
  1012. 289.77 s gammaloop-nextest-integration> 27: <gammaloop_integration_tests[191607b70c61cd5a]::CLIState>::run_command<unknown>
  1013. 289.77 s gammaloop-nextest-integration> at <unknown source file>:<unknown line>
  1014. 289.77 s gammaloop-nextest-integration> 28: uv[3c7454ef256d6487]::run_single_integrated_uv_case<unknown>
  1015. 289.77 s gammaloop-nextest-integration> at <unknown source file>:<unknown line>
  1016. 289.77 s gammaloop-nextest-integration> 29: <uv[3c7454ef256d6487]::thermal_sunrise_uv::{closure#0} as core[940e698046960fd5]::ops::function::FnOnce<()>>::call_once<unknown>
  1017. 289.77 s gammaloop-nextest-integration> at <unknown source file>:<unknown line>
  1018. 289.77 s gammaloop-nextest-integration> 30: test[75d6903177b1d7e9]::__rust_begin_short_backtrace::<core[940e698046960fd5]::result::Result<(), alloc[2ea6bcb46fca0c42]::string::String>, fn() -> core[940e698046960fd5]::result::Result<(), alloc[2ea6bcb46fca0c42]::string::String>><unknown>
  1019. 289.77 s gammaloop-nextest-integration> at <unknown source file>:<unknown line>
  1020. 289.77 s gammaloop-nextest-integration> 31: test[75d6903177b1d7e9]::run_test::{closure#0}<unknown>
  1021. 289.77 s gammaloop-nextest-integration> at <unknown source file>:<unknown line>
  1022. 289.77 s gammaloop-nextest-integration> 32: std[bcb96dfbba0ab899]::sys::backtrace::__rust_begin_short_backtrace::<test[75d6903177b1d7e9]::run_test::{closure#1}, ()><unknown>
  1023. 289.77 s gammaloop-nextest-integration> at <unknown source file>:<unknown line>
  1024. 289.77 s gammaloop-nextest-integration> 33: <std[bcb96dfbba0ab899]::thread::lifecycle::spawn_unchecked<test[75d6903177b1d7e9]::run_test::{closure#1}, ()>::{closure#1} as core[940e698046960fd5]::ops::function::FnOnce<()>>::call_once::{shim:vtable#0}<unknown>
  1025. 289.77 s gammaloop-nextest-integration> at <unknown source file>:<unknown line>
  1026. 289.77 s gammaloop-nextest-integration> 34: <std[bcb96dfbba0ab899]::sys::thread::unix::Thread>::new::thread_start<unknown>
  1027. 289.77 s gammaloop-nextest-integration> at <unknown source file>:<unknown line>
  1028. 289.77 s gammaloop-nextest-integration> 35: start_thread<unknown>
  1029. 289.77 s gammaloop-nextest-integration> at <unknown source file>:<unknown line>
  1030. 289.77 s gammaloop-nextest-integration> 36: __clone3<unknown>
  1031. 289.77 s gammaloop-nextest-integration> at <unknown source file>:<unknown line>
  1032. 289.77 s gammaloop-nextest-integration>
  1033. 289.77 s gammaloop-nextest-integration> Run with COLORBT_SHOW_HIDDEN=1 environment variable to disable frame filtering.
  1034. 289.77 s gammaloop-nextest-integration> Run with RUST_BACKTRACE=full to include source snippets.
  1035. 289.77 s gammaloop-nextest-integration> Warning: SpanTrace capture is Unsupported.
  1036. 289.77 s gammaloop-nextest-integration> Ensure that you've setup a tracing-error ErrorLayer and the semver versions are compatible
  1037. 289.77 s gammaloop-nextest-integration> =========================================
  1038. 289.88 s error: Cannot build '/nix/store/gigaa94kmmfy8jkh87hvwv50zf7hs40j-gammaloop-nextest-integration.drv'.
  1039. 289.88 s Reason: builder failed with exit code 100.
  1040. 289.88 s Output paths:
  1041. 289.88 s /nix/store/z4r9lrmw75s2jgdid4kv238yw4kqv7lb-gammaloop-nextest-integration
  1042. 289.88 s Last 755 log lines:
  1043. 289.88 s > Extracting 13 binaries, 1 build script output directory, and 3 linked paths to /build/nextest-archive-8dLRNL
  1044. 289.88 s > Extracted 30 files to /build/nextest-archive-8dLRNL in 2.53s
  1045. 289.88 s > ------------
  1046. 289.88 s > Nextest run ID 16c26a88-e889-46e2-8268-1df770c17995 with nextest profile: ci_gammaloop
  1047. 289.88 s > Starting 170 tests across 13 binaries (209 tests skipped, including 208 tests via profile.ci_gammaloop.default-filter)
  1048. 289.88 s > FAIL [ 2.807s] ( 55/170) gammaloop-integration-tests::test_runs aa_aa::important::aa_aa_local_inspect_backend_consistency
  1049. 289.88 s > stdout ---
  1050. 289.88 s >
  1051. 289.88 s > running 1 test
  1052. 289.88 s > test aa_aa::important::aa_aa_local_inspect_backend_consistency ... FAILED
  1053. 289.88 s >
  1054. 289.88 s > failures:
  1055. 289.88 s >
  1056. 289.88 s > failures:
  1057. 289.88 s > aa_aa::important::aa_aa_local_inspect_backend_consistency
  1058. 289.88 s >
  1059. 289.88 s > test result: FAILED. 0 passed; 1 failed; 0 ignored; 0 measured; 274 filtered out; finished in 2.79s
  1060. 289.88 s >
  1061. 289.88 s > stderr ---
  1062. 289.88 s > [2026-09-18 17:10:15.861] @gammaloop_api::se... INFO : Running command import model sm-default.json
  1063. 289.88 s > [2026-09-18 17:10:15.861] @import::model INFO : Loading built-in JSON model sm-default
  1064. 289.88 s > [2026-09-18 17:10:15.883] @gammalooprs::model INFO : The following 15 external parameters were forced to zero by the restriction card:
  1065. 289.88 s > lamWS, AWS, rhoWS, etaWS, ymc, yme, ymm, MC, Me, MM, WTau, muQ, muLe, muLmu, muLtau
  1066. 289.88 s > [2026-09-18 17:10:15.883] @gammalooprs::model INFO : The following 34 vertex rules were removed by the restriction card:
  1067. 289.88 s > V_82 -> (c~, d, G+) | V_83 -> (t~, d, G+) | V_84 -> (c~, s, G+) | V_85 -> (t~, s, G+) | V_86 -> (u~, b, G+) | V_87 -> (c~, b, G+) | V_90 -> (c~, d, W+) | V_91 -> (t~, d, W+) | V_92 -> (u~, s, W+) | V_94 -> (t~, s, W+) | V_95 -> (u~, b, W+) | V_96 -> (c~, b, W+) | V_101 -> (e+, e-, G0) | V_102 -> (mu+, mu-, G0) | V_104 -> (e+, e-, H) | V_105 -> (mu+, mu-, H) | V_110 -> (ve~, e-, G+) | V_111 -> (vm~, mu-, G+) | V_116 -> (b~, u, G-) | V_117 -> (d~, c, G-) | V_118 -> (s~, c, G-) | V_119 -> (b~, c, G-) | V_120 -> (d~, t, G-) | V_121 -> (s~, t, G-) | V_124 -> (s~, u, W-) | V_125 -> (b~, u, W-) | V_126 -> (d~, c, W-) | V_128 -> (b~, c, W-) | V_129 -> (d~, t, W-) | V_130 -> (s~, t, W-) | V_138 -> (c~, c, G0) | V_140 -> (c~, c, H) | V_145 -> (e+, ve, G-) | V_146 -> (mu+, vm, G-)
  1068. 289.88 s > [2026-09-18 17:10:15.883] @gammalooprs::model INFO : The following 36 couplings were removed by the restriction card:
  1069. 289.88 s > GC_13, GC_14, GC_16, GC_17, GC_18, GC_19, GC_20, GC_22, GC_23, GC_24, GC_25, GC_26, GC_28, GC_29, GC_42, GC_43, GC_44, GC_46, GC_47, GC_48, GC_84, GC_85, GC_86, GC_87, GC_88, GC_89, GC_90, GC_91, GC_92, GC_93, GC_101, GC_102, GC_103, GC_105, GC_106, GC_107
  1070. 289.88 s > [2026-09-18 17:10:15.884] @gammaloop_api::se... INFO : Running command run set_model_parameters
  1071. 289.88 s > [2026-09-18 17:10:15.884] @gammaloop_api::se... INFO : Starting command block set_model_parameters
  1072. 289.88 s > [2026-09-18 17:10:15.884] @gammaloop_api::se... INFO : Running command set model MT=173.0
  1073. 289.88 s > [2026-09-18 17:10:15.888] @gammaloop_api::se... INFO : Running command set model WT=0.0
  1074. 289.88 s > [2026-09-18 17:10:15.893] @gammaloop_api::se... INFO : Running command set model ymt=173.0
  1075. 289.88 s > [2026-09-18 17:10:15.897] @gammaloop_api::se... INFO : Running command set model aS=0.118
  1076. 289.88 s > [2026-09-18 17:10:15.902] @gammaloop_api::se... INFO : Running command set model aEWM1=137.036
  1077. 289.88 s > [2026-09-18 17:10:15.906] @gammaloop_api::se... INFO : Running command set model Gf=1.166390e-05
  1078. 289.88 s > [2026-09-18 17:10:15.911] @gammaloop_api::se... INFO : Running command set model MZ=91.188
  1079. 289.88 s > [2026-09-18 17:10:15.917] @gammaloop_api::se... INFO : Running command set global string '
  1080. 289.88 s > [global.generation.compile]
  1081. 289.88 s > compilation_mode = "symjit"
  1082. 289.88 s > optimization_level = "O0"
  1083. 289.88 s > fast_math = false
  1084. 289.88 s > [...]
  1085. 289.88 s > [2026-09-18 17:10:15.918] @gammaloop_api::se... INFO : Running command import graphs ./examples/cli/aa_aa/1L/aa_aa_1L.dot -p aa_aa_all_helicities -i 1L_ppmm -o
  1086. 289.88 s > [2026-09-18 17:10:15.918] @commands::import INFO : Loading graphs from '/build/source/examples/cli/aa_aa/1L/aa_aa_1L.dot'
  1087. 289.88 s > [2026-09-18 17:10:15.930] @gammaloop_api::se... INFO : Running command generate existing -p aa_aa_all_helicities
  1088. 289.88 s > The application panicked (crashed).
  1089. 289.88 s > Message: label _func_power_ not found
  1090. 289.88 s > Location: /nix/store/n9w914kh1cm59xx3spcs831cdyb56m32-vendor-cargo-deps/c19b7c6f923b580ac259164a89f2577984ad5ab09ee9d583b888f934adbbe8d0/symjit-2.25.6/src/symjit/assembler.rs:77
  1091. 289.88 s >
  1092. 289.88 s > ━━━━━━━━━━━━━━━━━━━━━━━━━━━━━━━━━━ BACKTRACE ━━━━━━━━━━━━━━━━━━━━━━━━━━━━━━━━━━━
  1093. 289.88 s > 1: <color_eyre[51793ea62743adbd]::config::PanicHook>::panic_report<unknown>
  1094. 289.88 s > at <unknown source file>:<unknown line>
  1095. 289.88 s > 2: <color_eyre[51793ea62743adbd]::config::PanicHook>::into_panic_hook::{closure#0}<unknown>
  1096. 289.88 s > at <unknown source file>:<unknown line>
  1097. 289.88 s > 3: std[bcb96dfbba0ab899]::panicking::panic_with_hook<unknown>
  1098. 289.88 s > at <unknown source file>:<unknown line>
  1099. 289.88 s > 4: std[bcb96dfbba0ab899]::panicking::panic_handler::{closure#0}<unknown>
  1100. 289.88 s > at <unknown source file>:<unknown line>
  1101. 289.88 s > 5: std[bcb96dfbba0ab899]::sys::backtrace::__rust_end_short_backtrace::<std[bcb96dfbba0ab899]::panicking::panic_handler::{closure#0}, !><unknown>
  1102. 289.88 s > at <unknown source file>:<unknown line>
  1103. 289.88 s > 6: __rustc[6c289b9f9c454d21]::rust_begin_unwind<unknown>
  1104. 289.88 s > at <unknown source file>:<unknown line>
  1105. 289.88 s > 7: core[940e698046960fd5]::panicking::panic_fmt<unknown>
  1106. 289.88 s > at <unknown source file>:<unknown line>
  1107. 289.88 s > 8: <symjit[e408de789c333cd]::symjit::assembler::Assembler>::apply_jumps<unknown>
  1108. 289.88 s > at <unknown source file>:<unknown line>
  1109. 289.88 s > 9: <symjit[e408de789c333cd]::symjit::builder::Builder>::compile_from_mir::<symjit[e408de789c333cd]::symjit::amd::complex::AmdComplexGenerator><unknown>
  1110. 289.88 s > at <unknown source file>:<unknown line>
  1111. 289.88 s > 10: <symjit[e408de789c333cd]::symjit::runnable::Application>::compile_ty<unknown>
  1112. 289.88 s > at <unknown source file>:<unknown line>
  1113. 289.88 s > 11: <symjit[e408de789c333cd]::symjit::runnable::Application>::with_mir<unknown>
  1114. 289.88 s > at <unknown source file>:<unknown line>
  1115. 289.88 s > 12: <symjit[e408de789c333cd]::symjit::composer::DirectTranslator as symjit[e408de789c333cd]::symjit::composer::Composer>::compile<unknown>
  1116. 289.88 s > at <unknown source file>:<unknown line>
  1117. 289.88 s > 13: <symjit[e408de789c333cd]::symjit::compiler::Translator as symjit[e408de789c333cd]::symjit::composer::Composer>::compile<unknown>
  1118. 289.88 s > at <unknown source file>:<unknown line>
  1119. 289.88 s > 14: <numerica[124dab8567f4861e]::domains::float::complex::Complex<f64> as symbolica[10e259bab675d243]::evaluate::backend::JITCompiledNumber>::jit_compile<unknown>
  1120. 289.88 s > at <unknown source file>:<unknown line>
  1121. 289.88 s > 15: <gammalooprs[917cbd3df9e68f8f]::integrands::process::evaluators::GenericEvaluator>::activate_symjit<unknown>
  1122. 289.88 s > at <unknown source file>:<unknown line>
  1123. 289.88 s > 16: <gammalooprs[917cbd3df9e68f8f]::integrands::process::amplitude::AmplitudeIntegrand>::prepare_runtime_backends_after_generation_with_compile_times<unknown>
  1124. 289.88 s > at <unknown source file>:<unknown line>
  1125. 289.88 s > 17: <gammalooprs[917cbd3df9e68f8f]::processes::amplitude::Amplitude>::build_integrand<unknown>
  1126. 289.88 s > at <unknown source file>:<unknown line>
  1127. 289.88 s > 18: <gammalooprs[917cbd3df9e68f8f]::processes::process::Process>::generate_integrands<unknown>
  1128. 289.88 s > at <unknown source file>:<unknown line>
  1129. 289.88 s > 19: <gammaloop_api[9ebf6628f97aeb57]::state::State>::generate_integrand<unknown>
  1130. 289.88 s > at <unknown source file>:<unknown line>
  1131. 289.88 s > 20: <gammaloop_api[9ebf6628f97aeb57]::commands::generate::Generate>::run::<&std[bcb96dfbba0ab899]::path::PathBuf><unknown>
  1132. 289.88 s > at <unknown source file>:<unknown line>
  1133. 289.88 s > 21: <gammaloop_api[9ebf6628f97aeb57]::commands::Commands>::run<unknown>
  1134. 289.88 s > at <unknown source file>:<unknown line>
  1135. 289.88 s > 22: <gammaloop_api[9ebf6628f97aeb57]::session::CliSession>::execute_prepared<unknown>
  1136. 289.88 s > at <unknown source file>:<unknown line>
  1137. 289.88 s > 23: <gammaloop_api[9ebf6628f97aeb57]::session::CliSession>::execute_command<unknown>
  1138. 289.88 s > at <unknown source file>:<unknown line>
  1139. 289.88 s > 24: <gammaloop_integration_tests[191607b70c61cd5a]::CLIState>::run_command<unknown>
  1140. 289.88 s > at <unknown source file>:<unknown line>
  1141. 289.88 s > 25: test_runs[9b7e2dc2dc4f29b0]::aa_aa::generate_aa_aa_helicity_family<unknown>
  1142. 289.88 s > at <unknown source file>:<unknown line>
  1143. 289.88 s > 26: <test_runs[9b7e2dc2dc4f29b0]::aa_aa::important::aa_aa_local_inspect_backend_consistency::{closure#0} as core[940e698046960fd5]::ops::function::FnOnce<()>>::call_once<unknown>
  1144. 289.88 s > at <unknown source file>:<unknown line>
  1145. 289.88 s > 27: serial_test[cd99724524a2f1c0]::serial_code_lock::local_serial_core_with_return::<(), eyre[cb2fd339c0c40fca]::Report><unknown>
  1146. 289.88 s > at <unknown source file>:<unknown line>
  1147. 289.88 s > 28: <test_runs[9b7e2dc2dc4f29b0]::aa_aa::important::aa_aa_local_inspect_backend_consistency::{closure#0} as core[940e698046960fd5]::ops::function::FnOnce<()>>::call_once<unknown>
  1148. 289.88 s > at <unknown source file>:<unknown line>
  1149. 289.88 s > 29: test[75d6903177b1d7e9]::__rust_begin_short_backtrace::<core[940e698046960fd5]::result::Result<(), alloc[2ea6bcb46fca0c42]::string::String>, fn() -> core[940e698046960fd5]::result::Result<(), alloc[2ea6bcb46fca0c42]::string::String>><unknown>
  1150. 289.88 s > at <unknown source file>:<unknown line>
  1151. 289.88 s > 30: test[75d6903177b1d7e9]::run_test::{closure#0}<unknown>
  1152. 289.88 s > at <unknown source file>:<unknown line>
  1153. 289.88 s > 31: std[bcb96dfbba0ab899]::sys::backtrace::__rust_begin_short_backtrace::<test[75d6903177b1d7e9]::run_test::{closure#1}, ()><unknown>
  1154. 289.88 s > at <unknown source file>:<unknown line>
  1155. 289.88 s > 32: <std[bcb96dfbba0ab899]::thread::lifecycle::spawn_unchecked<test[75d6903177b1d7e9]::run_test::{closure#1}, ()>::{closure#1} as core[940e698046960fd5]::ops::function::FnOnce<()>>::call_once::{shim:vtable#0}<unknown>
  1156. 289.88 s > at <unknown source file>:<unknown line>
  1157. 289.88 s > 33: <std[bcb96dfbba0ab899]::sys::thread::unix::Thread>::new::thread_start<unknown>
  1158. 289.88 s > at <unknown source file>:<unknown line>
  1159. 289.88 s > 34: start_thread<unknown>
  1160. 289.88 s > at <unknown source file>:<unknown line>
  1161. 289.88 s > 35: __clone3<unknown>
  1162. 289.88 s > at <unknown source file>:<unknown line>
  1163. 289.88 s >
  1164. 289.88 s > Run with COLORBT_SHOW_HIDDEN=1 environment variable to disable frame filtering.
  1165. 289.88 s > Run with RUST_BACKTRACE=full to include source snippets.
  1166. 289.88 s > Warning: SpanTrace capture is Unsupported.
  1167. 289.88 s > Ensure that you've setup a tracing-error ErrorLayer and the semver versions are compatible
  1168. 289.88 s >
  1169. 289.88 s > FAIL [ 3.760s] (158/170) gammaloop-integration-tests::uv thermal_sunrise_uv
  1170. 289.88 s > stdout ---
  1171. 289.88 s >
  1172. 289.88 s > running 1 test
  1173. 289.88 s > test thermal_sunrise_uv ... FAILED
  1174. 289.88 s >
  1175. 289.88 s > failures:
  1176. 289.88 s >
  1177. 289.88 s > failures:
  1178. 289.88 s > thermal_sunrise_uv
  1179. 289.88 s >
  1180. 289.88 s > test result: FAILED. 0 passed; 1 failed; 0 ignored; 0 measured; 31 filtered out; finished in 3.74s
  1181. 289.88 s >
  1182. 289.88 s > stderr ---
  1183. 289.88 s > [2026-09-18 17:11:03.336] @gammaloop_api::se... INFO : Running command run generate
  1184. 289.88 s > [2026-09-18 17:11:03.336] @gammaloop_api::se... INFO : Starting command block generate
  1185. 289.88 s > [2026-09-18 17:11:03.337] @gammaloop_api::se... INFO : Running command import model sm-default.json
  1186. 289.88 s > [2026-09-18 17:11:03.337] @import::model INFO : Loading built-in JSON model sm-default
  1187. 289.88 s > [2026-09-18 17:11:03.386] @gammalooprs::model INFO : The following 15 external parameters were forced to zero by the restriction card:
  1188. 289.88 s > lamWS, AWS, rhoWS, etaWS, ymc, yme, ymm, MC, Me, MM, WTau, muQ, muLe, muLmu, muLtau
  1189. 289.88 s > [2026-09-18 17:11:03.386] @gammalooprs::model INFO : The following 34 vertex rules were removed by the restriction card:
  1190. 289.88 s > V_82 -> (c~, d, G+) | V_83 -> (t~, d, G+) | V_84 -> (c~, s, G+) | V_85 -> (t~, s, G+) | V_86 -> (u~, b, G+) | V_87 -> (c~, b, G+) | V_90 -> (c~, d, W+) | V_91 -> (t~, d, W+) | V_92 -> (u~, s, W+) | V_94 -> (t~, s, W+) | V_95 -> (u~, b, W+) | V_96 -> (c~, b, W+) | V_101 -> (e+, e-, G0) | V_102 -> (mu+, mu-, G0) | V_104 -> (e+, e-, H) | V_105 -> (mu+, mu-, H) | V_110 -> (ve~, e-, G+) | V_111 -> (vm~, mu-, G+) | V_116 -> (b~, u, G-) | V_117 -> (d~, c, G-) | V_118 -> (s~, c, G-) | V_119 -> (b~, c, G-) | V_120 -> (d~, t, G-) | V_121 -> (s~, t, G-) | V_124 -> (s~, u, W-) | V_125 -> (b~, u, W-) | V_126 -> (d~, c, W-) | V_128 -> (b~, c, W-) | V_129 -> (d~, t, W-) | V_130 -> (s~, t, W-) | V_138 -> (c~, c, G0) | V_140 -> (c~, c, H) | V_145 -> (e+, ve, G-) | V_146 -> (mu+, vm, G-)
  1191. 289.88 s > [2026-09-18 17:11:03.386] @gammalooprs::model INFO : The following 36 couplings were removed by the restriction card:
  1192. 289.88 s > GC_13, GC_14, GC_16, GC_17, GC_18, GC_19, GC_20, GC_22, GC_23, GC_24, GC_25, GC_26, GC_28, GC_29, GC_42, GC_43, GC_44, GC_46, GC_47, GC_48, GC_84, GC_85, GC_86, GC_87, GC_88, GC_89, GC_90, GC_91, GC_92, GC_93, GC_101, GC_102, GC_103, GC_105, GC_106, GC_107
  1193. 289.88 s > [2026-09-18 17:11:03.387] @gammaloop_api::se... INFO : Running command remove processes
  1194. 289.88 s > [2026-09-18 17:11:03.387] @gammaloop_api::se... INFO : Running command generate amp {} > {} [{2}] | g u
  1195. 289.88 s > --numerator-grouping group_identical_graphs_up_to_scalar_rescaling
  1196. 289.88 s > --max-n-bridges 0
  1197. 289.88 s > --number-of-factorized-loop-subtopologies 1 1
  1198. 289.88 s > --number-of-anticommutating-loops 1 1
  1199. 289.88 s > [...]
  1200. 289.88 s > [2026-09-18 17:11:03.389] @feyngen::diagram_... INFO : 0s | Δ=0s | Starting Feynman graph generation with Symbolica...
  1201. 289.88 s > [2026-09-18 17:11:03.389] @feyngen::diagram_... INFO : 0s | Δ=0s | Number of graphs resulting from Symbolica generation: 3
  1202. 289.88 s > [2026-09-18 17:11:03.389] @feyngen::diagram_... INFO : 0s | Δ=0s | Number of graphs retained after removal of vetoed topologies: 2
  1203. 289.88 s > [2026-09-18 17:11:03.390] @feyngen::diagram_... INFO : 0s | Δ=0s | Number of graphs after vertex info assignment: 2
  1204. 289.88 s > [2026-09-18 17:11:03.390] @feyngen::diagram_... INFO : 0s | Δ=0s | Number of graphs after all complete graphs filters are applied: 2
  1205. 289.88 s > [2026-09-18 17:11:03.390] @feyngen::diagram_... INFO : 0s | Δ=0s | Number of graphs after closed anticommutating chains analysis: 1
  1206. 289.88 s > [2026-09-18 17:11:03.390] @feyngen::diagram_... INFO : 0s | Δ=0s | Number of graphs after symmetrization of external states: 1
  1207. 289.88 s > [2026-09-18 17:11:03.390] @feyngen::diagram_... INFO : 0s | Δ=0s | Number of graphs after canonization of vertices, edges and flows (graph labels assigned here): 1
  1208. 289.88 s > [2026-09-18 17:11:03.413] @feyngen::diagram_... INFO : 0s | Δ=0s | Number of graphs after numerator-aware grouping with strategy 'up to a scalar rescaling': 1 (1 isomorphically unique graph, 0 color zero, 0 lorentz zero, 0 grouped and 0 cancellation)
  1209. 289.88 s > [2026-09-18 17:11:03.413] @feyngen::diagram_... INFO : ( Sum of the symmetry factors from each graph generated = -1/2 )
  1210. 289.88 s > [2026-09-18 17:11:03.413] @commands::generate INFO : Generated amplitude 1 graphs.
  1211. 289.88 s > [2026-09-18 17:11:03.414] @commands::generate INFO : Only diagram generation was requested, skipping integrand generation. You can generate integrands later using the 'generate existing <options>' command.
  1212. 289.88 s > [2026-09-18 17:11:03.414] @gammaloop_api::se... INFO : Running command generate
  1213. 289.88 s > The application panicked (crashed).
  1214. 289.88 s > Message: label _func_power_ not found
  1215. 289.88 s > Location: /nix/store/n9w914kh1cm59xx3spcs831cdyb56m32-vendor-cargo-deps/c19b7c6f923b580ac259164a89f2577984ad5ab09ee9d583b888f934adbbe8d0/symjit-2.25.6/src/symjit/assembler.rs:77
  1216. 289.88 s >
  1217. 289.88 s > ━━━━━━━━━━━━━━━━━━━━━━━━━━━━━━━━━━ BACKTRACE ━━━━━━━━━━━━━━━━━━━━━━━━━━━━━━━━━━━
  1218. 289.88 s > 1: <color_eyre[51793ea62743adbd]::config::PanicHook>::panic_report<unknown>
  1219. 289.88 s > at <unknown source file>:<unknown line>
  1220. 289.88 s > 2: <color_eyre[51793ea62743adbd]::config::PanicHook>::into_panic_hook::{closure#0}<unknown>
  1221. 289.88 s > at <unknown source file>:<unknown line>
  1222. 289.88 s > 3: std[bcb96dfbba0ab899]::panicking::panic_with_hook<unknown>
  1223. 289.88 s > at <unknown source file>:<unknown line>
  1224. 289.88 s > 4: std[bcb96dfbba0ab899]::panicking::panic_handler::{closure#0}<unknown>
  1225. 289.88 s > at <unknown source file>:<unknown line>
  1226. 289.88 s > 5: std[bcb96dfbba0ab899]::sys::backtrace::__rust_end_short_backtrace::<std[bcb96dfbba0ab899]::panicking::panic_handler::{closure#0}, !><unknown>
  1227. 289.88 s > at <unknown source file>:<unknown line>
  1228. 289.88 s > 6: __rustc[6c289b9f9c454d21]::rust_begin_unwind<unknown>
  1229. 289.88 s > at <unknown source file>:<unknown line>
  1230. 289.88 s > 7: core[940e698046960fd5]::panicking::panic_fmt<unknown>
  1231. 289.88 s > at <unknown source file>:<unknown line>
  1232. 289.88 s > 8: <symjit[e408de789c333cd]::symjit::assembler::Assembler>::apply_jumps<unknown>
  1233. 289.88 s > at <unknown source file>:<unknown line>
  1234. 289.88 s > 9: <symjit[e408de789c333cd]::symjit::builder::Builder>::compile_from_mir::<symjit[e408de789c333cd]::symjit::amd::complex::AmdComplexGenerator><unknown>
  1235. 289.88 s > at <unknown source file>:<unknown line>
  1236. 289.88 s > 10: <symjit[e408de789c333cd]::symjit::runnable::Application>::compile_ty<unknown>
  1237. 289.88 s > at <unknown source file>:<unknown line>
  1238. 289.88 s > 11: <symjit[e408de789c333cd]::symjit::runnable::Application>::with_mir<unknown>
  1239. 289.88 s > at <unknown source file>:<unknown line>
  1240. 289.88 s > 12: <symjit[e408de789c333cd]::symjit::composer::DirectTranslator as symjit[e408de789c333cd]::symjit::composer::Composer>::compile<unknown>
  1241. 289.88 s > at <unknown source file>:<unknown line>
  1242. 289.88 s > 13: <symjit[e408de789c333cd]::symjit::compiler::Translator as symjit[e408de789c333cd]::symjit::composer::Composer>::compile<unknown>
  1243. 289.88 s > at <unknown source file>:<unknown line>
  1244. 289.88 s > 14: <numerica[124dab8567f4861e]::domains::float::complex::Complex<f64> as symbolica[10e259bab675d243]::evaluate::backend::JITCompiledNumber>::jit_compile<unknown>
  1245. 289.88 s > at <unknown source file>:<unknown line>
  1246. 289.88 s > 15: <gammalooprs[917cbd3df9e68f8f]::integrands::process::evaluators::GenericEvaluator>::activate_symjit<unknown>
  1247. 289.88 s > at <unknown source file>:<unknown line>
  1248. 289.88 s > 16: <gammalooprs[917cbd3df9e68f8f]::integrands::process::amplitude::AmplitudeIntegrand>::prepare_runtime_backends_after_generation_with_compile_times<unknown>
  1249. 289.88 s > at <unknown source file>:<unknown line>
  1250. 289.88 s > 17: <gammalooprs[917cbd3df9e68f8f]::processes::amplitude::Amplitude>::build_integrand<unknown>
  1251. 289.88 s > at <unknown source file>:<unknown line>
  1252. 289.88 s > 18: <gammalooprs[917cbd3df9e68f8f]::processes::process::Process>::generate_integrands<unknown>
  1253. 289.88 s > at <unknown source file>:<unknown line>
  1254. 289.88 s > 19: <gammalooprs[917cbd3df9e68f8f]::processes::ProcessList>::generate_integrands<unknown>
  1255. 289.88 s > at <unknown source file>:<unknown line>
  1256. 289.88 s > 20: <gammaloop_api[9ebf6628f97aeb57]::state::State>::generate_integrands<unknown>
  1257. 289.88 s > at <unknown source file>:<unknown line>
  1258. 289.88 s > 21: <gammaloop_api[9ebf6628f97aeb57]::commands::generate::Generate>::run::<&std[bcb96dfbba0ab899]::path::PathBuf><unknown>
  1259. 289.88 s > at <unknown source file>:<unknown line>
  1260. 289.88 s > 22: <gammaloop_api[9ebf6628f97aeb57]::commands::Commands>::run<unknown>
  1261. 289.88 s > at <unknown source file>:<unknown line>
  1262. 289.88 s > 23: <gammaloop_api[9ebf6628f97aeb57]::session::CliSession>::execute_prepared<unknown>
  1263. 289.88 s > at <unknown source file>:<unknown line>
  1264. 289.88 s > 24: <gammaloop_api[9ebf6628f97aeb57]::session::CliSession>::execute_prepared_commands<unknown>
  1265. 289.88 s > at <unknown source file>:<unknown line>
  1266. 289.88 s > 25: <gammaloop_api[9ebf6628f97aeb57]::session::CliSession>::execute_prepared<unknown>
  1267. 289.88 s > at <unknown source file>:<unknown line>
  1268. 289.88 s > 26: <gammaloop_api[9ebf6628f97aeb57]::session::CliSession>::execute_command<unknown>
  1269. 289.88 s > at <unknown source file>:<unknown line>
  1270. 289.88 s > 27: <gammaloop_integration_tests[191607b70c61cd5a]::CLIState>::run_command<unknown>
  1271. 289.88 s > at <unknown source file>:<unknown line>
  1272. 289.88 s > 28: uv[3c7454ef256d6487]::run_single_integrated_uv_case<unknown>
  1273. 289.88 s > at <unknown source file>:<unknown line>
  1274. 289.88 s > 29: <uv[3c7454ef256d6487]::thermal_sunrise_uv::{closure#0} as core[940e698046960fd5]::ops::function::FnOnce<()>>::call_once<unknown>
  1275. 289.88 s > at <unknown source file>:<unknown line>
  1276. 289.88 s > 30: test[75d6903177b1d7e9]::__rust_begin_short_backtrace::<core[940e698046960fd5]::result::Result<(), alloc[2ea6bcb46fca0c42]::string::String>, fn() -> core[940e698046960fd5]::result::Result<(), alloc[2ea6bcb46fca0c42]::string::String>><unknown>
  1277. 289.88 s > at <unknown source file>:<unknown line>
  1278. 289.88 s > 31: test[75d6903177b1d7e9]::run_test::{closure#0}<unknown>
  1279. 289.88 s > at <unknown source file>:<unknown line>
  1280. 289.88 s > 32: std[bcb96dfbba0ab899]::sys::backtrace::__rust_begin_short_backtrace::<test[75d6903177b1d7e9]::run_test::{closure#1}, ()><unknown>
  1281. 289.88 s > at <unknown source file>:<unknown line>
  1282. 289.88 s > 33: <std[bcb96dfbba0ab899]::thread::lifecycle::spawn_unchecked<test[75d6903177b1d7e9]::run_test::{closure#1}, ()>::{closure#1} as core[940e698046960fd5]::ops::function::FnOnce<()>>::call_once::{shim:vtable#0}<unknown>
  1283. 289.88 s > at <unknown source file>:<unknown line>
  1284. 289.88 s > 34: <std[bcb96dfbba0ab899]::sys::thread::unix::Thread>::new::thread_start<unknown>
  1285. 289.88 s > at <unknown source file>:<unknown line>
  1286. 289.88 s > 35: start_thread<unknown>
  1287. 289.88 s > at <unknown source file>:<unknown line>
  1288. 289.88 s > 36: __clone3<unknown>
  1289. 289.88 s > at <unknown source file>:<unknown line>
  1290. 289.88 s >
  1291. 289.88 s > Run with COLORBT_SHOW_HIDDEN=1 environment variable to disable frame filtering.
  1292. 289.88 s > Run with RUST_BACKTRACE=full to include source snippets.
  1293. 289.88 s > Warning: SpanTrace capture is Unsupported.
  1294. 289.88 s > Ensure that you've setup a tracing-error ErrorLayer and the semver versions are compatible
  1295. 289.88 s >
  1296. 289.88 s > ------------
  1297. 289.88 s > Summary [ 220.826s] 170 tests run: 168 passed, 2 failed, 209 skipped
  1298. 289.88 s > FAIL [ 2.807s] ( 55/170) gammaloop-integration-tests::test_runs aa_aa::important::aa_aa_local_inspect_backend_consistency
  1299. 289.88 s > stdout ---
  1300. 289.88 s >
  1301. 289.88 s > running 1 test
  1302. 289.88 s > test aa_aa::important::aa_aa_local_inspect_backend_consistency ... FAILED
  1303. 289.88 s >
  1304. 289.88 s > failures:
  1305. 289.88 s >
  1306. 289.88 s > failures:
  1307. 289.88 s > aa_aa::important::aa_aa_local_inspect_backend_consistency
  1308. 289.88 s >
  1309. 289.88 s > test result: FAILED. 0 passed; 1 failed; 0 ignored; 0 measured; 274 filtered out; finished in 2.79s
  1310. 289.88 s >
  1311. 289.88 s > stderr ---
  1312. 289.88 s > [2026-09-18 17:10:15.861] @gammaloop_api::se... INFO : Running command import model sm-default.json
  1313. 289.88 s > [2026-09-18 17:10:15.861] @import::model INFO : Loading built-in JSON model sm-default
  1314. 289.88 s > [2026-09-18 17:10:15.883] @gammalooprs::model INFO : The following 15 external parameters were forced to zero by the restriction card:
  1315. 289.88 s > lamWS, AWS, rhoWS, etaWS, ymc, yme, ymm, MC, Me, MM, WTau, muQ, muLe, muLmu, muLtau
  1316. 289.88 s > [2026-09-18 17:10:15.883] @gammalooprs::model INFO : The following 34 vertex rules were removed by the restriction card:
  1317. 289.88 s > V_82 -> (c~, d, G+) | V_83 -> (t~, d, G+) | V_84 -> (c~, s, G+) | V_85 -> (t~, s, G+) | V_86 -> (u~, b, G+) | V_87 -> (c~, b, G+) | V_90 -> (c~, d, W+) | V_91 -> (t~, d, W+) | V_92 -> (u~, s, W+) | V_94 -> (t~, s, W+) | V_95 -> (u~, b, W+) | V_96 -> (c~, b, W+) | V_101 -> (e+, e-, G0) | V_102 -> (mu+, mu-, G0) | V_104 -> (e+, e-, H) | V_105 -> (mu+, mu-, H) | V_110 -> (ve~, e-, G+) | V_111 -> (vm~, mu-, G+) | V_116 -> (b~, u, G-) | V_117 -> (d~, c, G-) | V_118 -> (s~, c, G-) | V_119 -> (b~, c, G-) | V_120 -> (d~, t, G-) | V_121 -> (s~, t, G-) | V_124 -> (s~, u, W-) | V_125 -> (b~, u, W-) | V_126 -> (d~, c, W-) | V_128 -> (b~, c, W-) | V_129 -> (d~, t, W-) | V_130 -> (s~, t, W-) | V_138 -> (c~, c, G0) | V_140 -> (c~, c, H) | V_145 -> (e+, ve, G-) | V_146 -> (mu+, vm, G-)
  1318. 289.88 s > [2026-09-18 17:10:15.883] @gammalooprs::model INFO : The following 36 couplings were removed by the restriction card:
  1319. 289.88 s > GC_13, GC_14, GC_16, GC_17, GC_18, GC_19, GC_20, GC_22, GC_23, GC_24, GC_25, GC_26, GC_28, GC_29, GC_42, GC_43, GC_44, GC_46, GC_47, GC_48, GC_84, GC_85, GC_86, GC_87, GC_88, GC_89, GC_90, GC_91, GC_92, GC_93, GC_101, GC_102, GC_103, GC_105, GC_106, GC_107
  1320. 289.88 s > [2026-09-18 17:10:15.884] @gammaloop_api::se... INFO : Running command run set_model_parameters
  1321. 289.88 s > [2026-09-18 17:10:15.884] @gammaloop_api::se... INFO : Starting command block set_model_parameters
  1322. 289.88 s > [2026-09-18 17:10:15.884] @gammaloop_api::se... INFO : Running command set model MT=173.0
  1323. 289.88 s > [2026-09-18 17:10:15.888] @gammaloop_api::se... INFO : Running command set model WT=0.0
  1324. 289.88 s > [2026-09-18 17:10:15.893] @gammaloop_api::se... INFO : Running command set model ymt=173.0
  1325. 289.88 s > [2026-09-18 17:10:15.897] @gammaloop_api::se... INFO : Running command set model aS=0.118
  1326. 289.88 s > [2026-09-18 17:10:15.902] @gammaloop_api::se... INFO : Running command set model aEWM1=137.036
  1327. 289.88 s > [2026-09-18 17:10:15.906] @gammaloop_api::se... INFO : Running command set model Gf=1.166390e-05
  1328. 289.88 s > [2026-09-18 17:10:15.911] @gammaloop_api::se... INFO : Running command set model MZ=91.188
  1329. 289.88 s > [2026-09-18 17:10:15.917] @gammaloop_api::se... INFO : Running command set global string '
  1330. 289.88 s > [global.generation.compile]
  1331. 289.88 s > compilation_mode = "symjit"
  1332. 289.88 s > optimization_level = "O0"
  1333. 289.88 s > fast_math = false
  1334. 289.88 s > [...]
  1335. 289.88 s > [2026-09-18 17:10:15.918] @gammaloop_api::se... INFO : Running command import graphs ./examples/cli/aa_aa/1L/aa_aa_1L.dot -p aa_aa_all_helicities -i 1L_ppmm -o
  1336. 289.88 s > [2026-09-18 17:10:15.918] @commands::import INFO : Loading graphs from '/build/source/examples/cli/aa_aa/1L/aa_aa_1L.dot'
  1337. 289.88 s > [2026-09-18 17:10:15.930] @gammaloop_api::se... INFO : Running command generate existing -p aa_aa_all_helicities
  1338. 289.88 s > The application panicked (crashed).
  1339. 289.88 s > Message: label _func_power_ not found
  1340. 289.88 s > Location: /nix/store/n9w914kh1cm59xx3spcs831cdyb56m32-vendor-cargo-deps/c19b7c6f923b580ac259164a89f2577984ad5ab09ee9d583b888f934adbbe8d0/symjit-2.25.6/src/symjit/assembler.rs:77
  1341. 289.88 s >
  1342. 289.88 s > ━━━━━━━━━━━━━━━━━━━━━━━━━━━━━━━━━━ BACKTRACE ━━━━━━━━━━━━━━━━━━━━━━━━━━━━━━━━━━━
  1343. 289.88 s > 1: <color_eyre[51793ea62743adbd]::config::PanicHook>::panic_report<unknown>
  1344. 289.88 s > at <unknown source file>:<unknown line>
  1345. 289.88 s > 2: <color_eyre[51793ea62743adbd]::config::PanicHook>::into_panic_hook::{closure#0}<unknown>
  1346. 289.88 s > at <unknown source file>:<unknown line>
  1347. 289.88 s > 3: std[bcb96dfbba0ab899]::panicking::panic_with_hook<unknown>
  1348. 289.88 s > at <unknown source file>:<unknown line>
  1349. 289.88 s > 4: std[bcb96dfbba0ab899]::panicking::panic_handler::{closure#0}<unknown>
  1350. 289.88 s > at <unknown source file>:<unknown line>
  1351. 289.88 s > 5: std[bcb96dfbba0ab899]::sys::backtrace::__rust_end_short_backtrace::<std[bcb96dfbba0ab899]::panicking::panic_handler::{closure#0}, !><unknown>
  1352. 289.88 s > at <unknown source file>:<unknown line>
  1353. 289.88 s > 6: __rustc[6c289b9f9c454d21]::rust_begin_unwind<unknown>
  1354. 289.88 s > at <unknown source file>:<unknown line>
  1355. 289.88 s > 7: core[940e698046960fd5]::panicking::panic_fmt<unknown>
  1356. 289.88 s > at <unknown source file>:<unknown line>
  1357. 289.88 s > 8: <symjit[e408de789c333cd]::symjit::assembler::Assembler>::apply_jumps<unknown>
  1358. 289.88 s > at <unknown source file>:<unknown line>
  1359. 289.88 s > 9: <symjit[e408de789c333cd]::symjit::builder::Builder>::compile_from_mir::<symjit[e408de789c333cd]::symjit::amd::complex::AmdComplexGenerator><unknown>
  1360. 289.88 s > at <unknown source file>:<unknown line>
  1361. 289.88 s > 10: <symjit[e408de789c333cd]::symjit::runnable::Application>::compile_ty<unknown>
  1362. 289.88 s > at <unknown source file>:<unknown line>
  1363. 289.88 s > 11: <symjit[e408de789c333cd]::symjit::runnable::Application>::with_mir<unknown>
  1364. 289.88 s > at <unknown source file>:<unknown line>
  1365. 289.88 s > 12: <symjit[e408de789c333cd]::symjit::composer::DirectTranslator as symjit[e408de789c333cd]::symjit::composer::Composer>::compile<unknown>
  1366. 289.88 s > at <unknown source file>:<unknown line>
  1367. 289.88 s > 13: <symjit[e408de789c333cd]::symjit::compiler::Translator as symjit[e408de789c333cd]::symjit::composer::Composer>::compile<unknown>
  1368. 289.88 s > at <unknown source file>:<unknown line>
  1369. 289.88 s > 14: <numerica[124dab8567f4861e]::domains::float::complex::Complex<f64> as symbolica[10e259bab675d243]::evaluate::backend::JITCompiledNumber>::jit_compile<unknown>
  1370. 289.88 s > at <unknown source file>:<unknown line>
  1371. 289.88 s > 15: <gammalooprs[917cbd3df9e68f8f]::integrands::process::evaluators::GenericEvaluator>::activate_symjit<unknown>
  1372. 289.88 s > at <unknown source file>:<unknown line>
  1373. 289.88 s > 16: <gammalooprs[917cbd3df9e68f8f]::integrands::process::amplitude::AmplitudeIntegrand>::prepare_runtime_backends_after_generation_with_compile_times<unknown>
  1374. 289.88 s > at <unknown source file>:<unknown line>
  1375. 289.88 s > 17: <gammalooprs[917cbd3df9e68f8f]::processes::amplitude::Amplitude>::build_integrand<unknown>
  1376. 289.88 s > at <unknown source file>:<unknown line>
  1377. 289.88 s > 18: <gammalooprs[917cbd3df9e68f8f]::processes::process::Process>::generate_integrands<unknown>
  1378. 289.88 s > at <unknown source file>:<unknown line>
  1379. 289.88 s > 19: <gammaloop_api[9ebf6628f97aeb57]::state::State>::generate_integrand<unknown>
  1380. 289.88 s > at <unknown source file>:<unknown line>
  1381. 289.88 s > 20: <gammaloop_api[9ebf6628f97aeb57]::commands::generate::Generate>::run::<&std[bcb96dfbba0ab899]::path::PathBuf><unknown>
  1382. 289.88 s > at <unknown source file>:<unknown line>
  1383. 289.88 s > 21: <gammaloop_api[9ebf6628f97aeb57]::commands::Commands>::run<unknown>
  1384. 289.88 s > at <unknown source file>:<unknown line>
  1385. 289.88 s > 22: <gammaloop_api[9ebf6628f97aeb57]::session::CliSession>::execute_prepared<unknown>
  1386. 289.88 s > at <unknown source file>:<unknown line>
  1387. 289.88 s > 23: <gammaloop_api[9ebf6628f97aeb57]::session::CliSession>::execute_command<unknown>
  1388. 289.88 s > at <unknown source file>:<unknown line>
  1389. 289.88 s > 24: <gammaloop_integration_tests[191607b70c61cd5a]::CLIState>::run_command<unknown>
  1390. 289.88 s > at <unknown source file>:<unknown line>
  1391. 289.88 s > 25: test_runs[9b7e2dc2dc4f29b0]::aa_aa::generate_aa_aa_helicity_family<unknown>
  1392. 289.88 s > at <unknown source file>:<unknown line>
  1393. 289.88 s > 26: <test_runs[9b7e2dc2dc4f29b0]::aa_aa::important::aa_aa_local_inspect_backend_consistency::{closure#0} as core[940e698046960fd5]::ops::function::FnOnce<()>>::call_once<unknown>
  1394. 289.88 s > at <unknown source file>:<unknown line>
  1395. 289.88 s > 27: serial_test[cd99724524a2f1c0]::serial_code_lock::local_serial_core_with_return::<(), eyre[cb2fd339c0c40fca]::Report><unknown>
  1396. 289.88 s > at <unknown source file>:<unknown line>
  1397. 289.88 s > 28: <test_runs[9b7e2dc2dc4f29b0]::aa_aa::important::aa_aa_local_inspect_backend_consistency::{closure#0} as core[940e698046960fd5]::ops::function::FnOnce<()>>::call_once<unknown>
  1398. 289.88 s > at <unknown source file>:<unknown line>
  1399. 289.88 s > 29: test[75d6903177b1d7e9]::__rust_begin_short_backtrace::<core[940e698046960fd5]::result::Result<(), alloc[2ea6bcb46fca0c42]::string::String>, fn() -> core[940e698046960fd5]::result::Result<(), alloc[2ea6bcb46fca0c42]::string::String>><unknown>
  1400. 289.88 s > at <unknown source file>:<unknown line>
  1401. 289.88 s > 30: test[75d6903177b1d7e9]::run_test::{closure#0}<unknown>
  1402. 289.88 s > at <unknown source file>:<unknown line>
  1403. 289.88 s > 31: std[bcb96dfbba0ab899]::sys::backtrace::__rust_begin_short_backtrace::<test[75d6903177b1d7e9]::run_test::{closure#1}, ()><unknown>
  1404. 289.88 s > at <unknown source file>:<unknown line>
  1405. 289.88 s > 32: <std[bcb96dfbba0ab899]::thread::lifecycle::spawn_unchecked<test[75d6903177b1d7e9]::run_test::{closure#1}, ()>::{closure#1} as core[940e698046960fd5]::ops::function::FnOnce<()>>::call_once::{shim:vtable#0}<unknown>
  1406. 289.88 s > at <unknown source file>:<unknown line>
  1407. 289.88 s > 33: <std[bcb96dfbba0ab899]::sys::thread::unix::Thread>::new::thread_start<unknown>
  1408. 289.88 s > at <unknown source file>:<unknown line>
  1409. 289.88 s > 34: start_thread<unknown>
  1410. 289.88 s > at <unknown source file>:<unknown line>
  1411. 289.88 s > 35: __clone3<unknown>
  1412. 289.88 s > at <unknown source file>:<unknown line>
  1413. 289.88 s >
  1414. 289.88 s > Run with COLORBT_SHOW_HIDDEN=1 environment variable to disable frame filtering.
  1415. 289.88 s > Run with RUST_BACKTRACE=full to include source snippets.
  1416. 289.88 s > Warning: SpanTrace capture is Unsupported.
  1417. 289.88 s > Ensure that you've setup a tracing-error ErrorLayer and the semver versions are compatible
  1418. 289.88 s >
  1419. 289.88 s > FAIL [ 3.760s] (158/170) gammaloop-integration-tests::uv thermal_sunrise_uv
  1420. 289.88 s > stdout ---
  1421. 289.88 s >
  1422. 289.88 s > running 1 test
  1423. 289.88 s > test thermal_sunrise_uv ... FAILED
  1424. 289.88 s >
  1425. 289.88 s > failures:
  1426. 289.88 s >
  1427. 289.88 s > failures:
  1428. 289.88 s > thermal_sunrise_uv
  1429. 289.88 s >
  1430. 289.88 s > test result: FAILED. 0 passed; 1 failed; 0 ignored; 0 measured; 31 filtered out; finished in 3.74s
  1431. 289.88 s >
  1432. 289.88 s > stderr ---
  1433. 289.88 s > [2026-09-18 17:11:03.336] @gammaloop_api::se... INFO : Running command run generate
  1434. 289.89 s > [2026-09-18 17:11:03.336] @gammaloop_api::se... INFO : Starting command block generate
  1435. 289.89 s > [2026-09-18 17:11:03.337] @gammaloop_api::se... INFO : Running command import model sm-default.json
  1436. 289.89 s > [2026-09-18 17:11:03.337] @import::model INFO : Loading built-in JSON model sm-default
  1437. 289.89 s > [2026-09-18 17:11:03.386] @gammalooprs::model INFO : The following 15 external parameters were forced to zero by the restriction card:
  1438. 289.89 s > lamWS, AWS, rhoWS, etaWS, ymc, yme, ymm, MC, Me, MM, WTau, muQ, muLe, muLmu, muLtau
  1439. 289.89 s > [2026-09-18 17:11:03.386] @gammalooprs::model INFO : The following 34 vertex rules were removed by the restriction card:
  1440. 289.89 s > V_82 -> (c~, d, G+) | V_83 -> (t~, d, G+) | V_84 -> (c~, s, G+) | V_85 -> (t~, s, G+) | V_86 -> (u~, b, G+) | V_87 -> (c~, b, G+) | V_90 -> (c~, d, W+) | V_91 -> (t~, d, W+) | V_92 -> (u~, s, W+) | V_94 -> (t~, s, W+) | V_95 -> (u~, b, W+) | V_96 -> (c~, b, W+) | V_101 -> (e+, e-, G0) | V_102 -> (mu+, mu-, G0) | V_104 -> (e+, e-, H) | V_105 -> (mu+, mu-, H) | V_110 -> (ve~, e-, G+) | V_111 -> (vm~, mu-, G+) | V_116 -> (b~, u, G-) | V_117 -> (d~, c, G-) | V_118 -> (s~, c, G-) | V_119 -> (b~, c, G-) | V_120 -> (d~, t, G-) | V_121 -> (s~, t, G-) | V_124 -> (s~, u, W-) | V_125 -> (b~, u, W-) | V_126 -> (d~, c, W-) | V_128 -> (b~, c, W-) | V_129 -> (d~, t, W-) | V_130 -> (s~, t, W-) | V_138 -> (c~, c, G0) | V_140 -> (c~, c, H) | V_145 -> (e+, ve, G-) | V_146 -> (mu+, vm, G-)
  1441. 289.89 s > [2026-09-18 17:11:03.386] @gammalooprs::model INFO : The following 36 couplings were removed by the restriction card:
  1442. 289.89 s > GC_13, GC_14, GC_16, GC_17, GC_18, GC_19, GC_20, GC_22, GC_23, GC_24, GC_25, GC_26, GC_28, GC_29, GC_42, GC_43, GC_44, GC_46, GC_47, GC_48, GC_84, GC_85, GC_86, GC_87, GC_88, GC_89, GC_90, GC_91, GC_92, GC_93, GC_101, GC_102, GC_103, GC_105, GC_106, GC_107
  1443. 289.89 s > [2026-09-18 17:11:03.387] @gammaloop_api::se... INFO : Running command remove processes
  1444. 289.89 s > [2026-09-18 17:11:03.387] @gammaloop_api::se... INFO : Running command generate amp {} > {} [{2}] | g u
  1445. 289.89 s > --numerator-grouping group_identical_graphs_up_to_scalar_rescaling
  1446. 289.89 s > --max-n-bridges 0
  1447. 289.89 s > --number-of-factorized-loop-subtopologies 1 1
  1448. 289.89 s > --number-of-anticommutating-loops 1 1
  1449. 289.89 s > [...]
  1450. 289.89 s > [2026-09-18 17:11:03.389] @feyngen::diagram_... INFO : 0s | Δ=0s | Starting Feynman graph generation with Symbolica...
  1451. 289.89 s > [2026-09-18 17:11:03.389] @feyngen::diagram_... INFO : 0s | Δ=0s | Number of graphs resulting from Symbolica generation: 3
  1452. 289.89 s > [2026-09-18 17:11:03.389] @feyngen::diagram_... INFO : 0s | Δ=0s | Number of graphs retained after removal of vetoed topologies: 2
  1453. 289.89 s > [2026-09-18 17:11:03.390] @feyngen::diagram_... INFO : 0s | Δ=0s | Number of graphs after vertex info assignment: 2
  1454. 289.89 s > [2026-09-18 17:11:03.390] @feyngen::diagram_... INFO : 0s | Δ=0s | Number of graphs after all complete graphs filters are applied: 2
  1455. 289.89 s > [2026-09-18 17:11:03.390] @feyngen::diagram_... INFO : 0s | Δ=0s | Number of graphs after closed anticommutating chains analysis: 1
  1456. 289.89 s > [2026-09-18 17:11:03.390] @feyngen::diagram_... INFO : 0s | Δ=0s | Number of graphs after symmetrization of external states: 1
  1457. 289.89 s > [2026-09-18 17:11:03.390] @feyngen::diagram_... INFO : 0s | Δ=0s | Number of graphs after canonization of vertices, edges and flows (graph labels assigned here): 1
  1458. 289.89 s > [2026-09-18 17:11:03.413] @feyngen::diagram_... INFO : 0s | Δ=0s | Number of graphs after numerator-aware grouping with strategy 'up to a scalar rescaling': 1 (1 isomorphically unique graph, 0 color zero, 0 lorentz zero, 0 grouped and 0 cancellation)
  1459. 289.89 s > [2026-09-18 17:11:03.413] @feyngen::diagram_... INFO : ( Sum of the symmetry factors from each graph generated = -1/2 )
  1460. 289.89 s > [2026-09-18 17:11:03.413] @commands::generate INFO : Generated amplitude 1 graphs.
  1461. 289.89 s > [2026-09-18 17:11:03.414] @commands::generate INFO : Only diagram generation was requested, skipping integrand generation. You can generate integrands later using the 'generate existing <options>' command.
  1462. 289.89 s > [2026-09-18 17:11:03.414] @gammaloop_api::se... INFO : Running command generate
  1463. 289.89 s > The application panicked (crashed).
  1464. 289.89 s > Message: label _func_power_ not found
  1465. 289.89 s > Location: /nix/store/n9w914kh1cm59xx3spcs831cdyb56m32-vendor-cargo-deps/c19b7c6f923b580ac259164a89f2577984ad5ab09ee9d583b888f934adbbe8d0/symjit-2.25.6/src/symjit/assembler.rs:77
  1466. 289.89 s >
  1467. 289.89 s > ━━━━━━━━━━━━━━━━━━━━━━━━━━━━━━━━━━ BACKTRACE ━━━━━━━━━━━━━━━━━━━━━━━━━━━━━━━━━━━
  1468. 289.89 s > 1: <color_eyre[51793ea62743adbd]::config::PanicHook>::panic_report<unknown>
  1469. 289.89 s > at <unknown source file>:<unknown line>
  1470. 289.89 s > 2: <color_eyre[51793ea62743adbd]::config::PanicHook>::into_panic_hook::{closure#0}<unknown>
  1471. 289.89 s > at <unknown source file>:<unknown line>
  1472. 289.89 s > 3: std[bcb96dfbba0ab899]::panicking::panic_with_hook<unknown>
  1473. 289.89 s > at <unknown source file>:<unknown line>
  1474. 289.89 s > 4: std[bcb96dfbba0ab899]::panicking::panic_handler::{closure#0}<unknown>
  1475. 289.89 s > at <unknown source file>:<unknown line>
  1476. 289.89 s > 5: std[bcb96dfbba0ab899]::sys::backtrace::__rust_end_short_backtrace::<std[bcb96dfbba0ab899]::panicking::panic_handler::{closure#0}, !><unknown>
  1477. 289.89 s > at <unknown source file>:<unknown line>
  1478. 289.89 s > 6: __rustc[6c289b9f9c454d21]::rust_begin_unwind<unknown>
  1479. 289.89 s > at <unknown source file>:<unknown line>
  1480. 289.89 s > 7: core[940e698046960fd5]::panicking::panic_fmt<unknown>
  1481. 289.89 s > at <unknown source file>:<unknown line>
  1482. 289.89 s > 8: <symjit[e408de789c333cd]::symjit::assembler::Assembler>::apply_jumps<unknown>
  1483. 289.89 s > at <unknown source file>:<unknown line>
  1484. 289.89 s > 9: <symjit[e408de789c333cd]::symjit::builder::Builder>::compile_from_mir::<symjit[e408de789c333cd]::symjit::amd::complex::AmdComplexGenerator><unknown>
  1485. 289.89 s > at <unknown source file>:<unknown line>
  1486. 289.89 s > 10: <symjit[e408de789c333cd]::symjit::runnable::Application>::compile_ty<unknown>
  1487. 289.89 s > at <unknown source file>:<unknown line>
  1488. 289.89 s > 11: <symjit[e408de789c333cd]::symjit::runnable::Application>::with_mir<unknown>
  1489. 289.89 s > at <unknown source file>:<unknown line>
  1490. 289.89 s > 12: <symjit[e408de789c333cd]::symjit::composer::DirectTranslator as symjit[e408de789c333cd]::symjit::composer::Composer>::compile<unknown>
  1491. 289.89 s > at <unknown source file>:<unknown line>
  1492. 289.89 s > 13: <symjit[e408de789c333cd]::symjit::compiler::Translator as symjit[e408de789c333cd]::symjit::composer::Composer>::compile<unknown>
  1493. 289.89 s > at <unknown source file>:<unknown line>
  1494. 289.89 s > 14: <numerica[124dab8567f4861e]::domains::float::complex::Complex<f64> as symbolica[10e259bab675d243]::evaluate::backend::JITCompiledNumber>::jit_compile<unknown>
  1495. 289.89 s > at <unknown source file>:<unknown line>
  1496. 289.89 s > 15: <gammalooprs[917cbd3df9e68f8f]::integrands::process::evaluators::GenericEvaluator>::activate_symjit<unknown>
  1497. 289.89 s > at <unknown source file>:<unknown line>
  1498. 289.89 s > 16: <gammalooprs[917cbd3df9e68f8f]::integrands::process::amplitude::AmplitudeIntegrand>::prepare_runtime_backends_after_generation_with_compile_times<unknown>
  1499. 289.89 s > at <unknown source file>:<unknown line>
  1500. 289.89 s > 17: <gammalooprs[917cbd3df9e68f8f]::processes::amplitude::Amplitude>::build_integrand<unknown>
  1501. 289.89 s > at <unknown source file>:<unknown line>
  1502. 289.89 s > 18: <gammalooprs[917cbd3df9e68f8f]::processes::process::Process>::generate_integrands<unknown>
  1503. 289.89 s > at <unknown source file>:<unknown line>
  1504. 289.89 s > 19: <gammalooprs[917cbd3df9e68f8f]::processes::ProcessList>::generate_integrands<unknown>
  1505. 289.89 s > at <unknown source file>:<unknown line>
  1506. 289.89 s > 20: <gammaloop_api[9ebf6628f97aeb57]::state::State>::generate_integrands<unknown>
  1507. 289.89 s > at <unknown source file>:<unknown line>
  1508. 289.89 s > 21: <gammaloop_api[9ebf6628f97aeb57]::commands::generate::Generate>::run::<&std[bcb96dfbba0ab899]::path::PathBuf><unknown>
  1509. 289.89 s > at <unknown source file>:<unknown line>
  1510. 289.89 s > 22: <gammaloop_api[9ebf6628f97aeb57]::commands::Commands>::run<unknown>
  1511. 289.89 s > at <unknown source file>:<unknown line>
  1512. 289.89 s > 23: <gammaloop_api[9ebf6628f97aeb57]::session::CliSession>::execute_prepared<unknown>
  1513. 289.89 s > at <unknown source file>:<unknown line>
  1514. 289.89 s > 24: <gammaloop_api[9ebf6628f97aeb57]::session::CliSession>::execute_prepared_commands<unknown>
  1515. 289.89 s > at <unknown source file>:<unknown line>
  1516. 289.89 s > 25: <gammaloop_api[9ebf6628f97aeb57]::session::CliSession>::execute_prepared<unknown>
  1517. 289.89 s > at <unknown source file>:<unknown line>
  1518. 289.89 s > 26: <gammaloop_api[9ebf6628f97aeb57]::session::CliSession>::execute_command<unknown>
  1519. 289.89 s > at <unknown source file>:<unknown line>
  1520. 289.89 s > 27: <gammaloop_integration_tests[191607b70c61cd5a]::CLIState>::run_command<unknown>
  1521. 289.89 s > at <unknown source file>:<unknown line>
  1522. 289.89 s > 28: uv[3c7454ef256d6487]::run_single_integrated_uv_case<unknown>
  1523. 289.89 s > at <unknown source file>:<unknown line>
  1524. 289.89 s > 29: <uv[3c7454ef256d6487]::thermal_sunrise_uv::{closure#0} as core[940e698046960fd5]::ops::function::FnOnce<()>>::call_once<unknown>
  1525. 289.89 s > at <unknown source file>:<unknown line>
  1526. 289.89 s > 30: test[75d6903177b1d7e9]::__rust_begin_short_backtrace::<core[940e698046960fd5]::result::Result<(), alloc[2ea6bcb46fca0c42]::string::String>, fn() -> core[940e698046960fd5]::result::Result<(), alloc[2ea6bcb46fca0c42]::string::String>><unknown>
  1527. 289.89 s > at <unknown source file>:<unknown line>
  1528. 289.89 s > 31: test[75d6903177b1d7e9]::run_test::{closure#0}<unknown>
  1529. 289.89 s > at <unknown source file>:<unknown line>
  1530. 289.89 s > 32: std[bcb96dfbba0ab899]::sys::backtrace::__rust_begin_short_backtrace::<test[75d6903177b1d7e9]::run_test::{closure#1}, ()><unknown>
  1531. 289.89 s > at <unknown source file>:<unknown line>
  1532. 289.89 s > 33: <std[bcb96dfbba0ab899]::thread::lifecycle::spawn_unchecked<test[75d6903177b1d7e9]::run_test::{closure#1}, ()>::{closure#1} as core[940e698046960fd5]::ops::function::FnOnce<()>>::call_once::{shim:vtable#0}<unknown>
  1533. 289.89 s > at <unknown source file>:<unknown line>
  1534. 289.89 s > 34: <std[bcb96dfbba0ab899]::sys::thread::unix::Thread>::new::thread_start<unknown>
  1535. 289.89 s > at <unknown source file>:<unknown line>
  1536. 289.89 s > 35: start_thread<unknown>
  1537. 289.89 s > at <unknown source file>:<unknown line>
  1538. 289.89 s > 36: __clone3<unknown>
  1539. 289.89 s > at <unknown source file>:<unknown line>
  1540. 289.89 s >
  1541. 289.89 s > Run with COLORBT_SHOW_HIDDEN=1 environment variable to disable frame filtering.
  1542. 289.89 s > Run with RUST_BACKTRACE=full to include source snippets.
  1543. 289.89 s > Warning: SpanTrace capture is Unsupported.
  1544. 289.89 s > Ensure that you've setup a tracing-error ErrorLayer and the semver versions are compatible
  1545. 289.89 s >
  1546. 289.89 s > error: test run failed
  1547. 289.89 s >
  1548. 289.89 s > ========== nextest test summary ==========
  1549. 289.89 s > report: target/nextest/ci_gammaloop/junit.xml
  1550. 289.89 s > tests: 170, failures: 2, errors: 0
  1551. 289.89 s >
  1552. 289.89 s > 1. gammaloop-integration-tests::test_runs::aa_aa::important::aa_aa_local_inspect_backend_consistency
  1553. 289.89 s > failure: test failure with exit code 101
  1554. 289.89 s > system-out
  1555. 289.89 s > running 1 test
  1556. 289.89 s > test aa_aa::important::aa_aa_local_inspect_backend_consistency ... FAILED
  1557. 289.89 s >
  1558. 289.89 s > failures:
  1559. 289.89 s >
  1560. 289.89 s > failures:
  1561. 289.89 s > aa_aa::important::aa_aa_local_inspect_backend_consistency
  1562. 289.89 s >
  1563. 289.89 s > test result: FAILED. 0 passed; 1 failed; 0 ignored; 0 measured; 274 filtered out; finished in 2.79s
  1564. 289.89 s > system-err
  1565. 289.89 s > [2026-09-18 17:10:15.861] @gammaloop_api::se... INFO : Running command import model sm-default.json
  1566. 289.89 s > [2026-09-18 17:10:15.861] @import::model INFO : Loading built-in JSON model sm-default
  1567. 289.89 s > [2026-09-18 17:10:15.883] @gammalooprs::model INFO : The following 15 external parameters were forced to zero by the restriction card:
  1568. 289.89 s > lamWS, AWS, rhoWS, etaWS, ymc, yme, ymm, MC, Me, MM, WTau, muQ, muLe, muLmu, muLtau
  1569. 289.89 s > [2026-09-18 17:10:15.883] @gammalooprs::model INFO : The following 34 vertex rules were removed by the restriction card:
  1570. 289.89 s > V_82 -> (c~, d, G+) | V_83 -> (t~, d, G+) | V_84 -> (c~, s, G+) | V_85 -> (t~, s, G+) | V_86 -> (u~, b, G+) | V_87 -> (c~, b, G+) | V_90 -> (c~, d, W+) | V_91 -> (t~, d, W+) | V_92 -> (u~, s, W+) | V_94 -> (t~, s, W+) | V_95 -> (u~, b, W+) | V_96 -> (c~, b, W+) | V_101 -> (e+, e-, G0) | V_102 -> (mu+, mu-, G0) | V_104 -> (e+, e-, H) | V_105 -> (mu+, mu-, H) | V_110 -> (ve~, e-, G+) | V_111 -> (vm~, mu-, G+) | V_116 -> (b~, u, G-) | V_117 -> (d~, c, G-) | V_118 -> (s~, c, G-) | V_119 -> (b~, c, G-) | V_120 -> (d~, t, G-) | V_121 -> (s~, t, G-) | V_124 -> (s~, u, W-) | V_125 -> (b~, u, W-) | V_126 -> (d~, c, W-) | V_128 -> (b~, c, W-) | V_129 -> (d~, t, W-) | V_130 -> (s~, t, W-) | V_138 -> (c~, c, G0) | V_140 -> (c~, c, H) | V_145 -> (e+, ve, G-) | V_146 -> (mu+, vm, G-)
  1571. 289.89 s > [2026-09-18 17:10:15.883] @gammalooprs::model INFO : The following 36 couplings were removed by the restriction card:
  1572. 289.89 s > GC_13, GC_14, GC_16, GC_17, GC_18, GC_19, GC_20, GC_22, GC_23, GC_24, GC_25, GC_26, GC_28, GC_29, GC_42, GC_43, GC_44, GC_46, GC_47, GC_48, GC_84, GC_85, GC_86, GC_87, GC_88, GC_89, GC_90, GC_91, GC_92, GC_93, GC_101, GC_102, GC_103, GC_105, GC_106, GC_107
  1573. 289.89 s > [2026-09-18 17:10:15.884] @gammaloop_api::se... INFO : Running command run set_model_parameters
  1574. 289.89 s > [2026-09-18 17:10:15.884] @gammaloop_api::se... INFO : Starting command block set_model_parameters
  1575. 289.89 s > [2026-09-18 17:10:15.884] @gammaloop_api::se... INFO : Running command set model MT=173.0
  1576. 289.89 s > [2026-09-18 17:10:15.888] @gammaloop_api::se... INFO : Running command set model WT=0.0
  1577. 289.89 s > [2026-09-18 17:10:15.893] @gammaloop_api::se... INFO : Running command set model ymt=173.0
  1578. 289.89 s > [2026-09-18 17:10:15.897] @gammaloop_api::se... INFO : Running command set model aS=0.118
  1579. 289.89 s > [2026-09-18 17:10:15.902] @gammaloop_api::se... INFO : Running command set model aEWM1=137.036
  1580. 289.89 s > [2026-09-18 17:10:15.906] @gammaloop_api::se... INFO : Running command set model Gf=1.166390e-05
  1581. 289.89 s > [2026-09-18 17:10:15.911] @gammaloop_api::se... INFO : Running command set model MZ=91.188
  1582. 289.89 s > [2026-09-18 17:10:15.917] @gammaloop_api::se... INFO : Running command set global string '
  1583. 289.89 s > [global.generation.compile]
  1584. 289.89 s > compilation_mode = "symjit"
  1585. 289.89 s > optimization_level = "O0"
  1586. 289.89 s > fast_math = false
  1587. 289.89 s > [...]
  1588. 289.89 s > [2026-09-18 17:10:15.918] @gammaloop_api::se... INFO : Running command import graphs ./examples/cli/aa_aa/1L/aa_aa_1L.dot -p aa_aa_all_helicities -i 1L_ppmm -o
  1589. 289.89 s > [2026-09-18 17:10:15.918] @commands::import INFO : Loading graphs from '/build/source/examples/cli/aa_aa/1L/aa_aa_1L.dot'
  1590. 289.89 s > [2026-09-18 17:10:15.930] @gammaloop_api::se... INFO : Running command generate existing -p aa_aa_all_helicities
  1591. 289.89 s > The application panicked (crashed).
  1592. 289.89 s > Message: label _func_power_ not found
  1593. 289.89 s > Location: /nix/store/n9w914kh1cm59xx3spcs831cdyb56m32-vendor-cargo-deps/c19b7c6f923b580ac259164a89f2577984ad5ab09ee9d583b888f934adbbe8d0/symjit-2.25.6/src/symjit/assembler.rs:77
  1594. 289.89 s >
  1595. 289.89 s > ━━━━━━━━━━━━━━━━━━━━━━━━━━━━━━━━━━ BACKTRACE ━━━━━━━━━━━━━━━━━━━━━━━━━━━━━━━━━━━
  1596. 289.89 s > 1: <color_eyre[51793ea62743adbd]::config::PanicHook>::panic_report<unknown>
  1597. 289.89 s > at <unknown source file>:<unknown line>
  1598. 289.89 s > 2: <color_eyre[51793ea62743adbd]::config::PanicHook>::into_panic_hook::{closure#0}<unknown>
  1599. 289.89 s > at <unknown source file>:<unknown line>
  1600. 289.89 s > 3: std[bcb96dfbba0ab899]::panicking::panic_with_hook<unknown>
  1601. 289.89 s > at <unknown source file>:<unknown line>
  1602. 289.89 s > 4: std[bcb96dfbba0ab899]::panicking::panic_handler::{closure#0}<unknown>
  1603. 289.89 s > at <unknown source file>:<unknown line>
  1604. 289.89 s > 5: std[bcb96dfbba0ab899]::sys::backtrace::__rust_end_short_backtrace::<std[bcb96dfbba0ab899]::panicking::panic_handler::{closure#0}, !><unknown>
  1605. 289.89 s > at <unknown source file>:<unknown line>
  1606. 289.89 s > 6: __rustc[6c289b9f9c454d21]::rust_begin_unwind<unknown>
  1607. 289.89 s > at <unknown source file>:<unknown line>
  1608. 289.89 s > 7: core[940e698046960fd5]::panicking::panic_fmt<unknown>
  1609. 289.89 s > at <unknown source file>:<unknown line>
  1610. 289.89 s > 8: <symjit[e408de789c333cd]::symjit::assembler::Assembler>::apply_jumps<unknown>
  1611. 289.89 s > at <unknown source file>:<unknown line>
  1612. 289.89 s > 9: <symjit[e408de789c333cd]::symjit::builder::Builder>::compile_from_mir::<symjit[e408de789c333cd]::symjit::amd::complex::AmdComplexGenerator><unknown>
  1613. 289.89 s > at <unknown source file>:<unknown line>
  1614. 289.89 s > 10: <symjit[e408de789c333cd]::symjit::runnable::Application>::compile_ty<unknown>
  1615. 289.89 s > at <unknown source file>:<unknown line>
  1616. 289.89 s > 11: <symjit[e408de789c333cd]::symjit::runnable::Application>::with_mir<unknown>
  1617. 289.89 s > at <unknown source file>:<unknown line>
  1618. 289.89 s > 12: <symjit[e408de789c333cd]::symjit::composer::DirectTranslator as symjit[e408de789c333cd]::symjit::composer::Composer>::compile<unknown>
  1619. 289.89 s > at <unknown source file>:<unknown line>
  1620. 289.89 s > 13: <symjit[e408de789c333cd]::symjit::compiler::Translator as symjit[e408de789c333cd]::symjit::composer::Composer>::compile<unknown>
  1621. 289.89 s > at <unknown source file>:<unknown line>
  1622. 289.89 s > 14: <numerica[124dab8567f4861e]::domains::float::complex::Complex<f64> as symbolica[10e259bab675d243]::evaluate::backend::JITCompiledNumber>::jit_compile<unknown>
  1623. 289.89 s > at <unknown source file>:<unknown line>
  1624. 289.89 s > 15: <gammalooprs[917cbd3df9e68f8f]::integrands::process::evaluators::GenericEvaluator>::activate_symjit<unknown>
  1625. 289.89 s > at <unknown source file>:<unknown line>
  1626. 289.89 s > 16: <gammalooprs[917cbd3df9e68f8f]::integrands::process::amplitude::AmplitudeIntegrand>::prepare_runtime_backends_after_generation_with_compile_times<unknown>
  1627. 289.89 s > at <unknown source file>:<unknown line>
  1628. 289.89 s > 17: <gammalooprs[917cbd3df9e68f8f]::processes::amplitude::Amplitude>::build_integrand<unknown>
  1629. 289.89 s > at <unknown source file>:<unknown line>
  1630. 289.89 s > 18: <gammalooprs[917cbd3df9e68f8f]::processes::process::Process>::generate_integrands<unknown>
  1631. 289.89 s > at <unknown source file>:<unknown line>
  1632. 289.89 s > 19: <gammaloop_api[9ebf6628f97aeb57]::state::State>::generate_integrand<unknown>
  1633. 289.89 s > at <unknown source file>:<unknown line>
  1634. 289.89 s > 20: <gammaloop_api[9ebf6628f97aeb57]::commands::generate::Generate>::run::<&std[bcb96dfbba0ab899]::path::PathBuf><unknown>
  1635. 289.89 s > at <unknown source file>:<unknown line>
  1636. 289.89 s > 21: <gammaloop_api[9ebf6628f97aeb57]::commands::Commands>::run<unknown>
  1637. 289.89 s > at <unknown source file>:<unknown line>
  1638. 289.89 s > 22: <gammaloop_api[9ebf6628f97aeb57]::session::CliSession>::execute_prepared<unknown>
  1639. 289.89 s > at <unknown source file>:<unknown line>
  1640. 289.89 s > 23: <gammaloop_api[9ebf6628f97aeb57]::session::CliSession>::execute_command<unknown>
  1641. 289.89 s > at <unknown source file>:<unknown line>
  1642. 289.89 s > 24: <gammaloop_integration_tests[191607b70c61cd5a]::CLIState>::run_command<unknown>
  1643. 289.89 s > at <unknown source file>:<unknown line>
  1644. 289.89 s > 25: test_runs[9b7e2dc2dc4f29b0]::aa_aa::generate_aa_aa_helicity_family<unknown>
  1645. 289.89 s > at <unknown source file>:<unknown line>
  1646. 289.89 s > 26: <test_runs[9b7e2dc2dc4f29b0]::aa_aa::important::aa_aa_local_inspect_backend_consistency::{closure#0} as core[940e698046960fd5]::ops::function::FnOnce<()>>::call_once<unknown>
  1647. 289.89 s > at <unknown source file>:<unknown line>
  1648. 289.89 s > 27: serial_test[cd99724524a2f1c0]::serial_code_lock::local_serial_core_with_return::<(), eyre[cb2fd339c0c40fca]::Report><unknown>
  1649. 289.89 s > at <unknown source file>:<unknown line>
  1650. 289.89 s > 28: <test_runs[9b7e2dc2dc4f29b0]::aa_aa::important::aa_aa_local_inspect_backend_consistency::{closure#0} as core[940e698046960fd5]::ops::function::FnOnce<()>>::call_once<unknown>
  1651. 289.89 s > at <unknown source file>:<unknown line>
  1652. 289.89 s > 29: test[75d6903177b1d7e9]::__rust_begin_short_backtrace::<core[940e698046960fd5]::result::Result<(), alloc[2ea6bcb46fca0c42]::string::String>, fn() -> core[940e698046960fd5]::result::Result<(), alloc[2ea6bcb46fca0c42]::string::String>><unknown>
  1653. 289.89 s > at <unknown source file>:<unknown line>
  1654. 289.89 s > 30: test[75d6903177b1d7e9]::run_test::{closure#0}<unknown>
  1655. 289.89 s > at <unknown source file>:<unknown line>
  1656. 289.89 s > 31: std[bcb96dfbba0ab899]::sys::backtrace::__rust_begin_short_backtrace::<test[75d6903177b1d7e9]::run_test::{closure#1}, ()><unknown>
  1657. 289.89 s > at <unknown source file>:<unknown line>
  1658. 289.89 s > 32: <std[bcb96dfbba0ab899]::thread::lifecycle::spawn_unchecked<test[75d6903177b1d7e9]::run_test::{closure#1}, ()>::{closure#1} as core[940e698046960fd5]::ops::function::FnOnce<()>>::call_once::{shim:vtable#0}<unknown>
  1659. 289.89 s > at <unknown source file>:<unknown line>
  1660. 289.89 s > 33: <std[bcb96dfbba0ab899]::sys::thread::unix::Thread>::new::thread_start<unknown>
  1661. 289.89 s > at <unknown source file>:<unknown line>
  1662. 289.89 s > 34: start_thread<unknown>
  1663. 289.89 s > at <unknown source file>:<unknown line>
  1664. 289.89 s > 35: __clone3<unknown>
  1665. 289.89 s > at <unknown source file>:<unknown line>
  1666. 289.89 s >
  1667. 289.89 s > Run with COLORBT_SHOW_HIDDEN=1 environment variable to disable frame filtering.
  1668. 289.89 s > Run with RUST_BACKTRACE=full to include source snippets.
  1669. 289.89 s > Warning: SpanTrace capture is Unsupported.
  1670. 289.89 s > Ensure that you've setup a tracing-error ErrorLayer and the semver versions are compatible
  1671. 289.89 s >
  1672. 289.89 s > 2. gammaloop-integration-tests::uv::thermal_sunrise_uv
  1673. 289.89 s > failure: test failure with exit code 101
  1674. 289.89 s > system-out
  1675. 289.89 s > running 1 test
  1676. 289.89 s > test thermal_sunrise_uv ... FAILED
  1677. 289.89 s >
  1678. 289.89 s > failures:
  1679. 289.89 s >
  1680. 289.89 s > failures:
  1681. 289.89 s > thermal_sunrise_uv
  1682. 289.89 s >
  1683. 289.89 s > test result: FAILED. 0 passed; 1 failed; 0 ignored; 0 measured; 31 filtered out; finished in 3.74s
  1684. 289.89 s > system-err
  1685. 289.89 s > [2026-09-18 17:11:03.336] @gammaloop_api::se... INFO : Running command run generate
  1686. 289.89 s > [2026-09-18 17:11:03.336] @gammaloop_api::se... INFO : Starting command block generate
  1687. 289.89 s > [2026-09-18 17:11:03.337] @gammaloop_api::se... INFO : Running command import model sm-default.json
  1688. 289.89 s > [2026-09-18 17:11:03.337] @import::model INFO : Loading built-in JSON model sm-default
  1689. 289.89 s > [2026-09-18 17:11:03.386] @gammalooprs::model INFO : The following 15 external parameters were forced to zero by the restriction card:
  1690. 289.89 s > lamWS, AWS, rhoWS, etaWS, ymc, yme, ymm, MC, Me, MM, WTau, muQ, muLe, muLmu, muLtau
  1691. 289.89 s > [2026-09-18 17:11:03.386] @gammalooprs::model INFO : The following 34 vertex rules were removed by the restriction card:
  1692. 289.89 s > V_82 -> (c~, d, G+) | V_83 -> (t~, d, G+) | V_84 -> (c~, s, G+) | V_85 -> (t~, s, G+) | V_86 -> (u~, b, G+) | V_87 -> (c~, b, G+) | V_90 -> (c~, d, W+) | V_91 -> (t~, d, W+) | V_92 -> (u~, s, W+) | V_94 -> (t~, s, W+) | V_95 -> (u~, b, W+) | V_96 -> (c~, b, W+) | V_101 -> (e+, e-, G0) | V_102 -> (mu+, mu-, G0) | V_104 -> (e+, e-, H) | V_105 -> (mu+, mu-, H) | V_110 -> (ve~, e-, G+) | V_111 -> (vm~, mu-, G+) | V_116 -> (b~, u, G-) | V_117 -> (d~, c, G-) | V_118 -> (s~, c, G-) | V_119 -> (b~, c, G-) | V_120 -> (d~, t, G-) | V_121 -> (s~, t, G-) | V_124 -> (s~, u, W-) | V_125 -> (b~, u, W-) | V_126 -> (d~, c, W-) | V_128 -> (b~, c, W-) | V_129 -> (d~, t, W-) | V_130 -> (s~, t, W-) | V_138 -> (c~, c, G0) | V_140 -> (c~, c, H) | V_145 -> (e+, ve, G-) | V_146 -> (mu+, vm, G-)
  1693. 289.89 s > [2026-09-18 17:11:03.386] @gammalooprs::model INFO : The following 36 couplings were removed by the restriction card:
  1694. 289.89 s > GC_13, GC_14, GC_16, GC_17, GC_18, GC_19, GC_20, GC_22, GC_23, GC_24, GC_25, GC_26, GC_28, GC_29, GC_42, GC_43, GC_44, GC_46, GC_47, GC_48, GC_84, GC_85, GC_86, GC_87, GC_88, GC_89, GC_90, GC_91, GC_92, GC_93, GC_101, GC_102, GC_103, GC_105, GC_106, GC_107
  1695. 289.89 s > [2026-09-18 17:11:03.387] @gammaloop_api::se... INFO : Running command remove processes
  1696. 289.89 s > [2026-09-18 17:11:03.387] @gammaloop_api::se... INFO : Running command generate amp {} > {} [{2}] | g u
  1697. 289.89 s > --numerator-grouping group_identical_graphs_up_to_scalar_rescaling
  1698. 289.89 s > --max-n-bridges 0
  1699. 289.89 s > --number-of-factorized-loop-subtopologies 1 1
  1700. 289.89 s > --number-of-anticommutating-loops 1 1
  1701. 289.89 s > [...]
  1702. 289.89 s > [2026-09-18 17:11:03.389] @feyngen::diagram_... INFO : 0s | Δ=0s | Starting Feynman graph generation with Symbolica...
  1703. 289.89 s > [2026-09-18 17:11:03.389] @feyngen::diagram_... INFO : 0s | Δ=0s | Number of graphs resulting from Symbolica generation: 3
  1704. 289.89 s > [2026-09-18 17:11:03.389] @feyngen::diagram_... INFO : 0s | Δ=0s | Number of graphs retained after removal of vetoed topologies: 2
  1705. 289.89 s > [2026-09-18 17:11:03.390] @feyngen::diagram_... INFO : 0s | Δ=0s | Number of graphs after vertex info assignment: 2
  1706. 289.89 s > [2026-09-18 17:11:03.390] @feyngen::diagram_... INFO : 0s | Δ=0s | Number of graphs after all complete graphs filters are applied: 2
  1707. 289.89 s > [2026-09-18 17:11:03.390] @feyngen::diagram_... INFO : 0s | Δ=0s | Number of graphs after closed anticommutating chains analysis: 1
  1708. 289.89 s > [2026-09-18 17:11:03.390] @feyngen::diagram_... INFO : 0s | Δ=0s | Number of graphs after symmetrization of external states: 1
  1709. 289.89 s > [2026-09-18 17:11:03.390] @feyngen::diagram_... INFO : 0s | Δ=0s | Number of graphs after canonization of vertices, edges and flows (graph labels assigned here): 1
  1710. 289.89 s > [2026-09-18 17:11:03.413] @feyngen::diagram_... INFO : 0s | Δ=0s | Number of graphs after numerator-aware grouping with strategy 'up to a scalar rescaling': 1 (1 isomorphically unique graph, 0 color zero, 0 lorentz zero, 0 grouped and 0 cancellation)
  1711. 289.89 s > [2026-09-18 17:11:03.413] @feyngen::diagram_... INFO : ( Sum of the symmetry factors from each graph generated = -1/2 )
  1712. 289.89 s > [2026-09-18 17:11:03.413] @commands::generate INFO : Generated amplitude 1 graphs.
  1713. 289.89 s > [2026-09-18 17:11:03.414] @commands::generate INFO : Only diagram generation was requested, skipping integrand generation. You can generate integrands later using the 'generate existing <options>' command.
  1714. 289.89 s > [2026-09-18 17:11:03.414] @gammaloop_api::se... INFO : Running command generate
  1715. 289.89 s > The application panicked (crashed).
  1716. 289.89 s > Message: label _func_power_ not found
  1717. 289.89 s > Location: /nix/store/n9w914kh1cm59xx3spcs831cdyb56m32-vendor-cargo-deps/c19b7c6f923b580ac259164a89f2577984ad5ab09ee9d583b888f934adbbe8d0/symjit-2.25.6/src/symjit/assembler.rs:77
  1718. 289.89 s >
  1719. 289.89 s > ━━━━━━━━━━━━━━━━━━━━━━━━━━━━━━━━━━ BACKTRACE ━━━━━━━━━━━━━━━━━━━━━━━━━━━━━━━━━━━
  1720. 289.89 s > 1: <color_eyre[51793ea62743adbd]::config::PanicHook>::panic_report<unknown>
  1721. 289.89 s > at <unknown source file>:<unknown line>
  1722. 289.89 s > 2: <color_eyre[51793ea62743adbd]::config::PanicHook>::into_panic_hook::{closure#0}<unknown>
  1723. 289.89 s > at <unknown source file>:<unknown line>
  1724. 289.89 s > 3: std[bcb96dfbba0ab899]::panicking::panic_with_hook<unknown>
  1725. 289.89 s > at <unknown source file>:<unknown line>
  1726. 289.89 s > 4: std[bcb96dfbba0ab899]::panicking::panic_handler::{closure#0}<unknown>
  1727. 289.89 s > at <unknown source file>:<unknown line>
  1728. 289.89 s > 5: std[bcb96dfbba0ab899]::sys::backtrace::__rust_end_short_backtrace::<std[bcb96dfbba0ab899]::panicking::panic_handler::{closure#0}, !><unknown>
  1729. 289.89 s > at <unknown source file>:<unknown line>
  1730. 289.89 s > 6: __rustc[6c289b9f9c454d21]::rust_begin_unwind<unknown>
  1731. 289.89 s > at <unknown source file>:<unknown line>
  1732. 289.89 s > 7: core[940e698046960fd5]::panicking::panic_fmt<unknown>
  1733. 289.89 s > at <unknown source file>:<unknown line>
  1734. 289.89 s > 8: <symjit[e408de789c333cd]::symjit::assembler::Assembler>::apply_jumps<unknown>
  1735. 289.89 s > at <unknown source file>:<unknown line>
  1736. 289.89 s > 9: <symjit[e408de789c333cd]::symjit::builder::Builder>::compile_from_mir::<symjit[e408de789c333cd]::symjit::amd::complex::AmdComplexGenerator><unknown>
  1737. 289.89 s > at <unknown source file>:<unknown line>
  1738. 289.89 s > 10: <symjit[e408de789c333cd]::symjit::runnable::Application>::compile_ty<unknown>
  1739. 289.89 s > at <unknown source file>:<unknown line>
  1740. 289.89 s > 11: <symjit[e408de789c333cd]::symjit::runnable::Application>::with_mir<unknown>
  1741. 289.89 s > at <unknown source file>:<unknown line>
  1742. 289.89 s > 12: <symjit[e408de789c333cd]::symjit::composer::DirectTranslator as symjit[e408de789c333cd]::symjit::composer::Composer>::compile<unknown>
  1743. 289.89 s > at <unknown source file>:<unknown line>
  1744. 289.89 s > 13: <symjit[e408de789c333cd]::symjit::compiler::Translator as symjit[e408de789c333cd]::symjit::composer::Composer>::compile<unknown>
  1745. 289.89 s > at <unknown source file>:<unknown line>
  1746. 289.89 s > 14: <numerica[124dab8567f4861e]::domains::float::complex::Complex<f64> as symbolica[10e259bab675d243]::evaluate::backend::JITCompiledNumber>::jit_compile<unknown>
  1747. 289.89 s > at <unknown source file>:<unknown line>
  1748. 289.89 s > 15: <gammalooprs[917cbd3df9e68f8f]::integrands::process::evaluators::GenericEvaluator>::activate_symjit<unknown>
  1749. 289.89 s > at <unknown source file>:<unknown line>
  1750. 289.89 s > 16: <gammalooprs[917cbd3df9e68f8f]::integrands::process::amplitude::AmplitudeIntegrand>::prepare_runtime_backends_after_generation_with_compile_times<unknown>
  1751. 289.89 s > at <unknown source file>:<unknown line>
  1752. 289.89 s > 17: <gammalooprs[917cbd3df9e68f8f]::processes::amplitude::Amplitude>::build_integrand<unknown>
  1753. 289.89 s > at <unknown source file>:<unknown line>
  1754. 289.89 s > 18: <gammalooprs[917cbd3df9e68f8f]::processes::process::Process>::generate_integrands<unknown>
  1755. 289.89 s > at <unknown source file>:<unknown line>
  1756. 289.89 s > 19: <gammalooprs[917cbd3df9e68f8f]::processes::ProcessList>::generate_integrands<unknown>
  1757. 289.89 s > at <unknown source file>:<unknown line>
  1758. 289.89 s > 20: <gammaloop_api[9ebf6628f97aeb57]::state::State>::generate_integrands<unknown>
  1759. 289.89 s > at <unknown source file>:<unknown line>
  1760. 289.89 s > 21: <gammaloop_api[9ebf6628f97aeb57]::commands::generate::Generate>::run::<&std[bcb96dfbba0ab899]::path::PathBuf><unknown>
  1761. 289.89 s > at <unknown source file>:<unknown line>
  1762. 289.89 s > 22: <gammaloop_api[9ebf6628f97aeb57]::commands::Commands>::run<unknown>
  1763. 289.89 s > at <unknown source file>:<unknown line>
  1764. 289.89 s > 23: <gammaloop_api[9ebf6628f97aeb57]::session::CliSession>::execute_prepared<unknown>
  1765. 289.89 s > at <unknown source file>:<unknown line>
  1766. 289.89 s > 24: <gammaloop_api[9ebf6628f97aeb57]::session::CliSession>::execute_prepared_commands<unknown>
  1767. 289.89 s > at <unknown source file>:<unknown line>
  1768. 289.89 s > 25: <gammaloop_api[9ebf6628f97aeb57]::session::CliSession>::execute_prepared<unknown>
  1769. 289.89 s > at <unknown source file>:<unknown line>
  1770. 289.89 s > 26: <gammaloop_api[9ebf6628f97aeb57]::session::CliSession>::execute_command<unknown>
  1771. 289.89 s > at <unknown source file>:<unknown line>
  1772. 289.89 s > 27: <gammaloop_integration_tests[191607b70c61cd5a]::CLIState>::run_command<unknown>
  1773. 289.89 s > at <unknown source file>:<unknown line>
  1774. 289.89 s > 28: uv[3c7454ef256d6487]::run_single_integrated_uv_case<unknown>
  1775. 289.89 s > at <unknown source file>:<unknown line>
  1776. 289.89 s > 29: <uv[3c7454ef256d6487]::thermal_sunrise_uv::{closure#0} as core[940e698046960fd5]::ops::function::FnOnce<()>>::call_once<unknown>
  1777. 289.89 s > at <unknown source file>:<unknown line>
  1778. 289.89 s > 30: test[75d6903177b1d7e9]::__rust_begin_short_backtrace::<core[940e698046960fd5]::result::Result<(), alloc[2ea6bcb46fca0c42]::string::String>, fn() -> core[940e698046960fd5]::result::Result<(), alloc[2ea6bcb46fca0c42]::string::String>><unknown>
  1779. 289.89 s > at <unknown source file>:<unknown line>
  1780. 289.89 s > 31: test[75d6903177b1d7e9]::run_test::{closure#0}<unknown>
  1781. 289.89 s > at <unknown source file>:<unknown line>
  1782. 289.89 s > 32: std[bcb96dfbba0ab899]::sys::backtrace::__rust_begin_short_backtrace::<test[75d6903177b1d7e9]::run_test::{closure#1}, ()><unknown>
  1783. 289.89 s > at <unknown source file>:<unknown line>
  1784. 289.89 s > 33: <std[bcb96dfbba0ab899]::thread::lifecycle::spawn_unchecked<test[75d6903177b1d7e9]::run_test::{closure#1}, ()>::{closure#1} as core[940e698046960fd5]::ops::function::FnOnce<()>>::call_once::{shim:vtable#0}<unknown>
  1785. 289.89 s > at <unknown source file>:<unknown line>
  1786. 289.89 s > 34: <std[bcb96dfbba0ab899]::sys::thread::unix::Thread>::new::thread_start<unknown>
  1787. 289.89 s > at <unknown source file>:<unknown line>
  1788. 289.89 s > 35: start_thread<unknown>
  1789. 289.89 s > at <unknown source file>:<unknown line>
  1790. 289.89 s > 36: __clone3<unknown>
  1791. 289.89 s > at <unknown source file>:<unknown line>
  1792. 289.89 s >
  1793. 289.89 s > Run with COLORBT_SHOW_HIDDEN=1 environment variable to disable frame filtering.
  1794. 289.89 s > Run with RUST_BACKTRACE=full to include source snippets.
  1795. 289.89 s > Warning: SpanTrace capture is Unsupported.
  1796. 289.89 s > Ensure that you've setup a tracing-error ErrorLayer and the semver versions are compatible
  1797. 289.89 s > =========================================
  1798. 289.89 s For full logs, run:
  1799. 289.89 s nix log /nix/store/gigaa94kmmfy8jkh87hvwv50zf7hs40j-gammaloop-nextest-integration.drv
  1800. 290.04 s [5 built (1 failed), 63 Run failed.