1. 0.00 s $ /nix/store/61685rbaxmpigwi3z23i33sv3jyfl70q-coreutils-9.11/bin/timeout --kill-after=15s 7200s /nix/store/wknkybkzrc16r11vk5vrykh4wmw7a353-nix-2.34.8/bin/nix --extra-experimental-features nix-command --extra-experimental-features flakes flake clone git+https://github.com/alphal00p/gammaloop --dest /tmp/nix-ci-worker/stable-pwd/repo/
  2. 0.09 s Cloning into '/tmp/nix-ci-worker/stable-pwd/repo'...
  3. 1.96 s remote: Enumerating objects: 93377 remote: Enumerating objects: 103390, done.
  4. 2.18 s remote: Counting objects: 0% (1/10013) remote: Counting objects: 1% (101/10013) remote: Counting objects: 2% (201/10013) remote: Counting objects: 3% (301/10013) remote: Counting objects: 4% (401/10013) remote: Counting objects: 5% (501/10013) remote: Counting objects: 6% (601/10013) remote: Counting objects: 7% (701/10013) remote: Counting objects: 8% (802/10013) remote: Counting objects: 9% (902/10013) remote: Counting objects: 10% (1002/10013) remote: Counting objects: 11% (1102/10013) remote: Counting objects: 12% (1202/10013) remote: Counting objects: 13% (1302/10013) remote: Counting objects: 14% (1402/10013) remote: Counting objects: 15% (1502/10013) remote: Counting objects: 16% (1603/10013) remote: Counting objects: 17% (1703/10013) remote: Counting objects: 18% (1803/10013) remote: Counting objects: 19% (1903/10013) remote: Counting objects: 20% (2003/10013) remote: Counting objects: 21% (2103/10013) remote: Counting objects: 22% (2203/10013) remote: Counting objects: 23% (2303/10013) remote: Counting objects: 24% (2404/10013) remote: Counting objects: 25% (2504/10013) remote: Counting objects: 26% (2604/10013) remote: Counting objects: 27% (2704/10013) remote: Counting objects: 28% (2804/10013) remote: Counting objects: 29% (2904/10013) remote: Counting objects: 30% (3004/10013) remote: Counting objects: 31% (3105/10013) remote: Counting objects: 32% (3205/10013) remote: Counting objects: 33% (3305/10013) remote: Counting objects: 34% (3405/10013) remote: Counting objects: 35% (3505/10013) remote: Counting objects: 36% (3605/10013) remote: Counting objects: 37% (3705/10013) remote: Counting objects: 38% (3805/10013) remote: Counting objects: 39% (3906/10013) remote: Counting objects: 40% (4006/10013) remote: Counting objects: 41% (4106/10013) remote: Counting objects: 42% (4206/10013) remote: Counting objects: 43% (4306/10013) remote: Counting objects: 44% (4406/10013) remote: Counting objects: 45% (4506/10013) remote: Counting objects: 46% (4606/10013) remote: Counting objects: 47% (4707/10013) remote: Counting objects: 48% (4807/10013) remote: Counting objects: 49% (4907/10013) remote: Counting objects: 50% (5007/10013) remote: Counting objects: 51% (5107/10013) remote: Counting objects: 52% (5207/10013) remote: Counting objects: 53% (5307/10013) remote: Counting objects: 54% (5408/10013) remote: Counting objects: 55% (5508/10013) remote: Counting objects: 56% (5608/10013) remote: Counting objects: 57% (5708/10013) remote: Counting objects: 58% (5808/10013) remote: Counting objects: 59% (5908/10013) remote: Counting objects: 60% (6008/10013) remote: Counting objects: 61% (6108/10013) remote: Counting objects: 62% (6209/10013) remote: Counting objects: 63% (6309/10013) remote: Counting objects: 64% (6409/10013) remote: Counting objects: 65% (6509/10013) remote: Counting objects: 66% (6609/10013) remote: Counting objects: 67% (6709/10013) remote: Counting objects: 68% (6809/10013) remote: Counting objects: 69% (6909/10013) remote: Counting objects: 70% (7010/10013) remote: Counting objects: 71% (7110/10013) remote: Counting objects: 72% (7210/10013) remote: Counting objects: 73% (7310/10013) remote: Counting objects: 74% (7410/10013) remote: Counting objects: 75% (7510/10013) remote: Counting objects: 76% (7610/10013) remote: Counting objects: 77% (7711/10013) remote: Counting objects: 78% (7811/10013) remote: Counting objects: 79% (7911/10013) remote: Counting objects: 80% (8011/10013) remote: Counting objects: 81% (8111/10013) remote: Counting objects: 82% (8211/10013) remote: Counting objects: 83% (8311/10013) remote: Counting objects: 84% (8411/10013) remote: Counting objects: 85% (8512/10013) remote: Counting objects: 86% (8612/10013) remote: Counting objects: 87% (8712/10013) remote: Counting objects: 88% (8812/10013) remote: Counting objects: 89% (8912/10013) remote: Counting objects: 90% (9012/10013) remote: Counting objects: 91% (9112/10013) remote: Counting objects: 92% (9212/10013) remote: Counting objects: 93% (9313/10013) remote: Counting objects: 94% (9413/10013) remote: Counting objects: 95% (9513/10013) remote: Counting objects: 96% (9613/10013) remote: Counting objects: 97% (9713/10013) remote: Counting objects: 98% (9813/10013) remote: Counting objects: 99% (9913/10013) remote: Counting objects: 100% (10013/10013) remote: Counting objects: 100% (10013/10013), done.
  5. 4.46 s remote: Compressing objects: 0% (1/2212) remote: Compressing objects: 1% (23/2212) remote: Compressing objects: 2% (45/2212) remote: Compressing objects: 3% (67/2212) remote: Compressing objects: 4% (89/2212) remote: Compressing objects: 5% (111/2212) remote: Compressing objects: 6% (133/2212) remote: Compressing objects: 7% (155/2212) remote: Compressing objects: 8% (177/2212) remote: Compressing objects: 8% (192/2212) remote: Compressing objects: 9% (200/2212) remote: Compressing objects: 10% (222/2212) remote: Compressing objects: 11% (244/2212) remote: Compressing objects: 12% (266/2212) remote: Compressing objects: 13% (288/2212) remote: Compressing objects: 14% (310/2212) remote: Compressing objects: 15% (332/2212) remote: Compressing objects: 16% (354/2212) remote: Compressing objects: 17% (377/2212) remote: Compressing objects: 18% (399/2212) remote: Compressing objects: 18% (405/2212) remote: Compressing objects: 19% (421/2212) remote: Compressing objects: 20% (443/2212) remote: Compressing objects: 21% (465/2212) remote: Compressing objects: 22% (487/2212) remote: Compressing objects: 23% (509/2212) remote: Compressing objects: 24% (531/2212) remote: Compressing objects: 25% (553/2212) remote: Compressing objects: 26% (576/2212) remote: Compressing objects: 27% (598/2212) remote: Compressing objects: 28% (620/2212) remote: Compressing objects: 29% (642/2212) remote: Compressing objects: 30% (664/2212) remote: Compressing objects: 31% (686/2212) remote: Compressing objects: 32% (708/2212) remote: Compressing objects: 33% (730/2212) remote: Compressing objects: 34% (753/2212) remote: Compressing objects: 35% (775/2212) remote: Compressing objects: 36% (797/2212) remote: Compressing objects: 37% (819/2212) remote: Compressing objects: 38% (841/2212) remote: Compressing objects: 39% (863/2212) remote: Compressing objects: 40% (885/2212) remote: Compressing objects: 41% (907/2212) remote: Compressing objects: 42% (930/2212) remote: Compressing objects: 43% (952/2212) remote: Compressing objects: 44% (974/2212) remote: Compressing objects: 45% (996/2212) remote: Compressing objects: 46% (1018/2212) remote: Compressing objects: 47% (1040/2212) remote: Compressing objects: 48% (1062/2212) remote: Compressing objects: 49% (1084/2212) remote: Compressing objects: 50% (1106/2212) remote: Compressing objects: 51% (1129/2212) remote: Compressing objects: 52% (1151/2212) remote: Compressing objects: 53% (1173/2212) remote: Compressing objects: 54% (1195/2212) remote: Compressing objects: 55% (1217/2212) remote: Compressing objects: 56% (1239/2212) remote: Compressing objects: 57% (1261/2212) remote: Compressing objects: 58% (1283/2212) remote: Compressing objects: 59% (1306/2212) remote: Compressing objects: 60% (1328/2212) remote: Compressing objects: 61% (1350/2212) remote: Compressing objects: 62% (1372/2212) remote: Compressing objects: 63% (1394/2212) remote: Compressing objects: 64% (1416/2212) remote: Compressing objects: 65% (1438/2212) remote: Compressing objects: 66% (1460/2212) remote: Compressing objects: 67% (1483/2212) remote: Compressing objects: 68% (1505/2212) remote: Compressing objects: 69% (1527/2212) remote: Compressing objects: 70% (1549/2212) remote: Compressing objects: 71% (1571/2212) remote: Compressing objects: 72% (1593/2212) remote: Compressing objects: 73% (1615/2212) remote: Compressing objects: 74% (1637/2212) remote: Compressing objects: 75% (1659/2212) remote: Compressing objects: 76% (1682/2212) remote: Compressing objects: 77% (1704/2212) remote: Compressing objects: 78% (1726/2212) remote: Compressing objects: 79% (1748/2212) remote: Compressing objects: 80% (1770/2212) remote: Compressing objects: 81% (1792/2212) remote: Compressing objects: 82% (1814/2212) remote: Compressing objects: 83% (1836/2212) remote: Compressing objects: 84% (1859/2212) remote: Compressing objects: 85% (1881/2212) remote: Compressing objects: 86% (1903/2212) remote: Compressing objects: 87% (1925/2212) remote: Compressing objects: 88% (1947/2212) remote: Compressing objects: 89% (1969/2212) remote: Compressing objects: 90% (1991/2212) remote: Compressing objects: 91% (2013/2212) remote: Compressing objects: 92% (2036/2212) remote: Compressing objects: 93% (2058/2212) remote: Compressing objects: 94% (2080/2212) remote: Compressing objects: 95% (2102/2212) remote: Compressing objects: 96% (2124/2212) remote: Compressing objects: 97% (2146/2212) remote: Compressing objects: 98% (2168/2212) remote: Compressing objects: 99% (2190/2212) remote: Compressing objects: 100% (2212/2212) remote: Compressing objects: 100% (2212/2212), done.
  6. 17.75 s Receiving objects: 0% (1/103390) Receiving objects: 1% (1034/103390) Receiving objects: 2% (2068/103390) Receiving objects: 3% (3102/103390) Receiving objects: 4% (4136/103390) Receiving objects: 5% (5170/103390) Receiving objects: 6% (6204/103390) Receiving objects: 7% (7238/103390), 13.93 MiB | 27.90 MiB/s Receiving objects: 8% (8272/103390), 13.93 MiB | 27.90 MiB/s Receiving objects: 9% (9306/103390), 13.93 MiB | 27.90 MiB/s Receiving objects: 10% (10339/103390), 13.93 MiB | 27.90 MiB/s Receiving objects: 11% (11373/103390), 13.93 MiB | 27.90 MiB/s Receiving objects: 12% (12407/103390), 13.93 MiB | 27.90 MiB/s Receiving objects: 13% (13441/103390), 13.93 MiB | 27.90 MiB/s Receiving objects: 14% (14475/103390), 13.93 MiB | 27.90 MiB/s Receiving objects: 15% (15509/103390), 13.93 MiB | 27.90 MiB/s Receiving objects: 16% (16543/103390), 13.93 MiB | 27.90 MiB/s Receiving objects: 17% (17577/103390), 13.93 MiB | 27.90 MiB/s Receiving objects: 18% (18611/103390), 13.93 MiB | 27.90 MiB/s Receiving objects: 19% (19645/103390), 13.93 MiB | 27.90 MiB/s Receiving objects: 20% (20678/103390), 13.93 MiB | 27.90 MiB/s Receiving objects: 21% (21712/103390), 13.93 MiB | 27.90 MiB/s Receiving objects: 22% (22746/103390), 13.93 MiB | 27.90 MiB/s Receiving objects: 23% (23780/103390), 13.93 MiB | 27.90 MiB/s Receiving objects: 24% (24814/103390), 13.93 MiB | 27.90 MiB/s Receiving objects: 25% (25848/103390), 13.93 MiB | 27.90 MiB/s Receiving objects: 26% (26882/103390), 13.93 MiB | 27.90 MiB/s Receiving objects: 27% (27916/103390), 13.93 MiB | 27.90 MiB/s Receiving objects: 28% (28950/103390), 13.93 MiB | 27.90 MiB/s Receiving objects: 29% (29984/103390), 13.93 MiB | 27.90 MiB/s Receiving objects: 30% (31017/103390), 13.93 MiB | 27.90 MiB/s Receiving objects: 31% (32051/103390), 13.93 MiB | 27.90 MiB/s Receiving objects: 32% (33085/103390), 13.93 MiB | 27.90 MiB/s Receiving objects: 33% (34119/103390), 13.93 MiB | 27.90 MiB/s Receiving objects: 33% (34351/103390), 33.00 MiB | 33.02 MiB/s Receiving objects: 34% (35153/103390), 33.00 MiB | 33.02 MiB/s Receiving objects: 35% (36187/103390), 33.00 MiB | 33.02 MiB/s Receiving objects: 36% (37221/103390), 33.00 MiB | 33.02 MiB/s Receiving objects: 37% (38255/103390), 33.00 MiB | 33.02 MiB/s Receiving objects: 38% (39289/103390), 33.00 MiB | 33.02 MiB/s Receiving objects: 39% (40323/103390), 33.00 MiB | 33.02 MiB/s Receiving objects: 40% (41356/103390), 33.00 MiB | 33.02 MiB/s Receiving objects: 41% (42390/103390), 33.00 MiB | 33.02 MiB/s Receiving objects: 42% (43424/103390), 50.96 MiB | 33.99 MiB/s Receiving objects: 43% (44458/103390), 50.96 MiB | 33.99 MiB/s Receiving objects: 44% (45492/103390), 50.96 MiB | 33.99 MiB/s Receiving objects: 45% (46526/103390), 50.96 MiB | 33.99 MiB/s Receiving objects: 46% (47560/103390), 50.96 MiB | 33.99 MiB/s Receiving objects: 47% (48594/103390), 50.96 MiB | 33.99 MiB/s Receiving objects: 47% (49028/103390), 66.91 MiB | 33.46 MiB/s Receiving objects: 48% (49628/103390), 66.91 MiB | 33.46 MiB/s Receiving objects: 49% (50662/103390), 66.91 MiB | 33.46 MiB/s Receiving objects: 50% (51695/103390), 66.91 MiB | 33.46 MiB/s Receiving objects: 51% (52729/103390), 66.91 MiB | 33.46 MiB/s Receiving objects: 52% (53763/103390), 66.91 MiB | 33.46 MiB/s Receiving objects: 53% (54797/103390), 66.91 MiB | 33.46 MiB/s Receiving objects: 54% (55831/103390), 66.91 MiB | 33.46 MiB/s Receiving objects: 55% (56865/103390), 66.91 MiB | 33.46 MiB/s Receiving objects: 55% (57064/103390), 95.17 MiB | 31.71 MiB/s Receiving objects: 55% (57151/103390), 111.36 MiB | 31.80 MiB/s Receiving objects: 55% (57734/103390), 145.61 MiB | 32.29 MiB/s Receiving objects: 56% (57899/103390), 145.61 MiB | 32.29 MiB/s Receiving objects: 57% (58933/103390), 162.99 MiB | 33.05 MiB/s Receiving objects: 58% (59967/103390), 162.99 MiB | 33.05 MiB/s Receiving objects: 59% (61001/103390), 162.99 MiB | 33.05 MiB/s Receiving objects: 60% (62034/103390), 162.99 MiB | 33.05 MiB/s Receiving objects: 61% (63068/103390), 162.99 MiB | 33.05 MiB/s Receiving objects: 62% (64102/103390), 179.82 MiB | 32.56 MiB/s Receiving objects: 63% (65136/103390), 179.82 MiB | 32.56 MiB/s Receiving objects: 64% (66170/103390), 179.82 MiB | 32.56 MiB/s Receiving objects: 65% (67204/103390), 179.82 MiB | 32.56 MiB/s Receiving objects: 66% (68238/103390), 179.82 MiB | 32.56 MiB/s Receiving objects: 67% (69272/103390), 179.82 MiB | 32.56 MiB/s Receiving objects: 68% (70306/103390), 179.82 MiB | 32.56 MiB/s Receiving objects: 69% (71340/103390), 179.82 MiB | 32.56 MiB/s Receiving objects: 70% (72373/103390), 179.82 MiB | 32.56 MiB/s Receiving objects: 70% (73380/103390), 179.82 MiB | 32.56 MiB/s Receiving objects: 71% (73407/103390), 179.82 MiB | 32.56 MiB/s Receiving objects: 72% (74441/103390), 197.28 MiB | 32.45 MiB/s Receiving objects: 73% (75475/103390), 197.28 MiB | 32.45 MiB/s Receiving objects: 74% (76509/103390), 197.28 MiB | 32.45 MiB/s Receiving objects: 74% (76976/103390), 214.03 MiB | 32.63 MiB/s Receiving objects: 75% (77543/103390), 226.54 MiB | 31.75 MiB/s Receiving objects: 76% (78577/103390), 226.54 MiB | 31.75 MiB/s Receiving objects: 77% (79611/103390), 237.46 MiB | 31.57 MiB/s Receiving objects: 78% (80645/103390), 237.46 MiB | 31.57 MiB/s Receiving objects: 79% (81679/103390), 237.46 MiB | 31.57 MiB/s Receiving objects: 80% (82712/103390), 237.46 MiB | 31.57 MiB/s Receiving objects: 80% (83657/103390), 237.46 MiB | 31.57 MiB/s Receiving objects: 81% (83746/103390), 247.18 MiB | 30.13 MiB/s Receiving objects: 81% (84192/103390), 260.67 MiB | 29.29 MiB/s Receiving objects: 81% (84515/103390), 306.46 MiB | 28.15 MiB/s Receiving objects: 82% (84780/103390), 306.46 MiB | 28.15 MiB/s Receiving objects: 83% (85814/103390), 320.64 MiB | 27.41 MiB/s Receiving objects: 84% (86848/103390), 320.64 MiB | 27.41 MiB/s Receiving objects: 85% (87882/103390), 320.64 MiB | 27.41 MiB/s Receiving objects: 85% (87965/103390), 332.42 MiB | 26.31 MiB/s Receiving objects: 86% (88916/103390), 332.42 MiB | 26.31 MiB/s Receiving objects: 87% (89950/103390), 332.42 MiB | 26.31 MiB/s Receiving objects: 88% (90984/103390), 332.42 MiB | 26.31 MiB/s Receiving objects: 88% (91427/103390), 359.28 MiB | 27.07 MiB/s Receiving objects: 89% (92018/103390), 374.82 MiB | 28.37 MiB/s Receiving objects: 90% (93051/103390), 374.82 MiB | 28.37 MiB/s Receiving objects: 91% (94085/103390), 374.82 MiB | 28.37 MiB/s Receiving objects: 92% (95119/103390), 374.82 MiB | 28.37 MiB/s Receiving objects: 93% (96153/103390), 374.82 MiB | 28.37 MiB/s Receiving objects: 94% (97187/103390), 374.82 MiB | 28.37 MiB/s Receiving objects: 94% (97930/103390), 374.82 MiB | 28.37 MiB/s Receiving objects: 95% (98221/103390), 386.30 MiB | 27.92 MiB/s Receiving objects: 96% (99255/103390), 386.30 MiB | 27.92 MiB/s Receiving objects: 97% (100289/103390), 386.30 MiB | 27.92 MiB/s Receiving objects: 98% (101323/103390), 386.30 MiB | 27.92 MiB/s Receiving objects: 99% (102357/103390), 386.30 MiB | 27.92 MiB/s remote: Total 103390 (delta 8556), reused 7986 (delta 7776), pack-reused 93377 (from 4)
  7. 17.75 s Receiving objects: 100% (103390/103390), 386.30 MiB | 27.92 MiB/s Receiving objects: 100% (103390/103390), 391.79 MiB | 29.48 MiB/s, done.
  8. 20.89 s Resolving deltas: 0% (0/67744) Resolving deltas: 1% (678/67744) Resolving deltas: 2% (1355/67744) Resolving deltas: 3% (2033/67744) Resolving deltas: 4% (2710/67744) Resolving deltas: 5% (3388/67744) Resolving deltas: 6% (4065/67744) Resolving deltas: 7% (4743/67744) Resolving deltas: 8% (5420/67744) Resolving deltas: 9% (6097/67744) Resolving deltas: 10% (6775/67744) Resolving deltas: 11% (7452/67744) Resolving deltas: 12% (8131/67744) Resolving deltas: 13% (8807/67744) Resolving deltas: 14% (9485/67744) Resolving deltas: 15% (10162/67744) Resolving deltas: 16% (10840/67744) Resolving deltas: 17% (11517/67744) Resolving deltas: 18% (12194/67744) Resolving deltas: 19% (12873/67744) Resolving deltas: 20% (13549/67744) Resolving deltas: 21% (14227/67744) Resolving deltas: 22% (14904/67744) Resolving deltas: 23% (15583/67744) Resolving deltas: 24% (16259/67744) Resolving deltas: 25% (16936/67744) Resolving deltas: 26% (17614/67744) Resolving deltas: 27% (18291/67744) Resolving deltas: 28% (18969/67744) Resolving deltas: 29% (19646/67744) Resolving deltas: 30% (20324/67744) Resolving deltas: 31% (21001/67744) Resolving deltas: 32% (21679/67744) Resolving deltas: 33% (22356/67744) Resolving deltas: 34% (23033/67744) Resolving deltas: 35% (23711/67744) Resolving deltas: 36% (24388/67744) Resolving deltas: 37% (25066/67744) Resolving deltas: 38% (25743/67744) Resolving deltas: 39% (26421/67744) Resolving deltas: 40% (27098/67744) Resolving deltas: 41% (27776/67744) Resolving deltas: 42% (28453/67744) Resolving deltas: 43% (29130/67744) Resolving deltas: 44% (29808/67744) Resolving deltas: 45% (30485/67744) Resolving deltas: 45% (31027/67744) Resolving deltas: 46% (31163/67744) Resolving deltas: 47% (31840/67744) Resolving deltas: 48% (32518/67744) Resolving deltas: 49% (33196/67744) Resolving deltas: 50% (33872/67744) Resolving deltas: 51% (34550/67744) Resolving deltas: 52% (35227/67744) Resolving deltas: 53% (35906/67744) Resolving deltas: 54% (36582/67744) Resolving deltas: 55% (37260/67744) Resolving deltas: 56% (37937/67744) Resolving deltas: 57% (38615/67744) Resolving deltas: 58% (39292/67744) Resolving deltas: 59% (39969/67744) Resolving deltas: 60% (40647/67744) Resolving deltas: 61% (41324/67744) Resolving deltas: 62% (42002/67744) Resolving deltas: 63% (42679/67744) Resolving deltas: 64% (43357/67744) Resolving deltas: 65% (44034/67744) Resolving deltas: 66% (44712/67744) Resolving deltas: 67% (45389/67744) Resolving deltas: 68% (46066/67744) Resolving deltas: 69% (46744/67744) Resolving deltas: 69% (46957/67744) Resolving deltas: 70% (47421/67744) Resolving deltas: 71% (48099/67744) Resolving deltas: 72% (48777/67744) Resolving deltas: 73% (49454/67744) Resolving deltas: 74% (50132/67744) Resolving deltas: 75% (50808/67744) Resolving deltas: 76% (51486/67744) Resolving deltas: 77% (52163/67744) Resolving deltas: 78% (52841/67744) Resolving deltas: 79% (53518/67744) Resolving deltas: 80% (54196/67744) Resolving deltas: 81% (54873/67744) Resolving deltas: 82% (55551/67744) Resolving deltas: 83% (56228/67744) Resolving deltas: 84% (56905/67744) Resolving deltas: 85% (57583/67744) Resolving deltas: 86% (58260/67744) Resolving deltas: 87% (58938/67744) Resolving deltas: 88% (59615/67744) Resolving deltas: 89% (60293/67744) Resolving deltas: 90% (60970/67744) Resolving deltas: 91% (61648/67744) Resolving deltas: 92% (62325/67744) Resolving deltas: 93% (63003/67744) Resolving deltas: 94% (63680/67744) Resolving deltas: 95% (64357/67744) Resolving deltas: 95% (64946/67744) Resolving deltas: 96% (65035/67744) Resolving deltas: 97% (65712/67744) Resolving deltas: 98% (66390/67744) Resolving deltas: 99% (67067/67744) Resolving deltas: 100% (67744/67744) Resolving deltas: 100% (67744/67744), done.
  9. 21.76 s Fetching commit 7ece86a8ed6a8193d0a29f5672536ac83359c492 for finite_T_and_mu ...
  10. 21.76 s $ /nix/store/5vpcfsdx1lcnlb2y4k7xyc74shp5qwbh-git-2.54.0/bin/git fetch origin 7ece86a8ed6a8193d0a29f5672536ac83359c492
  11. 22.31 s From https://github.com/alphal00p/gammaloop
  12. 22.31 s * branch 7ece86a8ed6a8193d0a29f5672536ac83359c492 -> FETCH_HEAD
  13. 22.34 s $ /nix/store/61685rbaxmpigwi3z23i33sv3jyfl70q-coreutils-9.11/bin/timeout --kill-after=15s 7200s /nix/store/5vpcfsdx1lcnlb2y4k7xyc74shp5qwbh-git-2.54.0/bin/git -c advice.detachedHead=false checkout 7ece86a8ed6a8193d0a29f5672536ac83359c492
  14. 22.72 s HEAD is now at 7ece86a8e extend thermal 3drep tests to cover higher-order distribution derivatives
  15. 22.74 s $ /nix/store/61685rbaxmpigwi3z23i33sv3jyfl70q-coreutils-9.11/bin/timeout --kill-after=15s 7200s /nix/store/wknkybkzrc16r11vk5vrykh4wmw7a353-nix-2.34.8/bin/nix --extra-experimental-features nix-command --extra-experimental-features flakes --log-format internal-json run .#packages.x86_64-linux.nix-ci-check-gammaloop-nextest-integration --print-build-logs
  16. 27.48 s
  17. 34.45 s evaluating derivation 'g copying '/nix/store/q9yd evaluating derivation 'g copying '/nix/store/q9yd evaluating derivation 'g copying '/nix/store/q9yd evaluating derivation 'g copying '/nix/store/q9yd evaluating derivation 'g copying '/nix/store/q9yd evaluating derivation 'g querying gammaloop-nexte querying info about miss querying gammaloop-nexte [0/1 built, 0.0 KiB DL] [1/0/1 built, 0.0 KiB DLgammaloop-nextest-integration> Extracting 13 binaries, 1 build script output directory, and 3 linked paths to /build/nextest-archive-XejmE9
  18. 36.95 s gammaloop-nextest-integration> Extracted 30 files to /build/nextest-archive-XejmE9 in 2.50s
  19. 36.97 s gammaloop-nextest-integration> ------------
  20. 36.97 s gammaloop-nextest-integration> Nextest run ID 76a62137-c3d1-40a0-be8d-5a3b452c5477 with nextest profile: ci_gammaloop
  21. 36.97 s gammaloop-nextest-integration> Starting 170 tests across 13 binaries (209 tests skipped, including 208 tests via profile.ci_gammaloop.default-filter)
  22. 143.37 s gammaloop-nextest-integration> FAIL [ 3.150s] ( 55/170) gammaloop-integration-tests::test_runs aa_aa::important::aa_aa_local_inspect_backend_consistency
  23. 143.37 s gammaloop-nextest-integration> stdout ---
  24. 143.37 s gammaloop-nextest-integration>
  25. 143.37 s gammaloop-nextest-integration> running 1 test
  26. 143.37 s gammaloop-nextest-integration> test aa_aa::important::aa_aa_local_inspect_backend_consistency ... FAILED
  27. 143.37 s gammaloop-nextest-integration>
  28. 143.37 s gammaloop-nextest-integration> failures:
  29. 143.37 s gammaloop-nextest-integration>
  30. 143.37 s gammaloop-nextest-integration> failures:
  31. 143.37 s gammaloop-nextest-integration> aa_aa::important::aa_aa_local_inspect_backend_consistency
  32. 143.37 s gammaloop-nextest-integration>
  33. 143.37 s gammaloop-nextest-integration> test result: FAILED. 0 passed; 1 failed; 0 ignored; 0 measured; 274 filtered out; finished in 3.14s
  34. 143.37 s gammaloop-nextest-integration>
  35. 143.37 s gammaloop-nextest-integration> stderr ---
  36. 143.37 s gammaloop-nextest-integration> [2026-09-18 17:05:15.276] @gammaloop_api::se... INFO : Running command import model sm-default.json
  37. 143.37 s gammaloop-nextest-integration> [2026-09-18 17:05:15.277] @import::model INFO : Loading built-in JSON model sm-default
  38. 143.37 s gammaloop-nextest-integration> [2026-09-18 17:05:15.299] @gammalooprs::model INFO : The following 15 external parameters were forced to zero by the restriction card:
  39. 143.37 s gammaloop-nextest-integration> lamWS, AWS, rhoWS, etaWS, ymc, yme, ymm, MC, Me, MM, WTau, muQ, muLe, muLmu, muLtau
  40. 143.37 s gammaloop-nextest-integration> [2026-09-18 17:05:15.300] @gammalooprs::model INFO : The following 34 vertex rules were removed by the restriction card:
  41. 143.37 s gammaloop-nextest-integration> V_82 -> (c~, d, G+) | V_83 -> (t~, d, G+) | V_84 -> (c~, s, G+) | V_85 -> (t~, s, G+) | V_86 -> (u~, b, G+) | V_87 -> (c~, b, G+) | V_90 -> (c~, d, W+) | V_91 -> (t~, d, W+) | V_92 -> (u~, s, W+) | V_94 -> (t~, s, W+) | V_95 -> (u~, b, W+) | V_96 -> (c~, b, W+) | V_101 -> (e+, e-, G0) | V_102 -> (mu+, mu-, G0) | V_104 -> (e+, e-, H) | V_105 -> (mu+, mu-, H) | V_110 -> (ve~, e-, G+) | V_111 -> (vm~, mu-, G+) | V_116 -> (b~, u, G-) | V_117 -> (d~, c, G-) | V_118 -> (s~, c, G-) | V_119 -> (b~, c, G-) | V_120 -> (d~, t, G-) | V_121 -> (s~, t, G-) | V_124 -> (s~, u, W-) | V_125 -> (b~, u, W-) | V_126 -> (d~, c, W-) | V_128 -> (b~, c, W-) | V_129 -> (d~, t, W-) | V_130 -> (s~, t, W-) | V_138 -> (c~, c, G0) | V_140 -> (c~, c, H) | V_145 -> (e+, ve, G-) | V_146 -> (mu+, vm, G-)
  42. 143.37 s gammaloop-nextest-integration> [2026-09-18 17:05:15.300] @gammalooprs::model INFO : The following 36 couplings were removed by the restriction card:
  43. 143.37 s gammaloop-nextest-integration> GC_13, GC_14, GC_16, GC_17, GC_18, GC_19, GC_20, GC_22, GC_23, GC_24, GC_25, GC_26, GC_28, GC_29, GC_42, GC_43, GC_44, GC_46, GC_47, GC_48, GC_84, GC_85, GC_86, GC_87, GC_88, GC_89, GC_90, GC_91, GC_92, GC_93, GC_101, GC_102, GC_103, GC_105, GC_106, GC_107
  44. 143.37 s gammaloop-nextest-integration> [2026-09-18 17:05:15.300] @gammaloop_api::se... INFO : Running command run set_model_parameters
  45. 143.37 s gammaloop-nextest-integration> [2026-09-18 17:05:15.300] @gammaloop_api::se... INFO : Starting command block set_model_parameters
  46. 143.37 s gammaloop-nextest-integration> [2026-09-18 17:05:15.300] @gammaloop_api::se... INFO : Running command set model MT=173.0
  47. 143.37 s gammaloop-nextest-integration> [2026-09-18 17:05:15.305] @gammaloop_api::se... INFO : Running command set model WT=0.0
  48. 143.37 s gammaloop-nextest-integration> [2026-09-18 17:05:15.309] @gammaloop_api::se... INFO : Running command set model ymt=173.0
  49. 143.37 s gammaloop-nextest-integration> [2026-09-18 17:05:15.314] @gammaloop_api::se... INFO : Running command set model aS=0.118
  50. 143.37 s gammaloop-nextest-integration> [2026-09-18 17:05:15.318] @gammaloop_api::se... INFO : Running command set model aEWM1=137.036
  51. 143.37 s gammaloop-nextest-integration> [2026-09-18 17:05:15.322] @gammaloop_api::se... INFO : Running command set model Gf=1.166390e-05
  52. 143.37 s gammaloop-nextest-integration> [2026-09-18 17:05:15.327] @gammaloop_api::se... INFO : Running command set model MZ=91.188
  53. 143.37 s gammaloop-nextest-integration> [2026-09-18 17:05:15.331] @gammaloop_api::se... INFO : Running command set global string '
  54. 143.37 s gammaloop-nextest-integration> [global.generation.compile]
  55. 143.37 s gammaloop-nextest-integration> compilation_mode = "symjit"
  56. 143.37 s gammaloop-nextest-integration> optimization_level = "O0"
  57. 143.37 s gammaloop-nextest-integration> fast_math = false
  58. 143.37 s gammaloop-nextest-integration> [...]
  59. 143.37 s gammaloop-nextest-integration> [2026-09-18 17:05:15.332] @gammaloop_api::se... INFO : Running command import graphs ./examples/cli/aa_aa/1L/aa_aa_1L.dot -p aa_aa_all_helicities -i 1L_ppmm -o
  60. 143.37 s gammaloop-nextest-integration> [2026-09-18 17:05:15.332] @commands::import INFO : Loading graphs from '/build/source/examples/cli/aa_aa/1L/aa_aa_1L.dot'
  61. 143.37 s gammaloop-nextest-integration> [2026-09-18 17:05:15.342] @gammaloop_api::se... INFO : Running command generate existing -p aa_aa_all_helicities
  62. 143.37 s gammaloop-nextest-integration> The application panicked (crashed).
  63. 143.37 s gammaloop-nextest-integration> Message: label _func_power_ not found
  64. 143.37 s gammaloop-nextest-integration> Location: /nix/store/n9w914kh1cm59xx3spcs831cdyb56m32-vendor-cargo-deps/c19b7c6f923b580ac259164a89f2577984ad5ab09ee9d583b888f934adbbe8d0/symjit-2.25.6/src/symjit/assembler.rs:77
  65. 143.37 s gammaloop-nextest-integration>
  66. 143.37 s gammaloop-nextest-integration> ━━━━━━━━━━━━━━━━━━━━━━━━━━━━━━━━━━ BACKTRACE ━━━━━━━━━━━━━━━━━━━━━━━━━━━━━━━━━━━
  67. 143.37 s gammaloop-nextest-integration> 1: <color_eyre[51793ea62743adbd]::config::PanicHook>::panic_report<unknown>
  68. 143.37 s gammaloop-nextest-integration> at <unknown source file>:<unknown line>
  69. 143.37 s gammaloop-nextest-integration> 2: <color_eyre[51793ea62743adbd]::config::PanicHook>::into_panic_hook::{closure#0}<unknown>
  70. 143.37 s gammaloop-nextest-integration> at <unknown source file>:<unknown line>
  71. 143.37 s gammaloop-nextest-integration> 3: std[bcb96dfbba0ab899]::panicking::panic_with_hook<unknown>
  72. 143.37 s gammaloop-nextest-integration> at <unknown source file>:<unknown line>
  73. 143.37 s gammaloop-nextest-integration> 4: std[bcb96dfbba0ab899]::panicking::panic_handler::{closure#0}<unknown>
  74. 143.37 s gammaloop-nextest-integration> at <unknown source file>:<unknown line>
  75. 143.37 s gammaloop-nextest-integration> 5: std[bcb96dfbba0ab899]::sys::backtrace::__rust_end_short_backtrace::<std[bcb96dfbba0ab899]::panicking::panic_handler::{closure#0}, !><unknown>
  76. 143.37 s gammaloop-nextest-integration> at <unknown source file>:<unknown line>
  77. 143.37 s gammaloop-nextest-integration> 6: __rustc[6c289b9f9c454d21]::rust_begin_unwind<unknown>
  78. 143.37 s gammaloop-nextest-integration> at <unknown source file>:<unknown line>
  79. 143.37 s gammaloop-nextest-integration> 7: core[940e698046960fd5]::panicking::panic_fmt<unknown>
  80. 143.37 s gammaloop-nextest-integration> at <unknown source file>:<unknown line>
  81. 143.37 s gammaloop-nextest-integration> 8: <symjit[e408de789c333cd]::symjit::assembler::Assembler>::apply_jumps<unknown>
  82. 143.37 s gammaloop-nextest-integration> at <unknown source file>:<unknown line>
  83. 143.37 s gammaloop-nextest-integration> 9: <symjit[e408de789c333cd]::symjit::builder::Builder>::compile_from_mir::<symjit[e408de789c333cd]::symjit::amd::complex::AmdComplexGenerator><unknown>
  84. 143.37 s gammaloop-nextest-integration> at <unknown source file>:<unknown line>
  85. 143.37 s gammaloop-nextest-integration> 10: <symjit[e408de789c333cd]::symjit::runnable::Application>::compile_ty<unknown>
  86. 143.37 s gammaloop-nextest-integration> at <unknown source file>:<unknown line>
  87. 143.37 s gammaloop-nextest-integration> 11: <symjit[e408de789c333cd]::symjit::runnable::Application>::with_mir<unknown>
  88. 143.37 s gammaloop-nextest-integration> at <unknown source file>:<unknown line>
  89. 143.37 s gammaloop-nextest-integration> 12: <symjit[e408de789c333cd]::symjit::composer::DirectTranslator as symjit[e408de789c333cd]::symjit::composer::Composer>::compile<unknown>
  90. 143.37 s gammaloop-nextest-integration> at <unknown source file>:<unknown line>
  91. 143.37 s gammaloop-nextest-integration> 13: <symjit[e408de789c333cd]::symjit::compiler::Translator as symjit[e408de789c333cd]::symjit::composer::Composer>::compile<unknown>
  92. 143.37 s gammaloop-nextest-integration> at <unknown source file>:<unknown line>
  93. 143.37 s gammaloop-nextest-integration> 14: <numerica[124dab8567f4861e]::domains::float::complex::Complex<f64> as symbolica[10e259bab675d243]::evaluate::backend::JITCompiledNumber>::jit_compile<unknown>
  94. 143.37 s gammaloop-nextest-integration> at <unknown source file>:<unknown line>
  95. 143.37 s gammaloop-nextest-integration> 15: <gammalooprs[917cbd3df9e68f8f]::integrands::process::evaluators::GenericEvaluator>::activate_symjit<unknown>
  96. 143.37 s gammaloop-nextest-integration> at <unknown source file>:<unknown line>
  97. 143.37 s gammaloop-nextest-integration> 16: <gammalooprs[917cbd3df9e68f8f]::integrands::process::amplitude::AmplitudeIntegrand>::prepare_runtime_backends_after_generation_with_compile_times<unknown>
  98. 143.37 s gammaloop-nextest-integration> at <unknown source file>:<unknown line>
  99. 143.37 s gammaloop-nextest-integration> 17: <gammalooprs[917cbd3df9e68f8f]::processes::amplitude::Amplitude>::build_integrand<unknown>
  100. 143.37 s gammaloop-nextest-integration> at <unknown source file>:<unknown line>
  101. 143.37 s gammaloop-nextest-integration> 18: <gammalooprs[917cbd3df9e68f8f]::processes::process::Process>::generate_integrands<unknown>
  102. 143.37 s gammaloop-nextest-integration> at <unknown source file>:<unknown line>
  103. 143.37 s gammaloop-nextest-integration> 19: <gammaloop_api[9ebf6628f97aeb57]::state::State>::generate_integrand<unknown>
  104. 143.37 s gammaloop-nextest-integration> at <unknown source file>:<unknown line>
  105. 143.37 s gammaloop-nextest-integration> 20: <gammaloop_api[9ebf6628f97aeb57]::commands::generate::Generate>::run::<&std[bcb96dfbba0ab899]::path::PathBuf><unknown>
  106. 143.37 s gammaloop-nextest-integration> at <unknown source file>:<unknown line>
  107. 143.37 s gammaloop-nextest-integration> 21: <gammaloop_api[9ebf6628f97aeb57]::commands::Commands>::run<unknown>
  108. 143.37 s gammaloop-nextest-integration> at <unknown source file>:<unknown line>
  109. 143.37 s gammaloop-nextest-integration> 22: <gammaloop_api[9ebf6628f97aeb57]::session::CliSession>::execute_prepared<unknown>
  110. 143.37 s gammaloop-nextest-integration> at <unknown source file>:<unknown line>
  111. 143.37 s gammaloop-nextest-integration> 23: <gammaloop_api[9ebf6628f97aeb57]::session::CliSession>::execute_command<unknown>
  112. 143.37 s gammaloop-nextest-integration> at <unknown source file>:<unknown line>
  113. 143.37 s gammaloop-nextest-integration> 24: <gammaloop_integration_tests[191607b70c61cd5a]::CLIState>::run_command<unknown>
  114. 143.37 s gammaloop-nextest-integration> at <unknown source file>:<unknown line>
  115. 143.37 s gammaloop-nextest-integration> 25: test_runs[9b7e2dc2dc4f29b0]::aa_aa::generate_aa_aa_helicity_family<unknown>
  116. 143.37 s gammaloop-nextest-integration> at <unknown source file>:<unknown line>
  117. 143.37 s gammaloop-nextest-integration> 26: <test_runs[9b7e2dc2dc4f29b0]::aa_aa::important::aa_aa_local_inspect_backend_consistency::{closure#0} as core[940e698046960fd5]::ops::function::FnOnce<()>>::call_once<unknown>
  118. 143.37 s gammaloop-nextest-integration> at <unknown source file>:<unknown line>
  119. 143.37 s gammaloop-nextest-integration> 27: serial_test[cd99724524a2f1c0]::serial_code_lock::local_serial_core_with_return::<(), eyre[cb2fd339c0c40fca]::Report><unknown>
  120. 143.37 s gammaloop-nextest-integration> at <unknown source file>:<unknown line>
  121. 143.37 s gammaloop-nextest-integration> 28: <test_runs[9b7e2dc2dc4f29b0]::aa_aa::important::aa_aa_local_inspect_backend_consistency::{closure#0} as core[940e698046960fd5]::ops::function::FnOnce<()>>::call_once<unknown>
  122. 143.37 s gammaloop-nextest-integration> at <unknown source file>:<unknown line>
  123. 143.37 s gammaloop-nextest-integration> 29: test[75d6903177b1d7e9]::__rust_begin_short_backtrace::<core[940e698046960fd5]::result::Result<(), alloc[2ea6bcb46fca0c42]::string::String>, fn() -> core[940e698046960fd5]::result::Result<(), alloc[2ea6bcb46fca0c42]::string::String>><unknown>
  124. 143.37 s gammaloop-nextest-integration> at <unknown source file>:<unknown line>
  125. 143.37 s gammaloop-nextest-integration> 30: test[75d6903177b1d7e9]::run_test::{closure#0}<unknown>
  126. 143.37 s gammaloop-nextest-integration> at <unknown source file>:<unknown line>
  127. 143.37 s gammaloop-nextest-integration> 31: std[bcb96dfbba0ab899]::sys::backtrace::__rust_begin_short_backtrace::<test[75d6903177b1d7e9]::run_test::{closure#1}, ()><unknown>
  128. 143.37 s gammaloop-nextest-integration> at <unknown source file>:<unknown line>
  129. 143.37 s gammaloop-nextest-integration> 32: <std[bcb96dfbba0ab899]::thread::lifecycle::spawn_unchecked<test[75d6903177b1d7e9]::run_test::{closure#1}, ()>::{closure#1} as core[940e698046960fd5]::ops::function::FnOnce<()>>::call_once::{shim:vtable#0}<unknown>
  130. 143.37 s gammaloop-nextest-integration> at <unknown source file>:<unknown line>
  131. 143.37 s gammaloop-nextest-integration> 33: <std[bcb96dfbba0ab899]::sys::thread::unix::Thread>::new::thread_start<unknown>
  132. 143.37 s gammaloop-nextest-integration> at <unknown source file>:<unknown line>
  133. 143.37 s gammaloop-nextest-integration> 34: start_thread<unknown>
  134. 143.37 s gammaloop-nextest-integration> at <unknown source file>:<unknown line>
  135. 143.37 s gammaloop-nextest-integration> 35: __clone3<unknown>
  136. 143.37 s gammaloop-nextest-integration> at <unknown source file>:<unknown line>
  137. 143.37 s gammaloop-nextest-integration>
  138. 143.37 s gammaloop-nextest-integration> Run with COLORBT_SHOW_HIDDEN=1 environment variable to disable frame filtering.
  139. 143.37 s gammaloop-nextest-integration> Run with RUST_BACKTRACE=full to include source snippets.
  140. 143.37 s gammaloop-nextest-integration> Warning: SpanTrace capture is Unsupported.
  141. 143.37 s gammaloop-nextest-integration> Ensure that you've setup a tracing-error ErrorLayer and the semver versions are compatible
  142. 143.37 s gammaloop-nextest-integration>
  143. 195.77 s gammaloop-nextest-integration> FAIL [ 3.410s] (159/170) gammaloop-integration-tests::uv thermal_sunrise_uv
  144. 195.77 s gammaloop-nextest-integration> stdout ---
  145. 195.77 s gammaloop-nextest-integration>
  146. 195.77 s gammaloop-nextest-integration> running 1 test
  147. 195.77 s gammaloop-nextest-integration> test thermal_sunrise_uv ... FAILED
  148. 195.77 s gammaloop-nextest-integration>
  149. 195.77 s gammaloop-nextest-integration> failures:
  150. 195.77 s gammaloop-nextest-integration>
  151. 195.77 s gammaloop-nextest-integration> failures:
  152. 195.77 s gammaloop-nextest-integration> thermal_sunrise_uv
  153. 195.77 s gammaloop-nextest-integration>
  154. 195.77 s gammaloop-nextest-integration> test result: FAILED. 0 passed; 1 failed; 0 ignored; 0 measured; 31 filtered out; finished in 3.40s
  155. 195.77 s gammaloop-nextest-integration>
  156. 195.77 s gammaloop-nextest-integration> stderr ---
  157. 195.77 s gammaloop-nextest-integration> [2026-09-18 17:06:07.493] @gammaloop_api::se... INFO : Running command run generate
  158. 195.77 s gammaloop-nextest-integration> [2026-09-18 17:06:07.493] @gammaloop_api::se... INFO : Starting command block generate
  159. 195.77 s gammaloop-nextest-integration> [2026-09-18 17:06:07.493] @gammaloop_api::se... INFO : Running command import model sm-default.json
  160. 195.77 s gammaloop-nextest-integration> [2026-09-18 17:06:07.493] @import::model INFO : Loading built-in JSON model sm-default
  161. 195.77 s gammaloop-nextest-integration> [2026-09-18 17:06:07.537] @gammalooprs::model INFO : The following 15 external parameters were forced to zero by the restriction card:
  162. 195.77 s gammaloop-nextest-integration> lamWS, AWS, rhoWS, etaWS, ymc, yme, ymm, MC, Me, MM, WTau, muQ, muLe, muLmu, muLtau
  163. 195.77 s gammaloop-nextest-integration> [2026-09-18 17:06:07.537] @gammalooprs::model INFO : The following 34 vertex rules were removed by the restriction card:
  164. 195.77 s gammaloop-nextest-integration> V_82 -> (c~, d, G+) | V_83 -> (t~, d, G+) | V_84 -> (c~, s, G+) | V_85 -> (t~, s, G+) | V_86 -> (u~, b, G+) | V_87 -> (c~, b, G+) | V_90 -> (c~, d, W+) | V_91 -> (t~, d, W+) | V_92 -> (u~, s, W+) | V_94 -> (t~, s, W+) | V_95 -> (u~, b, W+) | V_96 -> (c~, b, W+) | V_101 -> (e+, e-, G0) | V_102 -> (mu+, mu-, G0) | V_104 -> (e+, e-, H) | V_105 -> (mu+, mu-, H) | V_110 -> (ve~, e-, G+) | V_111 -> (vm~, mu-, G+) | V_116 -> (b~, u, G-) | V_117 -> (d~, c, G-) | V_118 -> (s~, c, G-) | V_119 -> (b~, c, G-) | V_120 -> (d~, t, G-) | V_121 -> (s~, t, G-) | V_124 -> (s~, u, W-) | V_125 -> (b~, u, W-) | V_126 -> (d~, c, W-) | V_128 -> (b~, c, W-) | V_129 -> (d~, t, W-) | V_130 -> (s~, t, W-) | V_138 -> (c~, c, G0) | V_140 -> (c~, c, H) | V_145 -> (e+, ve, G-) | V_146 -> (mu+, vm, G-)
  165. 195.77 s gammaloop-nextest-integration> [2026-09-18 17:06:07.537] @gammalooprs::model INFO : The following 36 couplings were removed by the restriction card:
  166. 195.77 s gammaloop-nextest-integration> GC_13, GC_14, GC_16, GC_17, GC_18, GC_19, GC_20, GC_22, GC_23, GC_24, GC_25, GC_26, GC_28, GC_29, GC_42, GC_43, GC_44, GC_46, GC_47, GC_48, GC_84, GC_85, GC_86, GC_87, GC_88, GC_89, GC_90, GC_91, GC_92, GC_93, GC_101, GC_102, GC_103, GC_105, GC_106, GC_107
  167. 195.77 s gammaloop-nextest-integration> [2026-09-18 17:06:07.537] @gammaloop_api::se... INFO : Running command remove processes
  168. 195.77 s gammaloop-nextest-integration> [2026-09-18 17:06:07.538] @gammaloop_api::se... INFO : Running command generate amp {} > {} [{2}] | g u
  169. 195.77 s gammaloop-nextest-integration> --numerator-grouping group_identical_graphs_up_to_scalar_rescaling
  170. 195.77 s gammaloop-nextest-integration> --max-n-bridges 0
  171. 195.77 s gammaloop-nextest-integration> --number-of-factorized-loop-subtopologies 1 1
  172. 195.77 s gammaloop-nextest-integration> --number-of-anticommutating-loops 1 1
  173. 195.77 s gammaloop-nextest-integration> [...]
  174. 195.77 s gammaloop-nextest-integration> [2026-09-18 17:06:07.540] @feyngen::diagram_... INFO : 0s | Δ=0s | Starting Feynman graph generation with Symbolica...
  175. 195.77 s gammaloop-nextest-integration> [2026-09-18 17:06:07.540] @feyngen::diagram_... INFO : 0s | Δ=0s | Number of graphs resulting from Symbolica generation: 3
  176. 195.77 s gammaloop-nextest-integration> [2026-09-18 17:06:07.540] @feyngen::diagram_... INFO : 0s | Δ=0s | Number of graphs retained after removal of vetoed topologies: 2
  177. 195.77 s gammaloop-nextest-integration> [2026-09-18 17:06:07.540] @feyngen::diagram_... INFO : 0s | Δ=0s | Number of graphs after vertex info assignment: 2
  178. 195.77 s gammaloop-nextest-integration> [2026-09-18 17:06:07.540] @feyngen::diagram_... INFO : 0s | Δ=0s | Number of graphs after all complete graphs filters are applied: 2
  179. 195.77 s gammaloop-nextest-integration> [2026-09-18 17:06:07.540] @feyngen::diagram_... INFO : 0s | Δ=0s | Number of graphs after closed anticommutating chains analysis: 1
  180. 195.77 s gammaloop-nextest-integration> [2026-09-18 17:06:07.540] @feyngen::diagram_... INFO : 0s | Δ=0s | Number of graphs after symmetrization of external states: 1
  181. 195.77 s gammaloop-nextest-integration> [2026-09-18 17:06:07.541] @feyngen::diagram_... INFO : 0s | Δ=0s | Number of graphs after canonization of vertices, edges and flows (graph labels assigned here): 1
  182. 195.77 s gammaloop-nextest-integration> [2026-09-18 17:06:07.559] @feyngen::diagram_... INFO : 0s | Δ=0s | Number of graphs after numerator-aware grouping with strategy 'up to a scalar rescaling': 1 (1 isomorphically unique graph, 0 color zero, 0 lorentz zero, 0 grouped and 0 cancellation)
  183. 195.77 s gammaloop-nextest-integration> [2026-09-18 17:06:07.559] @feyngen::diagram_... INFO : ( Sum of the symmetry factors from each graph generated = -1/2 )
  184. 195.77 s gammaloop-nextest-integration> [2026-09-18 17:06:07.559] @commands::generate INFO : Generated amplitude 1 graphs.
  185. 195.77 s gammaloop-nextest-integration> [2026-09-18 17:06:07.559] @commands::generate INFO : Only diagram generation was requested, skipping integrand generation. You can generate integrands later using the 'generate existing <options>' command.
  186. 195.77 s gammaloop-nextest-integration> [2026-09-18 17:06:07.559] @gammaloop_api::se... INFO : Running command generate
  187. 195.77 s gammaloop-nextest-integration> The application panicked (crashed).
  188. 195.77 s gammaloop-nextest-integration> Message: label _func_power_ not found
  189. 195.77 s gammaloop-nextest-integration> Location: /nix/store/n9w914kh1cm59xx3spcs831cdyb56m32-vendor-cargo-deps/c19b7c6f923b580ac259164a89f2577984ad5ab09ee9d583b888f934adbbe8d0/symjit-2.25.6/src/symjit/assembler.rs:77
  190. 195.77 s gammaloop-nextest-integration>
  191. 195.77 s gammaloop-nextest-integration> ━━━━━━━━━━━━━━━━━━━━━━━━━━━━━━━━━━ BACKTRACE ━━━━━━━━━━━━━━━━━━━━━━━━━━━━━━━━━━━
  192. 195.77 s gammaloop-nextest-integration> 1: <color_eyre[51793ea62743adbd]::config::PanicHook>::panic_report<unknown>
  193. 195.77 s gammaloop-nextest-integration> at <unknown source file>:<unknown line>
  194. 195.77 s gammaloop-nextest-integration> 2: <color_eyre[51793ea62743adbd]::config::PanicHook>::into_panic_hook::{closure#0}<unknown>
  195. 195.77 s gammaloop-nextest-integration> at <unknown source file>:<unknown line>
  196. 195.77 s gammaloop-nextest-integration> 3: std[bcb96dfbba0ab899]::panicking::panic_with_hook<unknown>
  197. 195.77 s gammaloop-nextest-integration> at <unknown source file>:<unknown line>
  198. 195.77 s gammaloop-nextest-integration> 4: std[bcb96dfbba0ab899]::panicking::panic_handler::{closure#0}<unknown>
  199. 195.77 s gammaloop-nextest-integration> at <unknown source file>:<unknown line>
  200. 195.77 s gammaloop-nextest-integration> 5: std[bcb96dfbba0ab899]::sys::backtrace::__rust_end_short_backtrace::<std[bcb96dfbba0ab899]::panicking::panic_handler::{closure#0}, !><unknown>
  201. 195.77 s gammaloop-nextest-integration> at <unknown source file>:<unknown line>
  202. 195.77 s gammaloop-nextest-integration> 6: __rustc[6c289b9f9c454d21]::rust_begin_unwind<unknown>
  203. 195.77 s gammaloop-nextest-integration> at <unknown source file>:<unknown line>
  204. 195.77 s gammaloop-nextest-integration> 7: core[940e698046960fd5]::panicking::panic_fmt<unknown>
  205. 195.77 s gammaloop-nextest-integration> at <unknown source file>:<unknown line>
  206. 195.77 s gammaloop-nextest-integration> 8: <symjit[e408de789c333cd]::symjit::assembler::Assembler>::apply_jumps<unknown>
  207. 195.77 s gammaloop-nextest-integration> at <unknown source file>:<unknown line>
  208. 195.77 s gammaloop-nextest-integration> 9: <symjit[e408de789c333cd]::symjit::builder::Builder>::compile_from_mir::<symjit[e408de789c333cd]::symjit::amd::complex::AmdComplexGenerator><unknown>
  209. 195.77 s gammaloop-nextest-integration> at <unknown source file>:<unknown line>
  210. 195.77 s gammaloop-nextest-integration> 10: <symjit[e408de789c333cd]::symjit::runnable::Application>::compile_ty<unknown>
  211. 195.77 s gammaloop-nextest-integration> at <unknown source file>:<unknown line>
  212. 195.77 s gammaloop-nextest-integration> 11: <symjit[e408de789c333cd]::symjit::runnable::Application>::with_mir<unknown>
  213. 195.77 s gammaloop-nextest-integration> at <unknown source file>:<unknown line>
  214. 195.77 s gammaloop-nextest-integration> 12: <symjit[e408de789c333cd]::symjit::composer::DirectTranslator as symjit[e408de789c333cd]::symjit::composer::Composer>::compile<unknown>
  215. 195.77 s gammaloop-nextest-integration> at <unknown source file>:<unknown line>
  216. 195.77 s gammaloop-nextest-integration> 13: <symjit[e408de789c333cd]::symjit::compiler::Translator as symjit[e408de789c333cd]::symjit::composer::Composer>::compile<unknown>
  217. 195.77 s gammaloop-nextest-integration> at <unknown source file>:<unknown line>
  218. 195.77 s gammaloop-nextest-integration> 14: <numerica[124dab8567f4861e]::domains::float::complex::Complex<f64> as symbolica[10e259bab675d243]::evaluate::backend::JITCompiledNumber>::jit_compile<unknown>
  219. 195.78 s gammaloop-nextest-integration> at <unknown source file>:<unknown line>
  220. 195.78 s gammaloop-nextest-integration> 15: <gammalooprs[917cbd3df9e68f8f]::integrands::process::evaluators::GenericEvaluator>::activate_symjit<unknown>
  221. 195.78 s gammaloop-nextest-integration> at <unknown source file>:<unknown line>
  222. 195.78 s gammaloop-nextest-integration> 16: <gammalooprs[917cbd3df9e68f8f]::integrands::process::amplitude::AmplitudeIntegrand>::prepare_runtime_backends_after_generation_with_compile_times<unknown>
  223. 195.78 s gammaloop-nextest-integration> at <unknown source file>:<unknown line>
  224. 195.78 s gammaloop-nextest-integration> 17: <gammalooprs[917cbd3df9e68f8f]::processes::amplitude::Amplitude>::build_integrand<unknown>
  225. 195.78 s gammaloop-nextest-integration> at <unknown source file>:<unknown line>
  226. 195.78 s gammaloop-nextest-integration> 18: <gammalooprs[917cbd3df9e68f8f]::processes::process::Process>::generate_integrands<unknown>
  227. 195.78 s gammaloop-nextest-integration> at <unknown source file>:<unknown line>
  228. 195.78 s gammaloop-nextest-integration> 19: <gammalooprs[917cbd3df9e68f8f]::processes::ProcessList>::generate_integrands<unknown>
  229. 195.78 s gammaloop-nextest-integration> at <unknown source file>:<unknown line>
  230. 195.78 s gammaloop-nextest-integration> 20: <gammaloop_api[9ebf6628f97aeb57]::state::State>::generate_integrands<unknown>
  231. 195.78 s gammaloop-nextest-integration> at <unknown source file>:<unknown line>
  232. 195.78 s gammaloop-nextest-integration> 21: <gammaloop_api[9ebf6628f97aeb57]::commands::generate::Generate>::run::<&std[bcb96dfbba0ab899]::path::PathBuf><unknown>
  233. 195.78 s gammaloop-nextest-integration> at <unknown source file>:<unknown line>
  234. 195.78 s gammaloop-nextest-integration> 22: <gammaloop_api[9ebf6628f97aeb57]::commands::Commands>::run<unknown>
  235. 195.78 s gammaloop-nextest-integration> at <unknown source file>:<unknown line>
  236. 195.78 s gammaloop-nextest-integration> 23: <gammaloop_api[9ebf6628f97aeb57]::session::CliSession>::execute_prepared<unknown>
  237. 195.78 s gammaloop-nextest-integration> at <unknown source file>:<unknown line>
  238. 195.78 s gammaloop-nextest-integration> 24: <gammaloop_api[9ebf6628f97aeb57]::session::CliSession>::execute_prepared_commands<unknown>
  239. 195.78 s gammaloop-nextest-integration> at <unknown source file>:<unknown line>
  240. 195.78 s gammaloop-nextest-integration> 25: <gammaloop_api[9ebf6628f97aeb57]::session::CliSession>::execute_prepared<unknown>
  241. 195.78 s gammaloop-nextest-integration> at <unknown source file>:<unknown line>
  242. 195.78 s gammaloop-nextest-integration> 26: <gammaloop_api[9ebf6628f97aeb57]::session::CliSession>::execute_command<unknown>
  243. 195.78 s gammaloop-nextest-integration> at <unknown source file>:<unknown line>
  244. 195.78 s gammaloop-nextest-integration> 27: <gammaloop_integration_tests[191607b70c61cd5a]::CLIState>::run_command<unknown>
  245. 195.78 s gammaloop-nextest-integration> at <unknown source file>:<unknown line>
  246. 195.78 s gammaloop-nextest-integration> 28: uv[3c7454ef256d6487]::run_single_integrated_uv_case<unknown>
  247. 195.78 s gammaloop-nextest-integration> at <unknown source file>:<unknown line>
  248. 195.78 s gammaloop-nextest-integration> 29: <uv[3c7454ef256d6487]::thermal_sunrise_uv::{closure#0} as core[940e698046960fd5]::ops::function::FnOnce<()>>::call_once<unknown>
  249. 195.78 s gammaloop-nextest-integration> at <unknown source file>:<unknown line>
  250. 195.78 s gammaloop-nextest-integration> 30: test[75d6903177b1d7e9]::__rust_begin_short_backtrace::<core[940e698046960fd5]::result::Result<(), alloc[2ea6bcb46fca0c42]::string::String>, fn() -> core[940e698046960fd5]::result::Result<(), alloc[2ea6bcb46fca0c42]::string::String>><unknown>
  251. 195.78 s gammaloop-nextest-integration> at <unknown source file>:<unknown line>
  252. 195.78 s gammaloop-nextest-integration> 31: test[75d6903177b1d7e9]::run_test::{closure#0}<unknown>
  253. 195.78 s gammaloop-nextest-integration> at <unknown source file>:<unknown line>
  254. 195.78 s gammaloop-nextest-integration> 32: std[bcb96dfbba0ab899]::sys::backtrace::__rust_begin_short_backtrace::<test[75d6903177b1d7e9]::run_test::{closure#1}, ()><unknown>
  255. 195.78 s gammaloop-nextest-integration> at <unknown source file>:<unknown line>
  256. 195.78 s gammaloop-nextest-integration> 33: <std[bcb96dfbba0ab899]::thread::lifecycle::spawn_unchecked<test[75d6903177b1d7e9]::run_test::{closure#1}, ()>::{closure#1} as core[940e698046960fd5]::ops::function::FnOnce<()>>::call_once::{shim:vtable#0}<unknown>
  257. 195.78 s gammaloop-nextest-integration> at <unknown source file>:<unknown line>
  258. 195.78 s gammaloop-nextest-integration> 34: <std[bcb96dfbba0ab899]::sys::thread::unix::Thread>::new::thread_start<unknown>
  259. 195.78 s gammaloop-nextest-integration> at <unknown source file>:<unknown line>
  260. 195.78 s gammaloop-nextest-integration> 35: start_thread<unknown>
  261. 195.78 s gammaloop-nextest-integration> at <unknown source file>:<unknown line>
  262. 195.78 s gammaloop-nextest-integration> 36: __clone3<unknown>
  263. 195.78 s gammaloop-nextest-integration> at <unknown source file>:<unknown line>
  264. 195.78 s gammaloop-nextest-integration>
  265. 195.78 s gammaloop-nextest-integration> Run with COLORBT_SHOW_HIDDEN=1 environment variable to disable frame filtering.
  266. 195.78 s gammaloop-nextest-integration> Run with RUST_BACKTRACE=full to include source snippets.
  267. 195.78 s gammaloop-nextest-integration> Warning: SpanTrace capture is Unsupported.
  268. 195.78 s gammaloop-nextest-integration> Ensure that you've setup a tracing-error ErrorLayer and the semver versions are compatible
  269. 195.78 s gammaloop-nextest-integration>
  270. 265.08 s gammaloop-nextest-integration> ------------
  271. 265.08 s gammaloop-nextest-integration> Summary [ 228.111s] 170 tests run: 168 passed, 2 failed, 209 skipped
  272. 265.08 s gammaloop-nextest-integration> FAIL [ 3.150s] ( 55/170) gammaloop-integration-tests::test_runs aa_aa::important::aa_aa_local_inspect_backend_consistency
  273. 265.08 s gammaloop-nextest-integration> stdout ---
  274. 265.08 s gammaloop-nextest-integration>
  275. 265.08 s gammaloop-nextest-integration> running 1 test
  276. 265.08 s gammaloop-nextest-integration> test aa_aa::important::aa_aa_local_inspect_backend_consistency ... FAILED
  277. 265.08 s gammaloop-nextest-integration>
  278. 265.08 s gammaloop-nextest-integration> failures:
  279. 265.08 s gammaloop-nextest-integration>
  280. 265.08 s gammaloop-nextest-integration> failures:
  281. 265.08 s gammaloop-nextest-integration> aa_aa::important::aa_aa_local_inspect_backend_consistency
  282. 265.08 s gammaloop-nextest-integration>
  283. 265.08 s gammaloop-nextest-integration> test result: FAILED. 0 passed; 1 failed; 0 ignored; 0 measured; 274 filtered out; finished in 3.14s
  284. 265.08 s gammaloop-nextest-integration>
  285. 265.08 s gammaloop-nextest-integration> stderr ---
  286. 265.08 s gammaloop-nextest-integration> [2026-09-18 17:05:15.276] @gammaloop_api::se... INFO : Running command import model sm-default.json
  287. 265.08 s gammaloop-nextest-integration> [2026-09-18 17:05:15.277] @import::model INFO : Loading built-in JSON model sm-default
  288. 265.08 s gammaloop-nextest-integration> [2026-09-18 17:05:15.299] @gammalooprs::model INFO : The following 15 external parameters were forced to zero by the restriction card:
  289. 265.08 s gammaloop-nextest-integration> lamWS, AWS, rhoWS, etaWS, ymc, yme, ymm, MC, Me, MM, WTau, muQ, muLe, muLmu, muLtau
  290. 265.08 s gammaloop-nextest-integration> [2026-09-18 17:05:15.300] @gammalooprs::model INFO : The following 34 vertex rules were removed by the restriction card:
  291. 265.08 s gammaloop-nextest-integration> V_82 -> (c~, d, G+) | V_83 -> (t~, d, G+) | V_84 -> (c~, s, G+) | V_85 -> (t~, s, G+) | V_86 -> (u~, b, G+) | V_87 -> (c~, b, G+) | V_90 -> (c~, d, W+) | V_91 -> (t~, d, W+) | V_92 -> (u~, s, W+) | V_94 -> (t~, s, W+) | V_95 -> (u~, b, W+) | V_96 -> (c~, b, W+) | V_101 -> (e+, e-, G0) | V_102 -> (mu+, mu-, G0) | V_104 -> (e+, e-, H) | V_105 -> (mu+, mu-, H) | V_110 -> (ve~, e-, G+) | V_111 -> (vm~, mu-, G+) | V_116 -> (b~, u, G-) | V_117 -> (d~, c, G-) | V_118 -> (s~, c, G-) | V_119 -> (b~, c, G-) | V_120 -> (d~, t, G-) | V_121 -> (s~, t, G-) | V_124 -> (s~, u, W-) | V_125 -> (b~, u, W-) | V_126 -> (d~, c, W-) | V_128 -> (b~, c, W-) | V_129 -> (d~, t, W-) | V_130 -> (s~, t, W-) | V_138 -> (c~, c, G0) | V_140 -> (c~, c, H) | V_145 -> (e+, ve, G-) | V_146 -> (mu+, vm, G-)
  292. 265.08 s gammaloop-nextest-integration> [2026-09-18 17:05:15.300] @gammalooprs::model INFO : The following 36 couplings were removed by the restriction card:
  293. 265.08 s gammaloop-nextest-integration> GC_13, GC_14, GC_16, GC_17, GC_18, GC_19, GC_20, GC_22, GC_23, GC_24, GC_25, GC_26, GC_28, GC_29, GC_42, GC_43, GC_44, GC_46, GC_47, GC_48, GC_84, GC_85, GC_86, GC_87, GC_88, GC_89, GC_90, GC_91, GC_92, GC_93, GC_101, GC_102, GC_103, GC_105, GC_106, GC_107
  294. 265.08 s gammaloop-nextest-integration> [2026-09-18 17:05:15.300] @gammaloop_api::se... INFO : Running command run set_model_parameters
  295. 265.08 s gammaloop-nextest-integration> [2026-09-18 17:05:15.300] @gammaloop_api::se... INFO : Starting command block set_model_parameters
  296. 265.08 s gammaloop-nextest-integration> [2026-09-18 17:05:15.300] @gammaloop_api::se... INFO : Running command set model MT=173.0
  297. 265.08 s gammaloop-nextest-integration> [2026-09-18 17:05:15.305] @gammaloop_api::se... INFO : Running command set model WT=0.0
  298. 265.08 s gammaloop-nextest-integration> [2026-09-18 17:05:15.309] @gammaloop_api::se... INFO : Running command set model ymt=173.0
  299. 265.08 s gammaloop-nextest-integration> [2026-09-18 17:05:15.314] @gammaloop_api::se... INFO : Running command set model aS=0.118
  300. 265.08 s gammaloop-nextest-integration> [2026-09-18 17:05:15.318] @gammaloop_api::se... INFO : Running command set model aEWM1=137.036
  301. 265.08 s gammaloop-nextest-integration> [2026-09-18 17:05:15.322] @gammaloop_api::se... INFO : Running command set model Gf=1.166390e-05
  302. 265.08 s gammaloop-nextest-integration> [2026-09-18 17:05:15.327] @gammaloop_api::se... INFO : Running command set model MZ=91.188
  303. 265.08 s gammaloop-nextest-integration> [2026-09-18 17:05:15.331] @gammaloop_api::se... INFO : Running command set global string '
  304. 265.08 s gammaloop-nextest-integration> [global.generation.compile]
  305. 265.08 s gammaloop-nextest-integration> compilation_mode = "symjit"
  306. 265.08 s gammaloop-nextest-integration> optimization_level = "O0"
  307. 265.08 s gammaloop-nextest-integration> fast_math = false
  308. 265.08 s gammaloop-nextest-integration> [...]
  309. 265.08 s gammaloop-nextest-integration> [2026-09-18 17:05:15.332] @gammaloop_api::se... INFO : Running command import graphs ./examples/cli/aa_aa/1L/aa_aa_1L.dot -p aa_aa_all_helicities -i 1L_ppmm -o
  310. 265.08 s gammaloop-nextest-integration> [2026-09-18 17:05:15.332] @commands::import INFO : Loading graphs from '/build/source/examples/cli/aa_aa/1L/aa_aa_1L.dot'
  311. 265.08 s gammaloop-nextest-integration> [2026-09-18 17:05:15.342] @gammaloop_api::se... INFO : Running command generate existing -p aa_aa_all_helicities
  312. 265.08 s gammaloop-nextest-integration> The application panicked (crashed).
  313. 265.08 s gammaloop-nextest-integration> Message: label _func_power_ not found
  314. 265.08 s gammaloop-nextest-integration> Location: /nix/store/n9w914kh1cm59xx3spcs831cdyb56m32-vendor-cargo-deps/c19b7c6f923b580ac259164a89f2577984ad5ab09ee9d583b888f934adbbe8d0/symjit-2.25.6/src/symjit/assembler.rs:77
  315. 265.08 s gammaloop-nextest-integration>
  316. 265.08 s gammaloop-nextest-integration> ━━━━━━━━━━━━━━━━━━━━━━━━━━━━━━━━━━ BACKTRACE ━━━━━━━━━━━━━━━━━━━━━━━━━━━━━━━━━━━
  317. 265.08 s gammaloop-nextest-integration> 1: <color_eyre[51793ea62743adbd]::config::PanicHook>::panic_report<unknown>
  318. 265.08 s gammaloop-nextest-integration> at <unknown source file>:<unknown line>
  319. 265.08 s gammaloop-nextest-integration> 2: <color_eyre[51793ea62743adbd]::config::PanicHook>::into_panic_hook::{closure#0}<unknown>
  320. 265.08 s gammaloop-nextest-integration> at <unknown source file>:<unknown line>
  321. 265.08 s gammaloop-nextest-integration> 3: std[bcb96dfbba0ab899]::panicking::panic_with_hook<unknown>
  322. 265.08 s gammaloop-nextest-integration> at <unknown source file>:<unknown line>
  323. 265.08 s gammaloop-nextest-integration> 4: std[bcb96dfbba0ab899]::panicking::panic_handler::{closure#0}<unknown>
  324. 265.08 s gammaloop-nextest-integration> at <unknown source file>:<unknown line>
  325. 265.08 s gammaloop-nextest-integration> 5: std[bcb96dfbba0ab899]::sys::backtrace::__rust_end_short_backtrace::<std[bcb96dfbba0ab899]::panicking::panic_handler::{closure#0}, !><unknown>
  326. 265.08 s gammaloop-nextest-integration> at <unknown source file>:<unknown line>
  327. 265.08 s gammaloop-nextest-integration> 6: __rustc[6c289b9f9c454d21]::rust_begin_unwind<unknown>
  328. 265.08 s gammaloop-nextest-integration> at <unknown source file>:<unknown line>
  329. 265.08 s gammaloop-nextest-integration> 7: core[940e698046960fd5]::panicking::panic_fmt<unknown>
  330. 265.08 s gammaloop-nextest-integration> at <unknown source file>:<unknown line>
  331. 265.08 s gammaloop-nextest-integration> 8: <symjit[e408de789c333cd]::symjit::assembler::Assembler>::apply_jumps<unknown>
  332. 265.08 s gammaloop-nextest-integration> at <unknown source file>:<unknown line>
  333. 265.08 s gammaloop-nextest-integration> 9: <symjit[e408de789c333cd]::symjit::builder::Builder>::compile_from_mir::<symjit[e408de789c333cd]::symjit::amd::complex::AmdComplexGenerator><unknown>
  334. 265.08 s gammaloop-nextest-integration> at <unknown source file>:<unknown line>
  335. 265.08 s gammaloop-nextest-integration> 10: <symjit[e408de789c333cd]::symjit::runnable::Application>::compile_ty<unknown>
  336. 265.08 s gammaloop-nextest-integration> at <unknown source file>:<unknown line>
  337. 265.08 s gammaloop-nextest-integration> 11: <symjit[e408de789c333cd]::symjit::runnable::Application>::with_mir<unknown>
  338. 265.08 s gammaloop-nextest-integration> at <unknown source file>:<unknown line>
  339. 265.08 s gammaloop-nextest-integration> 12: <symjit[e408de789c333cd]::symjit::composer::DirectTranslator as symjit[e408de789c333cd]::symjit::composer::Composer>::compile<unknown>
  340. 265.08 s gammaloop-nextest-integration> at <unknown source file>:<unknown line>
  341. 265.08 s gammaloop-nextest-integration> 13: <symjit[e408de789c333cd]::symjit::compiler::Translator as symjit[e408de789c333cd]::symjit::composer::Composer>::compile<unknown>
  342. 265.08 s gammaloop-nextest-integration> at <unknown source file>:<unknown line>
  343. 265.08 s gammaloop-nextest-integration> 14: <numerica[124dab8567f4861e]::domains::float::complex::Complex<f64> as symbolica[10e259bab675d243]::evaluate::backend::JITCompiledNumber>::jit_compile<unknown>
  344. 265.08 s gammaloop-nextest-integration> at <unknown source file>:<unknown line>
  345. 265.08 s gammaloop-nextest-integration> 15: <gammalooprs[917cbd3df9e68f8f]::integrands::process::evaluators::GenericEvaluator>::activate_symjit<unknown>
  346. 265.08 s gammaloop-nextest-integration> at <unknown source file>:<unknown line>
  347. 265.08 s gammaloop-nextest-integration> 16: <gammalooprs[917cbd3df9e68f8f]::integrands::process::amplitude::AmplitudeIntegrand>::prepare_runtime_backends_after_generation_with_compile_times<unknown>
  348. 265.08 s gammaloop-nextest-integration> at <unknown source file>:<unknown line>
  349. 265.08 s gammaloop-nextest-integration> 17: <gammalooprs[917cbd3df9e68f8f]::processes::amplitude::Amplitude>::build_integrand<unknown>
  350. 265.08 s gammaloop-nextest-integration> at <unknown source file>:<unknown line>
  351. 265.08 s gammaloop-nextest-integration> 18: <gammalooprs[917cbd3df9e68f8f]::processes::process::Process>::generate_integrands<unknown>
  352. 265.08 s gammaloop-nextest-integration> at <unknown source file>:<unknown line>
  353. 265.08 s gammaloop-nextest-integration> 19: <gammaloop_api[9ebf6628f97aeb57]::state::State>::generate_integrand<unknown>
  354. 265.08 s gammaloop-nextest-integration> at <unknown source file>:<unknown line>
  355. 265.08 s gammaloop-nextest-integration> 20: <gammaloop_api[9ebf6628f97aeb57]::commands::generate::Generate>::run::<&std[bcb96dfbba0ab899]::path::PathBuf><unknown>
  356. 265.08 s gammaloop-nextest-integration> at <unknown source file>:<unknown line>
  357. 265.08 s gammaloop-nextest-integration> 21: <gammaloop_api[9ebf6628f97aeb57]::commands::Commands>::run<unknown>
  358. 265.08 s gammaloop-nextest-integration> at <unknown source file>:<unknown line>
  359. 265.08 s gammaloop-nextest-integration> 22: <gammaloop_api[9ebf6628f97aeb57]::session::CliSession>::execute_prepared<unknown>
  360. 265.08 s gammaloop-nextest-integration> at <unknown source file>:<unknown line>
  361. 265.08 s gammaloop-nextest-integration> 23: <gammaloop_api[9ebf6628f97aeb57]::session::CliSession>::execute_command<unknown>
  362. 265.08 s gammaloop-nextest-integration> at <unknown source file>:<unknown line>
  363. 265.08 s gammaloop-nextest-integration> 24: <gammaloop_integration_tests[191607b70c61cd5a]::CLIState>::run_command<unknown>
  364. 265.08 s gammaloop-nextest-integration> at <unknown source file>:<unknown line>
  365. 265.08 s gammaloop-nextest-integration> 25: test_runs[9b7e2dc2dc4f29b0]::aa_aa::generate_aa_aa_helicity_family<unknown>
  366. 265.08 s gammaloop-nextest-integration> at <unknown source file>:<unknown line>
  367. 265.08 s gammaloop-nextest-integration> 26: <test_runs[9b7e2dc2dc4f29b0]::aa_aa::important::aa_aa_local_inspect_backend_consistency::{closure#0} as core[940e698046960fd5]::ops::function::FnOnce<()>>::call_once<unknown>
  368. 265.08 s gammaloop-nextest-integration> at <unknown source file>:<unknown line>
  369. 265.08 s gammaloop-nextest-integration> 27: serial_test[cd99724524a2f1c0]::serial_code_lock::local_serial_core_with_return::<(), eyre[cb2fd339c0c40fca]::Report><unknown>
  370. 265.08 s gammaloop-nextest-integration> at <unknown source file>:<unknown line>
  371. 265.08 s gammaloop-nextest-integration> 28: <test_runs[9b7e2dc2dc4f29b0]::aa_aa::important::aa_aa_local_inspect_backend_consistency::{closure#0} as core[940e698046960fd5]::ops::function::FnOnce<()>>::call_once<unknown>
  372. 265.08 s gammaloop-nextest-integration> at <unknown source file>:<unknown line>
  373. 265.08 s gammaloop-nextest-integration> 29: test[75d6903177b1d7e9]::__rust_begin_short_backtrace::<core[940e698046960fd5]::result::Result<(), alloc[2ea6bcb46fca0c42]::string::String>, fn() -> core[940e698046960fd5]::result::Result<(), alloc[2ea6bcb46fca0c42]::string::String>><unknown>
  374. 265.08 s gammaloop-nextest-integration> at <unknown source file>:<unknown line>
  375. 265.08 s gammaloop-nextest-integration> 30: test[75d6903177b1d7e9]::run_test::{closure#0}<unknown>
  376. 265.08 s gammaloop-nextest-integration> at <unknown source file>:<unknown line>
  377. 265.08 s gammaloop-nextest-integration> 31: std[bcb96dfbba0ab899]::sys::backtrace::__rust_begin_short_backtrace::<test[75d6903177b1d7e9]::run_test::{closure#1}, ()><unknown>
  378. 265.08 s gammaloop-nextest-integration> at <unknown source file>:<unknown line>
  379. 265.08 s gammaloop-nextest-integration> 32: <std[bcb96dfbba0ab899]::thread::lifecycle::spawn_unchecked<test[75d6903177b1d7e9]::run_test::{closure#1}, ()>::{closure#1} as core[940e698046960fd5]::ops::function::FnOnce<()>>::call_once::{shim:vtable#0}<unknown>
  380. 265.08 s gammaloop-nextest-integration> at <unknown source file>:<unknown line>
  381. 265.08 s gammaloop-nextest-integration> 33: <std[bcb96dfbba0ab899]::sys::thread::unix::Thread>::new::thread_start<unknown>
  382. 265.08 s gammaloop-nextest-integration> at <unknown source file>:<unknown line>
  383. 265.08 s gammaloop-nextest-integration> 34: start_thread<unknown>
  384. 265.08 s gammaloop-nextest-integration> at <unknown source file>:<unknown line>
  385. 265.08 s gammaloop-nextest-integration> 35: __clone3<unknown>
  386. 265.08 s gammaloop-nextest-integration> at <unknown source file>:<unknown line>
  387. 265.08 s gammaloop-nextest-integration>
  388. 265.08 s gammaloop-nextest-integration> Run with COLORBT_SHOW_HIDDEN=1 environment variable to disable frame filtering.
  389. 265.08 s gammaloop-nextest-integration> Run with RUST_BACKTRACE=full to include source snippets.
  390. 265.08 s gammaloop-nextest-integration> Warning: SpanTrace capture is Unsupported.
  391. 265.08 s gammaloop-nextest-integration> Ensure that you've setup a tracing-error ErrorLayer and the semver versions are compatible
  392. 265.08 s gammaloop-nextest-integration>
  393. 265.08 s gammaloop-nextest-integration> FAIL [ 3.410s] (159/170) gammaloop-integration-tests::uv thermal_sunrise_uv
  394. 265.08 s gammaloop-nextest-integration> stdout ---
  395. 265.09 s gammaloop-nextest-integration>
  396. 265.09 s gammaloop-nextest-integration> running 1 test
  397. 265.09 s gammaloop-nextest-integration> test thermal_sunrise_uv ... FAILED
  398. 265.09 s gammaloop-nextest-integration>
  399. 265.09 s gammaloop-nextest-integration> failures:
  400. 265.09 s gammaloop-nextest-integration>
  401. 265.09 s gammaloop-nextest-integration> failures:
  402. 265.09 s gammaloop-nextest-integration> thermal_sunrise_uv
  403. 265.09 s gammaloop-nextest-integration>
  404. 265.09 s gammaloop-nextest-integration> test result: FAILED. 0 passed; 1 failed; 0 ignored; 0 measured; 31 filtered out; finished in 3.40s
  405. 265.09 s gammaloop-nextest-integration>
  406. 265.09 s gammaloop-nextest-integration> stderr ---
  407. 265.09 s gammaloop-nextest-integration> [2026-09-18 17:06:07.493] @gammaloop_api::se... INFO : Running command run generate
  408. 265.09 s gammaloop-nextest-integration> [2026-09-18 17:06:07.493] @gammaloop_api::se... INFO : Starting command block generate
  409. 265.09 s gammaloop-nextest-integration> [2026-09-18 17:06:07.493] @gammaloop_api::se... INFO : Running command import model sm-default.json
  410. 265.09 s gammaloop-nextest-integration> [2026-09-18 17:06:07.493] @import::model INFO : Loading built-in JSON model sm-default
  411. 265.09 s gammaloop-nextest-integration> [2026-09-18 17:06:07.537] @gammalooprs::model INFO : The following 15 external parameters were forced to zero by the restriction card:
  412. 265.09 s gammaloop-nextest-integration> lamWS, AWS, rhoWS, etaWS, ymc, yme, ymm, MC, Me, MM, WTau, muQ, muLe, muLmu, muLtau
  413. 265.09 s gammaloop-nextest-integration> [2026-09-18 17:06:07.537] @gammalooprs::model INFO : The following 34 vertex rules were removed by the restriction card:
  414. 265.09 s gammaloop-nextest-integration> V_82 -> (c~, d, G+) | V_83 -> (t~, d, G+) | V_84 -> (c~, s, G+) | V_85 -> (t~, s, G+) | V_86 -> (u~, b, G+) | V_87 -> (c~, b, G+) | V_90 -> (c~, d, W+) | V_91 -> (t~, d, W+) | V_92 -> (u~, s, W+) | V_94 -> (t~, s, W+) | V_95 -> (u~, b, W+) | V_96 -> (c~, b, W+) | V_101 -> (e+, e-, G0) | V_102 -> (mu+, mu-, G0) | V_104 -> (e+, e-, H) | V_105 -> (mu+, mu-, H) | V_110 -> (ve~, e-, G+) | V_111 -> (vm~, mu-, G+) | V_116 -> (b~, u, G-) | V_117 -> (d~, c, G-) | V_118 -> (s~, c, G-) | V_119 -> (b~, c, G-) | V_120 -> (d~, t, G-) | V_121 -> (s~, t, G-) | V_124 -> (s~, u, W-) | V_125 -> (b~, u, W-) | V_126 -> (d~, c, W-) | V_128 -> (b~, c, W-) | V_129 -> (d~, t, W-) | V_130 -> (s~, t, W-) | V_138 -> (c~, c, G0) | V_140 -> (c~, c, H) | V_145 -> (e+, ve, G-) | V_146 -> (mu+, vm, G-)
  415. 265.09 s gammaloop-nextest-integration> [2026-09-18 17:06:07.537] @gammalooprs::model INFO : The following 36 couplings were removed by the restriction card:
  416. 265.09 s gammaloop-nextest-integration> GC_13, GC_14, GC_16, GC_17, GC_18, GC_19, GC_20, GC_22, GC_23, GC_24, GC_25, GC_26, GC_28, GC_29, GC_42, GC_43, GC_44, GC_46, GC_47, GC_48, GC_84, GC_85, GC_86, GC_87, GC_88, GC_89, GC_90, GC_91, GC_92, GC_93, GC_101, GC_102, GC_103, GC_105, GC_106, GC_107
  417. 265.09 s gammaloop-nextest-integration> [2026-09-18 17:06:07.537] @gammaloop_api::se... INFO : Running command remove processes
  418. 265.09 s gammaloop-nextest-integration> [2026-09-18 17:06:07.538] @gammaloop_api::se... INFO : Running command generate amp {} > {} [{2}] | g u
  419. 265.09 s gammaloop-nextest-integration> --numerator-grouping group_identical_graphs_up_to_scalar_rescaling
  420. 265.09 s gammaloop-nextest-integration> --max-n-bridges 0
  421. 265.09 s gammaloop-nextest-integration> --number-of-factorized-loop-subtopologies 1 1
  422. 265.09 s gammaloop-nextest-integration> --number-of-anticommutating-loops 1 1
  423. 265.09 s gammaloop-nextest-integration> [...]
  424. 265.09 s gammaloop-nextest-integration> [2026-09-18 17:06:07.540] @feyngen::diagram_... INFO : 0s | Δ=0s | Starting Feynman graph generation with Symbolica...
  425. 265.09 s gammaloop-nextest-integration> [2026-09-18 17:06:07.540] @feyngen::diagram_... INFO : 0s | Δ=0s | Number of graphs resulting from Symbolica generation: 3
  426. 265.09 s gammaloop-nextest-integration> [2026-09-18 17:06:07.540] @feyngen::diagram_... INFO : 0s | Δ=0s | Number of graphs retained after removal of vetoed topologies: 2
  427. 265.09 s gammaloop-nextest-integration> [2026-09-18 17:06:07.540] @feyngen::diagram_... INFO : 0s | Δ=0s | Number of graphs after vertex info assignment: 2
  428. 265.09 s gammaloop-nextest-integration> [2026-09-18 17:06:07.540] @feyngen::diagram_... INFO : 0s | Δ=0s | Number of graphs after all complete graphs filters are applied: 2
  429. 265.09 s gammaloop-nextest-integration> [2026-09-18 17:06:07.540] @feyngen::diagram_... INFO : 0s | Δ=0s | Number of graphs after closed anticommutating chains analysis: 1
  430. 265.09 s gammaloop-nextest-integration> [2026-09-18 17:06:07.540] @feyngen::diagram_... INFO : 0s | Δ=0s | Number of graphs after symmetrization of external states: 1
  431. 265.09 s gammaloop-nextest-integration> [2026-09-18 17:06:07.541] @feyngen::diagram_... INFO : 0s | Δ=0s | Number of graphs after canonization of vertices, edges and flows (graph labels assigned here): 1
  432. 265.09 s gammaloop-nextest-integration> [2026-09-18 17:06:07.559] @feyngen::diagram_... INFO : 0s | Δ=0s | Number of graphs after numerator-aware grouping with strategy 'up to a scalar rescaling': 1 (1 isomorphically unique graph, 0 color zero, 0 lorentz zero, 0 grouped and 0 cancellation)
  433. 265.09 s gammaloop-nextest-integration> [2026-09-18 17:06:07.559] @feyngen::diagram_... INFO : ( Sum of the symmetry factors from each graph generated = -1/2 )
  434. 265.09 s gammaloop-nextest-integration> [2026-09-18 17:06:07.559] @commands::generate INFO : Generated amplitude 1 graphs.
  435. 265.09 s gammaloop-nextest-integration> [2026-09-18 17:06:07.559] @commands::generate INFO : Only diagram generation was requested, skipping integrand generation. You can generate integrands later using the 'generate existing <options>' command.
  436. 265.09 s gammaloop-nextest-integration> [2026-09-18 17:06:07.559] @gammaloop_api::se... INFO : Running command generate
  437. 265.09 s gammaloop-nextest-integration> The application panicked (crashed).
  438. 265.09 s gammaloop-nextest-integration> Message: label _func_power_ not found
  439. 265.09 s gammaloop-nextest-integration> Location: /nix/store/n9w914kh1cm59xx3spcs831cdyb56m32-vendor-cargo-deps/c19b7c6f923b580ac259164a89f2577984ad5ab09ee9d583b888f934adbbe8d0/symjit-2.25.6/src/symjit/assembler.rs:77
  440. 265.09 s gammaloop-nextest-integration>
  441. 265.09 s gammaloop-nextest-integration> ━━━━━━━━━━━━━━━━━━━━━━━━━━━━━━━━━━ BACKTRACE ━━━━━━━━━━━━━━━━━━━━━━━━━━━━━━━━━━━
  442. 265.09 s gammaloop-nextest-integration> 1: <color_eyre[51793ea62743adbd]::config::PanicHook>::panic_report<unknown>
  443. 265.09 s gammaloop-nextest-integration> at <unknown source file>:<unknown line>
  444. 265.09 s gammaloop-nextest-integration> 2: <color_eyre[51793ea62743adbd]::config::PanicHook>::into_panic_hook::{closure#0}<unknown>
  445. 265.09 s gammaloop-nextest-integration> at <unknown source file>:<unknown line>
  446. 265.09 s gammaloop-nextest-integration> 3: std[bcb96dfbba0ab899]::panicking::panic_with_hook<unknown>
  447. 265.09 s gammaloop-nextest-integration> at <unknown source file>:<unknown line>
  448. 265.09 s gammaloop-nextest-integration> 4: std[bcb96dfbba0ab899]::panicking::panic_handler::{closure#0}<unknown>
  449. 265.09 s gammaloop-nextest-integration> at <unknown source file>:<unknown line>
  450. 265.09 s gammaloop-nextest-integration> 5: std[bcb96dfbba0ab899]::sys::backtrace::__rust_end_short_backtrace::<std[bcb96dfbba0ab899]::panicking::panic_handler::{closure#0}, !><unknown>
  451. 265.09 s gammaloop-nextest-integration> at <unknown source file>:<unknown line>
  452. 265.09 s gammaloop-nextest-integration> 6: __rustc[6c289b9f9c454d21]::rust_begin_unwind<unknown>
  453. 265.09 s gammaloop-nextest-integration> at <unknown source file>:<unknown line>
  454. 265.09 s gammaloop-nextest-integration> 7: core[940e698046960fd5]::panicking::panic_fmt<unknown>
  455. 265.09 s gammaloop-nextest-integration> at <unknown source file>:<unknown line>
  456. 265.09 s gammaloop-nextest-integration> 8: <symjit[e408de789c333cd]::symjit::assembler::Assembler>::apply_jumps<unknown>
  457. 265.09 s gammaloop-nextest-integration> at <unknown source file>:<unknown line>
  458. 265.09 s gammaloop-nextest-integration> 9: <symjit[e408de789c333cd]::symjit::builder::Builder>::compile_from_mir::<symjit[e408de789c333cd]::symjit::amd::complex::AmdComplexGenerator><unknown>
  459. 265.09 s gammaloop-nextest-integration> at <unknown source file>:<unknown line>
  460. 265.09 s gammaloop-nextest-integration> 10: <symjit[e408de789c333cd]::symjit::runnable::Application>::compile_ty<unknown>
  461. 265.09 s gammaloop-nextest-integration> at <unknown source file>:<unknown line>
  462. 265.09 s gammaloop-nextest-integration> 11: <symjit[e408de789c333cd]::symjit::runnable::Application>::with_mir<unknown>
  463. 265.09 s gammaloop-nextest-integration> at <unknown source file>:<unknown line>
  464. 265.09 s gammaloop-nextest-integration> 12: <symjit[e408de789c333cd]::symjit::composer::DirectTranslator as symjit[e408de789c333cd]::symjit::composer::Composer>::compile<unknown>
  465. 265.09 s gammaloop-nextest-integration> at <unknown source file>:<unknown line>
  466. 265.09 s gammaloop-nextest-integration> 13: <symjit[e408de789c333cd]::symjit::compiler::Translator as symjit[e408de789c333cd]::symjit::composer::Composer>::compile<unknown>
  467. 265.09 s gammaloop-nextest-integration> at <unknown source file>:<unknown line>
  468. 265.09 s gammaloop-nextest-integration> 14: <numerica[124dab8567f4861e]::domains::float::complex::Complex<f64> as symbolica[10e259bab675d243]::evaluate::backend::JITCompiledNumber>::jit_compile<unknown>
  469. 265.09 s gammaloop-nextest-integration> at <unknown source file>:<unknown line>
  470. 265.09 s gammaloop-nextest-integration> 15: <gammalooprs[917cbd3df9e68f8f]::integrands::process::evaluators::GenericEvaluator>::activate_symjit<unknown>
  471. 265.09 s gammaloop-nextest-integration> at <unknown source file>:<unknown line>
  472. 265.09 s gammaloop-nextest-integration> 16: <gammalooprs[917cbd3df9e68f8f]::integrands::process::amplitude::AmplitudeIntegrand>::prepare_runtime_backends_after_generation_with_compile_times<unknown>
  473. 265.09 s gammaloop-nextest-integration> at <unknown source file>:<unknown line>
  474. 265.09 s gammaloop-nextest-integration> 17: <gammalooprs[917cbd3df9e68f8f]::processes::amplitude::Amplitude>::build_integrand<unknown>
  475. 265.09 s gammaloop-nextest-integration> at <unknown source file>:<unknown line>
  476. 265.09 s gammaloop-nextest-integration> 18: <gammalooprs[917cbd3df9e68f8f]::processes::process::Process>::generate_integrands<unknown>
  477. 265.09 s gammaloop-nextest-integration> at <unknown source file>:<unknown line>
  478. 265.09 s gammaloop-nextest-integration> 19: <gammalooprs[917cbd3df9e68f8f]::processes::ProcessList>::generate_integrands<unknown>
  479. 265.09 s gammaloop-nextest-integration> at <unknown source file>:<unknown line>
  480. 265.09 s gammaloop-nextest-integration> 20: <gammaloop_api[9ebf6628f97aeb57]::state::State>::generate_integrands<unknown>
  481. 265.09 s gammaloop-nextest-integration> at <unknown source file>:<unknown line>
  482. 265.09 s gammaloop-nextest-integration> 21: <gammaloop_api[9ebf6628f97aeb57]::commands::generate::Generate>::run::<&std[bcb96dfbba0ab899]::path::PathBuf><unknown>
  483. 265.09 s gammaloop-nextest-integration> at <unknown source file>:<unknown line>
  484. 265.09 s gammaloop-nextest-integration> 22: <gammaloop_api[9ebf6628f97aeb57]::commands::Commands>::run<unknown>
  485. 265.09 s gammaloop-nextest-integration> at <unknown source file>:<unknown line>
  486. 265.09 s gammaloop-nextest-integration> 23: <gammaloop_api[9ebf6628f97aeb57]::session::CliSession>::execute_prepared<unknown>
  487. 265.09 s gammaloop-nextest-integration> at <unknown source file>:<unknown line>
  488. 265.09 s gammaloop-nextest-integration> 24: <gammaloop_api[9ebf6628f97aeb57]::session::CliSession>::execute_prepared_commands<unknown>
  489. 265.09 s gammaloop-nextest-integration> at <unknown source file>:<unknown line>
  490. 265.09 s gammaloop-nextest-integration> 25: <gammaloop_api[9ebf6628f97aeb57]::session::CliSession>::execute_prepared<unknown>
  491. 265.09 s gammaloop-nextest-integration> at <unknown source file>:<unknown line>
  492. 265.09 s gammaloop-nextest-integration> 26: <gammaloop_api[9ebf6628f97aeb57]::session::CliSession>::execute_command<unknown>
  493. 265.09 s gammaloop-nextest-integration> at <unknown source file>:<unknown line>
  494. 265.09 s gammaloop-nextest-integration> 27: <gammaloop_integration_tests[191607b70c61cd5a]::CLIState>::run_command<unknown>
  495. 265.09 s gammaloop-nextest-integration> at <unknown source file>:<unknown line>
  496. 265.09 s gammaloop-nextest-integration> 28: uv[3c7454ef256d6487]::run_single_integrated_uv_case<unknown>
  497. 265.09 s gammaloop-nextest-integration> at <unknown source file>:<unknown line>
  498. 265.09 s gammaloop-nextest-integration> 29: <uv[3c7454ef256d6487]::thermal_sunrise_uv::{closure#0} as core[940e698046960fd5]::ops::function::FnOnce<()>>::call_once<unknown>
  499. 265.09 s gammaloop-nextest-integration> at <unknown source file>:<unknown line>
  500. 265.09 s gammaloop-nextest-integration> 30: test[75d6903177b1d7e9]::__rust_begin_short_backtrace::<core[940e698046960fd5]::result::Result<(), alloc[2ea6bcb46fca0c42]::string::String>, fn() -> core[940e698046960fd5]::result::Result<(), alloc[2ea6bcb46fca0c42]::string::String>><unknown>
  501. 265.09 s gammaloop-nextest-integration> at <unknown source file>:<unknown line>
  502. 265.09 s gammaloop-nextest-integration> 31: test[75d6903177b1d7e9]::run_test::{closure#0}<unknown>
  503. 265.09 s gammaloop-nextest-integration> at <unknown source file>:<unknown line>
  504. 265.09 s gammaloop-nextest-integration> 32: std[bcb96dfbba0ab899]::sys::backtrace::__rust_begin_short_backtrace::<test[75d6903177b1d7e9]::run_test::{closure#1}, ()><unknown>
  505. 265.09 s gammaloop-nextest-integration> at <unknown source file>:<unknown line>
  506. 265.09 s gammaloop-nextest-integration> 33: <std[bcb96dfbba0ab899]::thread::lifecycle::spawn_unchecked<test[75d6903177b1d7e9]::run_test::{closure#1}, ()>::{closure#1} as core[940e698046960fd5]::ops::function::FnOnce<()>>::call_once::{shim:vtable#0}<unknown>
  507. 265.09 s gammaloop-nextest-integration> at <unknown source file>:<unknown line>
  508. 265.09 s gammaloop-nextest-integration> 34: <std[bcb96dfbba0ab899]::sys::thread::unix::Thread>::new::thread_start<unknown>
  509. 265.09 s gammaloop-nextest-integration> at <unknown source file>:<unknown line>
  510. 265.09 s gammaloop-nextest-integration> 35: start_thread<unknown>
  511. 265.09 s gammaloop-nextest-integration> at <unknown source file>:<unknown line>
  512. 265.09 s gammaloop-nextest-integration> 36: __clone3<unknown>
  513. 265.09 s gammaloop-nextest-integration> at <unknown source file>:<unknown line>
  514. 265.09 s gammaloop-nextest-integration>
  515. 265.09 s gammaloop-nextest-integration> Run with COLORBT_SHOW_HIDDEN=1 environment variable to disable frame filtering.
  516. 265.09 s gammaloop-nextest-integration> Run with RUST_BACKTRACE=full to include source snippets.
  517. 265.09 s gammaloop-nextest-integration> Warning: SpanTrace capture is Unsupported.
  518. 265.09 s gammaloop-nextest-integration> Ensure that you've setup a tracing-error ErrorLayer and the semver versions are compatible
  519. 265.09 s gammaloop-nextest-integration>
  520. 265.38 s gammaloop-nextest-integration> error: test run failed
  521. 265.41 s gammaloop-nextest-integration>
  522. 265.41 s gammaloop-nextest-integration> ========== nextest test summary ==========
  523. 265.41 s gammaloop-nextest-integration> report: target/nextest/ci_gammaloop/junit.xml
  524. 265.41 s gammaloop-nextest-integration> tests: 170, failures: 2, errors: 0
  525. 265.41 s gammaloop-nextest-integration>
  526. 265.41 s gammaloop-nextest-integration> 1. gammaloop-integration-tests::test_runs::aa_aa::important::aa_aa_local_inspect_backend_consistency
  527. 265.41 s gammaloop-nextest-integration> failure: test failure with exit code 101
  528. 265.41 s gammaloop-nextest-integration> system-out
  529. 265.41 s gammaloop-nextest-integration> running 1 test
  530. 265.41 s gammaloop-nextest-integration> test aa_aa::important::aa_aa_local_inspect_backend_consistency ... FAILED
  531. 265.41 s gammaloop-nextest-integration>
  532. 265.41 s gammaloop-nextest-integration> failures:
  533. 265.41 s gammaloop-nextest-integration>
  534. 265.41 s gammaloop-nextest-integration> failures:
  535. 265.41 s gammaloop-nextest-integration> aa_aa::important::aa_aa_local_inspect_backend_consistency
  536. 265.41 s gammaloop-nextest-integration>
  537. 265.41 s gammaloop-nextest-integration> test result: FAILED. 0 passed; 1 failed; 0 ignored; 0 measured; 274 filtered out; finished in 3.14s
  538. 265.41 s gammaloop-nextest-integration> system-err
  539. 265.41 s gammaloop-nextest-integration> [2026-09-18 17:05:15.276] @gammaloop_api::se... INFO : Running command import model sm-default.json
  540. 265.41 s gammaloop-nextest-integration> [2026-09-18 17:05:15.277] @import::model INFO : Loading built-in JSON model sm-default
  541. 265.41 s gammaloop-nextest-integration> [2026-09-18 17:05:15.299] @gammalooprs::model INFO : The following 15 external parameters were forced to zero by the restriction card:
  542. 265.41 s gammaloop-nextest-integration> lamWS, AWS, rhoWS, etaWS, ymc, yme, ymm, MC, Me, MM, WTau, muQ, muLe, muLmu, muLtau
  543. 265.41 s gammaloop-nextest-integration> [2026-09-18 17:05:15.300] @gammalooprs::model INFO : The following 34 vertex rules were removed by the restriction card:
  544. 265.41 s gammaloop-nextest-integration> V_82 -> (c~, d, G+) | V_83 -> (t~, d, G+) | V_84 -> (c~, s, G+) | V_85 -> (t~, s, G+) | V_86 -> (u~, b, G+) | V_87 -> (c~, b, G+) | V_90 -> (c~, d, W+) | V_91 -> (t~, d, W+) | V_92 -> (u~, s, W+) | V_94 -> (t~, s, W+) | V_95 -> (u~, b, W+) | V_96 -> (c~, b, W+) | V_101 -> (e+, e-, G0) | V_102 -> (mu+, mu-, G0) | V_104 -> (e+, e-, H) | V_105 -> (mu+, mu-, H) | V_110 -> (ve~, e-, G+) | V_111 -> (vm~, mu-, G+) | V_116 -> (b~, u, G-) | V_117 -> (d~, c, G-) | V_118 -> (s~, c, G-) | V_119 -> (b~, c, G-) | V_120 -> (d~, t, G-) | V_121 -> (s~, t, G-) | V_124 -> (s~, u, W-) | V_125 -> (b~, u, W-) | V_126 -> (d~, c, W-) | V_128 -> (b~, c, W-) | V_129 -> (d~, t, W-) | V_130 -> (s~, t, W-) | V_138 -> (c~, c, G0) | V_140 -> (c~, c, H) | V_145 -> (e+, ve, G-) | V_146 -> (mu+, vm, G-)
  545. 265.41 s gammaloop-nextest-integration> [2026-09-18 17:05:15.300] @gammalooprs::model INFO : The following 36 couplings were removed by the restriction card:
  546. 265.41 s gammaloop-nextest-integration> GC_13, GC_14, GC_16, GC_17, GC_18, GC_19, GC_20, GC_22, GC_23, GC_24, GC_25, GC_26, GC_28, GC_29, GC_42, GC_43, GC_44, GC_46, GC_47, GC_48, GC_84, GC_85, GC_86, GC_87, GC_88, GC_89, GC_90, GC_91, GC_92, GC_93, GC_101, GC_102, GC_103, GC_105, GC_106, GC_107
  547. 265.41 s gammaloop-nextest-integration> [2026-09-18 17:05:15.300] @gammaloop_api::se... INFO : Running command run set_model_parameters
  548. 265.41 s gammaloop-nextest-integration> [2026-09-18 17:05:15.300] @gammaloop_api::se... INFO : Starting command block set_model_parameters
  549. 265.41 s gammaloop-nextest-integration> [2026-09-18 17:05:15.300] @gammaloop_api::se... INFO : Running command set model MT=173.0
  550. 265.41 s gammaloop-nextest-integration> [2026-09-18 17:05:15.305] @gammaloop_api::se... INFO : Running command set model WT=0.0
  551. 265.41 s gammaloop-nextest-integration> [2026-09-18 17:05:15.309] @gammaloop_api::se... INFO : Running command set model ymt=173.0
  552. 265.41 s gammaloop-nextest-integration> [2026-09-18 17:05:15.314] @gammaloop_api::se... INFO : Running command set model aS=0.118
  553. 265.41 s gammaloop-nextest-integration> [2026-09-18 17:05:15.318] @gammaloop_api::se... INFO : Running command set model aEWM1=137.036
  554. 265.41 s gammaloop-nextest-integration> [2026-09-18 17:05:15.322] @gammaloop_api::se... INFO : Running command set model Gf=1.166390e-05
  555. 265.41 s gammaloop-nextest-integration> [2026-09-18 17:05:15.327] @gammaloop_api::se... INFO : Running command set model MZ=91.188
  556. 265.41 s gammaloop-nextest-integration> [2026-09-18 17:05:15.331] @gammaloop_api::se... INFO : Running command set global string '
  557. 265.41 s gammaloop-nextest-integration> [global.generation.compile]
  558. 265.41 s gammaloop-nextest-integration> compilation_mode = "symjit"
  559. 265.41 s gammaloop-nextest-integration> optimization_level = "O0"
  560. 265.41 s gammaloop-nextest-integration> fast_math = false
  561. 265.41 s gammaloop-nextest-integration> [...]
  562. 265.41 s gammaloop-nextest-integration> [2026-09-18 17:05:15.332] @gammaloop_api::se... INFO : Running command import graphs ./examples/cli/aa_aa/1L/aa_aa_1L.dot -p aa_aa_all_helicities -i 1L_ppmm -o
  563. 265.41 s gammaloop-nextest-integration> [2026-09-18 17:05:15.332] @commands::import INFO : Loading graphs from '/build/source/examples/cli/aa_aa/1L/aa_aa_1L.dot'
  564. 265.41 s gammaloop-nextest-integration> [2026-09-18 17:05:15.342] @gammaloop_api::se... INFO : Running command generate existing -p aa_aa_all_helicities
  565. 265.41 s gammaloop-nextest-integration> The application panicked (crashed).
  566. 265.41 s gammaloop-nextest-integration> Message: label _func_power_ not found
  567. 265.41 s gammaloop-nextest-integration> Location: /nix/store/n9w914kh1cm59xx3spcs831cdyb56m32-vendor-cargo-deps/c19b7c6f923b580ac259164a89f2577984ad5ab09ee9d583b888f934adbbe8d0/symjit-2.25.6/src/symjit/assembler.rs:77
  568. 265.41 s gammaloop-nextest-integration>
  569. 265.41 s gammaloop-nextest-integration> ━━━━━━━━━━━━━━━━━━━━━━━━━━━━━━━━━━ BACKTRACE ━━━━━━━━━━━━━━━━━━━━━━━━━━━━━━━━━━━
  570. 265.41 s gammaloop-nextest-integration> 1: <color_eyre[51793ea62743adbd]::config::PanicHook>::panic_report<unknown>
  571. 265.41 s gammaloop-nextest-integration> at <unknown source file>:<unknown line>
  572. 265.41 s gammaloop-nextest-integration> 2: <color_eyre[51793ea62743adbd]::config::PanicHook>::into_panic_hook::{closure#0}<unknown>
  573. 265.41 s gammaloop-nextest-integration> at <unknown source file>:<unknown line>
  574. 265.41 s gammaloop-nextest-integration> 3: std[bcb96dfbba0ab899]::panicking::panic_with_hook<unknown>
  575. 265.41 s gammaloop-nextest-integration> at <unknown source file>:<unknown line>
  576. 265.41 s gammaloop-nextest-integration> 4: std[bcb96dfbba0ab899]::panicking::panic_handler::{closure#0}<unknown>
  577. 265.41 s gammaloop-nextest-integration> at <unknown source file>:<unknown line>
  578. 265.41 s gammaloop-nextest-integration> 5: std[bcb96dfbba0ab899]::sys::backtrace::__rust_end_short_backtrace::<std[bcb96dfbba0ab899]::panicking::panic_handler::{closure#0}, !><unknown>
  579. 265.41 s gammaloop-nextest-integration> at <unknown source file>:<unknown line>
  580. 265.41 s gammaloop-nextest-integration> 6: __rustc[6c289b9f9c454d21]::rust_begin_unwind<unknown>
  581. 265.41 s gammaloop-nextest-integration> at <unknown source file>:<unknown line>
  582. 265.41 s gammaloop-nextest-integration> 7: core[940e698046960fd5]::panicking::panic_fmt<unknown>
  583. 265.41 s gammaloop-nextest-integration> at <unknown source file>:<unknown line>
  584. 265.41 s gammaloop-nextest-integration> 8: <symjit[e408de789c333cd]::symjit::assembler::Assembler>::apply_jumps<unknown>
  585. 265.41 s gammaloop-nextest-integration> at <unknown source file>:<unknown line>
  586. 265.41 s gammaloop-nextest-integration> 9: <symjit[e408de789c333cd]::symjit::builder::Builder>::compile_from_mir::<symjit[e408de789c333cd]::symjit::amd::complex::AmdComplexGenerator><unknown>
  587. 265.41 s gammaloop-nextest-integration> at <unknown source file>:<unknown line>
  588. 265.41 s gammaloop-nextest-integration> 10: <symjit[e408de789c333cd]::symjit::runnable::Application>::compile_ty<unknown>
  589. 265.41 s gammaloop-nextest-integration> at <unknown source file>:<unknown line>
  590. 265.41 s gammaloop-nextest-integration> 11: <symjit[e408de789c333cd]::symjit::runnable::Application>::with_mir<unknown>
  591. 265.41 s gammaloop-nextest-integration> at <unknown source file>:<unknown line>
  592. 265.41 s gammaloop-nextest-integration> 12: <symjit[e408de789c333cd]::symjit::composer::DirectTranslator as symjit[e408de789c333cd]::symjit::composer::Composer>::compile<unknown>
  593. 265.41 s gammaloop-nextest-integration> at <unknown source file>:<unknown line>
  594. 265.41 s gammaloop-nextest-integration> 13: <symjit[e408de789c333cd]::symjit::compiler::Translator as symjit[e408de789c333cd]::symjit::composer::Composer>::compile<unknown>
  595. 265.41 s gammaloop-nextest-integration> at <unknown source file>:<unknown line>
  596. 265.41 s gammaloop-nextest-integration> 14: <numerica[124dab8567f4861e]::domains::float::complex::Complex<f64> as symbolica[10e259bab675d243]::evaluate::backend::JITCompiledNumber>::jit_compile<unknown>
  597. 265.41 s gammaloop-nextest-integration> at <unknown source file>:<unknown line>
  598. 265.41 s gammaloop-nextest-integration> 15: <gammalooprs[917cbd3df9e68f8f]::integrands::process::evaluators::GenericEvaluator>::activate_symjit<unknown>
  599. 265.41 s gammaloop-nextest-integration> at <unknown source file>:<unknown line>
  600. 265.41 s gammaloop-nextest-integration> 16: <gammalooprs[917cbd3df9e68f8f]::integrands::process::amplitude::AmplitudeIntegrand>::prepare_runtime_backends_after_generation_with_compile_times<unknown>
  601. 265.41 s gammaloop-nextest-integration> at <unknown source file>:<unknown line>
  602. 265.41 s gammaloop-nextest-integration> 17: <gammalooprs[917cbd3df9e68f8f]::processes::amplitude::Amplitude>::build_integrand<unknown>
  603. 265.41 s gammaloop-nextest-integration> at <unknown source file>:<unknown line>
  604. 265.41 s gammaloop-nextest-integration> 18: <gammalooprs[917cbd3df9e68f8f]::processes::process::Process>::generate_integrands<unknown>
  605. 265.41 s gammaloop-nextest-integration> at <unknown source file>:<unknown line>
  606. 265.41 s gammaloop-nextest-integration> 19: <gammaloop_api[9ebf6628f97aeb57]::state::State>::generate_integrand<unknown>
  607. 265.41 s gammaloop-nextest-integration> at <unknown source file>:<unknown line>
  608. 265.41 s gammaloop-nextest-integration> 20: <gammaloop_api[9ebf6628f97aeb57]::commands::generate::Generate>::run::<&std[bcb96dfbba0ab899]::path::PathBuf><unknown>
  609. 265.41 s gammaloop-nextest-integration> at <unknown source file>:<unknown line>
  610. 265.41 s gammaloop-nextest-integration> 21: <gammaloop_api[9ebf6628f97aeb57]::commands::Commands>::run<unknown>
  611. 265.41 s gammaloop-nextest-integration> at <unknown source file>:<unknown line>
  612. 265.41 s gammaloop-nextest-integration> 22: <gammaloop_api[9ebf6628f97aeb57]::session::CliSession>::execute_prepared<unknown>
  613. 265.41 s gammaloop-nextest-integration> at <unknown source file>:<unknown line>
  614. 265.41 s gammaloop-nextest-integration> 23: <gammaloop_api[9ebf6628f97aeb57]::session::CliSession>::execute_command<unknown>
  615. 265.41 s gammaloop-nextest-integration> at <unknown source file>:<unknown line>
  616. 265.41 s gammaloop-nextest-integration> 24: <gammaloop_integration_tests[191607b70c61cd5a]::CLIState>::run_command<unknown>
  617. 265.41 s gammaloop-nextest-integration> at <unknown source file>:<unknown line>
  618. 265.41 s gammaloop-nextest-integration> 25: test_runs[9b7e2dc2dc4f29b0]::aa_aa::generate_aa_aa_helicity_family<unknown>
  619. 265.41 s gammaloop-nextest-integration> at <unknown source file>:<unknown line>
  620. 265.41 s gammaloop-nextest-integration> 26: <test_runs[9b7e2dc2dc4f29b0]::aa_aa::important::aa_aa_local_inspect_backend_consistency::{closure#0} as core[940e698046960fd5]::ops::function::FnOnce<()>>::call_once<unknown>
  621. 265.41 s gammaloop-nextest-integration> at <unknown source file>:<unknown line>
  622. 265.41 s gammaloop-nextest-integration> 27: serial_test[cd99724524a2f1c0]::serial_code_lock::local_serial_core_with_return::<(), eyre[cb2fd339c0c40fca]::Report><unknown>
  623. 265.41 s gammaloop-nextest-integration> at <unknown source file>:<unknown line>
  624. 265.41 s gammaloop-nextest-integration> 28: <test_runs[9b7e2dc2dc4f29b0]::aa_aa::important::aa_aa_local_inspect_backend_consistency::{closure#0} as core[940e698046960fd5]::ops::function::FnOnce<()>>::call_once<unknown>
  625. 265.41 s gammaloop-nextest-integration> at <unknown source file>:<unknown line>
  626. 265.41 s gammaloop-nextest-integration> 29: test[75d6903177b1d7e9]::__rust_begin_short_backtrace::<core[940e698046960fd5]::result::Result<(), alloc[2ea6bcb46fca0c42]::string::String>, fn() -> core[940e698046960fd5]::result::Result<(), alloc[2ea6bcb46fca0c42]::string::String>><unknown>
  627. 265.41 s gammaloop-nextest-integration> at <unknown source file>:<unknown line>
  628. 265.41 s gammaloop-nextest-integration> 30: test[75d6903177b1d7e9]::run_test::{closure#0}<unknown>
  629. 265.41 s gammaloop-nextest-integration> at <unknown source file>:<unknown line>
  630. 265.41 s gammaloop-nextest-integration> 31: std[bcb96dfbba0ab899]::sys::backtrace::__rust_begin_short_backtrace::<test[75d6903177b1d7e9]::run_test::{closure#1}, ()><unknown>
  631. 265.41 s gammaloop-nextest-integration> at <unknown source file>:<unknown line>
  632. 265.41 s gammaloop-nextest-integration> 32: <std[bcb96dfbba0ab899]::thread::lifecycle::spawn_unchecked<test[75d6903177b1d7e9]::run_test::{closure#1}, ()>::{closure#1} as core[940e698046960fd5]::ops::function::FnOnce<()>>::call_once::{shim:vtable#0}<unknown>
  633. 265.41 s gammaloop-nextest-integration> at <unknown source file>:<unknown line>
  634. 265.41 s gammaloop-nextest-integration> 33: <std[bcb96dfbba0ab899]::sys::thread::unix::Thread>::new::thread_start<unknown>
  635. 265.41 s gammaloop-nextest-integration> at <unknown source file>:<unknown line>
  636. 265.41 s gammaloop-nextest-integration> 34: start_thread<unknown>
  637. 265.41 s gammaloop-nextest-integration> at <unknown source file>:<unknown line>
  638. 265.41 s gammaloop-nextest-integration> 35: __clone3<unknown>
  639. 265.41 s gammaloop-nextest-integration> at <unknown source file>:<unknown line>
  640. 265.41 s gammaloop-nextest-integration>
  641. 265.41 s gammaloop-nextest-integration> Run with COLORBT_SHOW_HIDDEN=1 environment variable to disable frame filtering.
  642. 265.41 s gammaloop-nextest-integration> Run with RUST_BACKTRACE=full to include source snippets.
  643. 265.41 s gammaloop-nextest-integration> Warning: SpanTrace capture is Unsupported.
  644. 265.41 s gammaloop-nextest-integration> Ensure that you've setup a tracing-error ErrorLayer and the semver versions are compatible
  645. 265.41 s gammaloop-nextest-integration>
  646. 265.41 s gammaloop-nextest-integration> 2. gammaloop-integration-tests::uv::thermal_sunrise_uv
  647. 265.41 s gammaloop-nextest-integration> failure: test failure with exit code 101
  648. 265.41 s gammaloop-nextest-integration> system-out
  649. 265.41 s gammaloop-nextest-integration> running 1 test
  650. 265.41 s gammaloop-nextest-integration> test thermal_sunrise_uv ... FAILED
  651. 265.41 s gammaloop-nextest-integration>
  652. 265.41 s gammaloop-nextest-integration> failures:
  653. 265.41 s gammaloop-nextest-integration>
  654. 265.41 s gammaloop-nextest-integration> failures:
  655. 265.41 s gammaloop-nextest-integration> thermal_sunrise_uv
  656. 265.41 s gammaloop-nextest-integration>
  657. 265.41 s gammaloop-nextest-integration> test result: FAILED. 0 passed; 1 failed; 0 ignored; 0 measured; 31 filtered out; finished in 3.40s
  658. 265.41 s gammaloop-nextest-integration> system-err
  659. 265.41 s gammaloop-nextest-integration> [2026-09-18 17:06:07.493] @gammaloop_api::se... INFO : Running command run generate
  660. 265.41 s gammaloop-nextest-integration> [2026-09-18 17:06:07.493] @gammaloop_api::se... INFO : Starting command block generate
  661. 265.41 s gammaloop-nextest-integration> [2026-09-18 17:06:07.493] @gammaloop_api::se... INFO : Running command import model sm-default.json
  662. 265.41 s gammaloop-nextest-integration> [2026-09-18 17:06:07.493] @import::model INFO : Loading built-in JSON model sm-default
  663. 265.41 s gammaloop-nextest-integration> [2026-09-18 17:06:07.537] @gammalooprs::model INFO : The following 15 external parameters were forced to zero by the restriction card:
  664. 265.41 s gammaloop-nextest-integration> lamWS, AWS, rhoWS, etaWS, ymc, yme, ymm, MC, Me, MM, WTau, muQ, muLe, muLmu, muLtau
  665. 265.41 s gammaloop-nextest-integration> [2026-09-18 17:06:07.537] @gammalooprs::model INFO : The following 34 vertex rules were removed by the restriction card:
  666. 265.41 s gammaloop-nextest-integration> V_82 -> (c~, d, G+) | V_83 -> (t~, d, G+) | V_84 -> (c~, s, G+) | V_85 -> (t~, s, G+) | V_86 -> (u~, b, G+) | V_87 -> (c~, b, G+) | V_90 -> (c~, d, W+) | V_91 -> (t~, d, W+) | V_92 -> (u~, s, W+) | V_94 -> (t~, s, W+) | V_95 -> (u~, b, W+) | V_96 -> (c~, b, W+) | V_101 -> (e+, e-, G0) | V_102 -> (mu+, mu-, G0) | V_104 -> (e+, e-, H) | V_105 -> (mu+, mu-, H) | V_110 -> (ve~, e-, G+) | V_111 -> (vm~, mu-, G+) | V_116 -> (b~, u, G-) | V_117 -> (d~, c, G-) | V_118 -> (s~, c, G-) | V_119 -> (b~, c, G-) | V_120 -> (d~, t, G-) | V_121 -> (s~, t, G-) | V_124 -> (s~, u, W-) | V_125 -> (b~, u, W-) | V_126 -> (d~, c, W-) | V_128 -> (b~, c, W-) | V_129 -> (d~, t, W-) | V_130 -> (s~, t, W-) | V_138 -> (c~, c, G0) | V_140 -> (c~, c, H) | V_145 -> (e+, ve, G-) | V_146 -> (mu+, vm, G-)
  667. 265.41 s gammaloop-nextest-integration> [2026-09-18 17:06:07.537] @gammalooprs::model INFO : The following 36 couplings were removed by the restriction card:
  668. 265.41 s gammaloop-nextest-integration> GC_13, GC_14, GC_16, GC_17, GC_18, GC_19, GC_20, GC_22, GC_23, GC_24, GC_25, GC_26, GC_28, GC_29, GC_42, GC_43, GC_44, GC_46, GC_47, GC_48, GC_84, GC_85, GC_86, GC_87, GC_88, GC_89, GC_90, GC_91, GC_92, GC_93, GC_101, GC_102, GC_103, GC_105, GC_106, GC_107
  669. 265.41 s gammaloop-nextest-integration> [2026-09-18 17:06:07.537] @gammaloop_api::se... INFO : Running command remove processes
  670. 265.41 s gammaloop-nextest-integration> [2026-09-18 17:06:07.538] @gammaloop_api::se... INFO : Running command generate amp {} > {} [{2}] | g u
  671. 265.41 s gammaloop-nextest-integration> --numerator-grouping group_identical_graphs_up_to_scalar_rescaling
  672. 265.41 s gammaloop-nextest-integration> --max-n-bridges 0
  673. 265.41 s gammaloop-nextest-integration> --number-of-factorized-loop-subtopologies 1 1
  674. 265.41 s gammaloop-nextest-integration> --number-of-anticommutating-loops 1 1
  675. 265.41 s gammaloop-nextest-integration> [...]
  676. 265.41 s gammaloop-nextest-integration> [2026-09-18 17:06:07.540] @feyngen::diagram_... INFO : 0s | Δ=0s | Starting Feynman graph generation with Symbolica...
  677. 265.41 s gammaloop-nextest-integration> [2026-09-18 17:06:07.540] @feyngen::diagram_... INFO : 0s | Δ=0s | Number of graphs resulting from Symbolica generation: 3
  678. 265.41 s gammaloop-nextest-integration> [2026-09-18 17:06:07.540] @feyngen::diagram_... INFO : 0s | Δ=0s | Number of graphs retained after removal of vetoed topologies: 2
  679. 265.41 s gammaloop-nextest-integration> [2026-09-18 17:06:07.540] @feyngen::diagram_... INFO : 0s | Δ=0s | Number of graphs after vertex info assignment: 2
  680. 265.41 s gammaloop-nextest-integration> [2026-09-18 17:06:07.540] @feyngen::diagram_... INFO : 0s | Δ=0s | Number of graphs after all complete graphs filters are applied: 2
  681. 265.41 s gammaloop-nextest-integration> [2026-09-18 17:06:07.540] @feyngen::diagram_... INFO : 0s | Δ=0s | Number of graphs after closed anticommutating chains analysis: 1
  682. 265.41 s gammaloop-nextest-integration> [2026-09-18 17:06:07.540] @feyngen::diagram_... INFO : 0s | Δ=0s | Number of graphs after symmetrization of external states: 1
  683. 265.41 s gammaloop-nextest-integration> [2026-09-18 17:06:07.541] @feyngen::diagram_... INFO : 0s | Δ=0s | Number of graphs after canonization of vertices, edges and flows (graph labels assigned here): 1
  684. 265.41 s gammaloop-nextest-integration> [2026-09-18 17:06:07.559] @feyngen::diagram_... INFO : 0s | Δ=0s | Number of graphs after numerator-aware grouping with strategy 'up to a scalar rescaling': 1 (1 isomorphically unique graph, 0 color zero, 0 lorentz zero, 0 grouped and 0 cancellation)
  685. 265.41 s gammaloop-nextest-integration> [2026-09-18 17:06:07.559] @feyngen::diagram_... INFO : ( Sum of the symmetry factors from each graph generated = -1/2 )
  686. 265.41 s gammaloop-nextest-integration> [2026-09-18 17:06:07.559] @commands::generate INFO : Generated amplitude 1 graphs.
  687. 265.41 s gammaloop-nextest-integration> [2026-09-18 17:06:07.559] @commands::generate INFO : Only diagram generation was requested, skipping integrand generation. You can generate integrands later using the 'generate existing <options>' command.
  688. 265.41 s gammaloop-nextest-integration> [2026-09-18 17:06:07.559] @gammaloop_api::se... INFO : Running command generate
  689. 265.41 s gammaloop-nextest-integration> The application panicked (crashed).
  690. 265.41 s gammaloop-nextest-integration> Message: label _func_power_ not found
  691. 265.41 s gammaloop-nextest-integration> Location: /nix/store/n9w914kh1cm59xx3spcs831cdyb56m32-vendor-cargo-deps/c19b7c6f923b580ac259164a89f2577984ad5ab09ee9d583b888f934adbbe8d0/symjit-2.25.6/src/symjit/assembler.rs:77
  692. 265.41 s gammaloop-nextest-integration>
  693. 265.41 s gammaloop-nextest-integration> ━━━━━━━━━━━━━━━━━━━━━━━━━━━━━━━━━━ BACKTRACE ━━━━━━━━━━━━━━━━━━━━━━━━━━━━━━━━━━━
  694. 265.41 s gammaloop-nextest-integration> 1: <color_eyre[51793ea62743adbd]::config::PanicHook>::panic_report<unknown>
  695. 265.41 s gammaloop-nextest-integration> at <unknown source file>:<unknown line>
  696. 265.41 s gammaloop-nextest-integration> 2: <color_eyre[51793ea62743adbd]::config::PanicHook>::into_panic_hook::{closure#0}<unknown>
  697. 265.41 s gammaloop-nextest-integration> at <unknown source file>:<unknown line>
  698. 265.41 s gammaloop-nextest-integration> 3: std[bcb96dfbba0ab899]::panicking::panic_with_hook<unknown>
  699. 265.41 s gammaloop-nextest-integration> at <unknown source file>:<unknown line>
  700. 265.41 s gammaloop-nextest-integration> 4: std[bcb96dfbba0ab899]::panicking::panic_handler::{closure#0}<unknown>
  701. 265.41 s gammaloop-nextest-integration> at <unknown source file>:<unknown line>
  702. 265.41 s gammaloop-nextest-integration> 5: std[bcb96dfbba0ab899]::sys::backtrace::__rust_end_short_backtrace::<std[bcb96dfbba0ab899]::panicking::panic_handler::{closure#0}, !><unknown>
  703. 265.41 s gammaloop-nextest-integration> at <unknown source file>:<unknown line>
  704. 265.41 s gammaloop-nextest-integration> 6: __rustc[6c289b9f9c454d21]::rust_begin_unwind<unknown>
  705. 265.41 s gammaloop-nextest-integration> at <unknown source file>:<unknown line>
  706. 265.41 s gammaloop-nextest-integration> 7: core[940e698046960fd5]::panicking::panic_fmt<unknown>
  707. 265.41 s gammaloop-nextest-integration> at <unknown source file>:<unknown line>
  708. 265.41 s gammaloop-nextest-integration> 8: <symjit[e408de789c333cd]::symjit::assembler::Assembler>::apply_jumps<unknown>
  709. 265.41 s gammaloop-nextest-integration> at <unknown source file>:<unknown line>
  710. 265.41 s gammaloop-nextest-integration> 9: <symjit[e408de789c333cd]::symjit::builder::Builder>::compile_from_mir::<symjit[e408de789c333cd]::symjit::amd::complex::AmdComplexGenerator><unknown>
  711. 265.41 s gammaloop-nextest-integration> at <unknown source file>:<unknown line>
  712. 265.41 s gammaloop-nextest-integration> 10: <symjit[e408de789c333cd]::symjit::runnable::Application>::compile_ty<unknown>
  713. 265.41 s gammaloop-nextest-integration> at <unknown source file>:<unknown line>
  714. 265.41 s gammaloop-nextest-integration> 11: <symjit[e408de789c333cd]::symjit::runnable::Application>::with_mir<unknown>
  715. 265.41 s gammaloop-nextest-integration> at <unknown source file>:<unknown line>
  716. 265.41 s gammaloop-nextest-integration> 12: <symjit[e408de789c333cd]::symjit::composer::DirectTranslator as symjit[e408de789c333cd]::symjit::composer::Composer>::compile<unknown>
  717. 265.41 s gammaloop-nextest-integration> at <unknown source file>:<unknown line>
  718. 265.41 s gammaloop-nextest-integration> 13: <symjit[e408de789c333cd]::symjit::compiler::Translator as symjit[e408de789c333cd]::symjit::composer::Composer>::compile<unknown>
  719. 265.41 s gammaloop-nextest-integration> at <unknown source file>:<unknown line>
  720. 265.41 s gammaloop-nextest-integration> 14: <numerica[124dab8567f4861e]::domains::float::complex::Complex<f64> as symbolica[10e259bab675d243]::evaluate::backend::JITCompiledNumber>::jit_compile<unknown>
  721. 265.41 s gammaloop-nextest-integration> at <unknown source file>:<unknown line>
  722. 265.41 s gammaloop-nextest-integration> 15: <gammalooprs[917cbd3df9e68f8f]::integrands::process::evaluators::GenericEvaluator>::activate_symjit<unknown>
  723. 265.41 s gammaloop-nextest-integration> at <unknown source file>:<unknown line>
  724. 265.41 s gammaloop-nextest-integration> 16: <gammalooprs[917cbd3df9e68f8f]::integrands::process::amplitude::AmplitudeIntegrand>::prepare_runtime_backends_after_generation_with_compile_times<unknown>
  725. 265.41 s gammaloop-nextest-integration> at <unknown source file>:<unknown line>
  726. 265.41 s gammaloop-nextest-integration> 17: <gammalooprs[917cbd3df9e68f8f]::processes::amplitude::Amplitude>::build_integrand<unknown>
  727. 265.41 s gammaloop-nextest-integration> at <unknown source file>:<unknown line>
  728. 265.41 s gammaloop-nextest-integration> 18: <gammalooprs[917cbd3df9e68f8f]::processes::process::Process>::generate_integrands<unknown>
  729. 265.41 s gammaloop-nextest-integration> at <unknown source file>:<unknown line>
  730. 265.41 s gammaloop-nextest-integration> 19: <gammalooprs[917cbd3df9e68f8f]::processes::ProcessList>::generate_integrands<unknown>
  731. 265.41 s gammaloop-nextest-integration> at <unknown source file>:<unknown line>
  732. 265.41 s gammaloop-nextest-integration> 20: <gammaloop_api[9ebf6628f97aeb57]::state::State>::generate_integrands<unknown>
  733. 265.41 s gammaloop-nextest-integration> at <unknown source file>:<unknown line>
  734. 265.41 s gammaloop-nextest-integration> 21: <gammaloop_api[9ebf6628f97aeb57]::commands::generate::Generate>::run::<&std[bcb96dfbba0ab899]::path::PathBuf><unknown>
  735. 265.41 s gammaloop-nextest-integration> at <unknown source file>:<unknown line>
  736. 265.41 s gammaloop-nextest-integration> 22: <gammaloop_api[9ebf6628f97aeb57]::commands::Commands>::run<unknown>
  737. 265.42 s gammaloop-nextest-integration> at <unknown source file>:<unknown line>
  738. 265.42 s gammaloop-nextest-integration> 23: <gammaloop_api[9ebf6628f97aeb57]::session::CliSession>::execute_prepared<unknown>
  739. 265.42 s gammaloop-nextest-integration> at <unknown source file>:<unknown line>
  740. 265.42 s gammaloop-nextest-integration> 24: <gammaloop_api[9ebf6628f97aeb57]::session::CliSession>::execute_prepared_commands<unknown>
  741. 265.42 s gammaloop-nextest-integration> at <unknown source file>:<unknown line>
  742. 265.42 s gammaloop-nextest-integration> 25: <gammaloop_api[9ebf6628f97aeb57]::session::CliSession>::execute_prepared<unknown>
  743. 265.42 s gammaloop-nextest-integration> at <unknown source file>:<unknown line>
  744. 265.42 s gammaloop-nextest-integration> 26: <gammaloop_api[9ebf6628f97aeb57]::session::CliSession>::execute_command<unknown>
  745. 265.42 s gammaloop-nextest-integration> at <unknown source file>:<unknown line>
  746. 265.42 s gammaloop-nextest-integration> 27: <gammaloop_integration_tests[191607b70c61cd5a]::CLIState>::run_command<unknown>
  747. 265.42 s gammaloop-nextest-integration> at <unknown source file>:<unknown line>
  748. 265.42 s gammaloop-nextest-integration> 28: uv[3c7454ef256d6487]::run_single_integrated_uv_case<unknown>
  749. 265.42 s gammaloop-nextest-integration> at <unknown source file>:<unknown line>
  750. 265.42 s gammaloop-nextest-integration> 29: <uv[3c7454ef256d6487]::thermal_sunrise_uv::{closure#0} as core[940e698046960fd5]::ops::function::FnOnce<()>>::call_once<unknown>
  751. 265.42 s gammaloop-nextest-integration> at <unknown source file>:<unknown line>
  752. 265.42 s gammaloop-nextest-integration> 30: test[75d6903177b1d7e9]::__rust_begin_short_backtrace::<core[940e698046960fd5]::result::Result<(), alloc[2ea6bcb46fca0c42]::string::String>, fn() -> core[940e698046960fd5]::result::Result<(), alloc[2ea6bcb46fca0c42]::string::String>><unknown>
  753. 265.42 s gammaloop-nextest-integration> at <unknown source file>:<unknown line>
  754. 265.42 s gammaloop-nextest-integration> 31: test[75d6903177b1d7e9]::run_test::{closure#0}<unknown>
  755. 265.42 s gammaloop-nextest-integration> at <unknown source file>:<unknown line>
  756. 265.42 s gammaloop-nextest-integration> 32: std[bcb96dfbba0ab899]::sys::backtrace::__rust_begin_short_backtrace::<test[75d6903177b1d7e9]::run_test::{closure#1}, ()><unknown>
  757. 265.42 s gammaloop-nextest-integration> at <unknown source file>:<unknown line>
  758. 265.42 s gammaloop-nextest-integration> 33: <std[bcb96dfbba0ab899]::thread::lifecycle::spawn_unchecked<test[75d6903177b1d7e9]::run_test::{closure#1}, ()>::{closure#1} as core[940e698046960fd5]::ops::function::FnOnce<()>>::call_once::{shim:vtable#0}<unknown>
  759. 265.42 s gammaloop-nextest-integration> at <unknown source file>:<unknown line>
  760. 265.42 s gammaloop-nextest-integration> 34: <std[bcb96dfbba0ab899]::sys::thread::unix::Thread>::new::thread_start<unknown>
  761. 265.42 s gammaloop-nextest-integration> at <unknown source file>:<unknown line>
  762. 265.42 s gammaloop-nextest-integration> 35: start_thread<unknown>
  763. 265.42 s gammaloop-nextest-integration> at <unknown source file>:<unknown line>
  764. 265.42 s gammaloop-nextest-integration> 36: __clone3<unknown>
  765. 265.42 s gammaloop-nextest-integration> at <unknown source file>:<unknown line>
  766. 265.42 s gammaloop-nextest-integration>
  767. 265.42 s gammaloop-nextest-integration> Run with COLORBT_SHOW_HIDDEN=1 environment variable to disable frame filtering.
  768. 265.42 s gammaloop-nextest-integration> Run with RUST_BACKTRACE=full to include source snippets.
  769. 265.42 s gammaloop-nextest-integration> Warning: SpanTrace capture is Unsupported.
  770. 265.42 s gammaloop-nextest-integration> Ensure that you've setup a tracing-error ErrorLayer and the semver versions are compatible
  771. 265.42 s gammaloop-nextest-integration> =========================================
  772. 265.52 s [0 built (1 failed), 0.0error: Cannot build '/nix/store/gigaa94kmmfy8jkh87hvwv50zf7hs40j-gammaloop-nextest-integration.drv'.
  773. 265.52 s Reason: builder failed with exit code 100.
  774. 265.52 s Output paths:
  775. 265.52 s /nix/store/z4r9lrmw75s2jgdid4kv238yw4kqv7lb-gammaloop-nextest-integration
  776. 265.52 s Last 755 log lines:
  777. 265.52 s > Extracting 13 binaries, 1 build script output directory, and 3 linked paths to /build/nextest-archive-XejmE9
  778. 265.52 s > Extracted 30 files to /build/nextest-archive-XejmE9 in 2.50s
  779. 265.52 s > ------------
  780. 265.52 s > Nextest run ID 76a62137-c3d1-40a0-be8d-5a3b452c5477 with nextest profile: ci_gammaloop
  781. 265.52 s > Starting 170 tests across 13 binaries (209 tests skipped, including 208 tests via profile.ci_gammaloop.default-filter)
  782. 265.52 s > FAIL [ 3.150s] ( 55/170) gammaloop-integration-tests::test_runs aa_aa::important::aa_aa_local_inspect_backend_consistency
  783. 265.52 s > stdout ---
  784. 265.52 s >
  785. 265.52 s > running 1 test
  786. 265.52 s > test aa_aa::important::aa_aa_local_inspect_backend_consistency ... FAILED
  787. 265.52 s >
  788. 265.52 s > failures:
  789. 265.52 s >
  790. 265.52 s > failures:
  791. 265.52 s > aa_aa::important::aa_aa_local_inspect_backend_consistency
  792. 265.52 s >
  793. 265.52 s > test result: FAILED. 0 passed; 1 failed; 0 ignored; 0 measured; 274 filtered out; finished in 3.14s
  794. 265.52 s >
  795. 265.52 s > stderr ---
  796. 265.52 s > [2026-09-18 17:05:15.276] @gammaloop_api::se... INFO : Running command import model sm-default.json
  797. 265.52 s > [2026-09-18 17:05:15.277] @import::model INFO : Loading built-in JSON model sm-default
  798. 265.52 s > [2026-09-18 17:05:15.299] @gammalooprs::model INFO : The following 15 external parameters were forced to zero by the restriction card:
  799. 265.52 s > lamWS, AWS, rhoWS, etaWS, ymc, yme, ymm, MC, Me, MM, WTau, muQ, muLe, muLmu, muLtau
  800. 265.52 s > [2026-09-18 17:05:15.300] @gammalooprs::model INFO : The following 34 vertex rules were removed by the restriction card:
  801. 265.52 s > V_82 -> (c~, d, G+) | V_83 -> (t~, d, G+) | V_84 -> (c~, s, G+) | V_85 -> (t~, s, G+) | V_86 -> (u~, b, G+) | V_87 -> (c~, b, G+) | V_90 -> (c~, d, W+) | V_91 -> (t~, d, W+) | V_92 -> (u~, s, W+) | V_94 -> (t~, s, W+) | V_95 -> (u~, b, W+) | V_96 -> (c~, b, W+) | V_101 -> (e+, e-, G0) | V_102 -> (mu+, mu-, G0) | V_104 -> (e+, e-, H) | V_105 -> (mu+, mu-, H) | V_110 -> (ve~, e-, G+) | V_111 -> (vm~, mu-, G+) | V_116 -> (b~, u, G-) | V_117 -> (d~, c, G-) | V_118 -> (s~, c, G-) | V_119 -> (b~, c, G-) | V_120 -> (d~, t, G-) | V_121 -> (s~, t, G-) | V_124 -> (s~, u, W-) | V_125 -> (b~, u, W-) | V_126 -> (d~, c, W-) | V_128 -> (b~, c, W-) | V_129 -> (d~, t, W-) | V_130 -> (s~, t, W-) | V_138 -> (c~, c, G0) | V_140 -> (c~, c, H) | V_145 -> (e+, ve, G-) | V_146 -> (mu+, vm, G-)
  802. 265.52 s > [2026-09-18 17:05:15.300] @gammalooprs::model INFO : The following 36 couplings were removed by the restriction card:
  803. 265.52 s > GC_13, GC_14, GC_16, GC_17, GC_18, GC_19, GC_20, GC_22, GC_23, GC_24, GC_25, GC_26, GC_28, GC_29, GC_42, GC_43, GC_44, GC_46, GC_47, GC_48, GC_84, GC_85, GC_86, GC_87, GC_88, GC_89, GC_90, GC_91, GC_92, GC_93, GC_101, GC_102, GC_103, GC_105, GC_106, GC_107
  804. 265.52 s > [2026-09-18 17:05:15.300] @gammaloop_api::se... INFO : Running command run set_model_parameters
  805. 265.52 s > [2026-09-18 17:05:15.300] @gammaloop_api::se... INFO : Starting command block set_model_parameters
  806. 265.52 s > [2026-09-18 17:05:15.300] @gammaloop_api::se... INFO : Running command set model MT=173.0
  807. 265.52 s > [2026-09-18 17:05:15.305] @gammaloop_api::se... INFO : Running command set model WT=0.0
  808. 265.52 s > [2026-09-18 17:05:15.309] @gammaloop_api::se... INFO : Running command set model ymt=173.0
  809. 265.52 s > [2026-09-18 17:05:15.314] @gammaloop_api::se... INFO : Running command set model aS=0.118
  810. 265.52 s > [2026-09-18 17:05:15.318] @gammaloop_api::se... INFO : Running command set model aEWM1=137.036
  811. 265.52 s > [2026-09-18 17:05:15.322] @gammaloop_api::se... INFO : Running command set model Gf=1.166390e-05
  812. 265.52 s > [2026-09-18 17:05:15.327] @gammaloop_api::se... INFO : Running command set model MZ=91.188
  813. 265.52 s > [2026-09-18 17:05:15.331] @gammaloop_api::se... INFO : Running command set global string '
  814. 265.52 s > [global.generation.compile]
  815. 265.52 s > compilation_mode = "symjit"
  816. 265.52 s > optimization_level = "O0"
  817. 265.52 s > fast_math = false
  818. 265.52 s > [...]
  819. 265.52 s > [2026-09-18 17:05:15.332] @gammaloop_api::se... INFO : Running command import graphs ./examples/cli/aa_aa/1L/aa_aa_1L.dot -p aa_aa_all_helicities -i 1L_ppmm -o
  820. 265.52 s > [2026-09-18 17:05:15.332] @commands::import INFO : Loading graphs from '/build/source/examples/cli/aa_aa/1L/aa_aa_1L.dot'
  821. 265.52 s > [2026-09-18 17:05:15.342] @gammaloop_api::se... INFO : Running command generate existing -p aa_aa_all_helicities
  822. 265.52 s > The application panicked (crashed).
  823. 265.52 s > Message: label _func_power_ not found
  824. 265.52 s > Location: /nix/store/n9w914kh1cm59xx3spcs831cdyb56m32-vendor-cargo-deps/c19b7c6f923b580ac259164a89f2577984ad5ab09ee9d583b888f934adbbe8d0/symjit-2.25.6/src/symjit/assembler.rs:77
  825. 265.52 s >
  826. 265.52 s > ━━━━━━━━━━━━━━━━━━━━━━━━━━━━━━━━━━ BACKTRACE ━━━━━━━━━━━━━━━━━━━━━━━━━━━━━━━━━━━
  827. 265.52 s > 1: <color_eyre[51793ea62743adbd]::config::PanicHook>::panic_report<unknown>
  828. 265.52 s > at <unknown source file>:<unknown line>
  829. 265.52 s > 2: <color_eyre[51793ea62743adbd]::config::PanicHook>::into_panic_hook::{closure#0}<unknown>
  830. 265.52 s > at <unknown source file>:<unknown line>
  831. 265.52 s > 3: std[bcb96dfbba0ab899]::panicking::panic_with_hook<unknown>
  832. 265.52 s > at <unknown source file>:<unknown line>
  833. 265.52 s > 4: std[bcb96dfbba0ab899]::panicking::panic_handler::{closure#0}<unknown>
  834. 265.52 s > at <unknown source file>:<unknown line>
  835. 265.52 s > 5: std[bcb96dfbba0ab899]::sys::backtrace::__rust_end_short_backtrace::<std[bcb96dfbba0ab899]::panicking::panic_handler::{closure#0}, !><unknown>
  836. 265.52 s > at <unknown source file>:<unknown line>
  837. 265.52 s > 6: __rustc[6c289b9f9c454d21]::rust_begin_unwind<unknown>
  838. 265.52 s > at <unknown source file>:<unknown line>
  839. 265.52 s > 7: core[940e698046960fd5]::panicking::panic_fmt<unknown>
  840. 265.52 s > at <unknown source file>:<unknown line>
  841. 265.52 s > 8: <symjit[e408de789c333cd]::symjit::assembler::Assembler>::apply_jumps<unknown>
  842. 265.52 s > at <unknown source file>:<unknown line>
  843. 265.52 s > 9: <symjit[e408de789c333cd]::symjit::builder::Builder>::compile_from_mir::<symjit[e408de789c333cd]::symjit::amd::complex::AmdComplexGenerator><unknown>
  844. 265.52 s > at <unknown source file>:<unknown line>
  845. 265.52 s > 10: <symjit[e408de789c333cd]::symjit::runnable::Application>::compile_ty<unknown>
  846. 265.52 s > at <unknown source file>:<unknown line>
  847. 265.52 s > 11: <symjit[e408de789c333cd]::symjit::runnable::Application>::with_mir<unknown>
  848. 265.52 s > at <unknown source file>:<unknown line>
  849. 265.52 s > 12: <symjit[e408de789c333cd]::symjit::composer::DirectTranslator as symjit[e408de789c333cd]::symjit::composer::Composer>::compile<unknown>
  850. 265.52 s > at <unknown source file>:<unknown line>
  851. 265.52 s > 13: <symjit[e408de789c333cd]::symjit::compiler::Translator as symjit[e408de789c333cd]::symjit::composer::Composer>::compile<unknown>
  852. 265.52 s > at <unknown source file>:<unknown line>
  853. 265.52 s > 14: <numerica[124dab8567f4861e]::domains::float::complex::Complex<f64> as symbolica[10e259bab675d243]::evaluate::backend::JITCompiledNumber>::jit_compile<unknown>
  854. 265.52 s > at <unknown source file>:<unknown line>
  855. 265.52 s > 15: <gammalooprs[917cbd3df9e68f8f]::integrands::process::evaluators::GenericEvaluator>::activate_symjit<unknown>
  856. 265.52 s > at <unknown source file>:<unknown line>
  857. 265.52 s > 16: <gammalooprs[917cbd3df9e68f8f]::integrands::process::amplitude::AmplitudeIntegrand>::prepare_runtime_backends_after_generation_with_compile_times<unknown>
  858. 265.52 s > at <unknown source file>:<unknown line>
  859. 265.52 s > 17: <gammalooprs[917cbd3df9e68f8f]::processes::amplitude::Amplitude>::build_integrand<unknown>
  860. 265.52 s > at <unknown source file>:<unknown line>
  861. 265.52 s > 18: <gammalooprs[917cbd3df9e68f8f]::processes::process::Process>::generate_integrands<unknown>
  862. 265.52 s > at <unknown source file>:<unknown line>
  863. 265.52 s > 19: <gammaloop_api[9ebf6628f97aeb57]::state::State>::generate_integrand<unknown>
  864. 265.52 s > at <unknown source file>:<unknown line>
  865. 265.52 s > 20: <gammaloop_api[9ebf6628f97aeb57]::commands::generate::Generate>::run::<&std[bcb96dfbba0ab899]::path::PathBuf><unknown>
  866. 265.52 s > at <unknown source file>:<unknown line>
  867. 265.52 s > 21: <gammaloop_api[9ebf6628f97aeb57]::commands::Commands>::run<unknown>
  868. 265.52 s > at <unknown source file>:<unknown line>
  869. 265.52 s > 22: <gammaloop_api[9ebf6628f97aeb57]::session::CliSession>::execute_prepared<unknown>
  870. 265.52 s > at <unknown source file>:<unknown line>
  871. 265.52 s > 23: <gammaloop_api[9ebf6628f97aeb57]::session::CliSession>::execute_command<unknown>
  872. 265.52 s > at <unknown source file>:<unknown line>
  873. 265.52 s > 24: <gammaloop_integration_tests[191607b70c61cd5a]::CLIState>::run_command<unknown>
  874. 265.52 s > at <unknown source file>:<unknown line>
  875. 265.52 s > 25: test_runs[9b7e2dc2dc4f29b0]::aa_aa::generate_aa_aa_helicity_family<unknown>
  876. 265.52 s > at <unknown source file>:<unknown line>
  877. 265.52 s > 26: <test_runs[9b7e2dc2dc4f29b0]::aa_aa::important::aa_aa_local_inspect_backend_consistency::{closure#0} as core[940e698046960fd5]::ops::function::FnOnce<()>>::call_once<unknown>
  878. 265.52 s > at <unknown source file>:<unknown line>
  879. 265.52 s > 27: serial_test[cd99724524a2f1c0]::serial_code_lock::local_serial_core_with_return::<(), eyre[cb2fd339c0c40fca]::Report><unknown>
  880. 265.52 s > at <unknown source file>:<unknown line>
  881. 265.52 s > 28: <test_runs[9b7e2dc2dc4f29b0]::aa_aa::important::aa_aa_local_inspect_backend_consistency::{closure#0} as core[940e698046960fd5]::ops::function::FnOnce<()>>::call_once<unknown>
  882. 265.52 s > at <unknown source file>:<unknown line>
  883. 265.52 s > 29: test[75d6903177b1d7e9]::__rust_begin_short_backtrace::<core[940e698046960fd5]::result::Result<(), alloc[2ea6bcb46fca0c42]::string::String>, fn() -> core[940e698046960fd5]::result::Result<(), alloc[2ea6bcb46fca0c42]::string::String>><unknown>
  884. 265.52 s > at <unknown source file>:<unknown line>
  885. 265.52 s > 30: test[75d6903177b1d7e9]::run_test::{closure#0}<unknown>
  886. 265.52 s > at <unknown source file>:<unknown line>
  887. 265.52 s > 31: std[bcb96dfbba0ab899]::sys::backtrace::__rust_begin_short_backtrace::<test[75d6903177b1d7e9]::run_test::{closure#1}, ()><unknown>
  888. 265.52 s > at <unknown source file>:<unknown line>
  889. 265.52 s > 32: <std[bcb96dfbba0ab899]::thread::lifecycle::spawn_unchecked<test[75d6903177b1d7e9]::run_test::{closure#1}, ()>::{closure#1} as core[940e698046960fd5]::ops::function::FnOnce<()>>::call_once::{shim:vtable#0}<unknown>
  890. 265.52 s > at <unknown source file>:<unknown line>
  891. 265.52 s > 33: <std[bcb96dfbba0ab899]::sys::thread::unix::Thread>::new::thread_start<unknown>
  892. 265.52 s > at <unknown source file>:<unknown line>
  893. 265.52 s > 34: start_thread<unknown>
  894. 265.52 s > at <unknown source file>:<unknown line>
  895. 265.52 s > 35: __clone3<unknown>
  896. 265.52 s > at <unknown source file>:<unknown line>
  897. 265.52 s >
  898. 265.52 s > Run with COLORBT_SHOW_HIDDEN=1 environment variable to disable frame filtering.
  899. 265.52 s > Run with RUST_BACKTRACE=full to include source snippets.
  900. 265.52 s > Warning: SpanTrace capture is Unsupported.
  901. 265.52 s > Ensure that you've setup a tracing-error ErrorLayer and the semver versions are compatible
  902. 265.52 s >
  903. 265.52 s > FAIL [ 3.410s] (159/170) gammaloop-integration-tests::uv thermal_sunrise_uv
  904. 265.52 s > stdout ---
  905. 265.52 s >
  906. 265.52 s > running 1 test
  907. 265.52 s > test thermal_sunrise_uv ... FAILED
  908. 265.52 s >
  909. 265.52 s > failures:
  910. 265.52 s >
  911. 265.52 s > failures:
  912. 265.52 s > thermal_sunrise_uv
  913. 265.52 s >
  914. 265.52 s > test result: FAILED. 0 passed; 1 failed; 0 ignored; 0 measured; 31 filtered out; finished in 3.40s
  915. 265.52 s >
  916. 265.52 s > stderr ---
  917. 265.52 s > [2026-09-18 17:06:07.493] @gammaloop_api::se... INFO : Running command run generate
  918. 265.52 s > [2026-09-18 17:06:07.493] @gammaloop_api::se... INFO : Starting command block generate
  919. 265.52 s > [2026-09-18 17:06:07.493] @gammaloop_api::se... INFO : Running command import model sm-default.json
  920. 265.52 s > [2026-09-18 17:06:07.493] @import::model INFO : Loading built-in JSON model sm-default
  921. 265.52 s > [2026-09-18 17:06:07.537] @gammalooprs::model INFO : The following 15 external parameters were forced to zero by the restriction card:
  922. 265.52 s > lamWS, AWS, rhoWS, etaWS, ymc, yme, ymm, MC, Me, MM, WTau, muQ, muLe, muLmu, muLtau
  923. 265.52 s > [2026-09-18 17:06:07.537] @gammalooprs::model INFO : The following 34 vertex rules were removed by the restriction card:
  924. 265.52 s > V_82 -> (c~, d, G+) | V_83 -> (t~, d, G+) | V_84 -> (c~, s, G+) | V_85 -> (t~, s, G+) | V_86 -> (u~, b, G+) | V_87 -> (c~, b, G+) | V_90 -> (c~, d, W+) | V_91 -> (t~, d, W+) | V_92 -> (u~, s, W+) | V_94 -> (t~, s, W+) | V_95 -> (u~, b, W+) | V_96 -> (c~, b, W+) | V_101 -> (e+, e-, G0) | V_102 -> (mu+, mu-, G0) | V_104 -> (e+, e-, H) | V_105 -> (mu+, mu-, H) | V_110 -> (ve~, e-, G+) | V_111 -> (vm~, mu-, G+) | V_116 -> (b~, u, G-) | V_117 -> (d~, c, G-) | V_118 -> (s~, c, G-) | V_119 -> (b~, c, G-) | V_120 -> (d~, t, G-) | V_121 -> (s~, t, G-) | V_124 -> (s~, u, W-) | V_125 -> (b~, u, W-) | V_126 -> (d~, c, W-) | V_128 -> (b~, c, W-) | V_129 -> (d~, t, W-) | V_130 -> (s~, t, W-) | V_138 -> (c~, c, G0) | V_140 -> (c~, c, H) | V_145 -> (e+, ve, G-) | V_146 -> (mu+, vm, G-)
  925. 265.52 s > [2026-09-18 17:06:07.537] @gammalooprs::model INFO : The following 36 couplings were removed by the restriction card:
  926. 265.52 s > GC_13, GC_14, GC_16, GC_17, GC_18, GC_19, GC_20, GC_22, GC_23, GC_24, GC_25, GC_26, GC_28, GC_29, GC_42, GC_43, GC_44, GC_46, GC_47, GC_48, GC_84, GC_85, GC_86, GC_87, GC_88, GC_89, GC_90, GC_91, GC_92, GC_93, GC_101, GC_102, GC_103, GC_105, GC_106, GC_107
  927. 265.52 s > [2026-09-18 17:06:07.537] @gammaloop_api::se... INFO : Running command remove processes
  928. 265.52 s > [2026-09-18 17:06:07.538] @gammaloop_api::se... INFO : Running command generate amp {} > {} [{2}] | g u
  929. 265.52 s > --numerator-grouping group_identical_graphs_up_to_scalar_rescaling
  930. 265.52 s > --max-n-bridges 0
  931. 265.52 s > --number-of-factorized-loop-subtopologies 1 1
  932. 265.52 s > --number-of-anticommutating-loops 1 1
  933. 265.52 s > [...]
  934. 265.52 s > [2026-09-18 17:06:07.540] @feyngen::diagram_... INFO : 0s | Δ=0s | Starting Feynman graph generation with Symbolica...
  935. 265.52 s > [2026-09-18 17:06:07.540] @feyngen::diagram_... INFO : 0s | Δ=0s | Number of graphs resulting from Symbolica generation: 3
  936. 265.52 s > [2026-09-18 17:06:07.540] @feyngen::diagram_... INFO : 0s | Δ=0s | Number of graphs retained after removal of vetoed topologies: 2
  937. 265.52 s > [2026-09-18 17:06:07.540] @feyngen::diagram_... INFO : 0s | Δ=0s | Number of graphs after vertex info assignment: 2
  938. 265.52 s > [2026-09-18 17:06:07.540] @feyngen::diagram_... INFO : 0s | Δ=0s | Number of graphs after all complete graphs filters are applied: 2
  939. 265.52 s > [2026-09-18 17:06:07.540] @feyngen::diagram_... INFO : 0s | Δ=0s | Number of graphs after closed anticommutating chains analysis: 1
  940. 265.52 s > [2026-09-18 17:06:07.540] @feyngen::diagram_... INFO : 0s | Δ=0s | Number of graphs after symmetrization of external states: 1
  941. 265.52 s > [2026-09-18 17:06:07.541] @feyngen::diagram_... INFO : 0s | Δ=0s | Number of graphs after canonization of vertices, edges and flows (graph labels assigned here): 1
  942. 265.52 s > [2026-09-18 17:06:07.559] @feyngen::diagram_... INFO : 0s | Δ=0s | Number of graphs after numerator-aware grouping with strategy 'up to a scalar rescaling': 1 (1 isomorphically unique graph, 0 color zero, 0 lorentz zero, 0 grouped and 0 cancellation)
  943. 265.52 s > [2026-09-18 17:06:07.559] @feyngen::diagram_... INFO : ( Sum of the symmetry factors from each graph generated = -1/2 )
  944. 265.52 s > [2026-09-18 17:06:07.559] @commands::generate INFO : Generated amplitude 1 graphs.
  945. 265.52 s > [2026-09-18 17:06:07.559] @commands::generate INFO : Only diagram generation was requested, skipping integrand generation. You can generate integrands later using the 'generate existing <options>' command.
  946. 265.52 s > [2026-09-18 17:06:07.559] @gammaloop_api::se... INFO : Running command generate
  947. 265.52 s > The application panicked (crashed).
  948. 265.52 s > Message: label _func_power_ not found
  949. 265.52 s > Location: /nix/store/n9w914kh1cm59xx3spcs831cdyb56m32-vendor-cargo-deps/c19b7c6f923b580ac259164a89f2577984ad5ab09ee9d583b888f934adbbe8d0/symjit-2.25.6/src/symjit/assembler.rs:77
  950. 265.52 s >
  951. 265.52 s > ━━━━━━━━━━━━━━━━━━━━━━━━━━━━━━━━━━ BACKTRACE ━━━━━━━━━━━━━━━━━━━━━━━━━━━━━━━━━━━
  952. 265.52 s > 1: <color_eyre[51793ea62743adbd]::config::PanicHook>::panic_report<unknown>
  953. 265.52 s > at <unknown source file>:<unknown line>
  954. 265.52 s > 2: <color_eyre[51793ea62743adbd]::config::PanicHook>::into_panic_hook::{closure#0}<unknown>
  955. 265.52 s > at <unknown source file>:<unknown line>
  956. 265.52 s > 3: std[bcb96dfbba0ab899]::panicking::panic_with_hook<unknown>
  957. 265.52 s > at <unknown source file>:<unknown line>
  958. 265.52 s > 4: std[bcb96dfbba0ab899]::panicking::panic_handler::{closure#0}<unknown>
  959. 265.52 s > at <unknown source file>:<unknown line>
  960. 265.52 s > 5: std[bcb96dfbba0ab899]::sys::backtrace::__rust_end_short_backtrace::<std[bcb96dfbba0ab899]::panicking::panic_handler::{closure#0}, !><unknown>
  961. 265.52 s > at <unknown source file>:<unknown line>
  962. 265.52 s > 6: __rustc[6c289b9f9c454d21]::rust_begin_unwind<unknown>
  963. 265.52 s > at <unknown source file>:<unknown line>
  964. 265.52 s > 7: core[940e698046960fd5]::panicking::panic_fmt<unknown>
  965. 265.52 s > at <unknown source file>:<unknown line>
  966. 265.52 s > 8: <symjit[e408de789c333cd]::symjit::assembler::Assembler>::apply_jumps<unknown>
  967. 265.52 s > at <unknown source file>:<unknown line>
  968. 265.52 s > 9: <symjit[e408de789c333cd]::symjit::builder::Builder>::compile_from_mir::<symjit[e408de789c333cd]::symjit::amd::complex::AmdComplexGenerator><unknown>
  969. 265.52 s > at <unknown source file>:<unknown line>
  970. 265.52 s > 10: <symjit[e408de789c333cd]::symjit::runnable::Application>::compile_ty<unknown>
  971. 265.52 s > at <unknown source file>:<unknown line>
  972. 265.52 s > 11: <symjit[e408de789c333cd]::symjit::runnable::Application>::with_mir<unknown>
  973. 265.52 s > at <unknown source file>:<unknown line>
  974. 265.52 s > 12: <symjit[e408de789c333cd]::symjit::composer::DirectTranslator as symjit[e408de789c333cd]::symjit::composer::Composer>::compile<unknown>
  975. 265.52 s > at <unknown source file>:<unknown line>
  976. 265.52 s > 13: <symjit[e408de789c333cd]::symjit::compiler::Translator as symjit[e408de789c333cd]::symjit::composer::Composer>::compile<unknown>
  977. 265.52 s > at <unknown source file>:<unknown line>
  978. 265.52 s > 14: <numerica[124dab8567f4861e]::domains::float::complex::Complex<f64> as symbolica[10e259bab675d243]::evaluate::backend::JITCompiledNumber>::jit_compile<unknown>
  979. 265.52 s > at <unknown source file>:<unknown line>
  980. 265.52 s > 15: <gammalooprs[917cbd3df9e68f8f]::integrands::process::evaluators::GenericEvaluator>::activate_symjit<unknown>
  981. 265.52 s > at <unknown source file>:<unknown line>
  982. 265.52 s > 16: <gammalooprs[917cbd3df9e68f8f]::integrands::process::amplitude::AmplitudeIntegrand>::prepare_runtime_backends_after_generation_with_compile_times<unknown>
  983. 265.52 s > at <unknown source file>:<unknown line>
  984. 265.52 s > 17: <gammalooprs[917cbd3df9e68f8f]::processes::amplitude::Amplitude>::build_integrand<unknown>
  985. 265.52 s > at <unknown source file>:<unknown line>
  986. 265.52 s > 18: <gammalooprs[917cbd3df9e68f8f]::processes::process::Process>::generate_integrands<unknown>
  987. 265.52 s > at <unknown source file>:<unknown line>
  988. 265.52 s > 19: <gammalooprs[917cbd3df9e68f8f]::processes::ProcessList>::generate_integrands<unknown>
  989. 265.52 s > at <unknown source file>:<unknown line>
  990. 265.52 s > 20: <gammaloop_api[9ebf6628f97aeb57]::state::State>::generate_integrands<unknown>
  991. 265.52 s > at <unknown source file>:<unknown line>
  992. 265.52 s > 21: <gammaloop_api[9ebf6628f97aeb57]::commands::generate::Generate>::run::<&std[bcb96dfbba0ab899]::path::PathBuf><unknown>
  993. 265.52 s > at <unknown source file>:<unknown line>
  994. 265.52 s > 22: <gammaloop_api[9ebf6628f97aeb57]::commands::Commands>::run<unknown>
  995. 265.52 s > at <unknown source file>:<unknown line>
  996. 265.52 s > 23: <gammaloop_api[9ebf6628f97aeb57]::session::CliSession>::execute_prepared<unknown>
  997. 265.52 s > at <unknown source file>:<unknown line>
  998. 265.52 s > 24: <gammaloop_api[9ebf6628f97aeb57]::session::CliSession>::execute_prepared_commands<unknown>
  999. 265.52 s > at <unknown source file>:<unknown line>
  1000. 265.52 s > 25: <gammaloop_api[9ebf6628f97aeb57]::session::CliSession>::execute_prepared<unknown>
  1001. 265.52 s > at <unknown source file>:<unknown line>
  1002. 265.52 s > 26: <gammaloop_api[9ebf6628f97aeb57]::session::CliSession>::execute_command<unknown>
  1003. 265.52 s > at <unknown source file>:<unknown line>
  1004. 265.52 s > 27: <gammaloop_integration_tests[191607b70c61cd5a]::CLIState>::run_command<unknown>
  1005. 265.53 s > at <unknown source file>:<unknown line>
  1006. 265.53 s > 28: uv[3c7454ef256d6487]::run_single_integrated_uv_case<unknown>
  1007. 265.53 s > at <unknown source file>:<unknown line>
  1008. 265.53 s > 29: <uv[3c7454ef256d6487]::thermal_sunrise_uv::{closure#0} as core[940e698046960fd5]::ops::function::FnOnce<()>>::call_once<unknown>
  1009. 265.53 s > at <unknown source file>:<unknown line>
  1010. 265.53 s > 30: test[75d6903177b1d7e9]::__rust_begin_short_backtrace::<core[940e698046960fd5]::result::Result<(), alloc[2ea6bcb46fca0c42]::string::String>, fn() -> core[940e698046960fd5]::result::Result<(), alloc[2ea6bcb46fca0c42]::string::String>><unknown>
  1011. 265.53 s > at <unknown source file>:<unknown line>
  1012. 265.53 s > 31: test[75d6903177b1d7e9]::run_test::{closure#0}<unknown>
  1013. 265.53 s > at <unknown source file>:<unknown line>
  1014. 265.53 s > 32: std[bcb96dfbba0ab899]::sys::backtrace::__rust_begin_short_backtrace::<test[75d6903177b1d7e9]::run_test::{closure#1}, ()><unknown>
  1015. 265.53 s > at <unknown source file>:<unknown line>
  1016. 265.53 s > 33: <std[bcb96dfbba0ab899]::thread::lifecycle::spawn_unchecked<test[75d6903177b1d7e9]::run_test::{closure#1}, ()>::{closure#1} as core[940e698046960fd5]::ops::function::FnOnce<()>>::call_once::{shim:vtable#0}<unknown>
  1017. 265.53 s > at <unknown source file>:<unknown line>
  1018. 265.53 s > 34: <std[bcb96dfbba0ab899]::sys::thread::unix::Thread>::new::thread_start<unknown>
  1019. 265.53 s > at <unknown source file>:<unknown line>
  1020. 265.53 s > 35: start_thread<unknown>
  1021. 265.53 s > at <unknown source file>:<unknown line>
  1022. 265.53 s > 36: __clone3<unknown>
  1023. 265.53 s > at <unknown source file>:<unknown line>
  1024. 265.53 s >
  1025. 265.53 s > Run with COLORBT_SHOW_HIDDEN=1 environment variable to disable frame filtering.
  1026. 265.53 s > Run with RUST_BACKTRACE=full to include source snippets.
  1027. 265.53 s > Warning: SpanTrace capture is Unsupported.
  1028. 265.53 s > Ensure that you've setup a tracing-error ErrorLayer and the semver versions are compatible
  1029. 265.53 s >
  1030. 265.53 s > ------------
  1031. 265.53 s > Summary [ 228.111s] 170 tests run: 168 passed, 2 failed, 209 skipped
  1032. 265.53 s > FAIL [ 3.150s] ( 55/170) gammaloop-integration-tests::test_runs aa_aa::important::aa_aa_local_inspect_backend_consistency
  1033. 265.53 s > stdout ---
  1034. 265.53 s >
  1035. 265.53 s > running 1 test
  1036. 265.53 s > test aa_aa::important::aa_aa_local_inspect_backend_consistency ... FAILED
  1037. 265.53 s >
  1038. 265.53 s > failures:
  1039. 265.53 s >
  1040. 265.53 s > failures:
  1041. 265.53 s > aa_aa::important::aa_aa_local_inspect_backend_consistency
  1042. 265.53 s >
  1043. 265.53 s > test result: FAILED. 0 passed; 1 failed; 0 ignored; 0 measured; 274 filtered out; finished in 3.14s
  1044. 265.53 s >
  1045. 265.53 s > stderr ---
  1046. 265.53 s > [2026-09-18 17:05:15.276] @gammaloop_api::se... INFO : Running command import model sm-default.json
  1047. 265.53 s > [2026-09-18 17:05:15.277] @import::model INFO : Loading built-in JSON model sm-default
  1048. 265.53 s > [2026-09-18 17:05:15.299] @gammalooprs::model INFO : The following 15 external parameters were forced to zero by the restriction card:
  1049. 265.53 s > lamWS, AWS, rhoWS, etaWS, ymc, yme, ymm, MC, Me, MM, WTau, muQ, muLe, muLmu, muLtau
  1050. 265.53 s > [2026-09-18 17:05:15.300] @gammalooprs::model INFO : The following 34 vertex rules were removed by the restriction card:
  1051. 265.53 s > V_82 -> (c~, d, G+) | V_83 -> (t~, d, G+) | V_84 -> (c~, s, G+) | V_85 -> (t~, s, G+) | V_86 -> (u~, b, G+) | V_87 -> (c~, b, G+) | V_90 -> (c~, d, W+) | V_91 -> (t~, d, W+) | V_92 -> (u~, s, W+) | V_94 -> (t~, s, W+) | V_95 -> (u~, b, W+) | V_96 -> (c~, b, W+) | V_101 -> (e+, e-, G0) | V_102 -> (mu+, mu-, G0) | V_104 -> (e+, e-, H) | V_105 -> (mu+, mu-, H) | V_110 -> (ve~, e-, G+) | V_111 -> (vm~, mu-, G+) | V_116 -> (b~, u, G-) | V_117 -> (d~, c, G-) | V_118 -> (s~, c, G-) | V_119 -> (b~, c, G-) | V_120 -> (d~, t, G-) | V_121 -> (s~, t, G-) | V_124 -> (s~, u, W-) | V_125 -> (b~, u, W-) | V_126 -> (d~, c, W-) | V_128 -> (b~, c, W-) | V_129 -> (d~, t, W-) | V_130 -> (s~, t, W-) | V_138 -> (c~, c, G0) | V_140 -> (c~, c, H) | V_145 -> (e+, ve, G-) | V_146 -> (mu+, vm, G-)
  1052. 265.53 s > [2026-09-18 17:05:15.300] @gammalooprs::model INFO : The following 36 couplings were removed by the restriction card:
  1053. 265.53 s > GC_13, GC_14, GC_16, GC_17, GC_18, GC_19, GC_20, GC_22, GC_23, GC_24, GC_25, GC_26, GC_28, GC_29, GC_42, GC_43, GC_44, GC_46, GC_47, GC_48, GC_84, GC_85, GC_86, GC_87, GC_88, GC_89, GC_90, GC_91, GC_92, GC_93, GC_101, GC_102, GC_103, GC_105, GC_106, GC_107
  1054. 265.53 s > [2026-09-18 17:05:15.300] @gammaloop_api::se... INFO : Running command run set_model_parameters
  1055. 265.53 s > [2026-09-18 17:05:15.300] @gammaloop_api::se... INFO : Starting command block set_model_parameters
  1056. 265.53 s > [2026-09-18 17:05:15.300] @gammaloop_api::se... INFO : Running command set model MT=173.0
  1057. 265.53 s > [2026-09-18 17:05:15.305] @gammaloop_api::se... INFO : Running command set model WT=0.0
  1058. 265.53 s > [2026-09-18 17:05:15.309] @gammaloop_api::se... INFO : Running command set model ymt=173.0
  1059. 265.53 s > [2026-09-18 17:05:15.314] @gammaloop_api::se... INFO : Running command set model aS=0.118
  1060. 265.53 s > [2026-09-18 17:05:15.318] @gammaloop_api::se... INFO : Running command set model aEWM1=137.036
  1061. 265.53 s > [2026-09-18 17:05:15.322] @gammaloop_api::se... INFO : Running command set model Gf=1.166390e-05
  1062. 265.53 s > [2026-09-18 17:05:15.327] @gammaloop_api::se... INFO : Running command set model MZ=91.188
  1063. 265.53 s > [2026-09-18 17:05:15.331] @gammaloop_api::se... INFO : Running command set global string '
  1064. 265.53 s > [global.generation.compile]
  1065. 265.53 s > compilation_mode = "symjit"
  1066. 265.53 s > optimization_level = "O0"
  1067. 265.53 s > fast_math = false
  1068. 265.53 s > [...]
  1069. 265.53 s > [2026-09-18 17:05:15.332] @gammaloop_api::se... INFO : Running command import graphs ./examples/cli/aa_aa/1L/aa_aa_1L.dot -p aa_aa_all_helicities -i 1L_ppmm -o
  1070. 265.53 s > [2026-09-18 17:05:15.332] @commands::import INFO : Loading graphs from '/build/source/examples/cli/aa_aa/1L/aa_aa_1L.dot'
  1071. 265.53 s > [2026-09-18 17:05:15.342] @gammaloop_api::se... INFO : Running command generate existing -p aa_aa_all_helicities
  1072. 265.53 s > The application panicked (crashed).
  1073. 265.53 s > Message: label _func_power_ not found
  1074. 265.53 s > Location: /nix/store/n9w914kh1cm59xx3spcs831cdyb56m32-vendor-cargo-deps/c19b7c6f923b580ac259164a89f2577984ad5ab09ee9d583b888f934adbbe8d0/symjit-2.25.6/src/symjit/assembler.rs:77
  1075. 265.53 s >
  1076. 265.53 s > ━━━━━━━━━━━━━━━━━━━━━━━━━━━━━━━━━━ BACKTRACE ━━━━━━━━━━━━━━━━━━━━━━━━━━━━━━━━━━━
  1077. 265.53 s > 1: <color_eyre[51793ea62743adbd]::config::PanicHook>::panic_report<unknown>
  1078. 265.53 s > at <unknown source file>:<unknown line>
  1079. 265.53 s > 2: <color_eyre[51793ea62743adbd]::config::PanicHook>::into_panic_hook::{closure#0}<unknown>
  1080. 265.53 s > at <unknown source file>:<unknown line>
  1081. 265.53 s > 3: std[bcb96dfbba0ab899]::panicking::panic_with_hook<unknown>
  1082. 265.53 s > at <unknown source file>:<unknown line>
  1083. 265.53 s > 4: std[bcb96dfbba0ab899]::panicking::panic_handler::{closure#0}<unknown>
  1084. 265.53 s > at <unknown source file>:<unknown line>
  1085. 265.53 s > 5: std[bcb96dfbba0ab899]::sys::backtrace::__rust_end_short_backtrace::<std[bcb96dfbba0ab899]::panicking::panic_handler::{closure#0}, !><unknown>
  1086. 265.53 s > at <unknown source file>:<unknown line>
  1087. 265.53 s > 6: __rustc[6c289b9f9c454d21]::rust_begin_unwind<unknown>
  1088. 265.53 s > at <unknown source file>:<unknown line>
  1089. 265.53 s > 7: core[940e698046960fd5]::panicking::panic_fmt<unknown>
  1090. 265.53 s > at <unknown source file>:<unknown line>
  1091. 265.53 s > 8: <symjit[e408de789c333cd]::symjit::assembler::Assembler>::apply_jumps<unknown>
  1092. 265.53 s > at <unknown source file>:<unknown line>
  1093. 265.53 s > 9: <symjit[e408de789c333cd]::symjit::builder::Builder>::compile_from_mir::<symjit[e408de789c333cd]::symjit::amd::complex::AmdComplexGenerator><unknown>
  1094. 265.53 s > at <unknown source file>:<unknown line>
  1095. 265.53 s > 10: <symjit[e408de789c333cd]::symjit::runnable::Application>::compile_ty<unknown>
  1096. 265.53 s > at <unknown source file>:<unknown line>
  1097. 265.53 s > 11: <symjit[e408de789c333cd]::symjit::runnable::Application>::with_mir<unknown>
  1098. 265.53 s > at <unknown source file>:<unknown line>
  1099. 265.53 s > 12: <symjit[e408de789c333cd]::symjit::composer::DirectTranslator as symjit[e408de789c333cd]::symjit::composer::Composer>::compile<unknown>
  1100. 265.53 s > at <unknown source file>:<unknown line>
  1101. 265.53 s > 13: <symjit[e408de789c333cd]::symjit::compiler::Translator as symjit[e408de789c333cd]::symjit::composer::Composer>::compile<unknown>
  1102. 265.53 s > at <unknown source file>:<unknown line>
  1103. 265.53 s > 14: <numerica[124dab8567f4861e]::domains::float::complex::Complex<f64> as symbolica[10e259bab675d243]::evaluate::backend::JITCompiledNumber>::jit_compile<unknown>
  1104. 265.53 s > at <unknown source file>:<unknown line>
  1105. 265.53 s > 15: <gammalooprs[917cbd3df9e68f8f]::integrands::process::evaluators::GenericEvaluator>::activate_symjit<unknown>
  1106. 265.53 s > at <unknown source file>:<unknown line>
  1107. 265.53 s > 16: <gammalooprs[917cbd3df9e68f8f]::integrands::process::amplitude::AmplitudeIntegrand>::prepare_runtime_backends_after_generation_with_compile_times<unknown>
  1108. 265.53 s > at <unknown source file>:<unknown line>
  1109. 265.53 s > 17: <gammalooprs[917cbd3df9e68f8f]::processes::amplitude::Amplitude>::build_integrand<unknown>
  1110. 265.53 s > at <unknown source file>:<unknown line>
  1111. 265.53 s > 18: <gammalooprs[917cbd3df9e68f8f]::processes::process::Process>::generate_integrands<unknown>
  1112. 265.53 s > at <unknown source file>:<unknown line>
  1113. 265.53 s > 19: <gammaloop_api[9ebf6628f97aeb57]::state::State>::generate_integrand<unknown>
  1114. 265.53 s > at <unknown source file>:<unknown line>
  1115. 265.53 s > 20: <gammaloop_api[9ebf6628f97aeb57]::commands::generate::Generate>::run::<&std[bcb96dfbba0ab899]::path::PathBuf><unknown>
  1116. 265.53 s > at <unknown source file>:<unknown line>
  1117. 265.53 s > 21: <gammaloop_api[9ebf6628f97aeb57]::commands::Commands>::run<unknown>
  1118. 265.53 s > at <unknown source file>:<unknown line>
  1119. 265.53 s > 22: <gammaloop_api[9ebf6628f97aeb57]::session::CliSession>::execute_prepared<unknown>
  1120. 265.53 s > at <unknown source file>:<unknown line>
  1121. 265.53 s > 23: <gammaloop_api[9ebf6628f97aeb57]::session::CliSession>::execute_command<unknown>
  1122. 265.53 s > at <unknown source file>:<unknown line>
  1123. 265.53 s > 24: <gammaloop_integration_tests[191607b70c61cd5a]::CLIState>::run_command<unknown>
  1124. 265.53 s > at <unknown source file>:<unknown line>
  1125. 265.53 s > 25: test_runs[9b7e2dc2dc4f29b0]::aa_aa::generate_aa_aa_helicity_family<unknown>
  1126. 265.53 s > at <unknown source file>:<unknown line>
  1127. 265.53 s > 26: <test_runs[9b7e2dc2dc4f29b0]::aa_aa::important::aa_aa_local_inspect_backend_consistency::{closure#0} as core[940e698046960fd5]::ops::function::FnOnce<()>>::call_once<unknown>
  1128. 265.53 s > at <unknown source file>:<unknown line>
  1129. 265.53 s > 27: serial_test[cd99724524a2f1c0]::serial_code_lock::local_serial_core_with_return::<(), eyre[cb2fd339c0c40fca]::Report><unknown>
  1130. 265.53 s > at <unknown source file>:<unknown line>
  1131. 265.53 s > 28: <test_runs[9b7e2dc2dc4f29b0]::aa_aa::important::aa_aa_local_inspect_backend_consistency::{closure#0} as core[940e698046960fd5]::ops::function::FnOnce<()>>::call_once<unknown>
  1132. 265.53 s > at <unknown source file>:<unknown line>
  1133. 265.53 s > 29: test[75d6903177b1d7e9]::__rust_begin_short_backtrace::<core[940e698046960fd5]::result::Result<(), alloc[2ea6bcb46fca0c42]::string::String>, fn() -> core[940e698046960fd5]::result::Result<(), alloc[2ea6bcb46fca0c42]::string::String>><unknown>
  1134. 265.53 s > at <unknown source file>:<unknown line>
  1135. 265.53 s > 30: test[75d6903177b1d7e9]::run_test::{closure#0}<unknown>
  1136. 265.53 s > at <unknown source file>:<unknown line>
  1137. 265.53 s > 31: std[bcb96dfbba0ab899]::sys::backtrace::__rust_begin_short_backtrace::<test[75d6903177b1d7e9]::run_test::{closure#1}, ()><unknown>
  1138. 265.53 s > at <unknown source file>:<unknown line>
  1139. 265.53 s > 32: <std[bcb96dfbba0ab899]::thread::lifecycle::spawn_unchecked<test[75d6903177b1d7e9]::run_test::{closure#1}, ()>::{closure#1} as core[940e698046960fd5]::ops::function::FnOnce<()>>::call_once::{shim:vtable#0}<unknown>
  1140. 265.53 s > at <unknown source file>:<unknown line>
  1141. 265.53 s > 33: <std[bcb96dfbba0ab899]::sys::thread::unix::Thread>::new::thread_start<unknown>
  1142. 265.53 s > at <unknown source file>:<unknown line>
  1143. 265.53 s > 34: start_thread<unknown>
  1144. 265.53 s > at <unknown source file>:<unknown line>
  1145. 265.53 s > 35: __clone3<unknown>
  1146. 265.53 s > at <unknown source file>:<unknown line>
  1147. 265.53 s >
  1148. 265.53 s > Run with COLORBT_SHOW_HIDDEN=1 environment variable to disable frame filtering.
  1149. 265.53 s > Run with RUST_BACKTRACE=full to include source snippets.
  1150. 265.53 s > Warning: SpanTrace capture is Unsupported.
  1151. 265.53 s > Ensure that you've setup a tracing-error ErrorLayer and the semver versions are compatible
  1152. 265.53 s >
  1153. 265.53 s > FAIL [ 3.410s] (159/170) gammaloop-integration-tests::uv thermal_sunrise_uv
  1154. 265.53 s > stdout ---
  1155. 265.53 s >
  1156. 265.53 s > running 1 test
  1157. 265.53 s > test thermal_sunrise_uv ... FAILED
  1158. 265.53 s >
  1159. 265.53 s > failures:
  1160. 265.53 s >
  1161. 265.53 s > failures:
  1162. 265.53 s > thermal_sunrise_uv
  1163. 265.53 s >
  1164. 265.53 s > test result: FAILED. 0 passed; 1 failed; 0 ignored; 0 measured; 31 filtered out; finished in 3.40s
  1165. 265.53 s >
  1166. 265.53 s > stderr ---
  1167. 265.53 s > [2026-09-18 17:06:07.493] @gammaloop_api::se... INFO : Running command run generate
  1168. 265.53 s > [2026-09-18 17:06:07.493] @gammaloop_api::se... INFO : Starting command block generate
  1169. 265.53 s > [2026-09-18 17:06:07.493] @gammaloop_api::se... INFO : Running command import model sm-default.json
  1170. 265.53 s > [2026-09-18 17:06:07.493] @import::model INFO : Loading built-in JSON model sm-default
  1171. 265.53 s > [2026-09-18 17:06:07.537] @gammalooprs::model INFO : The following 15 external parameters were forced to zero by the restriction card:
  1172. 265.53 s > lamWS, AWS, rhoWS, etaWS, ymc, yme, ymm, MC, Me, MM, WTau, muQ, muLe, muLmu, muLtau
  1173. 265.53 s > [2026-09-18 17:06:07.537] @gammalooprs::model INFO : The following 34 vertex rules were removed by the restriction card:
  1174. 265.53 s > V_82 -> (c~, d, G+) | V_83 -> (t~, d, G+) | V_84 -> (c~, s, G+) | V_85 -> (t~, s, G+) | V_86 -> (u~, b, G+) | V_87 -> (c~, b, G+) | V_90 -> (c~, d, W+) | V_91 -> (t~, d, W+) | V_92 -> (u~, s, W+) | V_94 -> (t~, s, W+) | V_95 -> (u~, b, W+) | V_96 -> (c~, b, W+) | V_101 -> (e+, e-, G0) | V_102 -> (mu+, mu-, G0) | V_104 -> (e+, e-, H) | V_105 -> (mu+, mu-, H) | V_110 -> (ve~, e-, G+) | V_111 -> (vm~, mu-, G+) | V_116 -> (b~, u, G-) | V_117 -> (d~, c, G-) | V_118 -> (s~, c, G-) | V_119 -> (b~, c, G-) | V_120 -> (d~, t, G-) | V_121 -> (s~, t, G-) | V_124 -> (s~, u, W-) | V_125 -> (b~, u, W-) | V_126 -> (d~, c, W-) | V_128 -> (b~, c, W-) | V_129 -> (d~, t, W-) | V_130 -> (s~, t, W-) | V_138 -> (c~, c, G0) | V_140 -> (c~, c, H) | V_145 -> (e+, ve, G-) | V_146 -> (mu+, vm, G-)
  1175. 265.53 s > [2026-09-18 17:06:07.537] @gammalooprs::model INFO : The following 36 couplings were removed by the restriction card:
  1176. 265.53 s > GC_13, GC_14, GC_16, GC_17, GC_18, GC_19, GC_20, GC_22, GC_23, GC_24, GC_25, GC_26, GC_28, GC_29, GC_42, GC_43, GC_44, GC_46, GC_47, GC_48, GC_84, GC_85, GC_86, GC_87, GC_88, GC_89, GC_90, GC_91, GC_92, GC_93, GC_101, GC_102, GC_103, GC_105, GC_106, GC_107
  1177. 265.53 s > [2026-09-18 17:06:07.537] @gammaloop_api::se... INFO : Running command remove processes
  1178. 265.53 s > [2026-09-18 17:06:07.538] @gammaloop_api::se... INFO : Running command generate amp {} > {} [{2}] | g u
  1179. 265.53 s > --numerator-grouping group_identical_graphs_up_to_scalar_rescaling
  1180. 265.53 s > --max-n-bridges 0
  1181. 265.53 s > --number-of-factorized-loop-subtopologies 1 1
  1182. 265.53 s > --number-of-anticommutating-loops 1 1
  1183. 265.53 s > [...]
  1184. 265.53 s > [2026-09-18 17:06:07.540] @feyngen::diagram_... INFO : 0s | Δ=0s | Starting Feynman graph generation with Symbolica...
  1185. 265.53 s > [2026-09-18 17:06:07.540] @feyngen::diagram_... INFO : 0s | Δ=0s | Number of graphs resulting from Symbolica generation: 3
  1186. 265.53 s > [2026-09-18 17:06:07.540] @feyngen::diagram_... INFO : 0s | Δ=0s | Number of graphs retained after removal of vetoed topologies: 2
  1187. 265.53 s > [2026-09-18 17:06:07.540] @feyngen::diagram_... INFO : 0s | Δ=0s | Number of graphs after vertex info assignment: 2
  1188. 265.53 s > [2026-09-18 17:06:07.540] @feyngen::diagram_... INFO : 0s | Δ=0s | Number of graphs after all complete graphs filters are applied: 2
  1189. 265.53 s > [2026-09-18 17:06:07.540] @feyngen::diagram_... INFO : 0s | Δ=0s | Number of graphs after closed anticommutating chains analysis: 1
  1190. 265.53 s > [2026-09-18 17:06:07.540] @feyngen::diagram_... INFO : 0s | Δ=0s | Number of graphs after symmetrization of external states: 1
  1191. 265.53 s > [2026-09-18 17:06:07.541] @feyngen::diagram_... INFO : 0s | Δ=0s | Number of graphs after canonization of vertices, edges and flows (graph labels assigned here): 1
  1192. 265.53 s > [2026-09-18 17:06:07.559] @feyngen::diagram_... INFO : 0s | Δ=0s | Number of graphs after numerator-aware grouping with strategy 'up to a scalar rescaling': 1 (1 isomorphically unique graph, 0 color zero, 0 lorentz zero, 0 grouped and 0 cancellation)
  1193. 265.53 s > [2026-09-18 17:06:07.559] @feyngen::diagram_... INFO : ( Sum of the symmetry factors from each graph generated = -1/2 )
  1194. 265.53 s > [2026-09-18 17:06:07.559] @commands::generate INFO : Generated amplitude 1 graphs.
  1195. 265.53 s > [2026-09-18 17:06:07.559] @commands::generate INFO : Only diagram generation was requested, skipping integrand generation. You can generate integrands later using the 'generate existing <options>' command.
  1196. 265.53 s > [2026-09-18 17:06:07.559] @gammaloop_api::se... INFO : Running command generate
  1197. 265.53 s > The application panicked (crashed).
  1198. 265.53 s > Message: label _func_power_ not found
  1199. 265.53 s > Location: /nix/store/n9w914kh1cm59xx3spcs831cdyb56m32-vendor-cargo-deps/c19b7c6f923b580ac259164a89f2577984ad5ab09ee9d583b888f934adbbe8d0/symjit-2.25.6/src/symjit/assembler.rs:77
  1200. 265.53 s >
  1201. 265.53 s > ━━━━━━━━━━━━━━━━━━━━━━━━━━━━━━━━━━ BACKTRACE ━━━━━━━━━━━━━━━━━━━━━━━━━━━━━━━━━━━
  1202. 265.53 s > 1: <color_eyre[51793ea62743adbd]::config::PanicHook>::panic_report<unknown>
  1203. 265.53 s > at <unknown source file>:<unknown line>
  1204. 265.53 s > 2: <color_eyre[51793ea62743adbd]::config::PanicHook>::into_panic_hook::{closure#0}<unknown>
  1205. 265.53 s > at <unknown source file>:<unknown line>
  1206. 265.53 s > 3: std[bcb96dfbba0ab899]::panicking::panic_with_hook<unknown>
  1207. 265.53 s > at <unknown source file>:<unknown line>
  1208. 265.53 s > 4: std[bcb96dfbba0ab899]::panicking::panic_handler::{closure#0}<unknown>
  1209. 265.53 s > at <unknown source file>:<unknown line>
  1210. 265.53 s > 5: std[bcb96dfbba0ab899]::sys::backtrace::__rust_end_short_backtrace::<std[bcb96dfbba0ab899]::panicking::panic_handler::{closure#0}, !><unknown>
  1211. 265.53 s > at <unknown source file>:<unknown line>
  1212. 265.53 s > 6: __rustc[6c289b9f9c454d21]::rust_begin_unwind<unknown>
  1213. 265.53 s > at <unknown source file>:<unknown line>
  1214. 265.53 s > 7: core[940e698046960fd5]::panicking::panic_fmt<unknown>
  1215. 265.53 s > at <unknown source file>:<unknown line>
  1216. 265.53 s > 8: <symjit[e408de789c333cd]::symjit::assembler::Assembler>::apply_jumps<unknown>
  1217. 265.53 s > at <unknown source file>:<unknown line>
  1218. 265.53 s > 9: <symjit[e408de789c333cd]::symjit::builder::Builder>::compile_from_mir::<symjit[e408de789c333cd]::symjit::amd::complex::AmdComplexGenerator><unknown>
  1219. 265.53 s > at <unknown source file>:<unknown line>
  1220. 265.53 s > 10: <symjit[e408de789c333cd]::symjit::runnable::Application>::compile_ty<unknown>
  1221. 265.53 s > at <unknown source file>:<unknown line>
  1222. 265.53 s > 11: <symjit[e408de789c333cd]::symjit::runnable::Application>::with_mir<unknown>
  1223. 265.53 s > at <unknown source file>:<unknown line>
  1224. 265.53 s > 12: <symjit[e408de789c333cd]::symjit::composer::DirectTranslator as symjit[e408de789c333cd]::symjit::composer::Composer>::compile<unknown>
  1225. 265.53 s > at <unknown source file>:<unknown line>
  1226. 265.53 s > 13: <symjit[e408de789c333cd]::symjit::compiler::Translator as symjit[e408de789c333cd]::symjit::composer::Composer>::compile<unknown>
  1227. 265.53 s > at <unknown source file>:<unknown line>
  1228. 265.53 s > 14: <numerica[124dab8567f4861e]::domains::float::complex::Complex<f64> as symbolica[10e259bab675d243]::evaluate::backend::JITCompiledNumber>::jit_compile<unknown>
  1229. 265.53 s > at <unknown source file>:<unknown line>
  1230. 265.53 s > 15: <gammalooprs[917cbd3df9e68f8f]::integrands::process::evaluators::GenericEvaluator>::activate_symjit<unknown>
  1231. 265.53 s > at <unknown source file>:<unknown line>
  1232. 265.53 s > 16: <gammalooprs[917cbd3df9e68f8f]::integrands::process::amplitude::AmplitudeIntegrand>::prepare_runtime_backends_after_generation_with_compile_times<unknown>
  1233. 265.53 s > at <unknown source file>:<unknown line>
  1234. 265.53 s > 17: <gammalooprs[917cbd3df9e68f8f]::processes::amplitude::Amplitude>::build_integrand<unknown>
  1235. 265.53 s > at <unknown source file>:<unknown line>
  1236. 265.53 s > 18: <gammalooprs[917cbd3df9e68f8f]::processes::process::Process>::generate_integrands<unknown>
  1237. 265.53 s > at <unknown source file>:<unknown line>
  1238. 265.53 s > 19: <gammalooprs[917cbd3df9e68f8f]::processes::ProcessList>::generate_integrands<unknown>
  1239. 265.53 s > at <unknown source file>:<unknown line>
  1240. 265.53 s > 20: <gammaloop_api[9ebf6628f97aeb57]::state::State>::generate_integrands<unknown>
  1241. 265.53 s > at <unknown source file>:<unknown line>
  1242. 265.53 s > 21: <gammaloop_api[9ebf6628f97aeb57]::commands::generate::Generate>::run::<&std[bcb96dfbba0ab899]::path::PathBuf><unknown>
  1243. 265.53 s > at <unknown source file>:<unknown line>
  1244. 265.53 s > 22: <gammaloop_api[9ebf6628f97aeb57]::commands::Commands>::run<unknown>
  1245. 265.53 s > at <unknown source file>:<unknown line>
  1246. 265.53 s > 23: <gammaloop_api[9ebf6628f97aeb57]::session::CliSession>::execute_prepared<unknown>
  1247. 265.53 s > at <unknown source file>:<unknown line>
  1248. 265.53 s > 24: <gammaloop_api[9ebf6628f97aeb57]::session::CliSession>::execute_prepared_commands<unknown>
  1249. 265.53 s > at <unknown source file>:<unknown line>
  1250. 265.53 s > 25: <gammaloop_api[9ebf6628f97aeb57]::session::CliSession>::execute_prepared<unknown>
  1251. 265.53 s > at <unknown source file>:<unknown line>
  1252. 265.53 s > 26: <gammaloop_api[9ebf6628f97aeb57]::session::CliSession>::execute_command<unknown>
  1253. 265.53 s > at <unknown source file>:<unknown line>
  1254. 265.53 s > 27: <gammaloop_integration_tests[191607b70c61cd5a]::CLIState>::run_command<unknown>
  1255. 265.53 s > at <unknown source file>:<unknown line>
  1256. 265.53 s > 28: uv[3c7454ef256d6487]::run_single_integrated_uv_case<unknown>
  1257. 265.53 s > at <unknown source file>:<unknown line>
  1258. 265.53 s > 29: <uv[3c7454ef256d6487]::thermal_sunrise_uv::{closure#0} as core[940e698046960fd5]::ops::function::FnOnce<()>>::call_once<unknown>
  1259. 265.53 s > at <unknown source file>:<unknown line>
  1260. 265.53 s > 30: test[75d6903177b1d7e9]::__rust_begin_short_backtrace::<core[940e698046960fd5]::result::Result<(), alloc[2ea6bcb46fca0c42]::string::String>, fn() -> core[940e698046960fd5]::result::Result<(), alloc[2ea6bcb46fca0c42]::string::String>><unknown>
  1261. 265.53 s > at <unknown source file>:<unknown line>
  1262. 265.53 s > 31: test[75d6903177b1d7e9]::run_test::{closure#0}<unknown>
  1263. 265.53 s > at <unknown source file>:<unknown line>
  1264. 265.53 s > 32: std[bcb96dfbba0ab899]::sys::backtrace::__rust_begin_short_backtrace::<test[75d6903177b1d7e9]::run_test::{closure#1}, ()><unknown>
  1265. 265.53 s > at <unknown source file>:<unknown line>
  1266. 265.53 s > 33: <std[bcb96dfbba0ab899]::thread::lifecycle::spawn_unchecked<test[75d6903177b1d7e9]::run_test::{closure#1}, ()>::{closure#1} as core[940e698046960fd5]::ops::function::FnOnce<()>>::call_once::{shim:vtable#0}<unknown>
  1267. 265.53 s > at <unknown source file>:<unknown line>
  1268. 265.53 s > 34: <std[bcb96dfbba0ab899]::sys::thread::unix::Thread>::new::thread_start<unknown>
  1269. 265.53 s > at <unknown source file>:<unknown line>
  1270. 265.53 s > 35: start_thread<unknown>
  1271. 265.53 s > at <unknown source file>:<unknown line>
  1272. 265.53 s > 36: __clone3<unknown>
  1273. 265.53 s > at <unknown source file>:<unknown line>
  1274. 265.53 s >
  1275. 265.53 s > Run with COLORBT_SHOW_HIDDEN=1 environment variable to disable frame filtering.
  1276. 265.53 s > Run with RUST_BACKTRACE=full to include source snippets.
  1277. 265.53 s > Warning: SpanTrace capture is Unsupported.
  1278. 265.53 s > Ensure that you've setup a tracing-error ErrorLayer and the semver versions are compatible
  1279. 265.53 s >
  1280. 265.53 s > error: test run failed
  1281. 265.53 s >
  1282. 265.53 s > ========== nextest test summary ==========
  1283. 265.53 s > report: target/nextest/ci_gammaloop/junit.xml
  1284. 265.53 s > tests: 170, failures: 2, errors: 0
  1285. 265.53 s >
  1286. 265.53 s > 1. gammaloop-integration-tests::test_runs::aa_aa::important::aa_aa_local_inspect_backend_consistency
  1287. 265.53 s > failure: test failure with exit code 101
  1288. 265.53 s > system-out
  1289. 265.53 s > running 1 test
  1290. 265.53 s > test aa_aa::important::aa_aa_local_inspect_backend_consistency ... FAILED
  1291. 265.53 s >
  1292. 265.53 s > failures:
  1293. 265.53 s >
  1294. 265.53 s > failures:
  1295. 265.53 s > aa_aa::important::aa_aa_local_inspect_backend_consistency
  1296. 265.53 s >
  1297. 265.53 s > test result: FAILED. 0 passed; 1 failed; 0 ignored; 0 measured; 274 filtered out; finished in 3.14s
  1298. 265.53 s > system-err
  1299. 265.53 s > [2026-09-18 17:05:15.276] @gammaloop_api::se... INFO : Running command import model sm-default.json
  1300. 265.53 s > [2026-09-18 17:05:15.277] @import::model INFO : Loading built-in JSON model sm-default
  1301. 265.53 s > [2026-09-18 17:05:15.299] @gammalooprs::model INFO : The following 15 external parameters were forced to zero by the restriction card:
  1302. 265.53 s > lamWS, AWS, rhoWS, etaWS, ymc, yme, ymm, MC, Me, MM, WTau, muQ, muLe, muLmu, muLtau
  1303. 265.53 s > [2026-09-18 17:05:15.300] @gammalooprs::model INFO : The following 34 vertex rules were removed by the restriction card:
  1304. 265.53 s > V_82 -> (c~, d, G+) | V_83 -> (t~, d, G+) | V_84 -> (c~, s, G+) | V_85 -> (t~, s, G+) | V_86 -> (u~, b, G+) | V_87 -> (c~, b, G+) | V_90 -> (c~, d, W+) | V_91 -> (t~, d, W+) | V_92 -> (u~, s, W+) | V_94 -> (t~, s, W+) | V_95 -> (u~, b, W+) | V_96 -> (c~, b, W+) | V_101 -> (e+, e-, G0) | V_102 -> (mu+, mu-, G0) | V_104 -> (e+, e-, H) | V_105 -> (mu+, mu-, H) | V_110 -> (ve~, e-, G+) | V_111 -> (vm~, mu-, G+) | V_116 -> (b~, u, G-) | V_117 -> (d~, c, G-) | V_118 -> (s~, c, G-) | V_119 -> (b~, c, G-) | V_120 -> (d~, t, G-) | V_121 -> (s~, t, G-) | V_124 -> (s~, u, W-) | V_125 -> (b~, u, W-) | V_126 -> (d~, c, W-) | V_128 -> (b~, c, W-) | V_129 -> (d~, t, W-) | V_130 -> (s~, t, W-) | V_138 -> (c~, c, G0) | V_140 -> (c~, c, H) | V_145 -> (e+, ve, G-) | V_146 -> (mu+, vm, G-)
  1305. 265.53 s > [2026-09-18 17:05:15.300] @gammalooprs::model INFO : The following 36 couplings were removed by the restriction card:
  1306. 265.53 s > GC_13, GC_14, GC_16, GC_17, GC_18, GC_19, GC_20, GC_22, GC_23, GC_24, GC_25, GC_26, GC_28, GC_29, GC_42, GC_43, GC_44, GC_46, GC_47, GC_48, GC_84, GC_85, GC_86, GC_87, GC_88, GC_89, GC_90, GC_91, GC_92, GC_93, GC_101, GC_102, GC_103, GC_105, GC_106, GC_107
  1307. 265.53 s > [2026-09-18 17:05:15.300] @gammaloop_api::se... INFO : Running command run set_model_parameters
  1308. 265.53 s > [2026-09-18 17:05:15.300] @gammaloop_api::se... INFO : Starting command block set_model_parameters
  1309. 265.53 s > [2026-09-18 17:05:15.300] @gammaloop_api::se... INFO : Running command set model MT=173.0
  1310. 265.53 s > [2026-09-18 17:05:15.305] @gammaloop_api::se... INFO : Running command set model WT=0.0
  1311. 265.53 s > [2026-09-18 17:05:15.309] @gammaloop_api::se... INFO : Running command set model ymt=173.0
  1312. 265.53 s > [2026-09-18 17:05:15.314] @gammaloop_api::se... INFO : Running command set model aS=0.118
  1313. 265.53 s > [2026-09-18 17:05:15.318] @gammaloop_api::se... INFO : Running command set model aEWM1=137.036
  1314. 265.53 s > [2026-09-18 17:05:15.322] @gammaloop_api::se... INFO : Running command set model Gf=1.166390e-05
  1315. 265.53 s > [2026-09-18 17:05:15.327] @gammaloop_api::se... INFO : Running command set model MZ=91.188
  1316. 265.53 s > [2026-09-18 17:05:15.331] @gammaloop_api::se... INFO : Running command set global string '
  1317. 265.53 s > [global.generation.compile]
  1318. 265.53 s > compilation_mode = "symjit"
  1319. 265.53 s > optimization_level = "O0"
  1320. 265.53 s > fast_math = false
  1321. 265.53 s > [...]
  1322. 265.53 s > [2026-09-18 17:05:15.332] @gammaloop_api::se... INFO : Running command import graphs ./examples/cli/aa_aa/1L/aa_aa_1L.dot -p aa_aa_all_helicities -i 1L_ppmm -o
  1323. 265.53 s > [2026-09-18 17:05:15.332] @commands::import INFO : Loading graphs from '/build/source/examples/cli/aa_aa/1L/aa_aa_1L.dot'
  1324. 265.53 s > [2026-09-18 17:05:15.342] @gammaloop_api::se... INFO : Running command generate existing -p aa_aa_all_helicities
  1325. 265.53 s > The application panicked (crashed).
  1326. 265.53 s > Message: label _func_power_ not found
  1327. 265.53 s > Location: /nix/store/n9w914kh1cm59xx3spcs831cdyb56m32-vendor-cargo-deps/c19b7c6f923b580ac259164a89f2577984ad5ab09ee9d583b888f934adbbe8d0/symjit-2.25.6/src/symjit/assembler.rs:77
  1328. 265.53 s >
  1329. 265.53 s > ━━━━━━━━━━━━━━━━━━━━━━━━━━━━━━━━━━ BACKTRACE ━━━━━━━━━━━━━━━━━━━━━━━━━━━━━━━━━━━
  1330. 265.53 s > 1: <color_eyre[51793ea62743adbd]::config::PanicHook>::panic_report<unknown>
  1331. 265.53 s > at <unknown source file>:<unknown line>
  1332. 265.53 s > 2: <color_eyre[51793ea62743adbd]::config::PanicHook>::into_panic_hook::{closure#0}<unknown>
  1333. 265.53 s > at <unknown source file>:<unknown line>
  1334. 265.53 s > 3: std[bcb96dfbba0ab899]::panicking::panic_with_hook<unknown>
  1335. 265.53 s > at <unknown source file>:<unknown line>
  1336. 265.53 s > 4: std[bcb96dfbba0ab899]::panicking::panic_handler::{closure#0}<unknown>
  1337. 265.53 s > at <unknown source file>:<unknown line>
  1338. 265.53 s > 5: std[bcb96dfbba0ab899]::sys::backtrace::__rust_end_short_backtrace::<std[bcb96dfbba0ab899]::panicking::panic_handler::{closure#0}, !><unknown>
  1339. 265.53 s > at <unknown source file>:<unknown line>
  1340. 265.53 s > 6: __rustc[6c289b9f9c454d21]::rust_begin_unwind<unknown>
  1341. 265.53 s > at <unknown source file>:<unknown line>
  1342. 265.53 s > 7: core[940e698046960fd5]::panicking::panic_fmt<unknown>
  1343. 265.53 s > at <unknown source file>:<unknown line>
  1344. 265.53 s > 8: <symjit[e408de789c333cd]::symjit::assembler::Assembler>::apply_jumps<unknown>
  1345. 265.53 s > at <unknown source file>:<unknown line>
  1346. 265.53 s > 9: <symjit[e408de789c333cd]::symjit::builder::Builder>::compile_from_mir::<symjit[e408de789c333cd]::symjit::amd::complex::AmdComplexGenerator><unknown>
  1347. 265.53 s > at <unknown source file>:<unknown line>
  1348. 265.53 s > 10: <symjit[e408de789c333cd]::symjit::runnable::Application>::compile_ty<unknown>
  1349. 265.53 s > at <unknown source file>:<unknown line>
  1350. 265.53 s > 11: <symjit[e408de789c333cd]::symjit::runnable::Application>::with_mir<unknown>
  1351. 265.53 s > at <unknown source file>:<unknown line>
  1352. 265.53 s > 12: <symjit[e408de789c333cd]::symjit::composer::DirectTranslator as symjit[e408de789c333cd]::symjit::composer::Composer>::compile<unknown>
  1353. 265.53 s > at <unknown source file>:<unknown line>
  1354. 265.53 s > 13: <symjit[e408de789c333cd]::symjit::compiler::Translator as symjit[e408de789c333cd]::symjit::composer::Composer>::compile<unknown>
  1355. 265.53 s > at <unknown source file>:<unknown line>
  1356. 265.53 s > 14: <numerica[124dab8567f4861e]::domains::float::complex::Complex<f64> as symbolica[10e259bab675d243]::evaluate::backend::JITCompiledNumber>::jit_compile<unknown>
  1357. 265.53 s > at <unknown source file>:<unknown line>
  1358. 265.53 s > 15: <gammalooprs[917cbd3df9e68f8f]::integrands::process::evaluators::GenericEvaluator>::activate_symjit<unknown>
  1359. 265.53 s > at <unknown source file>:<unknown line>
  1360. 265.53 s > 16: <gammalooprs[917cbd3df9e68f8f]::integrands::process::amplitude::AmplitudeIntegrand>::prepare_runtime_backends_after_generation_with_compile_times<unknown>
  1361. 265.53 s > at <unknown source file>:<unknown line>
  1362. 265.53 s > 17: <gammalooprs[917cbd3df9e68f8f]::processes::amplitude::Amplitude>::build_integrand<unknown>
  1363. 265.53 s > at <unknown source file>:<unknown line>
  1364. 265.53 s > 18: <gammalooprs[917cbd3df9e68f8f]::processes::process::Process>::generate_integrands<unknown>
  1365. 265.53 s > at <unknown source file>:<unknown line>
  1366. 265.53 s > 19: <gammaloop_api[9ebf6628f97aeb57]::state::State>::generate_integrand<unknown>
  1367. 265.53 s > at <unknown source file>:<unknown line>
  1368. 265.53 s > 20: <gammaloop_api[9ebf6628f97aeb57]::commands::generate::Generate>::run::<&std[bcb96dfbba0ab899]::path::PathBuf><unknown>
  1369. 265.53 s > at <unknown source file>:<unknown line>
  1370. 265.53 s > 21: <gammaloop_api[9ebf6628f97aeb57]::commands::Commands>::run<unknown>
  1371. 265.53 s > at <unknown source file>:<unknown line>
  1372. 265.53 s > 22: <gammaloop_api[9ebf6628f97aeb57]::session::CliSession>::execute_prepared<unknown>
  1373. 265.53 s > at <unknown source file>:<unknown line>
  1374. 265.53 s > 23: <gammaloop_api[9ebf6628f97aeb57]::session::CliSession>::execute_command<unknown>
  1375. 265.53 s > at <unknown source file>:<unknown line>
  1376. 265.53 s > 24: <gammaloop_integration_tests[191607b70c61cd5a]::CLIState>::run_command<unknown>
  1377. 265.53 s > at <unknown source file>:<unknown line>
  1378. 265.53 s > 25: test_runs[9b7e2dc2dc4f29b0]::aa_aa::generate_aa_aa_helicity_family<unknown>
  1379. 265.53 s > at <unknown source file>:<unknown line>
  1380. 265.53 s > 26: <test_runs[9b7e2dc2dc4f29b0]::aa_aa::important::aa_aa_local_inspect_backend_consistency::{closure#0} as core[940e698046960fd5]::ops::function::FnOnce<()>>::call_once<unknown>
  1381. 265.53 s > at <unknown source file>:<unknown line>
  1382. 265.53 s > 27: serial_test[cd99724524a2f1c0]::serial_code_lock::local_serial_core_with_return::<(), eyre[cb2fd339c0c40fca]::Report><unknown>
  1383. 265.53 s > at <unknown source file>:<unknown line>
  1384. 265.53 s > 28: <test_runs[9b7e2dc2dc4f29b0]::aa_aa::important::aa_aa_local_inspect_backend_consistency::{closure#0} as core[940e698046960fd5]::ops::function::FnOnce<()>>::call_once<unknown>
  1385. 265.53 s > at <unknown source file>:<unknown line>
  1386. 265.53 s > 29: test[75d6903177b1d7e9]::__rust_begin_short_backtrace::<core[940e698046960fd5]::result::Result<(), alloc[2ea6bcb46fca0c42]::string::String>, fn() -> core[940e698046960fd5]::result::Result<(), alloc[2ea6bcb46fca0c42]::string::String>><unknown>
  1387. 265.53 s > at <unknown source file>:<unknown line>
  1388. 265.53 s > 30: test[75d6903177b1d7e9]::run_test::{closure#0}<unknown>
  1389. 265.53 s > at <unknown source file>:<unknown line>
  1390. 265.53 s > 31: std[bcb96dfbba0ab899]::sys::backtrace::__rust_begin_short_backtrace::<test[75d6903177b1d7e9]::run_test::{closure#1}, ()><unknown>
  1391. 265.53 s > at <unknown source file>:<unknown line>
  1392. 265.53 s > 32: <std[bcb96dfbba0ab899]::thread::lifecycle::spawn_unchecked<test[75d6903177b1d7e9]::run_test::{closure#1}, ()>::{closure#1} as core[940e698046960fd5]::ops::function::FnOnce<()>>::call_once::{shim:vtable#0}<unknown>
  1393. 265.53 s > at <unknown source file>:<unknown line>
  1394. 265.53 s > 33: <std[bcb96dfbba0ab899]::sys::thread::unix::Thread>::new::thread_start<unknown>
  1395. 265.53 s > at <unknown source file>:<unknown line>
  1396. 265.53 s > 34: start_thread<unknown>
  1397. 265.53 s > at <unknown source file>:<unknown line>
  1398. 265.53 s > 35: __clone3<unknown>
  1399. 265.53 s > at <unknown source file>:<unknown line>
  1400. 265.53 s >
  1401. 265.53 s > Run with COLORBT_SHOW_HIDDEN=1 environment variable to disable frame filtering.
  1402. 265.53 s > Run with RUST_BACKTRACE=full to include source snippets.
  1403. 265.53 s > Warning: SpanTrace capture is Unsupported.
  1404. 265.53 s > Ensure that you've setup a tracing-error ErrorLayer and the semver versions are compatible
  1405. 265.53 s >
  1406. 265.53 s > 2. gammaloop-integration-tests::uv::thermal_sunrise_uv
  1407. 265.53 s > failure: test failure with exit code 101
  1408. 265.53 s > system-out
  1409. 265.53 s > running 1 test
  1410. 265.53 s > test thermal_sunrise_uv ... FAILED
  1411. 265.53 s >
  1412. 265.53 s > failures:
  1413. 265.53 s >
  1414. 265.53 s > failures:
  1415. 265.53 s > thermal_sunrise_uv
  1416. 265.53 s >
  1417. 265.53 s > test result: FAILED. 0 passed; 1 failed; 0 ignored; 0 measured; 31 filtered out; finished in 3.40s
  1418. 265.53 s > system-err
  1419. 265.53 s > [2026-09-18 17:06:07.493] @gammaloop_api::se... INFO : Running command run generate
  1420. 265.53 s > [2026-09-18 17:06:07.493] @gammaloop_api::se... INFO : Starting command block generate
  1421. 265.53 s > [2026-09-18 17:06:07.493] @gammaloop_api::se... INFO : Running command import model sm-default.json
  1422. 265.53 s > [2026-09-18 17:06:07.493] @import::model INFO : Loading built-in JSON model sm-default
  1423. 265.53 s > [2026-09-18 17:06:07.537] @gammalooprs::model INFO : The following 15 external parameters were forced to zero by the restriction card:
  1424. 265.53 s > lamWS, AWS, rhoWS, etaWS, ymc, yme, ymm, MC, Me, MM, WTau, muQ, muLe, muLmu, muLtau
  1425. 265.53 s > [2026-09-18 17:06:07.537] @gammalooprs::model INFO : The following 34 vertex rules were removed by the restriction card:
  1426. 265.53 s > V_82 -> (c~, d, G+) | V_83 -> (t~, d, G+) | V_84 -> (c~, s, G+) | V_85 -> (t~, s, G+) | V_86 -> (u~, b, G+) | V_87 -> (c~, b, G+) | V_90 -> (c~, d, W+) | V_91 -> (t~, d, W+) | V_92 -> (u~, s, W+) | V_94 -> (t~, s, W+) | V_95 -> (u~, b, W+) | V_96 -> (c~, b, W+) | V_101 -> (e+, e-, G0) | V_102 -> (mu+, mu-, G0) | V_104 -> (e+, e-, H) | V_105 -> (mu+, mu-, H) | V_110 -> (ve~, e-, G+) | V_111 -> (vm~, mu-, G+) | V_116 -> (b~, u, G-) | V_117 -> (d~, c, G-) | V_118 -> (s~, c, G-) | V_119 -> (b~, c, G-) | V_120 -> (d~, t, G-) | V_121 -> (s~, t, G-) | V_124 -> (s~, u, W-) | V_125 -> (b~, u, W-) | V_126 -> (d~, c, W-) | V_128 -> (b~, c, W-) | V_129 -> (d~, t, W-) | V_130 -> (s~, t, W-) | V_138 -> (c~, c, G0) | V_140 -> (c~, c, H) | V_145 -> (e+, ve, G-) | V_146 -> (mu+, vm, G-)
  1427. 265.53 s > [2026-09-18 17:06:07.537] @gammalooprs::model INFO : The following 36 couplings were removed by the restriction card:
  1428. 265.53 s > GC_13, GC_14, GC_16, GC_17, GC_18, GC_19, GC_20, GC_22, GC_23, GC_24, GC_25, GC_26, GC_28, GC_29, GC_42, GC_43, GC_44, GC_46, GC_47, GC_48, GC_84, GC_85, GC_86, GC_87, GC_88, GC_89, GC_90, GC_91, GC_92, GC_93, GC_101, GC_102, GC_103, GC_105, GC_106, GC_107
  1429. 265.53 s > [2026-09-18 17:06:07.537] @gammaloop_api::se... INFO : Running command remove processes
  1430. 265.53 s > [2026-09-18 17:06:07.538] @gammaloop_api::se... INFO : Running command generate amp {} > {} [{2}] | g u
  1431. 265.53 s > --numerator-grouping group_identical_graphs_up_to_scalar_rescaling
  1432. 265.53 s > --max-n-bridges 0
  1433. 265.53 s > --number-of-factorized-loop-subtopologies 1 1
  1434. 265.53 s > --number-of-anticommutating-loops 1 1
  1435. 265.53 s > [...]
  1436. 265.53 s > [2026-09-18 17:06:07.540] @feyngen::diagram_... INFO : 0s | Δ=0s | Starting Feynman graph generation with Symbolica...
  1437. 265.53 s > [2026-09-18 17:06:07.540] @feyngen::diagram_... INFO : 0s | Δ=0s | Number of graphs resulting from Symbolica generation: 3
  1438. 265.53 s > [2026-09-18 17:06:07.540] @feyngen::diagram_... INFO : 0s | Δ=0s | Number of graphs retained after removal of vetoed topologies: 2
  1439. 265.53 s > [2026-09-18 17:06:07.540] @feyngen::diagram_... INFO : 0s | Δ=0s | Number of graphs after vertex info assignment: 2
  1440. 265.53 s > [2026-09-18 17:06:07.540] @feyngen::diagram_... INFO : 0s | Δ=0s | Number of graphs after all complete graphs filters are applied: 2
  1441. 265.53 s > [2026-09-18 17:06:07.540] @feyngen::diagram_... INFO : 0s | Δ=0s | Number of graphs after closed anticommutating chains analysis: 1
  1442. 265.53 s > [2026-09-18 17:06:07.540] @feyngen::diagram_... INFO : 0s | Δ=0s | Number of graphs after symmetrization of external states: 1
  1443. 265.53 s > [2026-09-18 17:06:07.541] @feyngen::diagram_... INFO : 0s | Δ=0s | Number of graphs after canonization of vertices, edges and flows (graph labels assigned here): 1
  1444. 265.53 s > [2026-09-18 17:06:07.559] @feyngen::diagram_... INFO : 0s | Δ=0s | Number of graphs after numerator-aware grouping with strategy 'up to a scalar rescaling': 1 (1 isomorphically unique graph, 0 color zero, 0 lorentz zero, 0 grouped and 0 cancellation)
  1445. 265.53 s > [2026-09-18 17:06:07.559] @feyngen::diagram_... INFO : ( Sum of the symmetry factors from each graph generated = -1/2 )
  1446. 265.53 s > [2026-09-18 17:06:07.559] @commands::generate INFO : Generated amplitude 1 graphs.
  1447. 265.53 s > [2026-09-18 17:06:07.559] @commands::generate INFO : Only diagram generation was requested, skipping integrand generation. You can generate integrands later using the 'generate existing <options>' command.
  1448. 265.53 s > [2026-09-18 17:06:07.559] @gammaloop_api::se... INFO : Running command generate
  1449. 265.53 s > The application panicked (crashed).
  1450. 265.53 s > Message: label _func_power_ not found
  1451. 265.53 s > Location: /nix/store/n9w914kh1cm59xx3spcs831cdyb56m32-vendor-cargo-deps/c19b7c6f923b580ac259164a89f2577984ad5ab09ee9d583b888f934adbbe8d0/symjit-2.25.6/src/symjit/assembler.rs:77
  1452. 265.53 s >
  1453. 265.53 s > ━━━━━━━━━━━━━━━━━━━━━━━━━━━━━━━━━━ BACKTRACE ━━━━━━━━━━━━━━━━━━━━━━━━━━━━━━━━━━━
  1454. 265.53 s > 1: <color_eyre[51793ea62743adbd]::config::PanicHook>::panic_report<unknown>
  1455. 265.53 s > at <unknown source file>:<unknown line>
  1456. 265.53 s > 2: <color_eyre[51793ea62743adbd]::config::PanicHook>::into_panic_hook::{closure#0}<unknown>
  1457. 265.53 s > at <unknown source file>:<unknown line>
  1458. 265.53 s > 3: std[bcb96dfbba0ab899]::panicking::panic_with_hook<unknown>
  1459. 265.53 s > at <unknown source file>:<unknown line>
  1460. 265.53 s > 4: std[bcb96dfbba0ab899]::panicking::panic_handler::{closure#0}<unknown>
  1461. 265.53 s > at <unknown source file>:<unknown line>
  1462. 265.53 s > 5: std[bcb96dfbba0ab899]::sys::backtrace::__rust_end_short_backtrace::<std[bcb96dfbba0ab899]::panicking::panic_handler::{closure#0}, !><unknown>
  1463. 265.53 s > at <unknown source file>:<unknown line>
  1464. 265.53 s > 6: __rustc[6c289b9f9c454d21]::rust_begin_unwind<unknown>
  1465. 265.53 s > at <unknown source file>:<unknown line>
  1466. 265.53 s > 7: core[940e698046960fd5]::panicking::panic_fmt<unknown>
  1467. 265.53 s > at <unknown source file>:<unknown line>
  1468. 265.53 s > 8: <symjit[e408de789c333cd]::symjit::assembler::Assembler>::apply_jumps<unknown>
  1469. 265.53 s > at <unknown source file>:<unknown line>
  1470. 265.53 s > 9: <symjit[e408de789c333cd]::symjit::builder::Builder>::compile_from_mir::<symjit[e408de789c333cd]::symjit::amd::complex::AmdComplexGenerator><unknown>
  1471. 265.53 s > at <unknown source file>:<unknown line>
  1472. 265.53 s > 10: <symjit[e408de789c333cd]::symjit::runnable::Application>::compile_ty<unknown>
  1473. 265.53 s > at <unknown source file>:<unknown line>
  1474. 265.53 s > 11: <symjit[e408de789c333cd]::symjit::runnable::Application>::with_mir<unknown>
  1475. 265.53 s > at <unknown source file>:<unknown line>
  1476. 265.53 s > 12: <symjit[e408de789c333cd]::symjit::composer::DirectTranslator as symjit[e408de789c333cd]::symjit::composer::Composer>::compile<unknown>
  1477. 265.53 s > at <unknown source file>:<unknown line>
  1478. 265.53 s > 13: <symjit[e408de789c333cd]::symjit::compiler::Translator as symjit[e408de789c333cd]::symjit::composer::Composer>::compile<unknown>
  1479. 265.53 s > at <unknown source file>:<unknown line>
  1480. 265.53 s > 14: <numerica[124dab8567f4861e]::domains::float::complex::Complex<f64> as symbolica[10e259bab675d243]::evaluate::backend::JITCompiledNumber>::jit_compile<unknown>
  1481. 265.53 s > at <unknown source file>:<unknown line>
  1482. 265.53 s > 15: <gammalooprs[917cbd3df9e68f8f]::integrands::process::evaluators::GenericEvaluator>::activate_symjit<unknown>
  1483. 265.53 s > at <unknown source file>:<unknown line>
  1484. 265.53 s > 16: <gammalooprs[917cbd3df9e68f8f]::integrands::process::amplitude::AmplitudeIntegrand>::prepare_runtime_backends_after_generation_with_compile_times<unknown>
  1485. 265.53 s > at <unknown source file>:<unknown line>
  1486. 265.53 s > 17: <gammalooprs[917cbd3df9e68f8f]::processes::amplitude::Amplitude>::build_integrand<unknown>
  1487. 265.53 s > at <unknown source file>:<unknown line>
  1488. 265.53 s > 18: <gammalooprs[917cbd3df9e68f8f]::processes::process::Process>::generate_integrands<unknown>
  1489. 265.53 s > at <unknown source file>:<unknown line>
  1490. 265.53 s > 19: <gammalooprs[917cbd3df9e68f8f]::processes::ProcessList>::generate_integrands<unknown>
  1491. 265.53 s > at <unknown source file>:<unknown line>
  1492. 265.53 s > 20: <gammaloop_api[9ebf6628f97aeb57]::state::State>::generate_integrands<unknown>
  1493. 265.53 s > at <unknown source file>:<unknown line>
  1494. 265.53 s > 21: <gammaloop_api[9ebf6628f97aeb57]::commands::generate::Generate>::run::<&std[bcb96dfbba0ab899]::path::PathBuf><unknown>
  1495. 265.53 s > at <unknown source file>:<unknown line>
  1496. 265.53 s > 22: <gammaloop_api[9ebf6628f97aeb57]::commands::Commands>::run<unknown>
  1497. 265.53 s > at <unknown source file>:<unknown line>
  1498. 265.53 s > 23: <gammaloop_api[9ebf6628f97aeb57]::session::CliSession>::execute_prepared<unknown>
  1499. 265.53 s > at <unknown source file>:<unknown line>
  1500. 265.53 s > 24: <gammaloop_api[9ebf6628f97aeb57]::session::CliSession>::execute_prepared_commands<unknown>
  1501. 265.53 s > at <unknown source file>:<unknown line>
  1502. 265.53 s > 25: <gammaloop_api[9ebf6628f97aeb57]::session::CliSession>::execute_prepared<unknown>
  1503. 265.53 s > at <unknown source file>:<unknown line>
  1504. 265.53 s > 26: <gammaloop_api[9ebf6628f97aeb57]::session::CliSession>::execute_command<unknown>
  1505. 265.53 s > at <unknown source file>:<unknown line>
  1506. 265.53 s > 27: <gammaloop_integration_tests[191607b70c61cd5a]::CLIState>::run_command<unknown>
  1507. 265.53 s > at <unknown source file>:<unknown line>
  1508. 265.53 s > 28: uv[3c7454ef256d6487]::run_single_integrated_uv_case<unknown>
  1509. 265.53 s > at <unknown source file>:<unknown line>
  1510. 265.53 s > 29: <uv[3c7454ef256d6487]::thermal_sunrise_uv::{closure#0} as core[940e698046960fd5]::ops::function::FnOnce<()>>::call_once<unknown>
  1511. 265.53 s > at <unknown source file>:<unknown line>
  1512. 265.53 s > 30: test[75d6903177b1d7e9]::__rust_begin_short_backtrace::<core[940e698046960fd5]::result::Result<(), alloc[2ea6bcb46fca0c42]::string::String>, fn() -> core[940e698046960fd5]::result::Result<(), alloc[2ea6bcb46fca0c42]::string::String>><unknown>
  1513. 265.53 s > at <unknown source file>:<unknown line>
  1514. 265.53 s > 31: test[75d6903177b1d7e9]::run_test::{closure#0}<unknown>
  1515. 265.53 s > at <unknown source file>:<unknown line>
  1516. 265.53 s > 32: std[bcb96dfbba0ab899]::sys::backtrace::__rust_begin_short_backtrace::<test[75d6903177b1d7e9]::run_test::{closure#1}, ()><unknown>
  1517. 265.53 s > at <unknown source file>:<unknown line>
  1518. 265.53 s > 33: <std[bcb96dfbba0ab899]::thread::lifecycle::spawn_unchecked<test[75d6903177b1d7e9]::run_test::{closure#1}, ()>::{closure#1} as core[940e698046960fd5]::ops::function::FnOnce<()>>::call_once::{shim:vtable#0}<unknown>
  1519. 265.53 s > at <unknown source file>:<unknown line>
  1520. 265.53 s > 34: <std[bcb96dfbba0ab899]::sys::thread::unix::Thread>::new::thread_start<unknown>
  1521. 265.53 s > at <unknown source file>:<unknown line>
  1522. 265.53 s > 35: start_thread<unknown>
  1523. 265.53 s > at <unknown source file>:<unknown line>
  1524. 265.53 s > 36: __clone3<unknown>
  1525. 265.53 s > at <unknown source file>:<unknown line>
  1526. 265.53 s >
  1527. 265.53 s > Run with COLORBT_SHOW_HIDDEN=1 environment variable to disable frame filtering.
  1528. 265.53 s > Run with RUST_BACKTRACE=full to include source snippets.
  1529. 265.53 s > Warning: SpanTrace capture is Unsupported.
  1530. 265.53 s > Ensure that you've setup a tracing-error ErrorLayer and the semver versions are compatible
  1531. 265.53 s > =========================================
  1532. 265.53 s For full logs, run:
  1533. 265.53 s nix log /nix/store/gigaa94kmmfy8jkh87hvwv50zf7hs40j-gammaloop-nextest-integration.drv
  1534. 265.70 s Run failed.