0.15 s
$ /nix/store/9ypz3flqsrl5xl495mm8h645gadjsxi1-coreutils-9.11/bin/timeout --kill-after=15s 7200s /nix/store/23zk8sgzamrbmj1fday15szf7f2279s8-nix-2.34.7/bin/nix --extra-experimental-features nix-command --extra-experimental-features flakes flake clone git+https://github.com/alphal00p/gammaloop --dest /tmp/nix-ci-worker/stable-pwd/repo/
0.66 s
Cloning into '/tmp/nix-ci-worker/stable-pwd/repo'...
2.96 s
remote: Enumerating objects: 64104, done.
3.19 s
remote: Counting objects: 0% (1/9458)
remote: Counting objects: 1% (95/9458)
remote: Counting objects: 2% (190/9458)
remote: Counting objects: 3% (284/9458)
remote: Counting objects: 4% (379/9458)
remote: Counting objects: 5% (473/9458)
remote: Counting objects: 6% (568/9458)
remote: Counting objects: 7% (663/9458)
remote: Counting objects: 8% (757/9458)
remote: Counting objects: 9% (852/9458)
remote: Counting objects: 10% (946/9458)
remote: Counting objects: 11% (1041/9458)
remote: Counting objects: 12% (1135/9458)
remote: Counting objects: 13% (1230/9458)
remote: Counting objects: 14% (1325/9458)
remote: Counting objects: 15% (1419/9458)
remote: Counting objects: 16% (1514/9458)
remote: Counting objects: 17% (1608/9458)
remote: Counting objects: 18% (1703/9458)
remote: Counting objects: 19% (1798/9458)
remote: Counting objects: 20% (1892/9458)
remote: Counting objects: 21% (1987/9458)
remote: Counting objects: 22% (2081/9458)
remote: Counting objects: 23% (2176/9458)
remote: Counting objects: 24% (2270/9458)
remote: Counting objects: 25% (2365/9458)
remote: Counting objects: 26% (2460/9458)
remote: Counting objects: 27% (2554/9458)
remote: Counting objects: 28% (2649/9458)
remote: Counting objects: 29% (2743/9458)
remote: Counting objects: 30% (2838/9458)
remote: Counting objects: 31% (2932/9458)
remote: Counting objects: 32% (3027/9458)
remote: Counting objects: 33% (3122/9458)
remote: Counting objects: 34% (3216/9458)
remote: Counting objects: 35% (3311/9458)
remote: Counting objects: 36% (3405/9458)
remote: Counting objects: 37% (3500/9458)
remote: Counting objects: 38% (3595/9458)
remote: Counting objects: 39% (3689/9458)
remote: Counting objects: 40% (3784/9458)
remote: Counting objects: 41% (3878/9458)
remote: Counting objects: 42% (3973/9458)
remote: Counting objects: 43% (4067/9458)
remote: Counting objects: 44% (4162/9458)
remote: Counting objects: 45% (4257/9458)
remote: Counting objects: 46% (4351/9458)
remote: Counting objects: 47% (4446/9458)
remote: Counting objects: 48% (4540/9458)
remote: Counting objects: 49% (4635/9458)
remote: Counting objects: 50% (4729/9458)
remote: Counting objects: 51% (4824/9458)
remote: Counting objects: 52% (4919/9458)
remote: Counting objects: 53% (5013/9458)
remote: Counting objects: 54% (5108/9458)
remote: Counting objects: 55% (5202/9458)
remote: Counting objects: 56% (5297/9458)
remote: Counting objects: 57% (5392/9458)
remote: Counting objects: 58% (5486/9458)
remote: Counting objects: 59% (5581/9458)
remote: Counting objects: 60% (5675/9458)
remote: Counting objects: 61% (5770/9458)
remote: Counting objects: 62% (5864/9458)
remote: Counting objects: 63% (5959/9458)
remote: Counting objects: 64% (6054/9458)
remote: Counting objects: 65% (6148/9458)
remote: Counting objects: 66% (6243/9458)
remote: Counting objects: 67% (6337/9458)
remote: Counting objects: 68% (6432/9458)
remote: Counting objects: 69% (6527/9458)
remote: Counting objects: 70% (6621/9458)
remote: Counting objects: 71% (6716/9458)
remote: Counting objects: 72% (6810/9458)
remote: Counting objects: 73% (6905/9458)
remote: Counting objects: 74% (6999/9458)
remote: Counting objects: 75% (7094/9458)
remote: Counting objects: 76% (7189/9458)
remote: Counting objects: 77% (7283/9458)
remote: Counting objects: 78% (7378/9458)
remote: Counting objects: 79% (7472/9458)
remote: Counting objects: 80% (7567/9458)
remote: Counting objects: 81% (7661/9458)
remote: Counting objects: 82% (7756/9458)
remote: Counting objects: 83% (7851/9458)
remote: Counting objects: 84% (7945/9458)
remote: Counting objects: 85% (8040/9458)
remote: Counting objects: 86% (8134/9458)
remote: Counting objects: 87% (8229/9458)
remote: Counting objects: 88% (8324/9458)
remote: Counting objects: 89% (8418/9458)
remote: Counting objects: 90% (8513/9458)
remote: Counting objects: 91% (8607/9458)
remote: Counting objects: 92% (8702/9458)
remote: Counting objects: 93% (8796/9458)
remote: Counting objects: 94% (8891/9458)
remote: Counting objects: 95% (8986/9458)
remote: Counting objects: 96% (9080/9458)
remote: Counting objects: 97% (9175/9458)
remote: Counting objects: 98% (9269/9458)
remote: Counting objects: 99% (9364/9458)
remote: Counting objects: 100% (9458/9458)
remote: Counting objects: 100% (9458/9458), done.
5.49 s
remote: Compressing objects: 0% (1/2283)
remote: Compressing objects: 1% (23/2283)
remote: Compressing objects: 2% (46/2283)
remote: Compressing objects: 3% (69/2283)
remote: Compressing objects: 4% (92/2283)
remote: Compressing objects: 5% (115/2283)
remote: Compressing objects: 6% (137/2283)
remote: Compressing objects: 7% (160/2283)
remote: Compressing objects: 8% (183/2283)
remote: Compressing objects: 9% (206/2283)
remote: Compressing objects: 10% (229/2283)
remote: Compressing objects: 11% (252/2283)
remote: Compressing objects: 12% (274/2283)
remote: Compressing objects: 13% (297/2283)
remote: Compressing objects: 14% (320/2283)
remote: Compressing objects: 15% (343/2283)
remote: Compressing objects: 16% (366/2283)
remote: Compressing objects: 17% (389/2283)
remote: Compressing objects: 18% (411/2283)
remote: Compressing objects: 19% (434/2283)
remote: Compressing objects: 20% (457/2283)
remote: Compressing objects: 21% (480/2283)
remote: Compressing objects: 22% (503/2283)
remote: Compressing objects: 23% (526/2283)
remote: Compressing objects: 23% (535/2283)
remote: Compressing objects: 24% (548/2283)
remote: Compressing objects: 25% (571/2283)
remote: Compressing objects: 26% (594/2283)
remote: Compressing objects: 27% (617/2283)
remote: Compressing objects: 28% (640/2283)
remote: Compressing objects: 29% (663/2283)
remote: Compressing objects: 30% (685/2283)
remote: Compressing objects: 30% (704/2283)
remote: Compressing objects: 31% (708/2283)
remote: Compressing objects: 32% (731/2283)
remote: Compressing objects: 33% (754/2283)
remote: Compressing objects: 34% (777/2283)
remote: Compressing objects: 35% (800/2283)
remote: Compressing objects: 36% (822/2283)
remote: Compressing objects: 37% (845/2283)
remote: Compressing objects: 38% (868/2283)
remote: Compressing objects: 39% (891/2283)
remote: Compressing objects: 40% (914/2283)
remote: Compressing objects: 41% (937/2283)
remote: Compressing objects: 42% (959/2283)
remote: Compressing objects: 43% (982/2283)
remote: Compressing objects: 44% (1005/2283)
remote: Compressing objects: 45% (1028/2283)
remote: Compressing objects: 46% (1051/2283)
remote: Compressing objects: 47% (1074/2283)
remote: Compressing objects: 48% (1096/2283)
remote: Compressing objects: 49% (1119/2283)
remote: Compressing objects: 50% (1142/2283)
remote: Compressing objects: 51% (1165/2283)
remote: Compressing objects: 52% (1188/2283)
remote: Compressing objects: 53% (1210/2283)
remote: Compressing objects: 54% (1233/2283)
remote: Compressing objects: 55% (1256/2283)
remote: Compressing objects: 56% (1279/2283)
remote: Compressing objects: 57% (1302/2283)
remote: Compressing objects: 58% (1325/2283)
remote: Compressing objects: 59% (1347/2283)
remote: Compressing objects: 60% (1370/2283)
remote: Compressing objects: 61% (1393/2283)
remote: Compressing objects: 62% (1416/2283)
remote: Compressing objects: 63% (1439/2283)
remote: Compressing objects: 64% (1462/2283)
remote: Compressing objects: 65% (1484/2283)
remote: Compressing objects: 66% (1507/2283)
remote: Compressing objects: 67% (1530/2283)
remote: Compressing objects: 68% (1553/2283)
remote: Compressing objects: 69% (1576/2283)
remote: Compressing objects: 70% (1599/2283)
remote: Compressing objects: 71% (1621/2283)
remote: Compressing objects: 72% (1644/2283)
remote: Compressing objects: 73% (1667/2283)
remote: Compressing objects: 74% (1690/2283)
remote: Compressing objects: 75% (1713/2283)
remote: Compressing objects: 76% (1736/2283)
remote: Compressing objects: 77% (1758/2283)
remote: Compressing objects: 78% (1781/2283)
remote: Compressing objects: 79% (1804/2283)
remote: Compressing objects: 80% (1827/2283)
remote: Compressing objects: 81% (1850/2283)
remote: Compressing objects: 82% (1873/2283)
remote: Compressing objects: 83% (1895/2283)
remote: Compressing objects: 84% (1918/2283)
remote: Compressing objects: 85% (1941/2283)
remote: Compressing objects: 86% (1964/2283)
remote: Compressing objects: 87% (1987/2283)
remote: Compressing objects: 88% (2010/2283)
remote: Compressing objects: 89% (2032/2283)
remote: Compressing objects: 90% (2055/2283)
remote: Compressing objects: 91% (2078/2283)
remote: Compressing objects: 92% (2101/2283)
remote: Compressing objects: 93% (2124/2283)
remote: Compressing objects: 94% (2147/2283)
remote: Compressing objects: 95% (2169/2283)
remote: Compressing objects: 96% (2192/2283)
remote: Compressing objects: 97% (2215/2283)
remote: Compressing objects: 98% (2238/2283)
remote: Compressing objects: 99% (2261/2283)
remote: Compressing objects: 100% (2283/2283)
remote: Compressing objects: 100% (2283/2283), done.
9.01 s
Receiving objects: 0% (1/64104)
Receiving objects: 1% (642/64104)
Receiving objects: 2% (1283/64104)
Receiving objects: 3% (1924/64104)
Receiving objects: 4% (2565/64104)
Receiving objects: 5% (3206/64104)
Receiving objects: 6% (3847/64104)
Receiving objects: 7% (4488/64104)
Receiving objects: 8% (5129/64104)
Receiving objects: 9% (5770/64104)
Receiving objects: 10% (6411/64104), 8.36 MiB | 16.69 MiB/s
Receiving objects: 11% (7052/64104), 8.36 MiB | 16.69 MiB/s
Receiving objects: 12% (7693/64104), 8.36 MiB | 16.69 MiB/s
Receiving objects: 13% (8334/64104), 8.36 MiB | 16.69 MiB/s
Receiving objects: 14% (8975/64104), 8.36 MiB | 16.69 MiB/s
Receiving objects: 15% (9616/64104), 8.36 MiB | 16.69 MiB/s
Receiving objects: 16% (10257/64104), 8.36 MiB | 16.69 MiB/s
Receiving objects: 17% (10898/64104), 8.36 MiB | 16.69 MiB/s
Receiving objects: 18% (11539/64104), 8.36 MiB | 16.69 MiB/s
Receiving objects: 19% (12180/64104), 8.36 MiB | 16.69 MiB/s
Receiving objects: 20% (12821/64104), 8.36 MiB | 16.69 MiB/s
Receiving objects: 21% (13462/64104), 8.36 MiB | 16.69 MiB/s
Receiving objects: 22% (14103/64104), 8.36 MiB | 16.69 MiB/s
Receiving objects: 23% (14744/64104), 8.36 MiB | 16.69 MiB/s
Receiving objects: 24% (15385/64104), 8.36 MiB | 16.69 MiB/s
Receiving objects: 25% (16026/64104), 8.36 MiB | 16.69 MiB/s
Receiving objects: 26% (16668/64104), 8.36 MiB | 16.69 MiB/s
Receiving objects: 27% (17309/64104), 8.36 MiB | 16.69 MiB/s
Receiving objects: 28% (17950/64104), 8.36 MiB | 16.69 MiB/s
Receiving objects: 29% (18591/64104), 8.36 MiB | 16.69 MiB/s
Receiving objects: 30% (19232/64104), 8.36 MiB | 16.69 MiB/s
Receiving objects: 31% (19873/64104), 8.36 MiB | 16.69 MiB/s
Receiving objects: 32% (20514/64104), 8.36 MiB | 16.69 MiB/s
Receiving objects: 33% (21155/64104), 8.36 MiB | 16.69 MiB/s
Receiving objects: 33% (21474/64104), 21.22 MiB | 21.21 MiB/s
Receiving objects: 34% (21796/64104), 21.22 MiB | 21.21 MiB/s
Receiving objects: 35% (22437/64104), 21.22 MiB | 21.21 MiB/s
Receiving objects: 36% (23078/64104), 21.22 MiB | 21.21 MiB/s
Receiving objects: 37% (23719/64104), 21.22 MiB | 21.21 MiB/s
Receiving objects: 38% (24360/64104), 21.22 MiB | 21.21 MiB/s
Receiving objects: 39% (25001/64104), 21.22 MiB | 21.21 MiB/s
Receiving objects: 40% (25642/64104), 21.22 MiB | 21.21 MiB/s
Receiving objects: 41% (26283/64104), 21.22 MiB | 21.21 MiB/s
Receiving objects: 42% (26924/64104), 21.22 MiB | 21.21 MiB/s
Receiving objects: 43% (27565/64104), 21.22 MiB | 21.21 MiB/s
Receiving objects: 44% (28206/64104), 21.22 MiB | 21.21 MiB/s
Receiving objects: 45% (28847/64104), 21.22 MiB | 21.21 MiB/s
Receiving objects: 46% (29488/64104), 21.22 MiB | 21.21 MiB/s
Receiving objects: 47% (30129/64104), 21.22 MiB | 21.21 MiB/s
Receiving objects: 48% (30770/64104), 21.22 MiB | 21.21 MiB/s
Receiving objects: 49% (31411/64104), 21.22 MiB | 21.21 MiB/s
Receiving objects: 50% (32052/64104), 21.22 MiB | 21.21 MiB/s
Receiving objects: 51% (32694/64104), 21.22 MiB | 21.21 MiB/s
Receiving objects: 52% (33335/64104), 21.22 MiB | 21.21 MiB/s
Receiving objects: 53% (33976/64104), 21.22 MiB | 21.21 MiB/s
Receiving objects: 54% (34617/64104), 34.83 MiB | 23.21 MiB/s
Receiving objects: 55% (35258/64104), 34.83 MiB | 23.21 MiB/s
Receiving objects: 56% (35899/64104), 34.83 MiB | 23.21 MiB/s
Receiving objects: 57% (36540/64104), 34.83 MiB | 23.21 MiB/s
Receiving objects: 58% (37181/64104), 34.83 MiB | 23.21 MiB/s
Receiving objects: 59% (37822/64104), 34.83 MiB | 23.21 MiB/s
Receiving objects: 60% (38463/64104), 34.83 MiB | 23.21 MiB/s
Receiving objects: 61% (39104/64104), 34.83 MiB | 23.21 MiB/s
Receiving objects: 62% (39745/64104), 34.83 MiB | 23.21 MiB/s
Receiving objects: 62% (39937/64104), 34.83 MiB | 23.21 MiB/s
Receiving objects: 63% (40386/64104), 53.01 MiB | 26.50 MiB/s
Receiving objects: 64% (41027/64104), 53.01 MiB | 26.50 MiB/s
Receiving objects: 65% (41668/64104), 53.01 MiB | 26.50 MiB/s
Receiving objects: 66% (42309/64104), 53.01 MiB | 26.50 MiB/s
Receiving objects: 67% (42950/64104), 53.01 MiB | 26.50 MiB/s
Receiving objects: 68% (43591/64104), 53.01 MiB | 26.50 MiB/s
Receiving objects: 69% (44232/64104), 53.01 MiB | 26.50 MiB/s
Receiving objects: 70% (44873/64104), 53.01 MiB | 26.50 MiB/s
Receiving objects: 71% (45514/64104), 53.01 MiB | 26.50 MiB/s
Receiving objects: 72% (46155/64104), 53.01 MiB | 26.50 MiB/s
Receiving objects: 73% (46796/64104), 53.01 MiB | 26.50 MiB/s
Receiving objects: 74% (47437/64104), 68.64 MiB | 27.42 MiB/s
Receiving objects: 75% (48078/64104), 68.64 MiB | 27.42 MiB/s
Receiving objects: 76% (48720/64104), 68.64 MiB | 27.42 MiB/s
Receiving objects: 77% (49361/64104), 68.64 MiB | 27.42 MiB/s
Receiving objects: 78% (50002/64104), 68.64 MiB | 27.42 MiB/s
Receiving objects: 79% (50643/64104), 68.64 MiB | 27.42 MiB/s
Receiving objects: 80% (51284/64104), 68.64 MiB | 27.42 MiB/s
Receiving objects: 81% (51925/64104), 68.64 MiB | 27.42 MiB/s
Receiving objects: 82% (52566/64104), 68.64 MiB | 27.42 MiB/s
Receiving objects: 83% (53207/64104), 68.64 MiB | 27.42 MiB/s
Receiving objects: 84% (53848/64104), 68.64 MiB | 27.42 MiB/s
Receiving objects: 84% (53975/64104), 83.29 MiB | 27.73 MiB/s
Receiving objects: 85% (54489/64104), 83.29 MiB | 27.73 MiB/s
Receiving objects: 86% (55130/64104), 83.29 MiB | 27.73 MiB/s
Receiving objects: 87% (55771/64104), 83.29 MiB | 27.73 MiB/s
Receiving objects: 88% (56412/64104), 83.29 MiB | 27.73 MiB/s
Receiving objects: 89% (57053/64104), 83.29 MiB | 27.73 MiB/s
Receiving objects: 90% (57694/64104), 83.29 MiB | 27.73 MiB/s
Receiving objects: 91% (58335/64104), 83.29 MiB | 27.73 MiB/s
Receiving objects: 92% (58976/64104), 83.29 MiB | 27.73 MiB/s
Receiving objects: 93% (59617/64104), 83.29 MiB | 27.73 MiB/s
Receiving objects: 94% (60258/64104), 83.29 MiB | 27.73 MiB/s
Receiving objects: 95% (60899/64104), 83.29 MiB | 27.73 MiB/s
Receiving objects: 96% (61540/64104), 83.29 MiB | 27.73 MiB/s
Receiving objects: 97% (62181/64104), 83.29 MiB | 27.73 MiB/s
Receiving objects: 98% (62822/64104), 83.29 MiB | 27.73 MiB/s
Receiving objects: 99% (63463/64104), 83.29 MiB | 27.73 MiB/s
remote: Total 64104 (delta 7330), reused 7706 (delta 6631), pack-reused 54646 (from 3)
9.02 s
Receiving objects: 100% (64104/64104), 83.29 MiB | 27.73 MiB/s
Receiving objects: 100% (64104/64104), 97.74 MiB | 27.80 MiB/s, done.
11.86 s
Resolving deltas: 0% (0/44260)
Resolving deltas: 1% (443/44260)
Resolving deltas: 2% (886/44260)
Resolving deltas: 3% (1328/44260)
Resolving deltas: 4% (1771/44260)
Resolving deltas: 5% (2213/44260)
Resolving deltas: 6% (2656/44260)
Resolving deltas: 7% (3099/44260)
Resolving deltas: 8% (3541/44260)
Resolving deltas: 9% (3984/44260)
Resolving deltas: 10% (4426/44260)
Resolving deltas: 11% (4869/44260)
Resolving deltas: 12% (5312/44260)
Resolving deltas: 13% (5754/44260)
Resolving deltas: 14% (6197/44260)
Resolving deltas: 15% (6639/44260)
Resolving deltas: 16% (7082/44260)
Resolving deltas: 17% (7525/44260)
Resolving deltas: 18% (7967/44260)
Resolving deltas: 19% (8410/44260)
Resolving deltas: 20% (8853/44260)
Resolving deltas: 21% (9295/44260)
Resolving deltas: 22% (9738/44260)
Resolving deltas: 23% (10180/44260)
Resolving deltas: 24% (10623/44260)
Resolving deltas: 25% (11065/44260)
Resolving deltas: 26% (11508/44260)
Resolving deltas: 27% (11951/44260)
Resolving deltas: 28% (12393/44260)
Resolving deltas: 29% (12836/44260)
Resolving deltas: 30% (13278/44260)
Resolving deltas: 31% (13721/44260)
Resolving deltas: 32% (14164/44260)
Resolving deltas: 33% (14606/44260)
Resolving deltas: 34% (15049/44260)
Resolving deltas: 35% (15491/44260)
Resolving deltas: 36% (15934/44260)
Resolving deltas: 37% (16377/44260)
Resolving deltas: 38% (16819/44260)
Resolving deltas: 39% (17262/44260)
Resolving deltas: 40% (17704/44260)
Resolving deltas: 41% (18147/44260)
Resolving deltas: 42% (18590/44260)
Resolving deltas: 43% (19032/44260)
Resolving deltas: 44% (19475/44260)
Resolving deltas: 45% (19917/44260)
Resolving deltas: 46% (20360/44260)
Resolving deltas: 47% (20803/44260)
Resolving deltas: 48% (21245/44260)
Resolving deltas: 49% (21688/44260)
Resolving deltas: 50% (22130/44260)
Resolving deltas: 51% (22573/44260)
Resolving deltas: 52% (23016/44260)
Resolving deltas: 53% (23458/44260)
Resolving deltas: 54% (23901/44260)
Resolving deltas: 55% (24343/44260)
Resolving deltas: 56% (24786/44260)
Resolving deltas: 57% (25229/44260)
Resolving deltas: 57% (25616/44260)
Resolving deltas: 58% (25671/44260)
Resolving deltas: 59% (26114/44260)
Resolving deltas: 60% (26556/44260)
Resolving deltas: 61% (26999/44260)
Resolving deltas: 62% (27442/44260)
Resolving deltas: 63% (27884/44260)
Resolving deltas: 64% (28330/44260)
Resolving deltas: 65% (28769/44260)
Resolving deltas: 66% (29212/44260)
Resolving deltas: 67% (29655/44260)
Resolving deltas: 68% (30097/44260)
Resolving deltas: 69% (30540/44260)
Resolving deltas: 70% (30982/44260)
Resolving deltas: 71% (31425/44260)
Resolving deltas: 72% (31868/44260)
Resolving deltas: 73% (32310/44260)
Resolving deltas: 74% (32754/44260)
Resolving deltas: 74% (33070/44260)
Resolving deltas: 75% (33196/44260)
Resolving deltas: 76% (33638/44260)
Resolving deltas: 77% (34081/44260)
Resolving deltas: 78% (34524/44260)
Resolving deltas: 79% (34966/44260)
Resolving deltas: 80% (35408/44260)
Resolving deltas: 81% (35851/44260)
Resolving deltas: 82% (36294/44260)
Resolving deltas: 83% (36736/44260)
Resolving deltas: 84% (37179/44260)
Resolving deltas: 85% (37621/44260)
Resolving deltas: 86% (38064/44260)
Resolving deltas: 87% (38507/44260)
Resolving deltas: 88% (38949/44260)
Resolving deltas: 89% (39392/44260)
Resolving deltas: 90% (39834/44260)
Resolving deltas: 91% (40277/44260)
Resolving deltas: 92% (40720/44260)
Resolving deltas: 93% (41162/44260)
Resolving deltas: 94% (41605/44260)
Resolving deltas: 95% (42047/44260)
Resolving deltas: 96% (42490/44260)
Resolving deltas: 97% (42933/44260)
Resolving deltas: 98% (43375/44260)
Resolving deltas: 99% (43818/44260)
Resolving deltas: 100% (44260/44260)
Resolving deltas: 100% (44260/44260), done.
14.69 s
Fetching commit da7b4c22f8a72cca8ddcc8537d642827d66b54b5 for finite_T_and_mu_pre_rebase ...
14.70 s
$ /nix/store/bcnisk3ydfgv26v2gw3zlky24g00yww2-git-2.54.0/bin/git fetch origin da7b4c22f8a72cca8ddcc8537d642827d66b54b5
16.17 s
From https://github.com/alphal00p/gammaloop
16.17 s
* branch da7b4c22f8a72cca8ddcc8537d642827d66b54b5 -> FETCH_HEAD
16.46 s
$ /nix/store/9ypz3flqsrl5xl495mm8h645gadjsxi1-coreutils-9.11/bin/timeout --kill-after=15s 7200s /nix/store/bcnisk3ydfgv26v2gw3zlky24g00yww2-git-2.54.0/bin/git -c advice.detachedHead=false checkout da7b4c22f8a72cca8ddcc8537d642827d66b54b5
19.36 s
HEAD is now at da7b4c22 add thermal inspect tests for 4-loop bugblatter graphs
19.62 s
$ /nix/store/9ypz3flqsrl5xl495mm8h645gadjsxi1-coreutils-9.11/bin/timeout --kill-after=15s 7200s /nix/store/23zk8sgzamrbmj1fday15szf7f2279s8-nix-2.34.7/bin/nix --extra-experimental-features nix-command --extra-experimental-features flakes --log-format internal-json run .#packages.x86_64-linux.nix-ci-check-gammaloop-nextest-core --print-build-logs
24.08 s
39.89 s
evaluating derivation 'g
copying '/nix/store/6nlb
evaluating derivation 'g
querying info about miss
[0 /5 built]
[0 /1 built]
[1 /0 /1 built] building g gammaloop-nextest-core-nextest> Running phase: unpackPhase
39.90 s
gammaloop-nextest-core-nextest> unpacking source archive /nix/store/2gfjwwccz6smw12y5x0gwjf4f3jnyqpn-source
42.52 s
gammaloop-nextest-core-nextest> source root is source
42.58 s
gammaloop-nextest-core-nextest> Running phase: patchPhase
42.60 s
gammaloop-nextest-core-nextest> Executing configureCargoCommonVars
42.61 s
gammaloop-nextest-core-nextest> decompressing cargo artifacts from /nix/store/g91zjhbw7sfq2h1pijj7b8hn2fp9z646-gammaloop-workspace-deps-deps-0.1.0/target.tar.zst to target
56.28 s
gammaloop-nextest-core-nextest> Running phase: updateAutotoolsGnuConfigScriptsPhase
56.38 s
gammaloop-nextest-core-nextest> Running phase: configurePhase
56.41 s
gammaloop-nextest-core-nextest> will append /build/source/.cargo-home/config.toml with contents of /nix/store/56mr0d5hrl1xh08y02lfig5azk7f8563-vendor-cargo-deps/config.toml
56.41 s
gammaloop-nextest-core-nextest> default configurePhase, nothing to do
56.42 s
gammaloop-nextest-core-nextest> Running phase: buildPhase
56.42 s
gammaloop-nextest-core-nextest> +++ command cargo --version
56.43 s
gammaloop-nextest-core-nextest> cargo 1.95.0 (f2d3ce0bd 2026-03-21)
56.43 s
gammaloop-nextest-core-nextest> +++ command cargo nextest --version
56.44 s
gammaloop-nextest-core-nextest> cargo-nextest 0.9.133
56.44 s
gammaloop-nextest-core-nextest> release: 0.9.133
56.44 s
gammaloop-nextest-core-nextest> host: x86_64-unknown-linux-gnu
56.44 s
gammaloop-nextest-core-nextest> Running phase: checkPhase
56.45 s
gammaloop-nextest-core-nextest> +++ command cargo nextest run --cargo-profile dev-optim --locked -p gammaloop-api -p gammaloop-tracing-filter -p gammalooprs --profile ci_gammaloop --no-fail-fast --final-status-level fail --no-tests=pass --run-ignored all
57.39 s
gammaloop-nextest-core-nextest> Compiling syn v2.0.117
57.40 s
gammaloop-nextest-core-nextest> Compiling tiny-keccak v2.0.2
57.40 s
gammaloop-nextest-core-nextest> Compiling getrandom v0.2.17
57.40 s
gammaloop-nextest-core-nextest> Compiling num-integer v0.1.46
57.41 s
gammaloop-nextest-core-nextest> Compiling indexmap v2.14.0
57.42 s
gammaloop-nextest-core-nextest> Compiling symbolica v1.5.1
57.43 s
gammaloop-nextest-core-nextest> Compiling vakint v0.1.2 (/build/source/crates/vakint)
57.44 s
gammaloop-nextest-core-nextest> Compiling gammalooprs v0.3.3 (/build/source/crates/gammalooprs)
57.44 s
gammaloop-nextest-core-nextest> Compiling gammaloop-api v0.1.0 (/build/source/crates/gammaloop-api)
57.59 s
gammaloop-nextest-core-nextest> Compiling num-iter v0.1.45
57.89 s
gammaloop-nextest-core-nextest> Compiling const-random-macro v0.1.16
58.07 s
gammaloop-nextest-core-nextest> Compiling petgraph v0.8.3
58.21 s
gammaloop-nextest-core-nextest> Compiling const-random v0.1.18
59.84 s
gammaloop-nextest-core-nextest> Compiling darling_core v0.23.0
59.84 s
gammaloop-nextest-core-nextest> Compiling pest_generator v2.8.6
59.84 s
gammaloop-nextest-core-nextest> Compiling proc-macro-error2 v2.0.1
59.84 s
gammaloop-nextest-core-nextest> Compiling proc-macro2-diagnostics v0.10.1
59.84 s
gammaloop-nextest-core-nextest> Compiling serde_derive_internals v0.29.1
63.05 s
gammaloop-nextest-core-nextest> Compiling serde_derive v1.0.228
63.07 s
gammaloop-nextest-core-nextest> Compiling zerocopy-derive v0.8.48
63.07 s
gammaloop-nextest-core-nextest> Compiling tracing-attributes v0.1.31
63.07 s
gammaloop-nextest-core-nextest> Compiling thiserror-impl v2.0.18
63.09 s
gammaloop-nextest-core-nextest> Compiling bincode-trait-derive v0.1.1
63.14 s
gammaloop-nextest-core-nextest> Compiling strum_macros v0.27.2
63.15 s
gammaloop-nextest-core-nextest> Compiling pest_derive v2.8.6
63.16 s
gammaloop-nextest-core-nextest> Compiling clap_derive v4.6.1
63.26 s
gammaloop-nextest-core-nextest> Compiling serde_repr v0.1.20
63.40 s
gammaloop-nextest-core-nextest> Compiling tabled_derive v0.11.0
63.40 s
gammaloop-nextest-core-nextest> Compiling duplicate v2.0.1
63.42 s
gammaloop-nextest-core-nextest> Compiling derive_more-impl v2.1.1
63.44 s
gammaloop-nextest-core-nextest> Compiling enum-try-as-inner v0.1.1
63.52 s
gammaloop-nextest-core-nextest> Compiling thiserror-impl v1.0.69
63.87 s
gammaloop-nextest-core-nextest> Compiling dot-parser v0.5.1
64.32 s
gammaloop-nextest-core-nextest> Compiling derive_more v0.99.20
67.57 s
gammaloop-nextest-core-nextest> Compiling delegate v0.12.0
68.00 s
gammaloop-nextest-core-nextest> Compiling phf_macros v0.13.1
68.92 s
gammaloop-nextest-core-nextest> Compiling ref-cast-impl v1.0.25
69.00 s
gammaloop-nextest-core-nextest> Compiling enum_dispatch v0.3.13
69.80 s
gammaloop-nextest-core-nextest> Compiling schemars_derive v1.2.1
70.83 s
gammaloop-nextest-core-nextest> Compiling derive_more v2.1.1
70.87 s
gammaloop-nextest-core-nextest> Compiling deprecate-until v1.0.0
71.85 s
gammaloop-nextest-core-nextest> Compiling strum_macros v0.26.4
73.35 s
gammaloop-nextest-core-nextest> Compiling ref-cast v1.0.25
73.44 s
gammaloop-nextest-core-nextest> Compiling rust-embed-impl v8.11.0
73.72 s
gammaloop-nextest-core-nextest> Compiling thiserror v1.0.69
73.98 s
gammaloop-nextest-core-nextest> Compiling phf v0.13.1
75.28 s
gammaloop-nextest-core-nextest> Compiling tabled v0.20.0
75.29 s
gammaloop-nextest-core-nextest> Compiling darling_macro v0.23.0
75.36 s
gammaloop-nextest-core-nextest> Compiling thiserror v2.0.18
75.44 s
gammaloop-nextest-core-nextest> Compiling kasuari v0.4.12
76.37 s
gammaloop-nextest-core-nextest> Compiling tracing v0.1.44
76.77 s
gammaloop-nextest-core-nextest> Compiling clap v4.6.1
76.87 s
gammaloop-nextest-core-nextest> Compiling pathfinding v4.15.0
77.07 s
gammaloop-nextest-core-nextest> Compiling tracing-subscriber v0.3.23
77.11 s
gammaloop-nextest-core-nextest> Compiling zerocopy v0.8.48
77.62 s
gammaloop-nextest-core-nextest> Compiling clap_complete v4.6.3
78.02 s
gammaloop-nextest-core-nextest> Compiling rust-embed v8.11.0
78.05 s
gammaloop-nextest-core-nextest> Compiling strum v0.27.2
78.10 s
gammaloop-nextest-core-nextest> Compiling clap_complete_nushell v4.6.0
78.13 s
gammaloop-nextest-core-nextest> Compiling ratatui-core v0.1.0
78.76 s
gammaloop-nextest-core-nextest> Compiling darling v0.23.0
78.82 s
gammaloop-nextest-core-nextest> Compiling instability v0.3.12
79.06 s
gammaloop-nextest-core-nextest> Compiling serde v1.0.228
80.17 s
gammaloop-nextest-core-nextest> Compiling smallvec v1.15.1
80.26 s
gammaloop-nextest-core-nextest> Compiling num-complex v0.4.6
80.45 s
gammaloop-nextest-core-nextest> Compiling tracing-serde v0.2.0
80.93 s
gammaloop-nextest-core-nextest> Compiling bincode v2.0.1
81.59 s
gammaloop-nextest-core-nextest> Compiling simba v0.9.1
81.80 s
gammaloop-nextest-core-nextest> Compiling rug v1.30.0
82.12 s
gammaloop-nextest-core-nextest> Compiling num-bigint v0.4.6
82.41 s
gammaloop-nextest-core-nextest> Compiling ppv-lite86 v0.2.21
83.01 s
gammaloop-nextest-core-nextest> Compiling rand_chacha v0.9.0
83.17 s
gammaloop-nextest-core-nextest> Compiling ahash v0.8.12
83.51 s
gammaloop-nextest-core-nextest> Compiling rand v0.9.4
83.79 s
gammaloop-nextest-core-nextest> Compiling rand_chacha v0.3.1
84.02 s
gammaloop-nextest-core-nextest> Compiling rand v0.8.6
84.28 s
gammaloop-nextest-core-nextest> Compiling toml_datetime v0.6.11
84.41 s
gammaloop-nextest-core-nextest> Compiling serde_spanned v0.6.9
84.45 s
gammaloop-nextest-core-nextest> Compiling symjit v2.14.9
84.58 s
gammaloop-nextest-core-nextest> Compiling toml_edit v0.22.27
84.70 s
gammaloop-nextest-core-nextest> Compiling num-rational v0.4.2
84.72 s
gammaloop-nextest-core-nextest> Compiling parking_lot_core v0.9.12
84.75 s
gammaloop-nextest-core-nextest> Compiling smartstring v1.0.1
84.82 s
gammaloop-nextest-core-nextest> Compiling half v2.7.1
85.03 s
gammaloop-nextest-core-nextest> Compiling parking_lot v0.12.5
85.15 s
gammaloop-nextest-core-nextest> Compiling bitvec v1.0.1
85.16 s
gammaloop-nextest-core-nextest> Compiling ciborium-ll v0.2.2
85.40 s
gammaloop-nextest-core-nextest> Compiling crossterm v0.28.1
85.41 s
gammaloop-nextest-core-nextest> Compiling num v0.4.3
85.50 s
gammaloop-nextest-core-nextest> Compiling rand_distr v0.4.3
85.78 s
gammaloop-nextest-core-nextest> Compiling simba v0.6.0
85.88 s
gammaloop-nextest-core-nextest> Compiling chrono v0.4.44
85.89 s
gammaloop-nextest-core-nextest> Compiling ratatui-widgets v0.3.0
86.60 s
gammaloop-nextest-core-nextest> Compiling xprec v0.2.2
86.67 s
gammaloop-nextest-core-nextest> Compiling toml v0.8.23
86.83 s
gammaloop-nextest-core-nextest> Compiling ciborium v0.2.2
87.80 s
gammaloop-nextest-core-nextest> Compiling figment v0.10.19
89.00 s
gammaloop-nextest-core-nextest> Compiling crossterm v0.29.0
89.20 s
gammaloop-nextest-core-nextest> Compiling tracing-error v0.2.1
89.58 s
gammaloop-nextest-core-nextest> Compiling tinytemplate v1.2.1
89.61 s
gammaloop-nextest-core-nextest> Compiling serde-big-array v0.5.1
89.73 s
gammaloop-nextest-core-nextest> Compiling clarabel v0.11.1
90.97 s
gammaloop-nextest-core-nextest> Compiling ratatui-crossterm v0.1.0
91.38 s
gammaloop-nextest-core-nextest> Compiling criterion v0.5.1
92.68 s
gammaloop-nextest-core-nextest> Compiling color-spantrace v0.3.0
94.05 s
gammaloop-nextest-core-nextest> Compiling ratatui-macros v0.7.0
94.19 s
gammaloop-nextest-core-nextest> Compiling string-template-plus v0.4.3
94.64 s
gammaloop-nextest-core-nextest> Compiling nalgebra v0.29.0
95.82 s
gammaloop-nextest-core-nextest> Compiling ratatui v0.30.0
95.94 s
gammaloop-nextest-core-nextest> Compiling color-eyre v0.6.5
97.35 s
gammaloop-nextest-core-nextest> Compiling numerica v1.4.3
97.35 s
gammaloop-nextest-core-nextest> Compiling schemars v1.2.1
97.97 s
gammaloop-nextest-core-nextest> Compiling tracing-indicatif v0.3.14
98.43 s
gammaloop-nextest-core-nextest> Compiling tracing-appender v0.2.5
100.85 s
gammaloop-nextest-core-nextest> Compiling typed-index-collections v3.5.0
101.94 s
gammaloop-nextest-core-nextest> Compiling slotmap v1.1.1
102.16 s
gammaloop-nextest-core-nextest> Compiling serde_yaml v0.9.34+deprecated
102.94 s
gammaloop-nextest-core-nextest> Compiling vectorize v0.2.0
103.13 s
gammaloop-nextest-core-nextest> Compiling json5 v0.4.1
103.40 s
gammaloop-nextest-core-nextest> Compiling gammaloop-tracing-filter v0.1.0 (/build/source/crates/gammaloop-tracing-filter)
103.66 s
gammaloop-nextest-core-nextest> Compiling reedline v0.42.0
105.50 s
gammaloop-nextest-core-nextest> Compiling ndarray v0.17.2
105.57 s
gammaloop-nextest-core-nextest> Compiling ron v0.12.1
107.81 s
gammaloop-nextest-core-nextest> Compiling graphica v1.2.1
113.07 s
gammaloop-nextest-core-nextest> Compiling insta v1.47.2
117.55 s
gammaloop-nextest-core-nextest> Compiling statrs v0.16.1
125.99 s
gammaloop-nextest-core-nextest> Compiling momtrop v0.3.0
184.49 s
gammaloop-nextest-core-nextest> Compiling linnet v0.17.0 (/build/source/crates/linnet)
638.13 s
gammaloop-nextest-core-nextest> Compiling spenso-macros v0.3.2 (/build/source/crates/spenso-macros)
639.16 s
gammaloop-nextest-core-nextest> Compiling spenso v0.6.0 (/build/source/crates/spenso)
650.77 s
gammaloop-nextest-core-nextest> Compiling idenso v0.3.0 (/build/source/crates/idenso)
655.50 s
gammaloop-nextest-core-nextest> Compiling spenso-hep-lib v0.1.7 (/build/source/crates/spenso-hep-lib)
1721.57 s
gammaloop-nextest-core-nextest> Finished `dev-optim` profile [optimized + debuginfo] target(s) in 27m 44s
1721.85 s
gammaloop-nextest-core-nextest> ------------
1721.85 s
gammaloop-nextest-core-nextest> Nextest run ID 7f62b4b3-1036-44d8-a11a-63718c46ba4d with nextest profile: ci_gammaloop
1721.85 s
gammaloop-nextest-core-nextest> Starting 649 tests across 5 binaries (58 tests skipped via profile.ci_gammaloop.default-filter )
1752.84 s
gammaloop-nextest-core-nextest> FAIL [ 26.540s] (644/649) gammalooprs cff::generation::tests_cff :: thermal_bugblatter
1752.85 s
gammaloop-nextest-core-nextest> stdout ---
1752.85 s
gammaloop-nextest-core-nextest>
1752.85 s
gammaloop-nextest-core-nextest> running 1 test
1752.85 s
gammaloop-nextest-core-nextest> test cff::generation::tests_cff::thermal_bugblatter ... FAILED
1752.85 s
gammaloop-nextest-core-nextest>
1752.85 s
gammaloop-nextest-core-nextest> failures:
1752.85 s
gammaloop-nextest-core-nextest>
1752.85 s
gammaloop-nextest-core-nextest> failures:
1752.85 s
gammaloop-nextest-core-nextest> cff::generation::tests_cff::thermal_bugblatter
1752.85 s
gammaloop-nextest-core-nextest>
1752.85 s
gammaloop-nextest-core-nextest> test result: FAILED. 0 passed; 1 failed; 0 ignored; 0 measured; 390 filtered out; finished in 26.38s
1752.85 s
gammaloop-nextest-core-nextest>
1752.85 s
gammaloop-nextest-core-nextest> stderr ---
1752.85 s
gammaloop-nextest-core-nextest>
1752.85 s
gammaloop-nextest-core-nextest> thread 'cff::generation::tests_cff::thermal_bugblatter' (5402) panicked at crates/gammalooprs/src/cff/generation.rs:2883:9:
1752.85 s
gammaloop-nextest-core-nextest> relative error: +5.091904431950302e-10 (ground truth: +1.3084677423579079e0 vs reproduced: +1.3084677430241671e0)
1752.85 s
gammaloop-nextest-core-nextest> stack backtrace:
1752.85 s
gammaloop-nextest-core-nextest> 0: __rustc::rust_begin_unwind
1752.85 s
gammaloop-nextest-core-nextest> at /rustc/59807616e1fa2540724bfbac14d7976d7e4a3860/library/std/src/panicking.rs:689:5
1752.85 s
gammaloop-nextest-core-nextest> 1: core::panicking::panic_fmt
1752.85 s
gammaloop-nextest-core-nextest> at /rustc/59807616e1fa2540724bfbac14d7976d7e4a3860/library/core/src/panicking.rs:80:14
1752.85 s
gammaloop-nextest-core-nextest> 2: gammalooprs::cff::generation::tests_cff::thermal_bugblatter
1752.85 s
gammaloop-nextest-core-nextest> at ./src/cff/generation.rs:2883:9
1752.85 s
gammaloop-nextest-core-nextest> 3: gammalooprs::cff::generation::tests_cff::thermal_bugblatter::{{closure}}
1752.85 s
gammaloop-nextest-core-nextest> at ./src/cff/generation.rs:2800:28
1752.85 s
gammaloop-nextest-core-nextest> 4: core::ops::function::FnOnce::call_once
1752.85 s
gammaloop-nextest-core-nextest> at /rustc/59807616e1fa2540724bfbac14d7976d7e4a3860/library/core/src/ops/function.rs:250:5
1752.85 s
gammaloop-nextest-core-nextest> 5: <fn() -> core::result::Result<(), alloc::string::String> as core::ops::function::FnOnce<()>>::call_once
1752.85 s
gammaloop-nextest-core-nextest> at /rustc/59807616e1fa2540724bfbac14d7976d7e4a3860/library/core/src/ops/function.rs:250:5
1752.85 s
gammaloop-nextest-core-nextest> note: Some details are omitted, run with `RUST_BACKTRACE=full` for a verbose backtrace.
1752.85 s
gammaloop-nextest-core-nextest>
1789.18 s
gammaloop-nextest-core-nextest> ------------
1789.19 s
gammaloop-nextest-core-nextest> Summary [ 67.329s] 649 tests run: 648 passed , 1 failed , 58 skipped
1789.19 s
gammaloop-nextest-core-nextest> FAIL [ 26.540s] (644/649) gammalooprs cff::generation::tests_cff :: thermal_bugblatter
1789.19 s
gammaloop-nextest-core-nextest> stdout ---
1789.19 s
gammaloop-nextest-core-nextest>
1789.19 s
gammaloop-nextest-core-nextest> running 1 test
1789.19 s
gammaloop-nextest-core-nextest> test cff::generation::tests_cff::thermal_bugblatter ... FAILED
1789.19 s
gammaloop-nextest-core-nextest>
1789.19 s
gammaloop-nextest-core-nextest> failures:
1789.19 s
gammaloop-nextest-core-nextest>
1789.19 s
gammaloop-nextest-core-nextest> failures:
1789.19 s
gammaloop-nextest-core-nextest> cff::generation::tests_cff::thermal_bugblatter
1789.19 s
gammaloop-nextest-core-nextest>
1789.19 s
gammaloop-nextest-core-nextest> test result: FAILED. 0 passed; 1 failed; 0 ignored; 0 measured; 390 filtered out; finished in 26.38s
1789.19 s
gammaloop-nextest-core-nextest>
1789.19 s
gammaloop-nextest-core-nextest> stderr ---
1789.19 s
gammaloop-nextest-core-nextest>
1789.19 s
gammaloop-nextest-core-nextest> thread 'cff::generation::tests_cff::thermal_bugblatter' (5402) panicked at crates/gammalooprs/src/cff/generation.rs:2883:9:
1789.19 s
gammaloop-nextest-core-nextest> relative error: +5.091904431950302e-10 (ground truth: +1.3084677423579079e0 vs reproduced: +1.3084677430241671e0)
1789.19 s
gammaloop-nextest-core-nextest> stack backtrace:
1789.19 s
gammaloop-nextest-core-nextest> 0: __rustc::rust_begin_unwind
1789.19 s
gammaloop-nextest-core-nextest> at /rustc/59807616e1fa2540724bfbac14d7976d7e4a3860/library/std/src/panicking.rs:689:5
1789.19 s
gammaloop-nextest-core-nextest> 1: core::panicking::panic_fmt
1789.19 s
gammaloop-nextest-core-nextest> at /rustc/59807616e1fa2540724bfbac14d7976d7e4a3860/library/core/src/panicking.rs:80:14
1789.19 s
gammaloop-nextest-core-nextest> 2: gammalooprs::cff::generation::tests_cff::thermal_bugblatter
1789.19 s
gammaloop-nextest-core-nextest> at ./src/cff/generation.rs:2883:9
1789.19 s
gammaloop-nextest-core-nextest> 3: gammalooprs::cff::generation::tests_cff::thermal_bugblatter::{{closure}}
1789.19 s
gammaloop-nextest-core-nextest> at ./src/cff/generation.rs:2800:28
1789.19 s
gammaloop-nextest-core-nextest> 4: core::ops::function::FnOnce::call_once
1789.19 s
gammaloop-nextest-core-nextest> at /rustc/59807616e1fa2540724bfbac14d7976d7e4a3860/library/core/src/ops/function.rs:250:5
1789.19 s
gammaloop-nextest-core-nextest> 5: <fn() -> core::result::Result<(), alloc::string::String> as core::ops::function::FnOnce<()>>::call_once
1789.19 s
gammaloop-nextest-core-nextest> at /rustc/59807616e1fa2540724bfbac14d7976d7e4a3860/library/core/src/ops/function.rs:250:5
1789.19 s
gammaloop-nextest-core-nextest> note: Some details are omitted, run with `RUST_BACKTRACE=full` for a verbose backtrace.
1789.19 s
gammaloop-nextest-core-nextest>
1789.20 s
gammaloop-nextest-core-nextest> error : test run failed
1789.30 s
gammaloop-nextest-core-nextest>
1789.30 s
gammaloop-nextest-core-nextest> ========== nextest test summary ==========
1789.30 s
gammaloop-nextest-core-nextest> report: target/nextest/ci_gammaloop/junit.xml
1789.30 s
gammaloop-nextest-core-nextest> tests: 649, failures: 1, errors: 0
1789.30 s
gammaloop-nextest-core-nextest>
1789.30 s
gammaloop-nextest-core-nextest> 1. gammalooprs::cff::generation::tests_cff::thermal_bugblatter
1789.30 s
gammaloop-nextest-core-nextest> failure: test failure with exit code 101
1789.30 s
gammaloop-nextest-core-nextest> thread 'cff::generation::tests_cff::thermal_bugblatter' (5402) panicked at crates/gammalooprs/src/cff/generation.rs:2883:9:
1789.30 s
gammaloop-nextest-core-nextest> relative error: +5.091904431950302e-10 (ground truth: +1.3084677423579079e0 vs reproduced: +1.3084677430241671e0)
1789.30 s
gammaloop-nextest-core-nextest> stack backtrace:
1789.30 s
gammaloop-nextest-core-nextest> 0: __rustc::rust_begin_unwind
1789.30 s
gammaloop-nextest-core-nextest> at /rustc/59807616e1fa2540724bfbac14d7976d7e4a3860/library/std/src/panicking.rs:689:5
1789.30 s
gammaloop-nextest-core-nextest> 1: core::panicking::panic_fmt
1789.30 s
gammaloop-nextest-core-nextest> at /rustc/59807616e1fa2540724bfbac14d7976d7e4a3860/library/core/src/panicking.rs:80:14
1789.30 s
gammaloop-nextest-core-nextest> 2: gammalooprs::cff::generation::tests_cff::thermal_bugblatter
1789.30 s
gammaloop-nextest-core-nextest> at ./src/cff/generation.rs:2883:9
1789.30 s
gammaloop-nextest-core-nextest> 3: gammalooprs::cff::generation::tests_cff::thermal_bugblatter::{{closure}}
1789.30 s
gammaloop-nextest-core-nextest> at ./src/cff/generation.rs:2800:28
1789.30 s
gammaloop-nextest-core-nextest> 4: core::ops::function::FnOnce::call_once
1789.30 s
gammaloop-nextest-core-nextest> at /rustc/59807616e1fa2540724bfbac14d7976d7e4a3860/library/core/src/ops/function.rs:250:5
1789.30 s
gammaloop-nextest-core-nextest> 5: <fn() -> core::result::Result<(), alloc::string::String> as core::ops::function::FnOnce<()>>::call_once
1789.30 s
gammaloop-nextest-core-nextest> at /rustc/59807616e1fa2540724bfbac14d7976d7e4a3860/library/core/src/ops/function.rs:250:5
1789.30 s
gammaloop-nextest-core-nextest> note: Some details are omitted, run with `RUST_BACKTRACE=full` for a verbose backtrace.
1789.30 s
gammaloop-nextest-core-nextest> system-out
1789.30 s
gammaloop-nextest-core-nextest> running 1 test
1789.30 s
gammaloop-nextest-core-nextest> test cff::generation::tests_cff::thermal_bugblatter ... FAILED
1789.30 s
gammaloop-nextest-core-nextest>
1789.30 s
gammaloop-nextest-core-nextest> failures:
1789.30 s
gammaloop-nextest-core-nextest>
1789.30 s
gammaloop-nextest-core-nextest> failures:
1789.30 s
gammaloop-nextest-core-nextest> cff::generation::tests_cff::thermal_bugblatter
1789.30 s
gammaloop-nextest-core-nextest>
1789.30 s
gammaloop-nextest-core-nextest> test result: FAILED. 0 passed; 1 failed; 0 ignored; 0 measured; 390 filtered out; finished in 26.38s
1789.30 s
gammaloop-nextest-core-nextest> system-err
1789.30 s
gammaloop-nextest-core-nextest> thread 'cff::generation::tests_cff::thermal_bugblatter' (5402) panicked at crates/gammalooprs/src/cff/generation.rs:2883:9:
1789.30 s
gammaloop-nextest-core-nextest> relative error: +5.091904431950302e-10 (ground truth: +1.3084677423579079e0 vs reproduced: +1.3084677430241671e0)
1789.30 s
gammaloop-nextest-core-nextest> stack backtrace:
1789.30 s
gammaloop-nextest-core-nextest> 0: __rustc::rust_begin_unwind
1789.30 s
gammaloop-nextest-core-nextest> at /rustc/59807616e1fa2540724bfbac14d7976d7e4a3860/library/std/src/panicking.rs:689:5
1789.30 s
gammaloop-nextest-core-nextest> 1: core::panicking::panic_fmt
1789.30 s
gammaloop-nextest-core-nextest> at /rustc/59807616e1fa2540724bfbac14d7976d7e4a3860/library/core/src/panicking.rs:80:14
1789.30 s
gammaloop-nextest-core-nextest> 2: gammalooprs::cff::generation::tests_cff::thermal_bugblatter
1789.30 s
gammaloop-nextest-core-nextest> at ./src/cff/generation.rs:2883:9
1789.30 s
gammaloop-nextest-core-nextest> 3: gammalooprs::cff::generation::tests_cff::thermal_bugblatter::{{closure}}
1789.30 s
gammaloop-nextest-core-nextest> at ./src/cff/generation.rs:2800:28
1789.30 s
gammaloop-nextest-core-nextest> 4: core::ops::function::FnOnce::call_once
1789.30 s
gammaloop-nextest-core-nextest> at /rustc/59807616e1fa2540724bfbac14d7976d7e4a3860/library/core/src/ops/function.rs:250:5
1789.30 s
gammaloop-nextest-core-nextest> 5: <fn() -> core::result::Result<(), alloc::string::String> as core::ops::function::FnOnce<()>>::call_once
1789.30 s
gammaloop-nextest-core-nextest> at /rustc/59807616e1fa2540724bfbac14d7976d7e4a3860/library/core/src/ops/function.rs:250:5
1789.30 s
gammaloop-nextest-core-nextest> note: Some details are omitted, run with `RUST_BACKTRACE=full` for a verbose backtrace.
1789.30 s
gammaloop-nextest-core-nextest> =========================================
1791.75 s
[0 built (1 failed )]error: Cannot build '/nix/store/x99f4l4rhn4rxfh9pva0mbx49rp8n02k-gammaloop-nextest-core-nextest-0.1.0.drv '.
1791.75 s
Reason: builder failed with exit code 100 .
1791.75 s
Output paths:
1791.75 s
/nix/store/fd2mrd8wif4zz2cw9bvy45fi89nggxj5-gammaloop-nextest-core-nextest-0.1.0
1791.75 s
Last 273 log lines:
1791.75 s
> Running phase: unpackPhase
1791.75 s
> unpacking source archive /nix/store/2gfjwwccz6smw12y5x0gwjf4f3jnyqpn-source
1791.75 s
> source root is source
1791.75 s
> Running phase: patchPhase
1791.75 s
> Executing configureCargoCommonVars
1791.75 s
> decompressing cargo artifacts from /nix/store/g91zjhbw7sfq2h1pijj7b8hn2fp9z646-gammaloop-workspace-deps-deps-0.1.0/target.tar.zst to target
1791.75 s
> Running phase: updateAutotoolsGnuConfigScriptsPhase
1791.75 s
> Running phase: configurePhase
1791.75 s
> will append /build/source/.cargo-home/config.toml with contents of /nix/store/56mr0d5hrl1xh08y02lfig5azk7f8563-vendor-cargo-deps/config.toml
1791.75 s
> default configurePhase, nothing to do
1791.75 s
> Running phase: buildPhase
1791.75 s
> +++ command cargo --version
1791.75 s
> cargo 1.95.0 (f2d3ce0bd 2026-03-21)
1791.75 s
> +++ command cargo nextest --version
1791.75 s
> cargo-nextest 0.9.133
1791.75 s
> release: 0.9.133
1791.75 s
> host: x86_64-unknown-linux-gnu
1791.75 s
> Running phase: checkPhase
1791.75 s
> +++ command cargo nextest run --cargo-profile dev-optim --locked -p gammaloop-api -p gammaloop-tracing-filter -p gammalooprs --profile ci_gammaloop --no-fail-fast --final-status-level fail --no-tests=pass --run-ignored all
1791.75 s
> Compiling syn v2.0.117
1791.75 s
> Compiling tiny-keccak v2.0.2
1791.75 s
> Compiling getrandom v0.2.17
1791.75 s
> Compiling num-integer v0.1.46
1791.75 s
> Compiling indexmap v2.14.0
1791.75 s
> Compiling symbolica v1.5.1
1791.75 s
> Compiling vakint v0.1.2 (/build/source/crates/vakint)
1791.75 s
> Compiling gammalooprs v0.3.3 (/build/source/crates/gammalooprs)
1791.75 s
> Compiling gammaloop-api v0.1.0 (/build/source/crates/gammaloop-api)
1791.75 s
> Compiling num-iter v0.1.45
1791.75 s
> Compiling const-random-macro v0.1.16
1791.75 s
> Compiling petgraph v0.8.3
1791.75 s
> Compiling const-random v0.1.18
1791.75 s
> Compiling darling_core v0.23.0
1791.75 s
> Compiling pest_generator v2.8.6
1791.75 s
> Compiling proc-macro-error2 v2.0.1
1791.75 s
> Compiling proc-macro2-diagnostics v0.10.1
1791.75 s
> Compiling serde_derive_internals v0.29.1
1791.75 s
> Compiling serde_derive v1.0.228
1791.75 s
> Compiling zerocopy-derive v0.8.48
1791.75 s
> Compiling tracing-attributes v0.1.31
1791.75 s
> Compiling thiserror-impl v2.0.18
1791.75 s
> Compiling bincode-trait-derive v0.1.1
1791.75 s
> Compiling strum_macros v0.27.2
1791.75 s
> Compiling pest_derive v2.8.6
1791.75 s
> Compiling clap_derive v4.6.1
1791.75 s
> Compiling serde_repr v0.1.20
1791.75 s
> Compiling tabled_derive v0.11.0
1791.75 s
> Compiling duplicate v2.0.1
1791.75 s
> Compiling derive_more-impl v2.1.1
1791.75 s
> Compiling enum-try-as-inner v0.1.1
1791.75 s
> Compiling thiserror-impl v1.0.69
1791.75 s
> Compiling dot-parser v0.5.1
1791.75 s
> Compiling derive_more v0.99.20
1791.75 s
> Compiling delegate v0.12.0
1791.75 s
> Compiling phf_macros v0.13.1
1791.75 s
> Compiling ref-cast-impl v1.0.25
1791.75 s
> Compiling enum_dispatch v0.3.13
1791.75 s
> Compiling schemars_derive v1.2.1
1791.75 s
> Compiling derive_more v2.1.1
1791.75 s
> Compiling deprecate-until v1.0.0
1791.75 s
> Compiling strum_macros v0.26.4
1791.75 s
> Compiling ref-cast v1.0.25
1791.75 s
> Compiling rust-embed-impl v8.11.0
1791.75 s
> Compiling thiserror v1.0.69
1791.75 s
> Compiling phf v0.13.1
1791.75 s
> Compiling tabled v0.20.0
1791.75 s
> Compiling darling_macro v0.23.0
1791.75 s
> Compiling thiserror v2.0.18
1791.75 s
> Compiling kasuari v0.4.12
1791.75 s
> Compiling tracing v0.1.44
1791.75 s
> Compiling clap v4.6.1
1791.75 s
> Compiling pathfinding v4.15.0
1791.75 s
> Compiling tracing-subscriber v0.3.23
1791.75 s
> Compiling zerocopy v0.8.48
1791.75 s
> Compiling clap_complete v4.6.3
1791.75 s
> Compiling rust-embed v8.11.0
1791.75 s
> Compiling strum v0.27.2
1791.75 s
> Compiling clap_complete_nushell v4.6.0
1791.75 s
> Compiling ratatui-core v0.1.0
1791.75 s
> Compiling darling v0.23.0
1791.75 s
> Compiling instability v0.3.12
1791.75 s
> Compiling serde v1.0.228
1791.75 s
> Compiling smallvec v1.15.1
1791.75 s
> Compiling num-complex v0.4.6
1791.75 s
> Compiling tracing-serde v0.2.0
1791.75 s
> Compiling bincode v2.0.1
1791.75 s
> Compiling simba v0.9.1
1791.75 s
> Compiling rug v1.30.0
1791.75 s
> Compiling num-bigint v0.4.6
1791.75 s
> Compiling ppv-lite86 v0.2.21
1791.75 s
> Compiling rand_chacha v0.9.0
1791.75 s
> Compiling ahash v0.8.12
1791.75 s
> Compiling rand v0.9.4
1791.75 s
> Compiling rand_chacha v0.3.1
1791.75 s
> Compiling rand v0.8.6
1791.75 s
> Compiling toml_datetime v0.6.11
1791.75 s
> Compiling serde_spanned v0.6.9
1791.75 s
> Compiling symjit v2.14.9
1791.75 s
> Compiling toml_edit v0.22.27
1791.75 s
> Compiling num-rational v0.4.2
1791.75 s
> Compiling parking_lot_core v0.9.12
1791.75 s
> Compiling smartstring v1.0.1
1791.75 s
> Compiling half v2.7.1
1791.75 s
> Compiling parking_lot v0.12.5
1791.75 s
> Compiling bitvec v1.0.1
1791.75 s
> Compiling ciborium-ll v0.2.2
1791.75 s
> Compiling crossterm v0.28.1
1791.75 s
> Compiling num v0.4.3
1791.75 s
> Compiling rand_distr v0.4.3
1791.75 s
> Compiling simba v0.6.0
1791.75 s
> Compiling chrono v0.4.44
1791.75 s
> Compiling ratatui-widgets v0.3.0
1791.75 s
> Compiling xprec v0.2.2
1791.75 s
> Compiling toml v0.8.23
1791.75 s
> Compiling ciborium v0.2.2
1791.75 s
> Compiling figment v0.10.19
1791.75 s
> Compiling crossterm v0.29.0
1791.75 s
> Compiling tracing-error v0.2.1
1791.75 s
> Compiling tinytemplate v1.2.1
1791.75 s
> Compiling serde-big-array v0.5.1
1791.75 s
> Compiling clarabel v0.11.1
1791.75 s
> Compiling ratatui-crossterm v0.1.0
1791.75 s
> Compiling criterion v0.5.1
1791.75 s
> Compiling color-spantrace v0.3.0
1791.75 s
> Compiling ratatui-macros v0.7.0
1791.75 s
> Compiling string-template-plus v0.4.3
1791.75 s
> Compiling nalgebra v0.29.0
1791.75 s
> Compiling ratatui v0.30.0
1791.75 s
> Compiling color-eyre v0.6.5
1791.75 s
> Compiling numerica v1.4.3
1791.75 s
> Compiling schemars v1.2.1
1791.75 s
> Compiling tracing-indicatif v0.3.14
1791.75 s
> Compiling tracing-appender v0.2.5
1791.75 s
> Compiling typed-index-collections v3.5.0
1791.75 s
> Compiling slotmap v1.1.1
1791.75 s
> Compiling serde_yaml v0.9.34+deprecated
1791.75 s
> Compiling vectorize v0.2.0
1791.75 s
> Compiling json5 v0.4.1
1791.75 s
> Compiling gammaloop-tracing-filter v0.1.0 (/build/source/crates/gammaloop-tracing-filter)
1791.75 s
> Compiling reedline v0.42.0
1791.75 s
> Compiling ndarray v0.17.2
1791.75 s
> Compiling ron v0.12.1
1791.75 s
> Compiling graphica v1.2.1
1791.75 s
> Compiling insta v1.47.2
1791.75 s
> Compiling statrs v0.16.1
1791.75 s
> Compiling momtrop v0.3.0
1791.75 s
> Compiling linnet v0.17.0 (/build/source/crates/linnet)
1791.75 s
> Compiling spenso-macros v0.3.2 (/build/source/crates/spenso-macros)
1791.75 s
> Compiling spenso v0.6.0 (/build/source/crates/spenso)
1791.75 s
> Compiling idenso v0.3.0 (/build/source/crates/idenso)
1791.75 s
> Compiling spenso-hep-lib v0.1.7 (/build/source/crates/spenso-hep-lib)
1791.75 s
> Finished `dev-optim` profile [optimized + debuginfo] target(s) in 27m 44s
1791.75 s
> ------------
1791.75 s
> Nextest run ID 7f62b4b3-1036-44d8-a11a-63718c46ba4d with nextest profile: ci_gammaloop
1791.75 s
> Starting 649 tests across 5 binaries (58 tests skipped via profile.ci_gammaloop.default-filter )
1791.75 s
> FAIL [ 26.540s] (644/649) gammalooprs cff::generation::tests_cff :: thermal_bugblatter
1791.75 s
> stdout ---
1791.75 s
>
1791.75 s
> running 1 test
1791.75 s
> test cff::generation::tests_cff::thermal_bugblatter ... FAILED
1791.75 s
>
1791.75 s
> failures:
1791.75 s
>
1791.75 s
> failures:
1791.75 s
> cff::generation::tests_cff::thermal_bugblatter
1791.75 s
>
1791.75 s
> test result: FAILED. 0 passed; 1 failed; 0 ignored; 0 measured; 390 filtered out; finished in 26.38s
1791.75 s
>
1791.75 s
> stderr ---
1791.75 s
>
1791.75 s
> thread 'cff::generation::tests_cff::thermal_bugblatter' (5402) panicked at crates/gammalooprs/src/cff/generation.rs:2883:9:
1791.75 s
> relative error: +5.091904431950302e-10 (ground truth: +1.3084677423579079e0 vs reproduced: +1.3084677430241671e0)
1791.75 s
> stack backtrace:
1791.75 s
> 0: __rustc::rust_begin_unwind
1791.75 s
> at /rustc/59807616e1fa2540724bfbac14d7976d7e4a3860/library/std/src/panicking.rs:689:5
1791.75 s
> 1: core::panicking::panic_fmt
1791.75 s
> at /rustc/59807616e1fa2540724bfbac14d7976d7e4a3860/library/core/src/panicking.rs:80:14
1791.75 s
> 2: gammalooprs::cff::generation::tests_cff::thermal_bugblatter
1791.75 s
> at ./src/cff/generation.rs:2883:9
1791.75 s
> 3: gammalooprs::cff::generation::tests_cff::thermal_bugblatter::{{closure}}
1791.75 s
> at ./src/cff/generation.rs:2800:28
1791.75 s
> 4: core::ops::function::FnOnce::call_once
1791.75 s
> at /rustc/59807616e1fa2540724bfbac14d7976d7e4a3860/library/core/src/ops/function.rs:250:5
1791.75 s
> 5: <fn() -> core::result::Result<(), alloc::string::String> as core::ops::function::FnOnce<()>>::call_once
1791.75 s
> at /rustc/59807616e1fa2540724bfbac14d7976d7e4a3860/library/core/src/ops/function.rs:250:5
1791.75 s
> note: Some details are omitted, run with `RUST_BACKTRACE=full` for a verbose backtrace.
1791.75 s
>
1791.75 s
> ------------
1791.75 s
> Summary [ 67.329s] 649 tests run: 648 passed , 1 failed , 58 skipped
1791.75 s
> FAIL [ 26.540s] (644/649) gammalooprs cff::generation::tests_cff :: thermal_bugblatter
1791.75 s
> stdout ---
1791.75 s
>
1791.75 s
> running 1 test
1791.75 s
> test cff::generation::tests_cff::thermal_bugblatter ... FAILED
1791.75 s
>
1791.75 s
> failures:
1791.75 s
>
1791.75 s
> failures:
1791.75 s
> cff::generation::tests_cff::thermal_bugblatter
1791.75 s
>
1791.75 s
> test result: FAILED. 0 passed; 1 failed; 0 ignored; 0 measured; 390 filtered out; finished in 26.38s
1791.75 s
>
1791.75 s
> stderr ---
1791.75 s
>
1791.75 s
> thread 'cff::generation::tests_cff::thermal_bugblatter' (5402) panicked at crates/gammalooprs/src/cff/generation.rs:2883:9:
1791.75 s
> relative error: +5.091904431950302e-10 (ground truth: +1.3084677423579079e0 vs reproduced: +1.3084677430241671e0)
1791.75 s
> stack backtrace:
1791.75 s
> 0: __rustc::rust_begin_unwind
1791.75 s
> at /rustc/59807616e1fa2540724bfbac14d7976d7e4a3860/library/std/src/panicking.rs:689:5
1791.75 s
> 1: core::panicking::panic_fmt
1791.75 s
> at /rustc/59807616e1fa2540724bfbac14d7976d7e4a3860/library/core/src/panicking.rs:80:14
1791.75 s
> 2: gammalooprs::cff::generation::tests_cff::thermal_bugblatter
1791.75 s
> at ./src/cff/generation.rs:2883:9
1791.75 s
> 3: gammalooprs::cff::generation::tests_cff::thermal_bugblatter::{{closure}}
1791.75 s
> at ./src/cff/generation.rs:2800:28
1791.75 s
> 4: core::ops::function::FnOnce::call_once
1791.75 s
> at /rustc/59807616e1fa2540724bfbac14d7976d7e4a3860/library/core/src/ops/function.rs:250:5
1791.75 s
> 5: <fn() -> core::result::Result<(), alloc::string::String> as core::ops::function::FnOnce<()>>::call_once
1791.75 s
> at /rustc/59807616e1fa2540724bfbac14d7976d7e4a3860/library/core/src/ops/function.rs:250:5
1791.75 s
> note: Some details are omitted, run with `RUST_BACKTRACE=full` for a verbose backtrace.
1791.75 s
>
1791.75 s
> error : test run failed
1791.75 s
>
1791.75 s
> ========== nextest test summary ==========
1791.75 s
> report: target/nextest/ci_gammaloop/junit.xml
1791.75 s
> tests: 649, failures: 1, errors: 0
1791.75 s
>
1791.75 s
> 1. gammalooprs::cff::generation::tests_cff::thermal_bugblatter
1791.75 s
> failure: test failure with exit code 101
1791.75 s
> thread 'cff::generation::tests_cff::thermal_bugblatter' (5402) panicked at crates/gammalooprs/src/cff/generation.rs:2883:9:
1791.75 s
> relative error: +5.091904431950302e-10 (ground truth: +1.3084677423579079e0 vs reproduced: +1.3084677430241671e0)
1791.75 s
> stack backtrace:
1791.75 s
> 0: __rustc::rust_begin_unwind
1791.75 s
> at /rustc/59807616e1fa2540724bfbac14d7976d7e4a3860/library/std/src/panicking.rs:689:5
1791.75 s
> 1: core::panicking::panic_fmt
1791.75 s
> at /rustc/59807616e1fa2540724bfbac14d7976d7e4a3860/library/core/src/panicking.rs:80:14
1791.75 s
> 2: gammalooprs::cff::generation::tests_cff::thermal_bugblatter
1791.75 s
> at ./src/cff/generation.rs:2883:9
1791.75 s
> 3: gammalooprs::cff::generation::tests_cff::thermal_bugblatter::{{closure}}
1791.75 s
> at ./src/cff/generation.rs:2800:28
1791.75 s
> 4: core::ops::function::FnOnce::call_once
1791.75 s
> at /rustc/59807616e1fa2540724bfbac14d7976d7e4a3860/library/core/src/ops/function.rs:250:5
1791.75 s
> 5: <fn() -> core::result::Result<(), alloc::string::String> as core::ops::function::FnOnce<()>>::call_once
1791.75 s
> at /rustc/59807616e1fa2540724bfbac14d7976d7e4a3860/library/core/src/ops/function.rs:250:5
1791.75 s
> note: Some details are omitted, run with `RUST_BACKTRACE=full` for a verbose backtrace.
1791.75 s
> system-out
1791.75 s
> running 1 test
1791.75 s
> test cff::generation::tests_cff::thermal_bugblatter ... FAILED
1791.75 s
>
1791.75 s
> failures:
1791.75 s
>
1791.75 s
> failures:
1791.75 s
> cff::generation::tests_cff::thermal_bugblatter
1791.75 s
>
1791.75 s
> test result: FAILED. 0 passed; 1 failed; 0 ignored; 0 measured; 390 filtered out; finished in 26.38s
1791.75 s
> system-err
1791.75 s
> thread 'cff::generation::tests_cff::thermal_bugblatter' (5402) panicked at crates/gammalooprs/src/cff/generation.rs:2883:9:
1791.75 s
> relative error: +5.091904431950302e-10 (ground truth: +1.3084677423579079e0 vs reproduced: +1.3084677430241671e0)
1791.75 s
> stack backtrace:
1791.75 s
> 0: __rustc::rust_begin_unwind
1791.75 s
> at /rustc/59807616e1fa2540724bfbac14d7976d7e4a3860/library/std/src/panicking.rs:689:5
1791.75 s
> 1: core::panicking::panic_fmt
1791.75 s
> at /rustc/59807616e1fa2540724bfbac14d7976d7e4a3860/library/core/src/panicking.rs:80:14
1791.75 s
> 2: gammalooprs::cff::generation::tests_cff::thermal_bugblatter
1791.75 s
> at ./src/cff/generation.rs:2883:9
1791.75 s
> 3: gammalooprs::cff::generation::tests_cff::thermal_bugblatter::{{closure}}
1791.75 s
> at ./src/cff/generation.rs:2800:28
1791.75 s
> 4: core::ops::function::FnOnce::call_once
1791.75 s
> at /rustc/59807616e1fa2540724bfbac14d7976d7e4a3860/library/core/src/ops/function.rs:250:5
1791.75 s
> 5: <fn() -> core::result::Result<(), alloc::string::String> as core::ops::function::FnOnce<()>>::call_once
1791.75 s
> at /rustc/59807616e1fa2540724bfbac14d7976d7e4a3860/library/core/src/ops/function.rs:250:5
1791.75 s
> note: Some details are omitted, run with `RUST_BACKTRACE=full` for a verbose backtrace.
1791.75 s
> =========================================
1791.75 s
For full logs, run:
1791.75 s
nix log /nix/store/x99f4l4rhn4rxfh9pva0mbx49rp8n02k-gammaloop-nextest-core-nextest-0.1.0.drv
1791.96 s
Run failed.