test packages.x86_64-linux.nix-ci-check-gammaloop-nextest-core

Reproduce this run
Retry Run
  1. 72.96 s cargo-package-ntapi (post)> copying 1 paths...
  2. 72.96 s cargo-package-ntapi (post)> copying path '/nix/store/50xx5j0b7hdhr8cpxl7h2l4jh4z3qfbl-cargo-package-ntapi-0.4.3' to 'https://cache.nix-ci.com'...
  3. 73.24 s cargo-package-ntapi (post)> warning: 'warn-short-path-literals' is deprecated, use 'lint-short-path-literals = ignore' instead
  4. 73.30 s cargo-package-ntapi (post)> copying 0 paths...
  5. 73.74 s [3/36/291 built, 5 copie [5/36/291 built, 5 copie [7/36/291 built, 5 copie [8/36/291 built, 5 copie [10/36/291 built, 5 copi [12/36/291 built, 5 copi [13/36/291 built, 5 copi [15/36/291 built, 5 copicargo-package-plotters-svg (post)> Uploading to the NixCI cache: /nix/store/6jvn20943hcz4nphy7nvlayzjr0f8n6i-cargo-package-plotters-svg-0.3.7
  6. 73.82 s [16/36/291 built, 5 copicargo-package-plotters-svg (post)> warning: 'warn-short-path-literals' is deprecated, use 'lint-short-path-literals = ignore' instead
  7. 73.83 s cargo-package-plotters-svg (post)> copying 1 paths...
  8. 73.83 s cargo-package-plotters-svg (post)> copying path '/nix/store/6jvn20943hcz4nphy7nvlayzjr0f8n6i-cargo-package-plotters-svg-0.3.7' to 'https://cache.nix-ci.com'...
  9. 73.97 s cargo-package-plotters-svg (post)> warning: 'warn-short-path-literals' is deprecated, use 'lint-short-path-literals = ignore' instead
  10. 74.02 s cargo-package-plotters-svg (post)> copying 0 paths...
  11. 74.10 s [16/37/292 built, 5 copicargo-package-ratatui (post)> Uploading to the NixCI cache: /nix/store/6x3zr9k4z2vrc7s5zlx3lrs055z1zxrz-cargo-package-ratatui-0.30.0
  12. 74.18 s cargo-package-ratatui (post)> warning: 'warn-short-path-literals' is deprecated, use 'lint-short-path-literals = ignore' instead
  13. 74.19 s cargo-package-ratatui (post)> copying 1 paths...
  14. 74.19 s cargo-package-ratatui (post)> copying path '/nix/store/6x3zr9k4z2vrc7s5zlx3lrs055z1zxrz-cargo-package-ratatui-0.30.0' to 'https://cache.nix-ci.com'...
  15. 74.39 s cargo-package-ratatui (post)> warning: 'warn-short-path-literals' is deprecated, use 'lint-short-path-literals = ignore' instead
  16. 74.46 s cargo-package-ratatui (post)> copying 0 paths...
  17. 74.52 s [15/38/293 built, 5 copicargo-package-ratatui-core (post)> Uploading to the NixCI cache: /nix/store/0gq4950ph9ncmrwa3il6ggg0hyvplpj2-cargo-package-ratatui-core-0.1.0
  18. 74.60 s cargo-package-ratatui-core (post)> warning: 'warn-short-path-literals' is deprecated, use 'lint-short-path-literals = ignore' instead
  19. 74.61 s cargo-package-ratatui-core (post)> copying 1 paths...
  20. 74.61 s cargo-package-ratatui-core (post)> copying path '/nix/store/0gq4950ph9ncmrwa3il6ggg0hyvplpj2-cargo-package-ratatui-core-0.1.0' to 'https://cache.nix-ci.com'...
  21. 74.90 s cargo-package-ratatui-core (post)> warning: 'warn-short-path-literals' is deprecated, use 'lint-short-path-literals = ignore' instead
  22. 74.96 s cargo-package-ratatui-core (post)> copying 0 paths...
  23. 75.07 s [14/39/294 built, 5 copi [15/39/262 built, 5 copicargo-package-num_threads> Running phase: unpackPhase
  24. 75.07 s [16/39/262 built, 5 copicargo-package-num_threads> setting SOURCE_DATE_EPOCH to timestamp 1153704088 of file "./crate/src/linux.rs"
  25. 75.07 s cargo-package-num_threads> Running phase: patchPhase
  26. 75.07 s cargo-package-num_threads> Running phase: updateAutotoolsGnuConfigScriptsPhase
  27. 75.07 s cargo-package-num_threads> Running phase: installPhase
  28. 75.07 s cargo-package-numpy> Running phase: unpackPhase
  29. 75.07 s cargo-package-numpy> setting SOURCE_DATE_EPOCH to timestamp 1153704088 of file "./crate/tests/to_py.rs"
  30. 75.07 s cargo-package-numpy> Running phase: patchPhase
  31. 75.07 s cargo-package-numpy> Running phase: updateAutotoolsGnuConfigScriptsPhase
  32. 75.07 s cargo-package-numpy> Running phase: installPhase
  33. 75.07 s cargo-package-objc2> Running phase: unpackPhase
  34. 75.07 s cargo-package-objc2> setting SOURCE_DATE_EPOCH to timestamp 1153704088 of file "./crate/translation-config.toml"
  35. 75.07 s cargo-package-objc2> Running phase: patchPhase
  36. 75.07 s cargo-package-objc2> Running phase: updateAutotoolsGnuConfigScriptsPhase
  37. 75.07 s cargo-package-objc2> Running phase: installPhase
  38. 75.07 s cargo-package-objc2-encode> Running phase: unpackPhase
  39. 75.07 s cargo-package-objc2-encode> setting SOURCE_DATE_EPOCH to timestamp 1153704088 of file "./crate/src/static_str.rs"
  40. 75.07 s cargo-package-objc2-encode> Running phase: patchPhase
  41. 75.07 s cargo-package-objc2-encode> Running phase: updateAutotoolsGnuConfigScriptsPhase
  42. 75.07 s cargo-package-objc2-encode> Running phase: installPhase
  43. 75.07 s cargo-package-object> Running phase: unpackPhase
  44. 75.07 s cargo-package-object> setting SOURCE_DATE_EPOCH to timestamp 1153704088 of file "./crate/tests/round_trip/tls.rs"
  45. 75.07 s cargo-package-object> Running phase: patchPhase
  46. 75.07 s cargo-package-object> Running phase: updateAutotoolsGnuConfigScriptsPhase
  47. 75.07 s cargo-package-object> Running phase: installPhase
  48. 75.07 s cargo-package-once_cell_polyfill> Running phase: unpackPhase
  49. 75.07 s cargo-package-once_cell_polyfill> setting SOURCE_DATE_EPOCH to timestamp 1153704088 of file "./crate/src/sync/mod.rs"
  50. 75.07 s cargo-package-once_cell_polyfill> Running phase: patchPhase
  51. 75.07 s cargo-package-once_cell_polyfill> Running phase: updateAutotoolsGnuConfigScriptsPhase
  52. 75.07 s cargo-package-once_cell_polyfill> Running phase: installPhase
  53. 75.07 s cargo-package-oorandom> Running phase: unpackPhase
  54. 75.07 s cargo-package-oorandom> setting SOURCE_DATE_EPOCH to timestamp 1153704088 of file "./crate/tarpaulin-report.html"
  55. 75.07 s cargo-package-oorandom> Running phase: patchPhase
  56. 75.07 s cargo-package-oorandom> Running phase: updateAutotoolsGnuConfigScriptsPhase
  57. 75.07 s cargo-package-oorandom> Running phase: installPhase
  58. 75.07 s cargo-package-option-ext> Running phase: unpackPhase
  59. 75.07 s cargo-package-option-ext> Running phase: patchPhase
  60. 75.07 s cargo-package-option-ext> Running phase: updateAutotoolsGnuConfigScriptsPhase
  61. 75.07 s cargo-package-option-ext> Running phase: installPhase
  62. 75.07 s cargo-package-ordered-float> Running phase: unpackPhase
  63. 75.07 s cargo-package-ordered-float> setting SOURCE_DATE_EPOCH to timestamp 1153704088 of file "./crate/tests/test.rs"
  64. 75.07 s cargo-package-ordered-float> Running phase: patchPhase
  65. 75.07 s cargo-package-ordered-float> Running phase: updateAutotoolsGnuConfigScriptsPhase
  66. 75.07 s cargo-package-ordered-float> Running phase: installPhase
  67. 75.07 s cargo-package-owo-colors> Running phase: unpackPhase
  68. 75.07 s cargo-package-owo-colors> setting SOURCE_DATE_EPOCH to timestamp 1153704088 of file "./crate/src/tests.rs"
  69. 75.07 s cargo-package-owo-colors> Running phase: patchPhase
  70. 75.07 s cargo-package-owo-colors> Running phase: updateAutotoolsGnuConfigScriptsPhase
  71. 75.07 s cargo-package-owo-colors> Running phase: installPhase
  72. 75.07 s cargo-package-papergrid> Running phase: unpackPhase
  73. 75.07 s cargo-package-papergrid> setting SOURCE_DATE_EPOCH to timestamp 1153704088 of file "./crate/tests/util/mod.rs"
  74. 75.07 s cargo-package-papergrid> Running phase: patchPhase
  75. 75.07 s cargo-package-papergrid> Running phase: updateAutotoolsGnuConfigScriptsPhase
  76. 75.07 s cargo-package-papergrid> Running phase: installPhase
  77. 75.07 s cargo-package-parking_lot_core> Running phase: unpackPhase
  78. 75.07 s cargo-package-parking_lot_core> setting SOURCE_DATE_EPOCH to timestamp 1153704088 of file "./crate/src/word_lock.rs"
  79. 75.07 s cargo-package-parking_lot_core> Running phase: patchPhase
  80. 75.07 s cargo-package-parking_lot_core> Running phase: updateAutotoolsGnuConfigScriptsPhase
  81. 75.07 s cargo-package-parking_lot_core> Running phase: installPhase
  82. 75.07 s cargo-package-paste> Running phase: unpackPhase
  83. 75.07 s cargo-package-paste> setting SOURCE_DATE_EPOCH to timestamp 1153704088 of file "./crate/tests/ui/unsupported-modifier.stderr"
  84. 75.07 s cargo-package-paste> Running phase: patchPhase
  85. 75.07 s cargo-package-paste> Running phase: updateAutotoolsGnuConfigScriptsPhase
  86. 75.07 s cargo-package-paste> Running phase: installPhase
  87. 75.07 s cargo-package-portable-atomic> Running phase: unpackPhase
  88. 75.07 s cargo-package-portable-atomic> setting SOURCE_DATE_EPOCH to timestamp 1153704088 of file "./crate/version.rs"
  89. 75.07 s cargo-package-portable-atomic> Running phase: patchPhase
  90. 75.07 s cargo-package-portable-atomic> Running phase: updateAutotoolsGnuConfigScriptsPhase
  91. 75.07 s cargo-package-portable-atomic> Running phase: installPhase
  92. 75.10 s cargo-package-num_threads (post)> Uploading to the NixCI cache: /nix/store/6dhij7bw4mss36b3bygqyfyhdbih9vkr-cargo-package-num_threads-0.1.7
  93. 75.17 s cargo-package-num_threads (post)> warning: 'warn-short-path-literals' is deprecated, use 'lint-short-path-literals = ignore' instead
  94. 75.18 s cargo-package-num_threads (post)> copying 1 paths...
  95. 75.18 s cargo-package-num_threads (post)> copying path '/nix/store/6dhij7bw4mss36b3bygqyfyhdbih9vkr-cargo-package-num_threads-0.1.7' to 'https://cache.nix-ci.com'...
  96. 75.31 s cargo-package-num_threads (post)> warning: 'warn-short-path-literals' is deprecated, use 'lint-short-path-literals = ignore' instead
  97. 75.37 s cargo-package-num_threads (post)> copying 0 paths...
  98. 75.42 s [15/40/263 built, 5 copicargo-package-numpy (post)> Uploading to the NixCI cache: /nix/store/ww27ls969ad2jk804ir1l465mjvwr44l-cargo-package-numpy-0.28.0
  99. 75.50 s cargo-package-numpy (post)> warning: 'warn-short-path-literals' is deprecated, use 'lint-short-path-literals = ignore' instead
  100. 75.54 s cargo-package-numpy (post)> copying 1 paths...
  101. 75.54 s cargo-package-numpy (post)> copying path '/nix/store/ww27ls969ad2jk804ir1l465mjvwr44l-cargo-package-numpy-0.28.0' to 'https://cache.nix-ci.com'...
  102. 75.71 s cargo-package-numpy (post)> warning: 'warn-short-path-literals' is deprecated, use 'lint-short-path-literals = ignore' instead
  103. 75.77 s cargo-package-numpy (post)> copying 0 paths...
  104. 75.82 s [14/41/264 built, 5 copicargo-package-objc2 (post)> Uploading to the NixCI cache: /nix/store/rhgapd8bgyn6zcqf7xwakd3jcv7nj538-cargo-package-objc2-0.6.4
  105. 75.90 s cargo-package-objc2 (post)> warning: 'warn-short-path-literals' is deprecated, use 'lint-short-path-literals = ignore' instead
  106. 75.91 s cargo-package-objc2 (post)> copying 1 paths...
  107. 75.91 s cargo-package-objc2 (post)> copying path '/nix/store/rhgapd8bgyn6zcqf7xwakd3jcv7nj538-cargo-package-objc2-0.6.4' to 'https://cache.nix-ci.com'...
  108. 76.31 s cargo-package-objc2 (post)> warning: 'warn-short-path-literals' is deprecated, use 'lint-short-path-literals = ignore' instead
  109. 76.37 s cargo-package-objc2 (post)> copying 0 paths...
  110. 76.42 s [13/42/265 built, 5 copicargo-package-objc2-encode (post)> Uploading to the NixCI cache: /nix/store/pxvaww133l2azpgsxh9blr3b1g65x6r1-cargo-package-objc2-encode-4.1.0
  111. 76.51 s cargo-package-objc2-encode (post)> warning: 'warn-short-path-literals' is deprecated, use 'lint-short-path-literals = ignore' instead
  112. 76.52 s cargo-package-objc2-encode (post)> copying 1 paths...
  113. 76.52 s cargo-package-objc2-encode (post)> copying path '/nix/store/pxvaww133l2azpgsxh9blr3b1g65x6r1-cargo-package-objc2-encode-4.1.0' to 'https://cache.nix-ci.com'...
  114. 76.68 s cargo-package-objc2-encode (post)> warning: 'warn-short-path-literals' is deprecated, use 'lint-short-path-literals = ignore' instead
  115. 76.74 s cargo-package-objc2-encode (post)> copying 0 paths...
  116. 76.80 s [12/43/266 built, 5 copicargo-package-object (post)> Uploading to the NixCI cache: /nix/store/f3jd24xg2ydm705p77q7ha7bz2abp94r-cargo-package-object-0.37.3
  117. 76.88 s cargo-package-object (post)> warning: 'warn-short-path-literals' is deprecated, use 'lint-short-path-literals = ignore' instead
  118. 76.89 s cargo-package-object (post)> copying 1 paths...
  119. 76.89 s cargo-package-object (post)> copying path '/nix/store/f3jd24xg2ydm705p77q7ha7bz2abp94r-cargo-package-object-0.37.3' to 'https://cache.nix-ci.com'...
  120. 77.41 s cargo-package-object (post)> warning: 'warn-short-path-literals' is deprecated, use 'lint-short-path-literals = ignore' instead
  121. 77.47 s cargo-package-object (post)> copying 0 paths...
  122. 77.52 s [11/44/267 built, 5 copicargo-package-once_cell_polyfill (post)> Uploading to the NixCI cache: /nix/store/6n2nla77ib4javvm158apsi0iz9mkkmm-cargo-package-once_cell_polyfill-1.70.2
  123. 77.59 s cargo-package-once_cell_polyfill (post)> warning: 'warn-short-path-literals' is deprecated, use 'lint-short-path-literals = ignore' instead
  124. 77.60 s cargo-package-once_cell_polyfill (post)> copying 1 paths...
  125. 77.60 s cargo-package-once_cell_polyfill (post)> copying path '/nix/store/6n2nla77ib4javvm158apsi0iz9mkkmm-cargo-package-once_cell_polyfill-1.70.2' to 'https://cache.nix-ci.com'...
  126. 77.73 s cargo-package-once_cell_polyfill (post)> warning: 'warn-short-path-literals' is deprecated, use 'lint-short-path-literals = ignore' instead
  127. 77.79 s cargo-package-once_cell_polyfill (post)> copying 0 paths...
  128. 77.84 s [10/45/268 built, 5 copicargo-package-oorandom (post)> Uploading to the NixCI cache: /nix/store/d2j7zazr911krv8kc4g0778d4hbqfxvs-cargo-package-oorandom-11.1.5
  129. 77.91 s cargo-package-oorandom (post)> warning: 'warn-short-path-literals' is deprecated, use 'lint-short-path-literals = ignore' instead
  130. 77.92 s cargo-package-oorandom (post)> copying 1 paths...
  131. 77.92 s cargo-package-oorandom (post)> copying path '/nix/store/d2j7zazr911krv8kc4g0778d4hbqfxvs-cargo-package-oorandom-11.1.5' to 'https://cache.nix-ci.com'...
  132. 78.06 s cargo-package-oorandom (post)> warning: 'warn-short-path-literals' is deprecated, use 'lint-short-path-literals = ignore' instead
  133. 78.13 s cargo-package-oorandom (post)> copying 0 paths...
  134. 78.17 s [9/46/269 built, 5 copiecargo-package-option-ext (post)> Uploading to the NixCI cache: /nix/store/6a5mqhv2cmlxw7ckcazmbfv3fb8i4fhg-cargo-package-option-ext-0.2.0
  135. 78.25 s cargo-package-option-ext (post)> warning: 'warn-short-path-literals' is deprecated, use 'lint-short-path-literals = ignore' instead
  136. 78.25 s cargo-package-option-ext (post)> copying 1 paths...
  137. 78.25 s cargo-package-option-ext (post)> copying path '/nix/store/6a5mqhv2cmlxw7ckcazmbfv3fb8i4fhg-cargo-package-option-ext-0.2.0' to 'https://cache.nix-ci.com'...
  138. 78.38 s cargo-package-option-ext (post)> warning: 'warn-short-path-literals' is deprecated, use 'lint-short-path-literals = ignore' instead
  139. 78.45 s cargo-package-option-ext (post)> copying 0 paths...
  140. 78.50 s [8/47/270 built, 5 copiecargo-package-ordered-float (post)> Uploading to the NixCI cache: /nix/store/zmz930sbfw0vzyp94wrx1y5xczkbjxxj-cargo-package-ordered-float-4.6.0
  141. 78.56 s cargo-package-ordered-float (post)> warning: 'warn-short-path-literals' is deprecated, use 'lint-short-path-literals = ignore' instead
  142. 78.57 s cargo-package-ordered-float (post)> copying 1 paths...
  143. 78.57 s cargo-package-ordered-float (post)> copying path '/nix/store/zmz930sbfw0vzyp94wrx1y5xczkbjxxj-cargo-package-ordered-float-4.6.0' to 'https://cache.nix-ci.com'...
  144. 78.71 s cargo-package-ordered-float (post)> warning: 'warn-short-path-literals' is deprecated, use 'lint-short-path-literals = ignore' instead
  145. 78.79 s cargo-package-ordered-float (post)> copying 0 paths...
  146. 78.84 s [7/48/271 built, 5 copiecargo-package-owo-colors (post)> Uploading to the NixCI cache: /nix/store/hhv2paw8in0yj72h45gv45lyrf74d41i-cargo-package-owo-colors-4.3.0
  147. 78.90 s cargo-package-owo-colors (post)> warning: 'warn-short-path-literals' is deprecated, use 'lint-short-path-literals = ignore' instead
  148. 78.91 s cargo-package-owo-colors (post)> copying 1 paths...
  149. 78.91 s cargo-package-owo-colors (post)> copying path '/nix/store/hhv2paw8in0yj72h45gv45lyrf74d41i-cargo-package-owo-colors-4.3.0' to 'https://cache.nix-ci.com'...
  150. 79.06 s cargo-package-owo-colors (post)> warning: 'warn-short-path-literals' is deprecated, use 'lint-short-path-literals = ignore' instead
  151. 79.13 s cargo-package-owo-colors (post)> copying 0 paths...
  152. 79.18 s [6/49/272 built, 5 copiecargo-package-papergrid (post)> Uploading to the NixCI cache: /nix/store/73xdm8lg54cgynyrdz31nww0xdasn7vi-cargo-package-papergrid-0.17.0
  153. 79.25 s cargo-package-papergrid (post)> warning: 'warn-short-path-literals' is deprecated, use 'lint-short-path-literals = ignore' instead
  154. 79.26 s cargo-package-papergrid (post)> copying 1 paths...
  155. 79.26 s cargo-package-papergrid (post)> copying path '/nix/store/73xdm8lg54cgynyrdz31nww0xdasn7vi-cargo-package-papergrid-0.17.0' to 'https://cache.nix-ci.com'...
  156. 79.49 s cargo-package-papergrid (post)> warning: 'warn-short-path-literals' is deprecated, use 'lint-short-path-literals = ignore' instead
  157. 79.56 s cargo-package-papergrid (post)> copying 0 paths...
  158. 79.60 s [5/50/273 built, 5 copiecargo-package-parking_lot_core (post)> Uploading to the NixCI cache: /nix/store/z088s9nv4b9hqd7f5ndn3ls4imxak6w6-cargo-package-parking_lot_core-0.9.12
  159. 79.67 s cargo-package-parking_lot_core (post)> warning: 'warn-short-path-literals' is deprecated, use 'lint-short-path-literals = ignore' instead
  160. 79.68 s cargo-package-parking_lot_core (post)> copying 1 paths...
  161. 79.68 s cargo-package-parking_lot_core (post)> copying path '/nix/store/z088s9nv4b9hqd7f5ndn3ls4imxak6w6-cargo-package-parking_lot_core-0.9.12' to 'https://cache.nix-ci.com'...
  162. 79.83 s cargo-package-parking_lot_core (post)> warning: 'warn-short-path-literals' is deprecated, use 'lint-short-path-literals = ignore' instead
  163. 79.89 s cargo-package-parking_lot_core (post)> copying 0 paths...
  164. 79.94 s [4/51/274 built, 5 copiecargo-package-paste (post)> Uploading to the NixCI cache: /nix/store/526vjxam9nwj57s2hh7fh8krcv1a1m1k-cargo-package-paste-1.0.15
  165. 80.02 s cargo-package-paste (post)> warning: 'warn-short-path-literals' is deprecated, use 'lint-short-path-literals = ignore' instead
  166. 80.03 s cargo-package-paste (post)> copying 1 paths...
  167. 80.03 s cargo-package-paste (post)> copying path '/nix/store/526vjxam9nwj57s2hh7fh8krcv1a1m1k-cargo-package-paste-1.0.15' to 'https://cache.nix-ci.com'...
  168. 80.17 s cargo-package-paste (post)> warning: 'warn-short-path-literals' is deprecated, use 'lint-short-path-literals = ignore' instead
  169. 80.23 s cargo-package-paste (post)> copying 0 paths...
  170. 80.29 s [3/52/275 built, 5 copiecargo-package-portable-atomic (post)> Uploading to the NixCI cache: /nix/store/p7mz5d5sfsgr05lca5nps4hd2a6qgxxb-cargo-package-portable-atomic-1.13.1
  171. 80.36 s cargo-package-portable-atomic (post)> warning: 'warn-short-path-literals' is deprecated, use 'lint-short-path-literals = ignore' instead
  172. 80.37 s cargo-package-portable-atomic (post)> copying 1 paths...
  173. 80.37 s cargo-package-portable-atomic (post)> copying path '/nix/store/p7mz5d5sfsgr05lca5nps4hd2a6qgxxb-cargo-package-portable-atomic-1.13.1' to 'https://cache.nix-ci.com'...
  174. 80.71 s cargo-package-portable-atomic (post)> warning: 'warn-short-path-literals' is deprecated, use 'lint-short-path-literals = ignore' instead
  175. 80.77 s cargo-package-portable-atomic (post)> copying 0 paths...
  176. 80.81 s cargo-package-pathdiff> Running phase: unpackPhase
  177. 80.81 s [2/53/258 built, 5 copiecargo-package-pathdiff> setting SOURCE_DATE_EPOCH to timestamp 1153704088 of file "./crate/src/lib.rs"
  178. 80.81 s cargo-package-pathdiff> Running phase: patchPhase
  179. 80.81 s cargo-package-pathdiff> Running phase: updateAutotoolsGnuConfigScriptsPhase
  180. 80.81 s cargo-package-pathdiff> Running phase: installPhase
  181. 80.81 s cargo-package-pathfinding> Running phase: unpackPhase
  182. 80.81 s cargo-package-pathfinding> setting SOURCE_DATE_EPOCH to timestamp 1153704088 of file "./crate/tests/yen.rs"
  183. 80.81 s cargo-package-pathfinding> Running phase: patchPhase
  184. 80.81 s cargo-package-pathfinding> Running phase: updateAutotoolsGnuConfigScriptsPhase
  185. 80.81 s cargo-package-pathfinding> Running phase: installPhase
  186. 80.85 s cargo-package-pathdiff (post)> Uploading to the NixCI cache: /nix/store/mfm6c4s4jww8pb3xass441l653pkff20-cargo-package-pathdiff-0.2.3
  187. 80.92 s cargo-package-pathdiff (post)> warning: 'warn-short-path-literals' is deprecated, use 'lint-short-path-literals = ignore' instead
  188. 80.93 s cargo-package-pathdiff (post)> copying 1 paths...
  189. 80.93 s cargo-package-pathdiff (post)> copying path '/nix/store/mfm6c4s4jww8pb3xass441l653pkff20-cargo-package-pathdiff-0.2.3' to 'https://cache.nix-ci.com'...
  190. 81.07 s cargo-package-pathdiff (post)> warning: 'warn-short-path-literals' is deprecated, use 'lint-short-path-literals = ignore' instead
  191. 81.14 s cargo-package-pathdiff (post)> copying 0 paths...
  192. 81.21 s [1/54/247 built, 5 copiecargo-package-pathfinding (post)> Uploading to the NixCI cache: /nix/store/1ywr8ma6ycpqrgz3l8gjkgwhi1a1g3rd-cargo-package-pathfinding-4.15.0
  193. 81.28 s cargo-package-pathfinding (post)> warning: 'warn-short-path-literals' is deprecated, use 'lint-short-path-literals = ignore' instead
  194. 81.29 s cargo-package-pathfinding (post)> copying 1 paths...
  195. 81.29 s cargo-package-pathfinding (post)> copying path '/nix/store/1ywr8ma6ycpqrgz3l8gjkgwhi1a1g3rd-cargo-package-pathfinding-4.15.0' to 'https://cache.nix-ci.com'...
  196. 81.59 s cargo-package-pathfinding (post)> warning: 'warn-short-path-literals' is deprecated, use 'lint-short-path-literals = ignore' instead
  197. 81.65 s cargo-package-pathfinding (post)> copying 0 paths...
  198. 86.70 s [55/248 built, 5 copied
  199. 88.07 s [55/246 built, 5 copied [1/55/246 built, 5 copie [3/55/246 built, 5 copie [5/55/246 built, 5 copie [6/55/246 built, 5 copie [7/55/246 built, 5 copie [8/55/246 built, 5 copiecargo-package-pin-project-lite> Running phase: unpackPhase
  200. 88.07 s cargo-package-pin-project-lite> setting SOURCE_DATE_EPOCH to timestamp 1153704088 of file "./crate/tests/ui/pinned_drop/conditional-drop-impl.stderr"
  201. 88.07 s cargo-package-pin-project-lite> Running phase: patchPhase
  202. 88.07 s cargo-package-pin-project-lite> Running phase: updateAutotoolsGnuConfigScriptsPhase
  203. 88.07 s cargo-package-pin-project-lite> Running phase: installPhase
  204. 88.07 s cargo-package-plotters> Running phase: unpackPhase
  205. 88.07 s cargo-package-plotters> setting SOURCE_DATE_EPOCH to timestamp 1153704088 of file "./crate/src/test.rs"
  206. 88.07 s cargo-package-plotters> Running phase: patchPhase
  207. 88.07 s cargo-package-plotters> Running phase: updateAutotoolsGnuConfigScriptsPhase
  208. 88.07 s cargo-package-plotters> Running phase: installPhase
  209. 88.07 s cargo-package-plotters-backend> Running phase: unpackPhase
  210. 88.07 s cargo-package-plotters-backend> setting SOURCE_DATE_EPOCH to timestamp 1153704088 of file "./crate/src/text.rs"
  211. 88.07 s cargo-package-plotters-backend> Running phase: patchPhase
  212. 88.07 s cargo-package-plotters-backend> Running phase: updateAutotoolsGnuConfigScriptsPhase
  213. 88.07 s cargo-package-plotters-backend> Running phase: installPhase
  214. 88.07 s cargo-package-ryu> Running phase: unpackPhase
  215. 88.07 s cargo-package-ryu> setting SOURCE_DATE_EPOCH to timestamp 1153704088 of file "./crate/tests/s2f_test.rs"
  216. 88.07 s cargo-package-ryu> Running phase: patchPhase
  217. 88.07 s cargo-package-ryu> Running phase: updateAutotoolsGnuConfigScriptsPhase
  218. 88.07 s cargo-package-ryu> Running phase: installPhase
  219. 88.07 s cargo-package-safe_arch> Running phase: unpackPhase
  220. 88.07 s cargo-package-safe_arch> setting SOURCE_DATE_EPOCH to timestamp 1153704088 of file "./crate/tmp.txt"
  221. 88.07 s cargo-package-safe_arch> Running phase: patchPhase
  222. 88.07 s cargo-package-safe_arch> Running phase: updateAutotoolsGnuConfigScriptsPhase
  223. 88.07 s cargo-package-safe_arch> Running phase: installPhase
  224. 88.07 s cargo-package-slotmap> Running phase: unpackPhase
  225. 88.07 s cargo-package-slotmap> setting SOURCE_DATE_EPOCH to timestamp 1153704088 of file "./crate/src/util.rs"
  226. 88.07 s cargo-package-slotmap> Running phase: patchPhase
  227. 88.07 s cargo-package-slotmap> Running phase: updateAutotoolsGnuConfigScriptsPhase
  228. 88.07 s cargo-package-slotmap> Running phase: installPhase
  229. 88.07 s cargo-package-toml_writer> Running phase: unpackPhase
  230. 88.07 s cargo-package-toml_writer> setting SOURCE_DATE_EPOCH to timestamp 1153704088 of file "./crate/src/write.rs"
  231. 88.07 s cargo-package-toml_writer> Running phase: patchPhase
  232. 88.07 s cargo-package-toml_writer> Running phase: updateAutotoolsGnuConfigScriptsPhase
  233. 88.07 s cargo-package-toml_writer> Running phase: installPhase
  234. 88.07 s cargo-package-unic-emoji-char> Running phase: unpackPhase
  235. 88.07 s cargo-package-unic-emoji-char> setting SOURCE_DATE_EPOCH to timestamp 1551589280 of file "./crate/Cargo.toml.orig"
  236. 88.07 s cargo-package-unic-emoji-char> Running phase: patchPhase
  237. 88.07 s cargo-package-unic-emoji-char> Running phase: updateAutotoolsGnuConfigScriptsPhase
  238. 88.07 s cargo-package-unic-emoji-char> Running phase: installPhase
  239. 88.11 s cargo-package-pin-project-lite (post)> Uploading to the NixCI cache: /nix/store/9fk8lcz5zsd0igp0ixm9fx58igs3i74g-cargo-package-pin-project-lite-0.2.17
  240. 88.18 s cargo-package-pin-project-lite (post)> warning: 'warn-short-path-literals' is deprecated, use 'lint-short-path-literals = ignore' instead
  241. 88.19 s cargo-package-pin-project-lite (post)> copying 1 paths...
  242. 88.19 s cargo-package-pin-project-lite (post)> copying path '/nix/store/9fk8lcz5zsd0igp0ixm9fx58igs3i74g-cargo-package-pin-project-lite-0.2.17' to 'https://cache.nix-ci.com'...
  243. 88.34 s cargo-package-pin-project-lite (post)> warning: 'warn-short-path-literals' is deprecated, use 'lint-short-path-literals = ignore' instead
  244. 88.41 s cargo-package-pin-project-lite (post)> copying 0 paths...
  245. 88.47 s cargo-package-plotters (post)> Uploading to the NixCI cache: /nix/store/za3q7gripnf3n2jqjazmv588jmj3klad-cargo-package-plotters-0.3.7
  246. 88.54 s [7/56/215 built, 5 copiecargo-package-plotters (post)> warning: 'warn-short-path-literals' is deprecated, use 'lint-short-path-literals = ignore' instead
  247. 88.55 s cargo-package-plotters (post)> copying 1 paths...
  248. 88.55 s cargo-package-plotters (post)> copying path '/nix/store/za3q7gripnf3n2jqjazmv588jmj3klad-cargo-package-plotters-0.3.7' to 'https://cache.nix-ci.com'...
  249. 88.84 s cargo-package-plotters (post)> warning: 'warn-short-path-literals' is deprecated, use 'lint-short-path-literals = ignore' instead
  250. 88.92 s cargo-package-plotters (post)> copying 0 paths...
  251. 88.97 s cargo-package-plotters-backend (post)> Uploading to the NixCI cache: /nix/store/wvf6b3j3hdqi0r7z0idjv85nzaq2wk6k-cargo-package-plotters-backend-0.3.7
  252. 89.05 s [6/57/216 built, 5 copiecargo-package-plotters-backend (post)> warning: 'warn-short-path-literals' is deprecated, use 'lint-short-path-literals = ignore' instead
  253. 89.06 s cargo-package-plotters-backend (post)> copying 1 paths...
  254. 89.06 s cargo-package-plotters-backend (post)> copying path '/nix/store/wvf6b3j3hdqi0r7z0idjv85nzaq2wk6k-cargo-package-plotters-backend-0.3.7' to 'https://cache.nix-ci.com'...
  255. 89.21 s cargo-package-plotters-backend (post)> warning: 'warn-short-path-literals' is deprecated, use 'lint-short-path-literals = ignore' instead
  256. 89.28 s cargo-package-plotters-backend (post)> copying 0 paths...
  257. 89.34 s [5/58/217 built, 5 copiecargo-package-ryu (post)> Uploading to the NixCI cache: /nix/store/7ldg1r7yxwmafl8jrbgckmvviww25haa-cargo-package-ryu-1.0.23
  258. 89.42 s cargo-package-ryu (post)> warning: 'warn-short-path-literals' is deprecated, use 'lint-short-path-literals = ignore' instead
  259. 89.43 s cargo-package-ryu (post)> copying 1 paths...
  260. 89.43 s cargo-package-ryu (post)> copying path '/nix/store/7ldg1r7yxwmafl8jrbgckmvviww25haa-cargo-package-ryu-1.0.23' to 'https://cache.nix-ci.com'...
  261. 89.60 s cargo-package-ryu (post)> warning: 'warn-short-path-literals' is deprecated, use 'lint-short-path-literals = ignore' instead
  262. 89.67 s cargo-package-ryu (post)> copying 0 paths...
  263. 89.72 s cargo-package-safe_arch (post)> Uploading to the NixCI cache: /nix/store/gdmnmkx4zm0h66pwicmmwipqc24v5nwb-cargo-package-safe_arch-0.7.4
  264. 89.80 s [4/59/218 built, 5 copiecargo-package-safe_arch (post)> warning: 'warn-short-path-literals' is deprecated, use 'lint-short-path-literals = ignore' instead
  265. 89.81 s cargo-package-safe_arch (post)> copying 1 paths...
  266. 89.81 s cargo-package-safe_arch (post)> copying path '/nix/store/gdmnmkx4zm0h66pwicmmwipqc24v5nwb-cargo-package-safe_arch-0.7.4' to 'https://cache.nix-ci.com'...
  267. 90.02 s cargo-package-safe_arch (post)> warning: 'warn-short-path-literals' is deprecated, use 'lint-short-path-literals = ignore' instead
  268. 90.09 s cargo-package-safe_arch (post)> copying 0 paths...
  269. 90.15 s [3/60/219 built, 5 copiecargo-package-slotmap (post)> Uploading to the NixCI cache: /nix/store/ks5hngdridy5am39f66q0lbbgwx5yqyc-cargo-package-slotmap-1.1.1
  270. 90.22 s cargo-package-slotmap (post)> warning: 'warn-short-path-literals' is deprecated, use 'lint-short-path-literals = ignore' instead
  271. 90.23 s cargo-package-slotmap (post)> copying 1 paths...
  272. 90.23 s cargo-package-slotmap (post)> copying path '/nix/store/ks5hngdridy5am39f66q0lbbgwx5yqyc-cargo-package-slotmap-1.1.1' to 'https://cache.nix-ci.com'...
  273. 90.41 s cargo-package-slotmap (post)> warning: 'warn-short-path-literals' is deprecated, use 'lint-short-path-literals = ignore' instead
  274. 90.48 s cargo-package-slotmap (post)> copying 0 paths...
  275. 90.53 s cargo-package-toml_writer (post)> Uploading to the NixCI cache: /nix/store/frn37ga4g03kjg6ynlp77j1m4cndcvfs-cargo-package-toml_writer-1.1.1+spec-1.1.0
  276. 90.60 s [2/61/220 built, 5 copiecargo-package-toml_writer (post)> warning: 'warn-short-path-literals' is deprecated, use 'lint-short-path-literals = ignore' instead
  277. 90.61 s cargo-package-toml_writer (post)> copying 1 paths...
  278. 90.61 s cargo-package-toml_writer (post)> copying path '/nix/store/frn37ga4g03kjg6ynlp77j1m4cndcvfs-cargo-package-toml_writer-1.1.1+spec-1.1.0' to 'https://cache.nix-ci.com'...
  279. 90.75 s cargo-package-toml_writer (post)> warning: 'warn-short-path-literals' is deprecated, use 'lint-short-path-literals = ignore' instead
  280. 90.81 s cargo-package-toml_writer (post)> copying 0 paths...
  281. 90.86 s [1/62/221 built, 5 copiecargo-package-unic-emoji-char (post)> Uploading to the NixCI cache: /nix/store/bkrs5sg3hgy9576kdyk4wanxnlrm1gl6-cargo-package-unic-emoji-char-0.9.0
  282. 90.94 s cargo-package-unic-emoji-char (post)> warning: 'warn-short-path-literals' is deprecated, use 'lint-short-path-literals = ignore' instead
  283. 90.94 s cargo-package-unic-emoji-char (post)> copying 1 paths...
  284. 90.94 s cargo-package-unic-emoji-char (post)> copying path '/nix/store/bkrs5sg3hgy9576kdyk4wanxnlrm1gl6-cargo-package-unic-emoji-char-0.9.0' to 'https://cache.nix-ci.com'...
  285. 91.08 s cargo-package-unic-emoji-char (post)> warning: 'warn-short-path-literals' is deprecated, use 'lint-short-path-literals = ignore' instead
  286. 91.14 s cargo-package-unic-emoji-char (post)> copying 0 paths...
  287. 92.65 s [63/222 built, 5 copied [2/63/214 built, 5 copie [4/63/214 built, 5 copie [6/63/214 built, 5 copie [8/63/214 built, 5 copie [9/63/214 built, 5 copie [11/63/214 built, 5 copi [13/63/214 built, 5 copi [14/63/214 built, 5 copi [16/63/214 built, 5 copicargo-package-portable-atomic-util> Running phase: unpackPhase
  288. 92.69 s cargo-package-portable-atomic-util> setting SOURCE_DATE_EPOCH to timestamp 1153704088 of file "./crate/tests/arc.rs"
  289. 92.69 s cargo-package-portable-atomic-util> Running phase: patchPhase
  290. 92.69 s cargo-package-portable-atomic-util> Running phase: updateAutotoolsGnuConfigScriptsPhase
  291. 92.69 s cargo-package-portable-atomic-util> Running phase: installPhase
  292. 92.69 s cargo-package-powerfmt> Running phase: unpackPhase
  293. 92.69 s cargo-package-powerfmt> setting SOURCE_DATE_EPOCH to timestamp 1153704088 of file "./crate/src/smart_display_impls.rs"
  294. 92.69 s cargo-package-powerfmt> Running phase: patchPhase
  295. 92.69 s cargo-package-powerfmt> Running phase: updateAutotoolsGnuConfigScriptsPhase
  296. 92.69 s cargo-package-powerfmt> Running phase: installPhase
  297. 92.69 s cargo-package-ppv-lite86> Running phase: unpackPhase
  298. 92.69 s cargo-package-ppv-lite86> setting SOURCE_DATE_EPOCH to timestamp 1153704088 of file "./crate/src/x86_64/sse2.rs"
  299. 92.69 s cargo-package-ppv-lite86> Running phase: patchPhase
  300. 92.69 s cargo-package-ppv-lite86> Running phase: updateAutotoolsGnuConfigScriptsPhase
  301. 92.69 s cargo-package-ppv-lite86> Running phase: installPhase
  302. 92.69 s cargo-package-prettyplease> Running phase: unpackPhase
  303. 92.69 s cargo-package-prettyplease> setting SOURCE_DATE_EPOCH to timestamp 1153704088 of file "./crate/tests/test_precedence.rs"
  304. 92.69 s cargo-package-prettyplease> Running phase: patchPhase
  305. 92.69 s cargo-package-prettyplease> Running phase: updateAutotoolsGnuConfigScriptsPhase
  306. 92.69 s cargo-package-prettyplease> Running phase: installPhase
  307. 92.69 s cargo-package-proc-macro-error> Running phase: unpackPhase
  308. 92.69 s cargo-package-proc-macro-error> setting SOURCE_DATE_EPOCH to timestamp 1596218818 of file "./crate/Cargo.toml"
  309. 92.69 s cargo-package-proc-macro-error> Running phase: patchPhase
  310. 92.69 s cargo-package-proc-macro-error> Running phase: updateAutotoolsGnuConfigScriptsPhase
  311. 92.69 s cargo-package-proc-macro-error> Running phase: installPhase
  312. 92.69 s cargo-package-proc-macro-error-attr> Running phase: unpackPhase
  313. 92.69 s cargo-package-proc-macro-error-attr> setting SOURCE_DATE_EPOCH to timestamp 1596218772 of file "./crate/Cargo.toml"
  314. 92.69 s cargo-package-proc-macro-error-attr> Running phase: patchPhase
  315. 92.69 s cargo-package-proc-macro-error-attr> Running phase: updateAutotoolsGnuConfigScriptsPhase
  316. 92.69 s cargo-package-proc-macro-error-attr> Running phase: installPhase
  317. 92.69 s cargo-package-proc-macro-error-attr2> Running phase: unpackPhase
  318. 92.69 s cargo-package-proc-macro-error-attr2> setting SOURCE_DATE_EPOCH to timestamp 1153704088 of file "./crate/src/settings.rs"
  319. 92.69 s cargo-package-proc-macro-error-attr2> Running phase: patchPhase
  320. 92.69 s cargo-package-proc-macro-error-attr2> Running phase: updateAutotoolsGnuConfigScriptsPhase
  321. 92.69 s cargo-package-proc-macro-error-attr2> Running phase: installPhase
  322. 92.69 s cargo-package-proc-macro-error2> Running phase: unpackPhase
  323. 92.69 s cargo-package-proc-macro-error2> setting SOURCE_DATE_EPOCH to timestamp 1153704088 of file "./crate/tests/ui/unrelated_panic.stderr"
  324. 92.69 s cargo-package-proc-macro-error2> Running phase: patchPhase
  325. 92.69 s cargo-package-proc-macro-error2> Running phase: updateAutotoolsGnuConfigScriptsPhase
  326. 92.69 s cargo-package-proc-macro-error2> Running phase: installPhase
  327. 92.69 s cargo-package-proptest> Running phase: unpackPhase
  328. 92.69 s cargo-package-proptest> setting SOURCE_DATE_EPOCH to timestamp 1153704088 of file "./crate/tests/pass/with_params.rs"
  329. 92.69 s cargo-package-proptest> Running phase: patchPhase
  330. 92.69 s cargo-package-proptest> Running phase: updateAutotoolsGnuConfigScriptsPhase
  331. 92.69 s cargo-package-proptest> Running phase: installPhase
  332. 92.69 s cargo-package-pyo3-build-config> Running phase: unpackPhase
  333. 92.69 s cargo-package-pyo3-build-config> setting SOURCE_DATE_EPOCH to timestamp 1153704088 of file "./crate/src/lib.rs"
  334. 92.69 s cargo-package-pyo3-build-config> Running phase: patchPhase
  335. 92.69 s cargo-package-pyo3-build-config> Running phase: updateAutotoolsGnuConfigScriptsPhase
  336. 92.69 s cargo-package-pyo3-build-config> Running phase: installPhase
  337. 92.69 s cargo-package-pyo3-ffi> Running phase: unpackPhase
  338. 92.69 s cargo-package-pyo3-ffi> setting SOURCE_DATE_EPOCH to timestamp 1153704088 of file "./crate/src/weakrefobject.rs"
  339. 92.69 s cargo-package-pyo3-ffi> Running phase: patchPhase
  340. 92.69 s cargo-package-pyo3-ffi> Running phase: updateAutotoolsGnuConfigScriptsPhase
  341. 92.69 s cargo-package-pyo3-ffi> Running phase: installPhase
  342. 92.69 s cargo-package-pyo3-macros> Running phase: unpackPhase
  343. 92.69 s cargo-package-pyo3-macros> setting SOURCE_DATE_EPOCH to timestamp 1153704088 of file "./crate/src/lib.rs"
  344. 92.69 s cargo-package-pyo3-macros> Running phase: patchPhase
  345. 92.69 s cargo-package-pyo3-macros> Running phase: updateAutotoolsGnuConfigScriptsPhase
  346. 92.69 s cargo-package-pyo3-macros> Running phase: installPhase
  347. 92.69 s cargo-package-rust-embed-utils> Running phase: unpackPhase
  348. 92.69 s cargo-package-rust-embed-utils> setting SOURCE_DATE_EPOCH to timestamp 1153704088 of file "./crate/src/lib.rs"
  349. 92.69 s cargo-package-rust-embed-utils> Running phase: patchPhase
  350. 92.69 s cargo-package-rust-embed-utils> Running phase: updateAutotoolsGnuConfigScriptsPhase
  351. 92.69 s cargo-package-rust-embed-utils> Running phase: installPhase
  352. 92.69 s cargo-package-rustc-demangle> Running phase: unpackPhase
  353. 92.69 s cargo-package-rustc-demangle> setting SOURCE_DATE_EPOCH to timestamp 1153704088 of file "./crate/src/v0.rs"
  354. 92.69 s cargo-package-rustc-demangle> Running phase: patchPhase
  355. 92.69 s cargo-package-rustc-demangle> Running phase: updateAutotoolsGnuConfigScriptsPhase
  356. 92.69 s cargo-package-rustc-demangle> Running phase: installPhase
  357. 92.69 s cargo-package-rustc-hash> Running phase: unpackPhase
  358. 92.69 s cargo-package-portable-atomic-util (post)> Uploading to the NixCI cache: /nix/store/irm8aznbpnj1lscg680pp8fw84d63i4f-cargo-package-portable-atomic-util-0.2.7
  359. 92.74 s cargo-package-portable-atomic-util (post)> warning: 'warn-short-path-literals' is deprecated, use 'lint-short-path-literals = ignore' instead
  360. 92.75 s cargo-package-portable-atomic-util (post)> copying 1 paths...
  361. 92.75 s cargo-package-portable-atomic-util (post)> copying path '/nix/store/irm8aznbpnj1lscg680pp8fw84d63i4f-cargo-package-portable-atomic-util-0.2.7' to 'https://cache.nix-ci.com'...
  362. 92.93 s cargo-package-portable-atomic-util (post)> warning: 'warn-short-path-literals' is deprecated, use 'lint-short-path-literals = ignore' instead
  363. 92.99 s cargo-package-portable-atomic-util (post)> copying 0 paths...
  364. 93.04 s cargo-package-powerfmt (post)> Uploading to the NixCI cache: /nix/store/2hyn93krlp2jq6zgkrvgfhhw40yn9bmv-cargo-package-powerfmt-0.2.0
  365. 93.11 s [15/64/194 built, 5 copicargo-package-powerfmt (post)> warning: 'warn-short-path-literals' is deprecated, use 'lint-short-path-literals = ignore' instead
  366. 93.12 s cargo-package-powerfmt (post)> copying 1 paths...
  367. 93.12 s cargo-package-powerfmt (post)> copying path '/nix/store/2hyn93krlp2jq6zgkrvgfhhw40yn9bmv-cargo-package-powerfmt-0.2.0' to 'https://cache.nix-ci.com'...
  368. 93.25 s cargo-package-powerfmt (post)> warning: 'warn-short-path-literals' is deprecated, use 'lint-short-path-literals = ignore' instead
  369. 93.32 s cargo-package-powerfmt (post)> copying 0 paths...
  370. 93.37 s [14/65/195 built, 5 copicargo-package-ppv-lite86 (post)> Uploading to the NixCI cache: /nix/store/v90l2alzfb69n1psmf51cqjd7y18whxh-cargo-package-ppv-lite86-0.2.21
  371. 93.44 s cargo-package-ppv-lite86 (post)> warning: 'warn-short-path-literals' is deprecated, use 'lint-short-path-literals = ignore' instead
  372. 93.45 s cargo-package-ppv-lite86 (post)> copying 1 paths...
  373. 93.45 s cargo-package-ppv-lite86 (post)> copying path '/nix/store/v90l2alzfb69n1psmf51cqjd7y18whxh-cargo-package-ppv-lite86-0.2.21' to 'https://cache.nix-ci.com'...
  374. 93.60 s cargo-package-ppv-lite86 (post)> warning: 'warn-short-path-literals' is deprecated, use 'lint-short-path-literals = ignore' instead
  375. 93.66 s cargo-package-ppv-lite86 (post)> copying 0 paths...
  376. 93.72 s [13/66/196 built, 5 copicargo-package-prettyplease (post)> Uploading to the NixCI cache: /nix/store/j4bcr8pz8khqdlnl8lfhqanphj4rmhq4-cargo-package-prettyplease-0.2.37
  377. 93.79 s cargo-package-prettyplease (post)> warning: 'warn-short-path-literals' is deprecated, use 'lint-short-path-literals = ignore' instead
  378. 93.80 s cargo-package-prettyplease (post)> copying 1 paths...
  379. 93.80 s cargo-package-prettyplease (post)> copying path '/nix/store/j4bcr8pz8khqdlnl8lfhqanphj4rmhq4-cargo-package-prettyplease-0.2.37' to 'https://cache.nix-ci.com'...
  380. 94.00 s cargo-package-prettyplease (post)> warning: 'warn-short-path-literals' is deprecated, use 'lint-short-path-literals = ignore' instead
  381. 94.05 s cargo-package-prettyplease (post)> copying 0 paths...
  382. 94.10 s [12/67/197 built, 5 copicargo-package-proc-macro-error (post)> Uploading to the NixCI cache: /nix/store/w1cxk6jacr3j2fhz48c6giwrfmk6wva0-cargo-package-proc-macro-error-1.0.4
  383. 94.17 s cargo-package-proc-macro-error (post)> warning: 'warn-short-path-literals' is deprecated, use 'lint-short-path-literals = ignore' instead
  384. 94.18 s cargo-package-proc-macro-error (post)> copying 1 paths...
  385. 94.18 s cargo-package-proc-macro-error (post)> copying path '/nix/store/w1cxk6jacr3j2fhz48c6giwrfmk6wva0-cargo-package-proc-macro-error-1.0.4' to 'https://cache.nix-ci.com'...
  386. 94.32 s cargo-package-proc-macro-error (post)> warning: 'warn-short-path-literals' is deprecated, use 'lint-short-path-literals = ignore' instead
  387. 94.39 s cargo-package-proc-macro-error (post)> copying 0 paths...
  388. 94.44 s cargo-package-proc-macro-error-attr (post)> Uploading to the NixCI cache: /nix/store/w2p3hhw2fgr3cb63ky25gs9y08npq322-cargo-package-proc-macro-error-attr-1.0.4
  389. 94.51 s [11/68/198 built, 5 copicargo-package-proc-macro-error-attr (post)> warning: 'warn-short-path-literals' is deprecated, use 'lint-short-path-literals = ignore' instead
  390. 94.51 s cargo-package-proc-macro-error-attr (post)> copying 1 paths...
  391. 94.52 s cargo-package-proc-macro-error-attr (post)> copying path '/nix/store/w2p3hhw2fgr3cb63ky25gs9y08npq322-cargo-package-proc-macro-error-attr-1.0.4' to 'https://cache.nix-ci.com'...
  392. 94.64 s cargo-package-proc-macro-error-attr (post)> warning: 'warn-short-path-literals' is deprecated, use 'lint-short-path-literals = ignore' instead
  393. 94.70 s cargo-package-proc-macro-error-attr (post)> copying 0 paths...
  394. 94.74 s cargo-package-proc-macro-error-attr2 (post)> Uploading to the NixCI cache: /nix/store/sswl38x19f9r05cpbs1bsnq71p6iif2v-cargo-package-proc-macro-error-attr2-2.0.0
  395. 94.81 s [10/69/199 built, 5 copicargo-package-proc-macro-error-attr2 (post)> warning: 'warn-short-path-literals' is deprecated, use 'lint-short-path-literals = ignore' instead
  396. 94.82 s cargo-package-proc-macro-error-attr2 (post)> copying 1 paths...
  397. 94.82 s cargo-package-proc-macro-error-attr2 (post)> copying path '/nix/store/sswl38x19f9r05cpbs1bsnq71p6iif2v-cargo-package-proc-macro-error-attr2-2.0.0' to 'https://cache.nix-ci.com'...
  398. 94.94 s cargo-package-proc-macro-error-attr2 (post)> warning: 'warn-short-path-literals' is deprecated, use 'lint-short-path-literals = ignore' instead
  399. 95.01 s cargo-package-proc-macro-error-attr2 (post)> copying 0 paths...
  400. 95.06 s [9/70/200 built, 5 copiecargo-package-proc-macro-error2 (post)> Uploading to the NixCI cache: /nix/store/zb3lwlyv98mg5r4gdc5c9v5m5fbpwb35-cargo-package-proc-macro-error2-2.0.1
  401. 95.12 s cargo-package-proc-macro-error2 (post)> warning: 'warn-short-path-literals' is deprecated, use 'lint-short-path-literals = ignore' instead
  402. 95.14 s cargo-package-proc-macro-error2 (post)> copying 1 paths...
  403. 95.14 s cargo-package-proc-macro-error2 (post)> copying path '/nix/store/zb3lwlyv98mg5r4gdc5c9v5m5fbpwb35-cargo-package-proc-macro-error2-2.0.1' to 'https://cache.nix-ci.com'...
  404. 95.27 s cargo-package-proc-macro-error2 (post)> warning: 'warn-short-path-literals' is deprecated, use 'lint-short-path-literals = ignore' instead
  405. 95.35 s cargo-package-proc-macro-error2 (post)> copying 0 paths...
  406. 95.40 s [8/71/201 built, 5 copiecargo-package-proptest (post)> Uploading to the NixCI cache: /nix/store/jfnwwhy5fw5xvpdmiapq9f02rm8r44pk-cargo-package-proptest-1.11.0
  407. 95.47 s cargo-package-proptest (post)> warning: 'warn-short-path-literals' is deprecated, use 'lint-short-path-literals = ignore' instead
  408. 95.48 s cargo-package-proptest (post)> copying 1 paths...
  409. 95.48 s cargo-package-proptest (post)> copying path '/nix/store/jfnwwhy5fw5xvpdmiapq9f02rm8r44pk-cargo-package-proptest-1.11.0' to 'https://cache.nix-ci.com'...
  410. 95.77 s cargo-package-proptest (post)> warning: 'warn-short-path-literals' is deprecated, use 'lint-short-path-literals = ignore' instead
  411. 95.84 s cargo-package-proptest (post)> copying 0 paths...
  412. 95.89 s cargo-package-pyo3-build-config (post)> Uploading to the NixCI cache: /nix/store/f7fizdzgh65hvg7ni5q222zhbfy5286m-cargo-package-pyo3-build-config-0.28.3
  413. 95.95 s [7/72/202 built, 5 copiecargo-package-pyo3-build-config (post)> warning: 'warn-short-path-literals' is deprecated, use 'lint-short-path-literals = ignore' instead
  414. 95.96 s cargo-package-pyo3-build-config (post)> copying 1 paths...
  415. 95.96 s cargo-package-pyo3-build-config (post)> copying path '/nix/store/f7fizdzgh65hvg7ni5q222zhbfy5286m-cargo-package-pyo3-build-config-0.28.3' to 'https://cache.nix-ci.com'...
  416. 96.10 s cargo-package-pyo3-build-config (post)> warning: 'warn-short-path-literals' is deprecated, use 'lint-short-path-literals = ignore' instead
  417. 96.17 s cargo-package-pyo3-build-config (post)> copying 0 paths...
  418. 96.22 s [6/73/203 built, 5 copiecargo-package-pyo3-ffi (post)> Uploading to the NixCI cache: /nix/store/kc3xv5smaj25d7ci6n0hcxcmc5s7w8yq-cargo-package-pyo3-ffi-0.28.3
  419. 96.29 s cargo-package-pyo3-ffi (post)> warning: 'warn-short-path-literals' is deprecated, use 'lint-short-path-literals = ignore' instead
  420. 96.30 s cargo-package-pyo3-ffi (post)> copying 1 paths...
  421. 96.30 s cargo-package-pyo3-ffi (post)> copying path '/nix/store/kc3xv5smaj25d7ci6n0hcxcmc5s7w8yq-cargo-package-pyo3-ffi-0.28.3' to 'https://cache.nix-ci.com'...
  422. 97.00 s cargo-package-pyo3-ffi (post)> warning: 'warn-short-path-literals' is deprecated, use 'lint-short-path-literals = ignore' instead
  423. 97.06 s cargo-package-pyo3-ffi (post)> copying 0 paths...
  424. 97.11 s [5/74/204 built, 5 copiecargo-package-pyo3-macros (post)> Uploading to the NixCI cache: /nix/store/4bql9l7nz12qhf8xkas35amncnbyx9j3-cargo-package-pyo3-macros-0.28.3
  425. 97.18 s cargo-package-pyo3-macros (post)> warning: 'warn-short-path-literals' is deprecated, use 'lint-short-path-literals = ignore' instead
  426. 97.19 s cargo-package-pyo3-macros (post)> copying 1 paths...
  427. 97.19 s cargo-package-pyo3-macros (post)> copying path '/nix/store/4bql9l7nz12qhf8xkas35amncnbyx9j3-cargo-package-pyo3-macros-0.28.3' to 'https://cache.nix-ci.com'...
  428. 97.31 s cargo-package-pyo3-macros (post)> warning: 'warn-short-path-literals' is deprecated, use 'lint-short-path-literals = ignore' instead
  429. 97.37 s cargo-package-pyo3-macros (post)> copying 0 paths...
  430. 97.42 s [4/75/205 built, 5 copiecargo-package-rust-embed-utils (post)> Uploading to the NixCI cache: /nix/store/1sz35hc5inrsbpxsj4mcq64052zlmhxi-cargo-package-rust-embed-utils-8.11.0
  431. 97.49 s cargo-package-rust-embed-utils (post)> warning: 'warn-short-path-literals' is deprecated, use 'lint-short-path-literals = ignore' instead
  432. 97.50 s cargo-package-rust-embed-utils (post)> copying 1 paths...
  433. 97.50 s cargo-package-rust-embed-utils (post)> copying path '/nix/store/1sz35hc5inrsbpxsj4mcq64052zlmhxi-cargo-package-rust-embed-utils-8.11.0' to 'https://cache.nix-ci.com'...
  434. 97.62 s cargo-package-rust-embed-utils (post)> warning: 'warn-short-path-literals' is deprecated, use 'lint-short-path-literals = ignore' instead
  435. 97.68 s cargo-package-rust-embed-utils (post)> copying 0 paths...
  436. 97.75 s [3/76/206 built, 5 copiecargo-package-rustc-demangle (post)> Uploading to the NixCI cache: /nix/store/7y28xll6glp3hfwa429av4s0j9ab533k-cargo-package-rustc-demangle-0.1.27
  437. 97.81 s cargo-package-rustc-demangle (post)> warning: 'warn-short-path-literals' is deprecated, use 'lint-short-path-literals = ignore' instead
  438. 97.82 s cargo-package-rustc-demangle (post)> copying 1 paths...
  439. 97.82 s cargo-package-rustc-demangle (post)> copying path '/nix/store/7y28xll6glp3hfwa429av4s0j9ab533k-cargo-package-rustc-demangle-0.1.27' to 'https://cache.nix-ci.com'...
  440. 97.97 s cargo-package-rustc-demangle (post)> warning: 'warn-short-path-literals' is deprecated, use 'lint-short-path-literals = ignore' instead
  441. 98.04 s cargo-package-rustc-demangle (post)> copying 0 paths...
  442. 98.06 s cargo-package-rustc-hash> setting SOURCE_DATE_EPOCH to timestamp 1581168035 of file "./crate/Cargo.toml"
  443. 98.06 s [2/77/191 built, 5 copiecargo-package-rustc-hash> Running phase: patchPhase
  444. 98.06 s cargo-package-rustc-hash> Running phase: updateAutotoolsGnuConfigScriptsPhase
  445. 98.06 s cargo-package-rustc-hash> Running phase: installPhase
  446. 98.06 s cargo-package-rustc-hash> Running phase: unpackPhase
  447. 98.06 s cargo-package-rustc-hash> setting SOURCE_DATE_EPOCH to timestamp 1153704088 of file "./crate/src/seeded_state.rs"
  448. 98.06 s cargo-package-rustc-hash> Running phase: patchPhase
  449. 98.06 s cargo-package-rustc-hash> Running phase: updateAutotoolsGnuConfigScriptsPhase
  450. 98.06 s cargo-package-rustc-hash> Running phase: installPhase
  451. 98.09 s cargo-package-rustc-hash (post)> Uploading to the NixCI cache: /nix/store/y3j0w01zwfdqm0z29aw4jsd71g1wm417-cargo-package-rustc-hash-1.1.0
  452. 98.16 s cargo-package-rustc-hash (post)> warning: 'warn-short-path-literals' is deprecated, use 'lint-short-path-literals = ignore' instead
  453. 98.16 s cargo-package-rustc-hash (post)> copying 1 paths...
  454. 98.16 s cargo-package-rustc-hash (post)> copying path '/nix/store/y3j0w01zwfdqm0z29aw4jsd71g1wm417-cargo-package-rustc-hash-1.1.0' to 'https://cache.nix-ci.com'...
  455. 98.28 s cargo-package-rustc-hash (post)> warning: 'warn-short-path-literals' is deprecated, use 'lint-short-path-literals = ignore' instead
  456. 98.34 s cargo-package-rustc-hash (post)> copying 0 paths...
  457. 98.39 s [1/78/187 built, 5 copiecargo-package-rustc-hash (post)> Uploading to the NixCI cache: /nix/store/w6850wwz2nwm2dfnnd8kp3acmkqldv1h-cargo-package-rustc-hash-2.1.2
  458. 98.45 s cargo-package-rustc-hash (post)> warning: 'warn-short-path-literals' is deprecated, use 'lint-short-path-literals = ignore' instead
  459. 98.46 s cargo-package-rustc-hash (post)> copying 1 paths...
  460. 98.46 s cargo-package-rustc-hash (post)> copying path '/nix/store/w6850wwz2nwm2dfnnd8kp3acmkqldv1h-cargo-package-rustc-hash-2.1.2' to 'https://cache.nix-ci.com'...
  461. 98.59 s cargo-package-rustc-hash (post)> warning: 'warn-short-path-literals' is deprecated, use 'lint-short-path-literals = ignore' instead
  462. 98.64 s cargo-package-rustc-hash (post)> copying 0 paths...
  463. 103.69 s [79/188 built, 5 copied
  464. 104.55 s [79/186 built, 5 copied [1/79/186 built, 5 copie [3/79/186 built, 5 copie [5/79/186 built, 5 copie [6/79/186 built, 5 copie [7/79/186 built, 5 copie [9/79/186 built, 5 copie [10/79/186 built, 5 copi [11/79/186 built, 5 copi [12/79/186 built, 5 copi [13/79/186 built, 5 copi [14/79/186 built, 5 copicargo-package-signal-hook-registry> Running phase: unpackPhase
  465. 104.55 s cargo-package-signal-hook-registry> setting SOURCE_DATE_EPOCH to timestamp 1153704088 of file "./crate/tests/unregister_signal.rs"
  466. 104.55 s cargo-package-signal-hook-registry> Running phase: patchPhase
  467. 104.55 s cargo-package-signal-hook-registry> Running phase: updateAutotoolsGnuConfigScriptsPhase
  468. 104.55 s cargo-package-signal-hook-registry> Running phase: installPhase
  469. 104.55 s cargo-package-similar> Running phase: unpackPhase
  470. 104.55 s cargo-package-similar> setting SOURCE_DATE_EPOCH to timestamp 1153704088 of file "./crate/src/utils.rs"
  471. 104.55 s cargo-package-similar> Running phase: patchPhase
  472. 104.55 s cargo-package-similar> Running phase: updateAutotoolsGnuConfigScriptsPhase
  473. 104.55 s cargo-package-similar> Running phase: installPhase
  474. 104.55 s cargo-package-similar-asserts> Running phase: unpackPhase
  475. 104.55 s cargo-package-similar-asserts> setting SOURCE_DATE_EPOCH to timestamp 1153704088 of file "./crate/tests/test_unsized.rs"
  476. 104.55 s cargo-package-similar-asserts> Running phase: patchPhase
  477. 104.55 s cargo-package-similar-asserts> Running phase: updateAutotoolsGnuConfigScriptsPhase
  478. 104.55 s cargo-package-similar-asserts> Running phase: installPhase
  479. 104.55 s cargo-package-siphasher> Running phase: unpackPhase
  480. 104.55 s cargo-package-siphasher> setting SOURCE_DATE_EPOCH to timestamp 1153704088 of file "./crate/src/tests128.rs"
  481. 104.55 s cargo-package-siphasher> Running phase: patchPhase
  482. 104.55 s cargo-package-siphasher> Running phase: updateAutotoolsGnuConfigScriptsPhase
  483. 104.55 s cargo-package-siphasher> Running phase: installPhase
  484. 104.55 s cargo-package-smallvec> Running phase: unpackPhase
  485. 104.55 s cargo-package-smallvec> setting SOURCE_DATE_EPOCH to timestamp 1153704088 of file "./crate/tests/macro.rs"
  486. 104.55 s cargo-package-smallvec> Running phase: patchPhase
  487. 104.55 s cargo-package-smallvec> Running phase: updateAutotoolsGnuConfigScriptsPhase
  488. 104.55 s cargo-package-smallvec> Running phase: installPhase
  489. 104.55 s cargo-package-smartstring> Running phase: unpackPhase
  490. 104.55 s cargo-package-smartstring> Running phase: patchPhase
  491. 104.55 s cargo-package-smartstring> Running phase: updateAutotoolsGnuConfigScriptsPhase
  492. 104.55 s cargo-package-smartstring> Running phase: installPhase
  493. 104.55 s cargo-package-spec_math> Running phase: unpackPhase
  494. 104.55 s cargo-package-spec_math> Running phase: patchPhase
  495. 104.55 s cargo-package-spec_math> Running phase: updateAutotoolsGnuConfigScriptsPhase
  496. 104.55 s cargo-package-spec_math> Running phase: installPhase
  497. 104.55 s cargo-package-statrs> Running phase: unpackPhase
  498. 104.55 s cargo-package-statrs> setting SOURCE_DATE_EPOCH to timestamp 1153704088 of file "./crate/src/testing/mod.rs"
  499. 104.55 s cargo-package-statrs> Running phase: patchPhase
  500. 104.55 s cargo-package-statrs> Running phase: updateAutotoolsGnuConfigScriptsPhase
  501. 104.55 s cargo-package-statrs> Running phase: installPhase
  502. 104.55 s cargo-package-string-template-plus> Running phase: unpackPhase
  503. 104.55 s cargo-package-string-template-plus> setting SOURCE_DATE_EPOCH to timestamp 1153704088 of file "./crate/templates/test5"
  504. 104.55 s cargo-package-string-template-plus> Running phase: patchPhase
  505. 104.55 s cargo-package-string-template-plus> Running phase: updateAutotoolsGnuConfigScriptsPhase
  506. 104.55 s cargo-package-string-template-plus> Running phase: installPhase
  507. 104.55 s cargo-package-strip-ansi-escapes> Running phase: unpackPhase
  508. 104.55 s cargo-package-strip-ansi-escapes> setting SOURCE_DATE_EPOCH to timestamp 1153704088 of file "./crate/src/lib.rs"
  509. 104.55 s cargo-package-strip-ansi-escapes> Running phase: patchPhase
  510. 104.55 s cargo-package-strip-ansi-escapes> Running phase: updateAutotoolsGnuConfigScriptsPhase
  511. 104.55 s cargo-package-strip-ansi-escapes> Running phase: installPhase
  512. 104.55 s cargo-package-target-lexicon> Running phase: unpackPhase
  513. 104.55 s cargo-package-target-lexicon> setting SOURCE_DATE_EPOCH to timestamp 1153704088 of file "./crate/src/triple.rs"
  514. 104.55 s cargo-package-target-lexicon> Running phase: patchPhase
  515. 104.55 s cargo-package-target-lexicon> Running phase: updateAutotoolsGnuConfigScriptsPhase
  516. 104.55 s cargo-package-target-lexicon> Running phase: installPhase
  517. 104.55 s cargo-package-tinytemplate> Running phase: unpackPhase
  518. 104.55 s cargo-package-tinytemplate> setting SOURCE_DATE_EPOCH to timestamp 1614815787 of file "./crate/Cargo.toml.orig"
  519. 104.55 s cargo-package-tinytemplate> Running phase: patchPhase
  520. 104.55 s cargo-package-tinytemplate> Running phase: updateAutotoolsGnuConfigScriptsPhase
  521. 104.55 s cargo-package-tinytemplate> Running phase: installPhase
  522. 104.55 s cargo-package-toml_datetime> Running phase: unpackPhase
  523. 104.55 s cargo-package-toml_datetime> setting SOURCE_DATE_EPOCH to timestamp 1153704088 of file "./crate/src/ser.rs"
  524. 104.55 s cargo-package-toml_datetime> Running phase: patchPhase
  525. 104.55 s cargo-package-toml_datetime> Running phase: updateAutotoolsGnuConfigScriptsPhase
  526. 104.55 s cargo-package-toml_datetime> Running phase: installPhase
  527. 104.55 s cargo-package-unsafe-libyaml> Running phase: unpackPhase
  528. 104.55 s cargo-package-unsafe-libyaml> setting SOURCE_DATE_EPOCH to timestamp 1153704088 of file "./crate/tests/test_parser_error.rs"
  529. 104.55 s cargo-package-unsafe-libyaml> Running phase: patchPhase
  530. 104.55 s cargo-package-unsafe-libyaml> Running phase: updateAutotoolsGnuConfigScriptsPhase
  531. 104.55 s cargo-package-unsafe-libyaml> Running phase: installPhase
  532. 104.57 s cargo-package-signal-hook-registry (post)> Uploading to the NixCI cache: /nix/store/8nyngkzlqv50hf11wqpyna49xhgl76b2-cargo-package-signal-hook-registry-1.4.8
  533. 104.63 s cargo-package-signal-hook-registry (post)> warning: 'warn-short-path-literals' is deprecated, use 'lint-short-path-literals = ignore' instead
  534. 104.64 s cargo-package-signal-hook-registry (post)> copying 1 paths...
  535. 104.64 s cargo-package-signal-hook-registry (post)> copying path '/nix/store/8nyngkzlqv50hf11wqpyna49xhgl76b2-cargo-package-signal-hook-registry-1.4.8' to 'https://cache.nix-ci.com'...
  536. 104.77 s cargo-package-signal-hook-registry (post)> warning: 'warn-short-path-literals' is deprecated, use 'lint-short-path-literals = ignore' instead
  537. 104.83 s cargo-package-signal-hook-registry (post)> copying 0 paths...
  538. 104.88 s [13/80/170 built, 5 copicargo-package-similar (post)> Uploading to the NixCI cache: /nix/store/vm6vp7zqh305f6919xdjnq33hwv0b1cg-cargo-package-similar-2.7.0
  539. 104.94 s cargo-package-similar (post)> warning: 'warn-short-path-literals' is deprecated, use 'lint-short-path-literals = ignore' instead
  540. 104.95 s cargo-package-similar (post)> copying 1 paths...
  541. 104.95 s cargo-package-similar (post)> copying path '/nix/store/vm6vp7zqh305f6919xdjnq33hwv0b1cg-cargo-package-similar-2.7.0' to 'https://cache.nix-ci.com'...
  542. 105.10 s cargo-package-similar (post)> warning: 'warn-short-path-literals' is deprecated, use 'lint-short-path-literals = ignore' instead
  543. 105.16 s cargo-package-similar (post)> copying 0 paths...
  544. 105.20 s [12/81/171 built, 5 copicargo-package-similar-asserts (post)> Uploading to the NixCI cache: /nix/store/ryf6zgyp2qn30avxfdqmm0y5vmnnkcv5-cargo-package-similar-asserts-1.7.0
  545. 105.26 s cargo-package-similar-asserts (post)> warning: 'warn-short-path-literals' is deprecated, use 'lint-short-path-literals = ignore' instead
  546. 105.27 s cargo-package-similar-asserts (post)> copying 1 paths...
  547. 105.27 s cargo-package-similar-asserts (post)> copying path '/nix/store/ryf6zgyp2qn30avxfdqmm0y5vmnnkcv5-cargo-package-similar-asserts-1.7.0' to 'https://cache.nix-ci.com'...
  548. 105.39 s cargo-package-similar-asserts (post)> warning: 'warn-short-path-literals' is deprecated, use 'lint-short-path-literals = ignore' instead
  549. 105.46 s cargo-package-similar-asserts (post)> copying 0 paths...
  550. 105.51 s [11/82/172 built, 5 copicargo-package-siphasher (post)> Uploading to the NixCI cache: /nix/store/sqhdsqrasj7h7xh5cjg4b161v52wak3i-cargo-package-siphasher-1.0.2
  551. 105.57 s cargo-package-siphasher (post)> warning: 'warn-short-path-literals' is deprecated, use 'lint-short-path-literals = ignore' instead
  552. 105.58 s cargo-package-siphasher (post)> copying 1 paths...
  553. 105.58 s cargo-package-siphasher (post)> copying path '/nix/store/sqhdsqrasj7h7xh5cjg4b161v52wak3i-cargo-package-siphasher-1.0.2' to 'https://cache.nix-ci.com'...
  554. 105.69 s cargo-package-siphasher (post)> warning: 'warn-short-path-literals' is deprecated, use 'lint-short-path-literals = ignore' instead
  555. 105.75 s cargo-package-siphasher (post)> copying 0 paths...
  556. 105.80 s cargo-package-smallvec (post)> Uploading to the NixCI cache: /nix/store/w2dl2dq4vlmbhrizkc6g7m97wrqii8pa-cargo-package-smallvec-1.15.1
  557. 105.86 s [10/83/173 built, 5 copicargo-package-smallvec (post)> warning: 'warn-short-path-literals' is deprecated, use 'lint-short-path-literals = ignore' instead
  558. 105.87 s cargo-package-smallvec (post)> copying 1 paths...
  559. 105.87 s cargo-package-smallvec (post)> copying path '/nix/store/w2dl2dq4vlmbhrizkc6g7m97wrqii8pa-cargo-package-smallvec-1.15.1' to 'https://cache.nix-ci.com'...
  560. 106.02 s cargo-package-smallvec (post)> warning: 'warn-short-path-literals' is deprecated, use 'lint-short-path-literals = ignore' instead
  561. 106.08 s cargo-package-smallvec (post)> copying 0 paths...
  562. 106.13 s cargo-package-smartstring (post)> Uploading to the NixCI cache: /nix/store/x8y47kwj37pnigxnf20l5rk170kgz2rs-cargo-package-smartstring-1.0.1
  563. 106.20 s [9/84/174 built, 5 copiecargo-package-smartstring (post)> warning: 'warn-short-path-literals' is deprecated, use 'lint-short-path-literals = ignore' instead
  564. 106.21 s cargo-package-smartstring (post)> copying 1 paths...
  565. 106.21 s cargo-package-smartstring (post)> copying path '/nix/store/x8y47kwj37pnigxnf20l5rk170kgz2rs-cargo-package-smartstring-1.0.1' to 'https://cache.nix-ci.com'...
  566. 106.35 s cargo-package-smartstring (post)> warning: 'warn-short-path-literals' is deprecated, use 'lint-short-path-literals = ignore' instead
  567. 106.40 s cargo-package-smartstring (post)> copying 0 paths...
  568. 106.45 s cargo-package-spec_math (post)> Uploading to the NixCI cache: /nix/store/k198rvvn765mf8gzzwrx06dv0l9l1xkh-cargo-package-spec_math-0.1.6
  569. 106.52 s [8/85/175 built, 5 copiecargo-package-spec_math (post)> warning: 'warn-short-path-literals' is deprecated, use 'lint-short-path-literals = ignore' instead
  570. 106.53 s cargo-package-spec_math (post)> copying 1 paths...
  571. 106.53 s cargo-package-spec_math (post)> copying path '/nix/store/k198rvvn765mf8gzzwrx06dv0l9l1xkh-cargo-package-spec_math-0.1.6' to 'https://cache.nix-ci.com'...
  572. 106.89 s cargo-package-spec_math (post)> warning: 'warn-short-path-literals' is deprecated, use 'lint-short-path-literals = ignore' instead
  573. 106.95 s cargo-package-spec_math (post)> copying 0 paths...
  574. 107.01 s [7/86/176 built, 5 copiecargo-package-statrs (post)> Uploading to the NixCI cache: /nix/store/9gs2qmfhddaw1yi3lbx73042amagj9zq-cargo-package-statrs-0.16.1
  575. 107.07 s cargo-package-statrs (post)> warning: 'warn-short-path-literals' is deprecated, use 'lint-short-path-literals = ignore' instead
  576. 107.08 s cargo-package-statrs (post)> copying 1 paths...
  577. 107.08 s cargo-package-statrs (post)> copying path '/nix/store/9gs2qmfhddaw1yi3lbx73042amagj9zq-cargo-package-statrs-0.16.1' to 'https://cache.nix-ci.com'...
  578. 107.33 s cargo-package-statrs (post)> warning: 'warn-short-path-literals' is deprecated, use 'lint-short-path-literals = ignore' instead
  579. 107.39 s cargo-package-statrs (post)> copying 0 paths...
  580. 107.44 s cargo-package-string-template-plus (post)> Uploading to the NixCI cache: /nix/store/304hmbs38sk2s5i7axlwv8m9q3cp5cyc-cargo-package-string-template-plus-0.4.3
  581. 107.50 s [6/87/177 built, 5 copiecargo-package-string-template-plus (post)> warning: 'warn-short-path-literals' is deprecated, use 'lint-short-path-literals = ignore' instead
  582. 107.51 s cargo-package-string-template-plus (post)> copying 1 paths...
  583. 107.51 s cargo-package-string-template-plus (post)> copying path '/nix/store/304hmbs38sk2s5i7axlwv8m9q3cp5cyc-cargo-package-string-template-plus-0.4.3' to 'https://cache.nix-ci.com'...
  584. 107.65 s cargo-package-string-template-plus (post)> warning: 'warn-short-path-literals' is deprecated, use 'lint-short-path-literals = ignore' instead
  585. 107.72 s cargo-package-string-template-plus (post)> copying 0 paths...
  586. 107.77 s [5/88/178 built, 5 copiecargo-package-strip-ansi-escapes (post)> Uploading to the NixCI cache: /nix/store/rg9gzyaxmk1pgi1x0shchhv23al9gfjk-cargo-package-strip-ansi-escapes-0.2.1
  587. 107.83 s cargo-package-strip-ansi-escapes (post)> warning: 'warn-short-path-literals' is deprecated, use 'lint-short-path-literals = ignore' instead
  588. 107.84 s cargo-package-strip-ansi-escapes (post)> copying 1 paths...
  589. 107.84 s cargo-package-strip-ansi-escapes (post)> copying path '/nix/store/rg9gzyaxmk1pgi1x0shchhv23al9gfjk-cargo-package-strip-ansi-escapes-0.2.1' to 'https://cache.nix-ci.com'...
  590. 107.97 s cargo-package-strip-ansi-escapes (post)> warning: 'warn-short-path-literals' is deprecated, use 'lint-short-path-literals = ignore' instead
  591. 108.03 s cargo-package-strip-ansi-escapes (post)> copying 0 paths...
  592. 108.07 s [4/89/179 built, 5 copiecargo-package-target-lexicon (post)> Uploading to the NixCI cache: /nix/store/hdwfp4qd84wrs6lm7xka3hsaflnr4gvd-cargo-package-target-lexicon-0.13.5
  593. 108.14 s cargo-package-target-lexicon (post)> warning: 'warn-short-path-literals' is deprecated, use 'lint-short-path-literals = ignore' instead
  594. 108.15 s cargo-package-target-lexicon (post)> copying 1 paths...
  595. 108.15 s cargo-package-target-lexicon (post)> copying path '/nix/store/hdwfp4qd84wrs6lm7xka3hsaflnr4gvd-cargo-package-target-lexicon-0.13.5' to 'https://cache.nix-ci.com'...
  596. 108.30 s cargo-package-target-lexicon (post)> warning: 'warn-short-path-literals' is deprecated, use 'lint-short-path-literals = ignore' instead
  597. 108.36 s cargo-package-target-lexicon (post)> copying 0 paths...
  598. 108.41 s [3/90/180 built, 5 copiecargo-package-tinytemplate (post)> Uploading to the NixCI cache: /nix/store/5882fw0q9axmvjxk548bm64a62sdd7iz-cargo-package-tinytemplate-1.2.1
  599. 108.48 s cargo-package-tinytemplate (post)> warning: 'warn-short-path-literals' is deprecated, use 'lint-short-path-literals = ignore' instead
  600. 108.49 s cargo-package-tinytemplate (post)> copying 1 paths...
  601. 108.49 s cargo-package-tinytemplate (post)> copying path '/nix/store/5882fw0q9axmvjxk548bm64a62sdd7iz-cargo-package-tinytemplate-1.2.1' to 'https://cache.nix-ci.com'...
  602. 108.64 s cargo-package-tinytemplate (post)> warning: 'warn-short-path-literals' is deprecated, use 'lint-short-path-literals = ignore' instead
  603. 108.70 s cargo-package-tinytemplate (post)> copying 0 paths...
  604. 108.75 s cargo-package-toml_datetime (post)> Uploading to the NixCI cache: /nix/store/2lghy1iby2mp7hhqixjp8k7mhi85pww4-cargo-package-toml_datetime-1.1.1+spec-1.1.0
  605. 108.83 s [2/91/181 built, 5 copiecargo-package-toml_datetime (post)> warning: 'warn-short-path-literals' is deprecated, use 'lint-short-path-literals = ignore' instead
  606. 108.84 s cargo-package-toml_datetime (post)> copying 1 paths...
  607. 108.84 s cargo-package-toml_datetime (post)> copying path '/nix/store/2lghy1iby2mp7hhqixjp8k7mhi85pww4-cargo-package-toml_datetime-1.1.1+spec-1.1.0' to 'https://cache.nix-ci.com'...
  608. 109.01 s cargo-package-toml_datetime (post)> warning: 'warn-short-path-literals' is deprecated, use 'lint-short-path-literals = ignore' instead
  609. 109.08 s cargo-package-toml_datetime (post)> copying 0 paths...
  610. 109.14 s [1/92/182 built, 5 copiecargo-package-unsafe-libyaml (post)> Uploading to the NixCI cache: /nix/store/sbn12d53p7wraffxv9alsgrzvfplj11m-cargo-package-unsafe-libyaml-0.2.11
  611. 109.21 s cargo-package-unsafe-libyaml (post)> warning: 'warn-short-path-literals' is deprecated, use 'lint-short-path-literals = ignore' instead
  612. 109.22 s cargo-package-unsafe-libyaml (post)> copying 1 paths...
  613. 109.22 s cargo-package-unsafe-libyaml (post)> copying path '/nix/store/sbn12d53p7wraffxv9alsgrzvfplj11m-cargo-package-unsafe-libyaml-0.2.11' to 'https://cache.nix-ci.com'...
  614. 109.43 s cargo-package-unsafe-libyaml (post)> warning: 'warn-short-path-literals' is deprecated, use 'lint-short-path-literals = ignore' instead
  615. 109.50 s cargo-package-unsafe-libyaml (post)> copying 0 paths...
  616. 111.03 s [93/183 built, 5 copied [1/93/169 built, 5 copie [2/93/169 built, 5 copie [4/93/169 built, 5 copie [6/93/169 built, 5 copie [8/93/169 built, 5 copie [9/93/169 built, 5 copie [11/93/169 built, 5 copi [12/93/169 built, 5 copi [14/93/169 built, 5 copi [15/93/169 built, 5 copicargo-package-strsim> Running phase: unpackPhase
  617. 111.03 s [16/93/169 built, 5 copicargo-package-strsim> setting SOURCE_DATE_EPOCH to timestamp 1580481539 of file "./crate/README.md"
  618. 111.03 s cargo-package-strsim> Running phase: patchPhase
  619. 111.03 s cargo-package-strsim> Running phase: updateAutotoolsGnuConfigScriptsPhase
  620. 111.03 s cargo-package-strsim> Running phase: installPhase
  621. 111.03 s cargo-package-strsim> Running phase: unpackPhase
  622. 111.03 s cargo-package-strsim> setting SOURCE_DATE_EPOCH to timestamp 1153704088 of file "./crate/tests/lib.rs"
  623. 111.03 s cargo-package-strsim> Running phase: patchPhase
  624. 111.03 s cargo-package-strsim> Running phase: updateAutotoolsGnuConfigScriptsPhase
  625. 111.03 s cargo-package-strsim> Running phase: installPhase
  626. 111.03 s cargo-package-strum_macros> Running phase: unpackPhase
  627. 111.03 s cargo-package-strum_macros> setting SOURCE_DATE_EPOCH to timestamp 1153704088 of file "./crate/src/macros/strings/to_string.rs"
  628. 111.03 s cargo-package-strum_macros> Running phase: patchPhase
  629. 111.03 s cargo-package-strum_macros> Running phase: updateAutotoolsGnuConfigScriptsPhase
  630. 111.03 s cargo-package-strum_macros> Running phase: installPhase
  631. 111.03 s cargo-package-subprocess> Running phase: unpackPhase
  632. 111.03 s cargo-package-subprocess> setting SOURCE_DATE_EPOCH to timestamp 1153704088 of file "./crate/tests/weird-args.rs"
  633. 111.03 s cargo-package-subprocess> Running phase: patchPhase
  634. 111.03 s cargo-package-subprocess> Running phase: updateAutotoolsGnuConfigScriptsPhase
  635. 111.03 s cargo-package-subprocess> Running phase: installPhase
  636. 111.03 s cargo-package-symlink> Running phase: unpackPhase
  637. 111.03 s cargo-package-symlink> setting SOURCE_DATE_EPOCH to timestamp 1485452823 of file "./crate/src/windows/mod.rs"
  638. 111.03 s cargo-package-symlink> Running phase: patchPhase
  639. 111.03 s cargo-package-symlink> Running phase: updateAutotoolsGnuConfigScriptsPhase
  640. 111.03 s cargo-package-symlink> Running phase: installPhase
  641. 111.03 s cargo-package-termios> Running phase: unpackPhase
  642. 111.03 s cargo-package-termios> setting SOURCE_DATE_EPOCH to timestamp 1602554563 of file "./crate/Cargo.toml.orig"
  643. 111.03 s cargo-package-termios> Running phase: patchPhase
  644. 111.03 s cargo-package-termios> Running phase: updateAutotoolsGnuConfigScriptsPhase
  645. 111.03 s cargo-package-termios> Running phase: installPhase
  646. 111.03 s cargo-package-test-log> Running phase: unpackPhase
  647. 111.03 s cargo-package-test-log> setting SOURCE_DATE_EPOCH to timestamp 1153704088 of file "./crate/src/lib.rs"
  648. 111.03 s cargo-package-test-log> Running phase: patchPhase
  649. 111.03 s cargo-package-test-log> Running phase: updateAutotoolsGnuConfigScriptsPhase
  650. 111.03 s cargo-package-test-log> Running phase: installPhase
  651. 111.03 s cargo-package-test-log-macros> Running phase: unpackPhase
  652. 111.03 s cargo-package-test-log-macros> setting SOURCE_DATE_EPOCH to timestamp 1153704088 of file "./crate/src/lib.rs"
  653. 111.03 s cargo-package-test-log-macros> Running phase: patchPhase
  654. 111.03 s cargo-package-test-log-macros> Running phase: updateAutotoolsGnuConfigScriptsPhase
  655. 111.03 s cargo-package-test-log-macros> Running phase: installPhase
  656. 111.03 s cargo-package-thiserror> Running phase: unpackPhase
  657. 111.03 s cargo-package-thiserror> setting SOURCE_DATE_EPOCH to timestamp 1153704088 of file "./crate/tests/ui/union.stderr"
  658. 111.03 s cargo-package-thiserror> Running phase: patchPhase
  659. 111.03 s cargo-package-thiserror> Running phase: updateAutotoolsGnuConfigScriptsPhase
  660. 111.03 s cargo-package-thiserror> Running phase: installPhase
  661. 111.03 s cargo-package-thiserror-impl> Running phase: unpackPhase
  662. 111.03 s cargo-package-thiserror-impl> setting SOURCE_DATE_EPOCH to timestamp 1153704088 of file "./crate/src/valid.rs"
  663. 111.03 s cargo-package-thiserror-impl> Running phase: patchPhase
  664. 111.03 s cargo-package-thiserror-impl> Running phase: updateAutotoolsGnuConfigScriptsPhase
  665. 111.03 s cargo-package-thiserror-impl> Running phase: installPhase
  666. 111.03 s cargo-package-thiserror-impl> Running phase: unpackPhase
  667. 111.03 s cargo-package-thiserror-impl> setting SOURCE_DATE_EPOCH to timestamp 1153704088 of file "./crate/src/valid.rs"
  668. 111.03 s cargo-package-thiserror-impl> Running phase: patchPhase
  669. 111.03 s cargo-package-thiserror-impl> Running phase: updateAutotoolsGnuConfigScriptsPhase
  670. 111.03 s cargo-package-thiserror-impl> Running phase: installPhase
  671. 111.03 s cargo-package-thread_local> Running phase: unpackPhase
  672. 111.03 s cargo-package-thread_local> setting SOURCE_DATE_EPOCH to timestamp 1153704088 of file "./crate/src/unreachable.rs"
  673. 111.03 s cargo-package-thread_local> Running phase: patchPhase
  674. 111.03 s cargo-package-thread_local> Running phase: updateAutotoolsGnuConfigScriptsPhase
  675. 111.03 s cargo-package-thread_local> Running phase: installPhase
  676. 111.03 s cargo-package-time> Running phase: unpackPhase
  677. 111.03 s cargo-package-time> setting SOURCE_DATE_EPOCH to timestamp 1153704088 of file "./crate/tests/integration/weekday.rs"
  678. 111.03 s cargo-package-time> Running phase: patchPhase
  679. 111.03 s cargo-package-time> Running phase: updateAutotoolsGnuConfigScriptsPhase
  680. 111.03 s cargo-package-time> Running phase: installPhase
  681. 111.03 s cargo-package-time-macros> Running phase: unpackPhase
  682. 111.03 s cargo-package-time-macros> setting SOURCE_DATE_EPOCH to timestamp 1153704088 of file "./crate/src/utc_datetime.rs"
  683. 111.03 s cargo-package-time-macros> Running phase: patchPhase
  684. 111.03 s cargo-package-time-macros> Running phase: updateAutotoolsGnuConfigScriptsPhase
  685. 111.03 s cargo-package-time-macros> Running phase: installPhase
  686. 111.07 s cargo-package-strsim (post)> Uploading to the NixCI cache: /nix/store/bz7sqnrb6li8frilz39laqsjqfxaz87k-cargo-package-strsim-0.10.0
  687. 111.15 s cargo-package-strsim (post)> warning: 'warn-short-path-literals' is deprecated, use 'lint-short-path-literals = ignore' instead
  688. 111.16 s cargo-package-strsim (post)> copying 1 paths...
  689. 111.16 s cargo-package-strsim (post)> copying path '/nix/store/bz7sqnrb6li8frilz39laqsjqfxaz87k-cargo-package-strsim-0.10.0' to 'https://cache.nix-ci.com'...
  690. 111.32 s cargo-package-strsim (post)> warning: 'warn-short-path-literals' is deprecated, use 'lint-short-path-literals = ignore' instead
  691. 111.39 s cargo-package-strsim (post)> copying 0 paths...
  692. 111.45 s cargo-package-strsim (post)> Uploading to the NixCI cache: /nix/store/qvp5rlzinkgqj4pbk5zy29s35b5z2wc1-cargo-package-strsim-0.11.1
  693. 111.52 s [15/94/145 built, 5 copicargo-package-strsim (post)> warning: 'warn-short-path-literals' is deprecated, use 'lint-short-path-literals = ignore' instead
  694. 111.54 s cargo-package-strsim (post)> copying 1 paths...
  695. 111.54 s cargo-package-strsim (post)> copying path '/nix/store/qvp5rlzinkgqj4pbk5zy29s35b5z2wc1-cargo-package-strsim-0.11.1' to 'https://cache.nix-ci.com'...
  696. 111.69 s cargo-package-strsim (post)> warning: 'warn-short-path-literals' is deprecated, use 'lint-short-path-literals = ignore' instead
  697. 111.76 s cargo-package-strsim (post)> copying 0 paths...
  698. 111.82 s [14/95/146 built, 5 copicargo-package-strum_macros (post)> Uploading to the NixCI cache: /nix/store/qvylbbn2h5khxasxs503klxap73w0c6g-cargo-package-strum_macros-0.26.4
  699. 111.90 s cargo-package-strum_macros (post)> warning: 'warn-short-path-literals' is deprecated, use 'lint-short-path-literals = ignore' instead
  700. 111.92 s cargo-package-strum_macros (post)> copying 1 paths...
  701. 111.92 s cargo-package-strum_macros (post)> copying path '/nix/store/qvylbbn2h5khxasxs503klxap73w0c6g-cargo-package-strum_macros-0.26.4' to 'https://cache.nix-ci.com'...
  702. 112.57 s cargo-package-strum_macros (post)> warning: 'warn-short-path-literals' is deprecated, use 'lint-short-path-literals = ignore' instead
  703. 112.64 s cargo-package-strum_macros (post)> copying 0 paths...
  704. 112.70 s cargo-package-subprocess (post)> Uploading to the NixCI cache: /nix/store/46gr9fsbgy0dch2pksg0mb1davmszpg9-cargo-package-subprocess-0.2.15
  705. 112.77 s [13/96/147 built, 5 copicargo-package-subprocess (post)> warning: 'warn-short-path-literals' is deprecated, use 'lint-short-path-literals = ignore' instead
  706. 112.79 s cargo-package-subprocess (post)> copying 1 paths...
  707. 112.79 s cargo-package-subprocess (post)> copying path '/nix/store/46gr9fsbgy0dch2pksg0mb1davmszpg9-cargo-package-subprocess-0.2.15' to 'https://cache.nix-ci.com'...
  708. 112.97 s cargo-package-subprocess (post)> warning: 'warn-short-path-literals' is deprecated, use 'lint-short-path-literals = ignore' instead
  709. 113.04 s cargo-package-subprocess (post)> copying 0 paths...
  710. 113.09 s [12/97/148 built, 5 copicargo-package-symlink (post)> Uploading to the NixCI cache: /nix/store/0k9llzhgh4w2nnwcskix7lnwqxcxsj3m-cargo-package-symlink-0.1.0
  711. 113.16 s cargo-package-symlink (post)> warning: 'warn-short-path-literals' is deprecated, use 'lint-short-path-literals = ignore' instead
  712. 113.17 s cargo-package-symlink (post)> copying 1 paths...
  713. 113.17 s cargo-package-symlink (post)> copying path '/nix/store/0k9llzhgh4w2nnwcskix7lnwqxcxsj3m-cargo-package-symlink-0.1.0' to 'https://cache.nix-ci.com'...
  714. 113.31 s cargo-package-symlink (post)> warning: 'warn-short-path-literals' is deprecated, use 'lint-short-path-literals = ignore' instead
  715. 113.36 s cargo-package-symlink (post)> copying 0 paths...
  716. 113.41 s cargo-package-termios (post)> Uploading to the NixCI cache: /nix/store/m01hav7zwn9khinakxja27mlcmlvm752-cargo-package-termios-0.3.3
  717. 113.49 s [11/98/149 built, 5 copicargo-package-termios (post)> warning: 'warn-short-path-literals' is deprecated, use 'lint-short-path-literals = ignore' instead
  718. 113.50 s cargo-package-termios (post)> copying 1 paths...
  719. 113.50 s cargo-package-termios (post)> copying path '/nix/store/m01hav7zwn9khinakxja27mlcmlvm752-cargo-package-termios-0.3.3' to 'https://cache.nix-ci.com'...
  720. 113.64 s cargo-package-termios (post)> warning: 'warn-short-path-literals' is deprecated, use 'lint-short-path-literals = ignore' instead
  721. 113.70 s cargo-package-termios (post)> copying 0 paths...
  722. 113.76 s cargo-package-test-log (post)> Uploading to the NixCI cache: /nix/store/1223j1v8j81vd69b88dgv0ymb3plwcfk-cargo-package-test-log-0.2.20
  723. 114.55 s [10/99/150 built, 5 copicargo-package-test-log (post)> warning: 'warn-short-path-literals' is deprecated, use 'lint-short-path-literals = ignore' instead
  724. 114.55 s cargo-package-test-log (post)> copying 1 paths...
  725. 114.55 s cargo-package-test-log (post)> copying path '/nix/store/1223j1v8j81vd69b88dgv0ymb3plwcfk-cargo-package-test-log-0.2.20' to 'https://cache.nix-ci.com'...
  726. 114.55 s cargo-package-test-log (post)> warning: 'warn-short-path-literals' is deprecated, use 'lint-short-path-literals = ignore' instead
  727. 114.55 s cargo-package-test-log (post)> copying 0 paths...
  728. 114.55 s [9/100/151 built, 5 copicargo-package-test-log-macros (post)> Uploading to the NixCI cache: /nix/store/7ghr3jf7gk2ydv5pz3p31i2d4mlgwrxk-cargo-package-test-log-macros-0.2.20
  729. 114.55 s cargo-package-test-log-macros (post)> warning: 'warn-short-path-literals' is deprecated, use 'lint-short-path-literals = ignore' instead
  730. 114.55 s cargo-package-test-log-macros (post)> copying 1 paths...
  731. 114.55 s cargo-package-test-log-macros (post)> copying path '/nix/store/7ghr3jf7gk2ydv5pz3p31i2d4mlgwrxk-cargo-package-test-log-macros-0.2.20' to 'https://cache.nix-ci.com'...
  732. 114.55 s cargo-package-test-log-macros (post)> warning: 'warn-short-path-literals' is deprecated, use 'lint-short-path-literals = ignore' instead
  733. 114.55 s cargo-package-test-log-macros (post)> copying 0 paths...
  734. 114.55 s cargo-package-thiserror (post)> Uploading to the NixCI cache: /nix/store/96yfhdfknjl8p7m7s5j7l7g1ic51kvrb-cargo-package-thiserror-1.0.69
  735. 114.55 s [8/101/152 built, 5 copicargo-package-thiserror (post)> warning: 'warn-short-path-literals' is deprecated, use 'lint-short-path-literals = ignore' instead
  736. 114.55 s cargo-package-thiserror (post)> copying 1 paths...
  737. 114.55 s cargo-package-thiserror (post)> copying path '/nix/store/96yfhdfknjl8p7m7s5j7l7g1ic51kvrb-cargo-package-thiserror-1.0.69' to 'https://cache.nix-ci.com'...
  738. 114.66 s cargo-package-thiserror (post)> warning: 'warn-short-path-literals' is deprecated, use 'lint-short-path-literals = ignore' instead
  739. 114.72 s cargo-package-thiserror (post)> copying 0 paths...
  740. 114.77 s cargo-package-thiserror-impl (post)> Uploading to the NixCI cache: /nix/store/4kd9cxq1s5czd9illyd8sb5c24bay5jb-cargo-package-thiserror-impl-1.0.69
  741. 114.84 s [7/102/153 built, 5 copicargo-package-thiserror-impl (post)> warning: 'warn-short-path-literals' is deprecated, use 'lint-short-path-literals = ignore' instead
  742. 114.85 s cargo-package-thiserror-impl (post)> copying 1 paths...
  743. 114.85 s cargo-package-thiserror-impl (post)> copying path '/nix/store/4kd9cxq1s5czd9illyd8sb5c24bay5jb-cargo-package-thiserror-impl-1.0.69' to 'https://cache.nix-ci.com'...
  744. 115.01 s cargo-package-thiserror-impl (post)> warning: 'warn-short-path-literals' is deprecated, use 'lint-short-path-literals = ignore' instead
  745. 115.08 s cargo-package-thiserror-impl (post)> copying 0 paths...
  746. 115.13 s cargo-package-thiserror-impl (post)> Uploading to the NixCI cache: /nix/store/5jiwv8ha6g9d4db131xklkqss9ihkz4w-cargo-package-thiserror-impl-2.0.18
  747. 115.21 s [6/103/154 built, 5 copicargo-package-thiserror-impl (post)> warning: 'warn-short-path-literals' is deprecated, use 'lint-short-path-literals = ignore' instead
  748. 115.22 s cargo-package-thiserror-impl (post)> copying 1 paths...
  749. 115.22 s cargo-package-thiserror-impl (post)> copying path '/nix/store/5jiwv8ha6g9d4db131xklkqss9ihkz4w-cargo-package-thiserror-impl-2.0.18' to 'https://cache.nix-ci.com'...
  750. 115.36 s cargo-package-thiserror-impl (post)> warning: 'warn-short-path-literals' is deprecated, use 'lint-short-path-literals = ignore' instead
  751. 115.42 s cargo-package-thiserror-impl (post)> copying 0 paths...
  752. 115.47 s cargo-package-thread_local (post)> Uploading to the NixCI cache: /nix/store/pgc6nmr2g51k05b6mlxdil994n3s20rd-cargo-package-thread_local-1.1.9
  753. 115.55 s [5/104/155 built, 5 copicargo-package-thread_local (post)> warning: 'warn-short-path-literals' is deprecated, use 'lint-short-path-literals = ignore' instead
  754. 115.56 s cargo-package-thread_local (post)> copying 1 paths...
  755. 115.56 s cargo-package-thread_local (post)> copying path '/nix/store/pgc6nmr2g51k05b6mlxdil994n3s20rd-cargo-package-thread_local-1.1.9' to 'https://cache.nix-ci.com'...
  756. 115.71 s cargo-package-thread_local (post)> warning: 'warn-short-path-literals' is deprecated, use 'lint-short-path-literals = ignore' instead
  757. 115.78 s cargo-package-thread_local (post)> copying 0 paths...
  758. 115.86 s [4/105/156 built, 5 copicargo-package-time (post)> Uploading to the NixCI cache: /nix/store/34ffv2mswldjk1mrbw7w0bp70n799mcn-cargo-package-time-0.3.47
  759. 115.93 s cargo-package-time (post)> warning: 'warn-short-path-literals' is deprecated, use 'lint-short-path-literals = ignore' instead
  760. 115.94 s cargo-package-time (post)> copying 1 paths...
  761. 115.94 s cargo-package-time (post)> copying path '/nix/store/34ffv2mswldjk1mrbw7w0bp70n799mcn-cargo-package-time-0.3.47' to 'https://cache.nix-ci.com'...
  762. 116.33 s cargo-package-time (post)> warning: 'warn-short-path-literals' is deprecated, use 'lint-short-path-literals = ignore' instead
  763. 116.39 s cargo-package-time (post)> copying 0 paths...
  764. 116.46 s [3/106/157 built, 5 copicargo-package-time-macros (post)> Uploading to the NixCI cache: /nix/store/zvmlzckmdhyrk9d1ydl04ckm45idljvq-cargo-package-time-macros-0.2.27
  765. 116.52 s cargo-package-time-macros (post)> warning: 'warn-short-path-literals' is deprecated, use 'lint-short-path-literals = ignore' instead
  766. 116.53 s cargo-package-time-macros (post)> copying 1 paths...
  767. 116.53 s cargo-package-time-macros (post)> copying path '/nix/store/zvmlzckmdhyrk9d1ydl04ckm45idljvq-cargo-package-time-macros-0.2.27' to 'https://cache.nix-ci.com'...
  768. 116.68 s cargo-package-time-macros (post)> warning: 'warn-short-path-literals' is deprecated, use 'lint-short-path-literals = ignore' instead
  769. 116.75 s cargo-package-time-macros (post)> copying 0 paths...
  770. 116.77 s cargo-package-titlecase> Running phase: unpackPhase
  771. 116.77 s [2/107/129 built, 5 copicargo-package-titlecase> Running phase: patchPhase
  772. 116.77 s cargo-package-titlecase> Running phase: updateAutotoolsGnuConfigScriptsPhase
  773. 116.77 s cargo-package-titlecase> Running phase: installPhase
  774. 116.77 s cargo-package-toml> Running phase: unpackPhase
  775. 116.77 s cargo-package-toml> setting SOURCE_DATE_EPOCH to timestamp 1153704088 of file "./crate/src/value.rs"
  776. 116.77 s cargo-package-toml> Running phase: patchPhase
  777. 116.77 s cargo-package-toml> Running phase: updateAutotoolsGnuConfigScriptsPhase
  778. 116.77 s cargo-package-toml> Running phase: installPhase
  779. 116.80 s cargo-package-titlecase (post)> Uploading to the NixCI cache: /nix/store/l634irvdrb7y7fr6h21xi65qshm7pkf3-cargo-package-titlecase-2.2.1
  780. 116.87 s cargo-package-titlecase (post)> warning: 'warn-short-path-literals' is deprecated, use 'lint-short-path-literals = ignore' instead
  781. 116.88 s cargo-package-titlecase (post)> copying 1 paths...
  782. 116.88 s cargo-package-titlecase (post)> copying path '/nix/store/l634irvdrb7y7fr6h21xi65qshm7pkf3-cargo-package-titlecase-2.2.1' to 'https://cache.nix-ci.com'...
  783. 117.02 s cargo-package-titlecase (post)> warning: 'warn-short-path-literals' is deprecated, use 'lint-short-path-literals = ignore' instead
  784. 117.08 s cargo-package-titlecase (post)> copying 0 paths...
  785. 117.14 s cargo-package-toml (post)> Uploading to the NixCI cache: /nix/store/qsc4vj1dil9qb2mr7wdqm6clhdwbk0a5-cargo-package-toml-0.9.12+spec-1.1.0
  786. 117.21 s [1/108/128 built, 5 copicargo-package-toml (post)> warning: 'warn-short-path-literals' is deprecated, use 'lint-short-path-literals = ignore' instead
  787. 117.22 s cargo-package-toml (post)> copying 1 paths...
  788. 117.22 s cargo-package-toml (post)> copying path '/nix/store/qsc4vj1dil9qb2mr7wdqm6clhdwbk0a5-cargo-package-toml-0.9.12+spec-1.1.0' to 'https://cache.nix-ci.com'...
  789. 117.40 s cargo-package-toml (post)> warning: 'warn-short-path-literals' is deprecated, use 'lint-short-path-literals = ignore' instead
  790. 117.45 s cargo-package-toml (post)> copying 0 paths...
  791. 126.52 s [109/129 built, 5 copied [109/127 built, 5 copied
  792. 126.61 s [109/112 built, 5 copiedgammaloop-workspace-deps-deps> cargoArtifacts not set, will not reuse any cargo artifacts
  793. 126.63 s [1/109/111 built, 5 copigammaloop-workspace-deps-deps> Running phase: unpackPhase
  794. 126.64 s gammaloop-workspace-deps-deps> unpacking source archive /nix/store/6c0c6si8srn6mgd9sni442ha19wv3vz2-source
  795. 126.65 s gammaloop-workspace-deps-deps> source root is source
  796. 126.66 s gammaloop-workspace-deps-deps> Running phase: patchPhase
  797. 126.66 s gammaloop-workspace-deps-deps> Executing configureCargoCommonVars
  798. 126.66 s gammaloop-workspace-deps-deps> Running phase: updateAutotoolsGnuConfigScriptsPhase
  799. 126.67 s gammaloop-workspace-deps-deps> Running phase: configurePhase
  800. 126.68 s gammaloop-workspace-deps-deps> will append /build/source/.cargo-home/config.toml with contents of /nix/store/56mr0d5hrl1xh08y02lfig5azk7f8563-vendor-cargo-deps/config.toml
  801. 126.68 s gammaloop-workspace-deps-deps> default configurePhase, nothing to do
  802. 126.68 s gammaloop-workspace-deps-deps> Running phase: buildPhase
  803. 126.68 s gammaloop-workspace-deps-deps> +++ command cargo --version
  804. 126.69 s gammaloop-workspace-deps-deps> cargo 1.95.0 (f2d3ce0bd 2026-03-21)
  805. 126.69 s gammaloop-workspace-deps-deps> +++ command cargo check --profile dev-optim --locked --workspace --all-targets
  806. 127.07 s gammaloop-workspace-deps-deps> Compiling proc-macro2 v1.0.106
  807. 127.07 s gammaloop-workspace-deps-deps> Compiling quote v1.0.45
  808. 127.07 s gammaloop-workspace-deps-deps> Compiling unicode-ident v1.0.24
  809. 127.07 s gammaloop-workspace-deps-deps> Compiling serde_core v1.0.228
  810. 127.07 s gammaloop-workspace-deps-deps> Compiling serde v1.0.228
  811. 127.07 s gammaloop-workspace-deps-deps> Compiling autocfg v1.5.0
  812. 127.07 s gammaloop-workspace-deps-deps> Checking cfg-if v1.0.4
  813. 127.07 s gammaloop-workspace-deps-deps> Compiling libc v0.2.186
  814. 127.08 s gammaloop-workspace-deps-deps> Compiling version_check v0.9.5
  815. 127.08 s gammaloop-workspace-deps-deps> Checking memchr v2.8.0
  816. 127.09 s gammaloop-workspace-deps-deps> Compiling zerocopy v0.8.48
  817. 127.09 s gammaloop-workspace-deps-deps> Compiling libm v0.2.16
  818. 127.11 s gammaloop-workspace-deps-deps> Checking once_cell v1.21.4
  819. 127.11 s gammaloop-workspace-deps-deps> Compiling heck v0.5.0
  820. 127.14 s gammaloop-workspace-deps-deps> Compiling getrandom v0.3.4
  821. 127.15 s gammaloop-workspace-deps-deps> Compiling crossbeam-utils v0.8.21
  822. 127.22 s gammaloop-workspace-deps-deps> Checking either v1.15.0
  823. 127.27 s gammaloop-workspace-deps-deps> Checking itoa v1.0.18
  824. 127.34 s gammaloop-workspace-deps-deps> Compiling zmij v1.0.21
  825. 127.36 s gammaloop-workspace-deps-deps> Compiling crunchy v0.2.4
  826. 127.38 s gammaloop-workspace-deps-deps> Compiling tiny-keccak v2.0.2
  827. 127.47 s gammaloop-workspace-deps-deps> Checking regex-syntax v0.8.10
  828. 127.49 s gammaloop-workspace-deps-deps> Checking aho-corasick v1.1.4
  829. 127.57 s gammaloop-workspace-deps-deps> Checking log v0.4.29
  830. 127.62 s gammaloop-workspace-deps-deps> Compiling rayon-core v1.13.0
  831. 127.72 s gammaloop-workspace-deps-deps> Compiling paste v1.0.15
  832. 127.76 s gammaloop-workspace-deps-deps> Checking equivalent v1.0.2
  833. 127.86 s gammaloop-workspace-deps-deps> Compiling target-lexicon v0.13.5
  834. 127.95 s gammaloop-workspace-deps-deps> Compiling anyhow v1.0.102
  835. 128.06 s gammaloop-workspace-deps-deps> Compiling ahash v0.8.12
  836. 128.09 s gammaloop-workspace-deps-deps> Compiling gmp-mpfr-sys v1.7.1
  837. 128.14 s gammaloop-workspace-deps-deps> Checking bytemuck v1.25.0
  838. 128.19 s gammaloop-workspace-deps-deps> Compiling syn v2.0.117
  839. 128.26 s gammaloop-workspace-deps-deps> Compiling num-traits v0.2.19
  840. 128.37 s gammaloop-workspace-deps-deps> Checking crossbeam-epoch v0.9.18
  841. 128.48 s gammaloop-workspace-deps-deps> Compiling getrandom v0.2.17
  842. 128.53 s gammaloop-workspace-deps-deps> Checking lazy_static v1.5.0
  843. 128.56 s gammaloop-workspace-deps-deps> Checking crossbeam-deque v0.8.6
  844. 128.57 s gammaloop-workspace-deps-deps> Compiling serde_json v1.0.149
  845. 128.64 s gammaloop-workspace-deps-deps> Compiling const-random-macro v0.1.16
  846. 128.64 s gammaloop-workspace-deps-deps> Checking pin-project-lite v0.2.17
  847. 128.65 s gammaloop-workspace-deps-deps> Compiling siphasher v1.0.2
  848. 128.68 s gammaloop-workspace-deps-deps> Checking hashbrown v0.17.0
  849. 128.73 s gammaloop-workspace-deps-deps> Checking regex-automata v0.4.14
  850. 128.80 s gammaloop-workspace-deps-deps> Checking safe_arch v0.7.4
  851. 128.82 s gammaloop-workspace-deps-deps> Checking itertools v0.14.0
  852. 128.93 s gammaloop-workspace-deps-deps> Checking rayon v1.12.0
  853. 128.93 s gammaloop-workspace-deps-deps> Checking tracing-core v0.1.36
  854. 129.03 s gammaloop-workspace-deps-deps> Checking wide v0.7.33
  855. 129.06 s gammaloop-workspace-deps-deps> Compiling thiserror v2.0.18
  856. 129.09 s gammaloop-workspace-deps-deps> Checking indexmap v2.14.0
  857. 129.18 s gammaloop-workspace-deps-deps> Checking nu-ansi-term v0.50.3
  858. 129.18 s gammaloop-workspace-deps-deps> Compiling pyo3-build-config v0.28.3
  859. 129.21 s gammaloop-workspace-deps-deps> Checking const-random v0.1.18
  860. 129.25 s gammaloop-workspace-deps-deps> Compiling rand_core v0.6.4
  861. 129.31 s gammaloop-workspace-deps-deps> Checking powerfmt v0.2.0
  862. 129.34 s gammaloop-workspace-deps-deps> Checking allocator-api2 v0.2.21
  863. 129.43 s gammaloop-workspace-deps-deps> Checking foldhash v0.2.0
  864. 129.51 s gammaloop-workspace-deps-deps> Checking deranged v0.5.8
  865. 129.51 s gammaloop-workspace-deps-deps> Checking tracing-log v0.2.0
  866. 129.53 s gammaloop-workspace-deps-deps> Compiling phf_shared v0.11.3
  867. 129.53 s gammaloop-workspace-deps-deps> Checking hashbrown v0.16.1
  868. 129.54 s gammaloop-workspace-deps-deps> Checking sharded-slab v0.1.7
  869. 129.56 s gammaloop-workspace-deps-deps> Checking thread_local v1.1.9
  870. 129.59 s gammaloop-workspace-deps-deps> Checking num-conv v0.2.1
  871. 129.60 s gammaloop-workspace-deps-deps> Checking time-core v0.1.8
  872. 129.66 s gammaloop-workspace-deps-deps> Compiling eyre v0.6.12
  873. 129.67 s gammaloop-workspace-deps-deps> Checking num_threads v0.1.7
  874. 129.68 s gammaloop-workspace-deps-deps> Checking indenter v0.3.4
  875. 129.68 s gammaloop-workspace-deps-deps> Checking num-integer v0.1.46
  876. 129.70 s gammaloop-workspace-deps-deps> Checking static_assertions v1.1.0
  877. 129.72 s gammaloop-workspace-deps-deps> Compiling virtue v0.0.18
  878. 129.75 s gammaloop-workspace-deps-deps> Checking safe_arch v1.0.0
  879. 129.83 s gammaloop-workspace-deps-deps> Compiling matrixmultiply v0.3.10
  880. 129.87 s gammaloop-workspace-deps-deps> Checking az v1.3.0
  881. 129.88 s gammaloop-workspace-deps-deps> Checking bitflags v1.3.2
  882. 129.91 s gammaloop-workspace-deps-deps> Checking dyn-clone v1.0.20
  883. 129.92 s gammaloop-workspace-deps-deps> Checking approx v0.5.1
  884. 129.95 s gammaloop-workspace-deps-deps> Checking arrayvec v0.7.6
  885. 129.97 s gammaloop-workspace-deps-deps> Checking unty v0.0.4
  886. 130.00 s gammaloop-workspace-deps-deps> Compiling unicode-width v0.2.2
  887. 130.07 s gammaloop-workspace-deps-deps> Checking colored v3.1.1
  888. 130.07 s gammaloop-workspace-deps-deps> Checking wide v1.3.0
  889. 130.09 s gammaloop-workspace-deps-deps> Checking rawpointer v0.2.1
  890. 130.12 s gammaloop-workspace-deps-deps> Checking alloc-no-stdlib v2.0.4
  891. 130.17 s gammaloop-workspace-deps-deps> Checking alloc-stdlib v0.2.2
  892. 130.20 s gammaloop-workspace-deps-deps> Compiling getopts v0.2.24
  893. 130.21 s gammaloop-workspace-deps-deps> Checking rand_core v0.9.5
  894. 130.25 s gammaloop-workspace-deps-deps> Checking foldhash v0.1.5
  895. 130.25 s gammaloop-workspace-deps-deps> Checking utf8parse v0.2.2
  896. 130.29 s gammaloop-workspace-deps-deps> Compiling unic-char-range v0.9.0
  897. 130.29 s gammaloop-workspace-deps-deps> Checking time v0.3.47
  898. 130.31 s gammaloop-workspace-deps-deps> Checking fixedbitset v0.5.7
  899. 130.32 s gammaloop-workspace-deps-deps> Checking anstyle-parse v1.0.0
  900. 130.33 s gammaloop-workspace-deps-deps> Compiling unic-common v0.9.0
  901. 130.33 s gammaloop-workspace-deps-deps> Checking hashbrown v0.15.5
  902. 130.37 s gammaloop-workspace-deps-deps> Checking colorchoice v1.0.5
  903. 130.38 s gammaloop-workspace-deps-deps> Checking anstyle v1.0.14
  904. 130.40 s gammaloop-workspace-deps-deps> Checking is_terminal_polyfill v1.70.2
  905. 130.44 s gammaloop-workspace-deps-deps> Checking anstyle-query v1.1.5
  906. 130.44 s gammaloop-workspace-deps-deps> Compiling unic-ucd-version v0.9.0
  907. 130.46 s gammaloop-workspace-deps-deps> Compiling unic-char-property v0.9.0
  908. 130.48 s gammaloop-workspace-deps-deps> Checking bitflags v2.11.1
  909. 130.49 s gammaloop-workspace-deps-deps> Compiling rustpython-parser-vendored v0.4.0
  910. 130.52 s gammaloop-workspace-deps-deps> Checking spec_math v0.1.6
  911. 130.54 s gammaloop-workspace-deps-deps> Checking brotli-decompressor v5.0.0
  912. 130.55 s gammaloop-workspace-deps-deps> Compiling phf v0.11.3
  913. 130.59 s gammaloop-workspace-deps-deps> Compiling rug v1.30.0
  914. 130.68 s gammaloop-workspace-deps-deps> Checking rustc-hash v2.1.2
  915. 130.73 s gammaloop-workspace-deps-deps> Checking append-only-vec v0.1.8
  916. 130.74 s gammaloop-workspace-deps-deps> Checking petgraph v0.8.3
  917. 130.76 s gammaloop-workspace-deps-deps> Checking matchers v0.2.0
  918. 130.79 s gammaloop-workspace-deps-deps> Compiling unic-ucd-ident v0.9.0
  919. 130.82 s gammaloop-workspace-deps-deps> Compiling unic-emoji-char v0.9.0
  920. 130.83 s gammaloop-workspace-deps-deps> Compiling itertools v0.11.0
  921. 130.84 s gammaloop-workspace-deps-deps> Checking libloading v0.9.0
  922. 130.87 s gammaloop-workspace-deps-deps> Checking tinyjson v2.5.1
  923. 130.93 s gammaloop-workspace-deps-deps> Checking byteorder v1.5.0
  924. 130.93 s gammaloop-workspace-deps-deps> Compiling rustc-hash v1.1.0
  925. 130.94 s gammaloop-workspace-deps-deps> Compiling lalrpop-util v0.20.2
  926. 130.99 s gammaloop-workspace-deps-deps> Checking bytes v1.11.1
  927. 130.99 s gammaloop-workspace-deps-deps> Checking self_cell v1.2.2
  928. 131.01 s gammaloop-workspace-deps-deps> Compiling smartstring v1.0.1
  929. 131.03 s gammaloop-workspace-deps-deps> Checking anstream v1.0.0
  930. 131.06 s gammaloop-workspace-deps-deps> Checking region v3.0.2
  931. 131.07 s gammaloop-workspace-deps-deps> Checking wasmtime-jit-icache-coherence v34.0.2
  932. 131.10 s gammaloop-workspace-deps-deps> Checking brotli v8.0.2
  933. 131.10 s gammaloop-workspace-deps-deps> Compiling symbolica v1.5.1
  934. 131.18 s gammaloop-workspace-deps-deps> Checking regex v1.12.3
  935. 131.18 s gammaloop-workspace-deps-deps> Checking jiff v0.2.24
  936. 131.19 s gammaloop-workspace-deps-deps> Compiling syn v1.0.109
  937. 131.31 s gammaloop-workspace-deps-deps> Compiling ucd-trie v0.1.7
  938. 131.39 s gammaloop-workspace-deps-deps> Compiling uncased v0.9.10
  939. 131.40 s gammaloop-workspace-deps-deps> Compiling rustix v1.1.4
  940. 131.40 s gammaloop-workspace-deps-deps> Checking env_filter v1.0.1
  941. 131.45 s gammaloop-workspace-deps-deps> Compiling bincode_derive v2.0.1
  942. 131.47 s gammaloop-workspace-deps-deps> Compiling pest v2.8.6
  943. 131.56 s gammaloop-workspace-deps-deps> Compiling proc-macro2-diagnostics v0.10.1
  944. 131.61 s gammaloop-workspace-deps-deps> Compiling cgmath v0.18.0
  945. 131.61 s gammaloop-workspace-deps-deps> Checking linux-raw-sys v0.12.1
  946. 131.74 s gammaloop-workspace-deps-deps> Compiling radium v0.7.0
  947. 131.89 s gammaloop-workspace-deps-deps> Checking winnow v0.7.15
  948. 131.99 s gammaloop-workspace-deps-deps> Checking tap v1.0.1
  949. 132.04 s gammaloop-workspace-deps-deps> Checking wyz v0.5.1
  950. 132.17 s gammaloop-workspace-deps-deps> Checking funty v2.0.0
  951. 132.22 s gammaloop-workspace-deps-deps> Checking toml_write v0.1.2
  952. 132.32 s gammaloop-workspace-deps-deps> Compiling figment v0.10.19
  953. 132.58 s gammaloop-workspace-deps-deps> Compiling pest_meta v2.8.6
  954. 132.63 s gammaloop-workspace-deps-deps> Compiling proc-macro-error-attr2 v2.0.0
  955. 132.85 s gammaloop-workspace-deps-deps> Checking approx v0.4.0
  956. 132.90 s gammaloop-workspace-deps-deps> Checking colored v2.2.0
  957. 132.95 s gammaloop-workspace-deps-deps> Checking unicode-segmentation v1.13.2
  958. 133.14 s gammaloop-workspace-deps-deps> Checking iana-time-zone v0.1.65
  959. 133.15 s gammaloop-workspace-deps-deps> Checking fnv v1.0.7
  960. 133.17 s gammaloop-workspace-deps-deps> Compiling linnet v0.17.0 (/build/source/crates/linnet)
  961. 133.23 s gammaloop-workspace-deps-deps> Compiling pest_generator v2.8.6
  962. 133.46 s gammaloop-workspace-deps-deps> Compiling proc-macro-error2 v2.0.1
  963. 133.48 s gammaloop-workspace-deps-deps> Checking env_logger v0.11.10
  964. 133.49 s gammaloop-workspace-deps-deps> Checking vte v0.14.1
  965. 134.36 s gammaloop-workspace-deps-deps> Compiling pyo3-ffi v0.28.3
  966. 134.38 s gammaloop-workspace-deps-deps> Compiling pyo3-macros-backend v0.28.3
  967. 134.75 s gammaloop-workspace-deps-deps> Compiling pyo3 v0.28.3
  968. 134.78 s gammaloop-workspace-deps-deps> Compiling numpy v0.28.0
  969. 135.14 s gammaloop-workspace-deps-deps> Compiling smallvec v1.15.1
  970. 135.35 s gammaloop-workspace-deps-deps> Compiling proc-macro-error-attr v1.0.4
  971. 135.57 s gammaloop-workspace-deps-deps> Checking minimal-lexical v0.2.1
  972. 135.78 s gammaloop-workspace-deps-deps> Compiling spenso-macros v0.3.2 (/build/source/crates/spenso-macros)
  973. 135.84 s gammaloop-workspace-deps-deps> Checking bytecount v0.6.9
  974. 136.42 s gammaloop-workspace-deps-deps> Checking nom v7.1.3
  975. 136.59 s gammaloop-workspace-deps-deps> Compiling proc-macro-error v1.0.4
  976. 137.09 s gammaloop-workspace-deps-deps> Compiling phf_shared v0.13.1
  977. 137.46 s gammaloop-workspace-deps-deps> Checking ansitok v0.3.0
  978. 137.69 s gammaloop-workspace-deps-deps> Checking winnow v1.0.2
  979. 137.86 s gammaloop-workspace-deps-deps> Compiling heck v0.4.1
  980. 138.19 s gammaloop-workspace-deps-deps> Compiling fastrand v2.4.1
  981. 138.39 s gammaloop-workspace-deps-deps> Compiling phf_generator v0.13.1
  982. 138.39 s gammaloop-workspace-deps-deps> Checking toml_parser v1.1.2+spec-1.1.0
  983. 138.39 s gammaloop-workspace-deps-deps> Checking serde_spanned v1.1.1
  984. 138.47 s gammaloop-workspace-deps-deps> Compiling convert_case v0.4.0
  985. 138.71 s gammaloop-workspace-deps-deps> Checking ref-ops v0.2.5
  986. 138.73 s gammaloop-workspace-deps-deps> Compiling ident_case v1.0.1
  987. 138.77 s gammaloop-workspace-deps-deps> Checking toml_writer v1.1.1+spec-1.1.0
  988. 138.78 s gammaloop-workspace-deps-deps> Checking joinery v2.1.0
  989. 138.91 s gammaloop-workspace-deps-deps> Checking titlecase v2.2.1
  990. 138.92 s gammaloop-workspace-deps-deps> Checking ansi-str v0.9.0
  991. 138.97 s gammaloop-workspace-deps-deps> Checking features v0.10.0
  992. 138.99 s gammaloop-workspace-deps-deps> Checking subprocess v0.2.15
  993. 138.99 s gammaloop-workspace-deps-deps> Checking rust_lisp v0.18.0
  994. 139.00 s gammaloop-workspace-deps-deps> Checking constcat v0.5.1
  995. 139.05 s gammaloop-workspace-deps-deps> Compiling vakint v0.1.2 (/build/source/crates/vakint)
  996. 139.07 s gammaloop-workspace-deps-deps> Checking gat-lending-iterator v0.1.8
  997. 139.10 s gammaloop-workspace-deps-deps> Checking papergrid v0.17.0
  998. 139.14 s gammaloop-workspace-deps-deps> Checking testing_table v0.3.0
  999. 139.18 s gammaloop-workspace-deps-deps> Checking num-iter v0.1.45
  1000. 139.22 s gammaloop-workspace-deps-deps> Compiling generic-array v0.14.7
  1001. 139.25 s gammaloop-workspace-deps-deps> Checking version-compare v0.2.1
  1002. 139.26 s gammaloop-workspace-deps-deps> Compiling spenso v0.6.0 (/build/source/crates/spenso)
  1003. 139.28 s gammaloop-workspace-deps-deps> Checking rand_xoshiro v0.6.0
  1004. 139.31 s gammaloop-workspace-deps-deps> Checking console v0.16.3
  1005. 139.39 s gammaloop-workspace-deps-deps> Checking typenum v1.20.0
  1006. 139.43 s gammaloop-workspace-deps-deps> Checking terminal_size v0.4.4
  1007. 139.44 s gammaloop-workspace-deps-deps> Checking unicase v2.9.0
  1008. 139.46 s gammaloop-workspace-deps-deps> Compiling rustversion v1.0.22
  1009. 139.48 s gammaloop-workspace-deps-deps> Compiling parking_lot_core v0.9.12
  1010. 139.50 s gammaloop-workspace-deps-deps> Checking clap_lex v1.1.0
  1011. 139.51 s gammaloop-workspace-deps-deps> Checking strsim v0.11.1
  1012. 139.52 s gammaloop-workspace-deps-deps> Compiling getrandom v0.4.2
  1013. 139.60 s gammaloop-workspace-deps-deps> Checking same-file v1.0.6
  1014. 139.65 s gammaloop-workspace-deps-deps> Compiling idenso v0.3.0 (/build/source/crates/idenso)
  1015. 139.66 s gammaloop-workspace-deps-deps> Checking scopeguard v1.2.0
  1016. 139.67 s gammaloop-workspace-deps-deps> Checking clap_builder v4.6.0
  1017. 139.79 s gammaloop-workspace-deps-deps> Checking lock_api v0.4.14
  1018. 139.85 s gammaloop-workspace-deps-deps> Checking walkdir v2.5.0
  1019. 139.93 s gammaloop-workspace-deps-deps> Checking ciborium-io v0.2.2
  1020. 139.93 s gammaloop-workspace-deps-deps> Checking errno v0.3.14
  1021. 139.96 s gammaloop-workspace-deps-deps> Compiling convert_case v0.10.0
  1022. 139.98 s gammaloop-workspace-deps-deps> Compiling signal-hook v0.3.18
  1023. 140.00 s gammaloop-workspace-deps-deps> Compiling strsim v0.10.0
  1024. 140.01 s gammaloop-workspace-deps-deps> Checking signal-hook-registry v1.4.8
  1025. 140.02 s gammaloop-workspace-deps-deps> Checking tempfile v3.27.0
  1026. 140.11 s gammaloop-workspace-deps-deps> Compiling darling_core v0.23.0
  1027. 140.16 s gammaloop-workspace-deps-deps> Compiling darling_core v0.14.4
  1028. 140.17 s gammaloop-workspace-deps-deps> Compiling typeid v1.0.3
  1029. 140.18 s gammaloop-workspace-deps-deps> Checking ryu v1.0.23
  1030. 140.30 s gammaloop-workspace-deps-deps> Checking plotters-backend v0.3.7
  1031. 140.60 s gammaloop-workspace-deps-deps> Compiling spenso-hep-lib v0.1.7 (/build/source/crates/spenso-hep-lib)
  1032. 140.65 s gammaloop-workspace-deps-deps> Checking plotters-svg v0.3.7
  1033. 140.68 s gammaloop-workspace-deps-deps> Checking xpct v0.5.1
  1034. 140.73 s gammaloop-workspace-deps-deps> Checking toml_datetime v0.7.5+spec-1.1.0
  1035. 140.82 s gammaloop-workspace-deps-deps> Checking mio v1.2.0
  1036. 140.83 s gammaloop-workspace-deps-deps> Checking itertools v0.10.5
  1037. 140.84 s gammaloop-workspace-deps-deps> Checking cast v0.3.0
  1038. 140.95 s gammaloop-workspace-deps-deps> Compiling indoc v2.0.7
  1039. 140.96 s gammaloop-workspace-deps-deps> Compiling instability v0.3.12
  1040. 140.96 s gammaloop-workspace-deps-deps> Compiling portable-atomic v1.13.1
  1041. 141.06 s gammaloop-workspace-deps-deps> Compiling rustix v0.38.44
  1042. 141.13 s gammaloop-workspace-deps-deps> Checking signal-hook-mio v0.2.5
  1043. 141.18 s gammaloop-workspace-deps-deps> Checking toml v0.9.12+spec-1.1.0
  1044. 141.18 s gammaloop-workspace-deps-deps> Checking plotters v0.3.7
  1045. 141.37 s gammaloop-workspace-deps-deps> Checking castaway v0.2.4
  1046. 141.42 s gammaloop-workspace-deps-deps> Checking compact_str v0.9.0
  1047. 141.51 s gammaloop-workspace-deps-deps> Checking similar v2.7.0
  1048. 141.69 s gammaloop-workspace-deps-deps> Checking criterion-plot v0.5.0
  1049. 141.79 s gammaloop-workspace-deps-deps> Checking unicode-truncate v2.0.1
  1050. 141.80 s gammaloop-workspace-deps-deps> Checking vte v0.15.0
  1051. 141.83 s gammaloop-workspace-deps-deps> Checking lru v0.16.4
  1052. 141.84 s gammaloop-workspace-deps-deps> Checking toml_datetime v1.1.1+spec-1.1.0
  1053. 141.86 s gammaloop-workspace-deps-deps> Checking is-terminal v0.4.17
  1054. 141.87 s gammaloop-workspace-deps-deps> Checking anes v0.1.6
  1055. 141.87 s gammaloop-workspace-deps-deps> Checking oorandom v11.1.5
  1056. 141.89 s gammaloop-workspace-deps-deps> Checking linux-raw-sys v0.4.15
  1057. 141.90 s gammaloop-workspace-deps-deps> Checking vt100 v0.16.2
  1058. 141.91 s gammaloop-workspace-deps-deps> Compiling block-buffer v0.10.4
  1059. 141.94 s gammaloop-workspace-deps-deps> Compiling crypto-common v0.1.7
  1060. 141.98 s gammaloop-workspace-deps-deps> Checking toml_edit v0.25.11+spec-1.1.0
  1061. 141.99 s gammaloop-workspace-deps-deps> Compiling cfg_aliases v0.2.1
  1062. 142.01 s gammaloop-workspace-deps-deps> Compiling object v0.37.3
  1063. 142.03 s gammaloop-workspace-deps-deps> Compiling option-ext v0.2.0
  1064. 142.03 s gammaloop-workspace-deps-deps> Compiling owo-colors v4.3.0
  1065. 142.07 s gammaloop-workspace-deps-deps> Compiling litrs v1.0.0
  1066. 142.18 s gammaloop-workspace-deps-deps> Checking unit-prefix v0.5.2
  1067. 142.25 s gammaloop-workspace-deps-deps> Compiling thiserror v1.0.69
  1068. 142.40 s gammaloop-workspace-deps-deps> Checking indicatif v0.18.4
  1069. 142.46 s gammaloop-workspace-deps-deps> Compiling dirs-sys v0.5.0
  1070. 142.58 s gammaloop-workspace-deps-deps> Compiling nix v0.31.2
  1071. 142.64 s gammaloop-workspace-deps-deps> Compiling digest v0.10.7
  1072. 142.70 s gammaloop-workspace-deps-deps> Checking line-clipping v0.3.7
  1073. 142.72 s gammaloop-workspace-deps-deps> Compiling color-spantrace v0.3.0
  1074. 142.75 s gammaloop-workspace-deps-deps> Compiling cpufeatures v0.2.17
  1075. 142.79 s gammaloop-workspace-deps-deps> Checking adler2 v2.0.1
  1076. 142.79 s gammaloop-workspace-deps-deps> Compiling ref-cast v1.0.25
  1077. 142.81 s gammaloop-workspace-deps-deps> Compiling clarabel v0.11.1
  1078. 142.81 s gammaloop-workspace-deps-deps> Checking gimli v0.32.3
  1079. 142.84 s gammaloop-workspace-deps-deps> Compiling sha2 v0.10.9
  1080. 142.87 s gammaloop-workspace-deps-deps> Checking miniz_oxide v0.8.9
  1081. 143.06 s gammaloop-workspace-deps-deps> Compiling dirs v6.0.0
  1082. 143.14 s gammaloop-workspace-deps-deps> Compiling serde_derive_internals v0.29.1
  1083. 143.16 s gammaloop-workspace-deps-deps> Checking amd v0.2.2
  1084. 143.25 s gammaloop-workspace-deps-deps> Compiling document-features v0.2.12
  1085. 143.30 s gammaloop-workspace-deps-deps> Compiling slotmap v1.1.1
  1086. 143.49 s gammaloop-workspace-deps-deps> Checking rustc-demangle v0.1.27
  1087. 143.52 s gammaloop-workspace-deps-deps> Compiling semver v1.0.28
  1088. 143.94 s gammaloop-workspace-deps-deps> Compiling shellexpand v3.1.2
  1089. 143.95 s gammaloop-workspace-deps-deps> Compiling rust-embed-utils v8.11.0
  1090. 144.02 s gammaloop-workspace-deps-deps> Checking brotli-decompressor v4.0.3
  1091. 144.15 s gammaloop-workspace-deps-deps> Compiling include_dir_macros v0.7.4
  1092. 144.17 s gammaloop-workspace-deps-deps> Checking integer-sqrt v0.1.5
  1093. 144.20 s gammaloop-workspace-deps-deps> Checking crossbeam-channel v0.5.15
  1094. 144.30 s gammaloop-workspace-deps-deps> Checking itertools v0.12.1
  1095. 144.39 s gammaloop-workspace-deps-deps> Checking addr2line v0.25.1
  1096. 144.50 s gammaloop-workspace-deps-deps> Checking symlink v0.1.0
  1097. 144.54 s gammaloop-workspace-deps-deps> Compiling find-msvc-tools v0.1.9
  1098. 144.57 s gammaloop-workspace-deps-deps> Checking unsafe-libyaml v0.2.11
  1099. 144.66 s gammaloop-workspace-deps-deps> Compiling shlex v1.3.0
  1100. 144.66 s gammaloop-workspace-deps-deps> Compiling gammalooprs v0.3.3 (/build/source/crates/gammalooprs)
  1101. 144.85 s gammaloop-workspace-deps-deps> Compiling cc v1.2.61
  1102. 144.86 s gammaloop-workspace-deps-deps> Checking brotli v7.0.0
  1103. 144.88 s gammaloop-workspace-deps-deps> Checking ctrlc v3.5.2
  1104. 145.05 s gammaloop-workspace-deps-deps> Checking ringbuffer v0.16.0
  1105. 145.05 s gammaloop-workspace-deps-deps> Checking base62 v2.2.4
  1106. 145.07 s gammaloop-workspace-deps-deps> Compiling gammaloop-tracing-filter v0.1.0 (/build/source/crates/gammaloop-tracing-filter)
  1107. 145.18 s gammaloop-workspace-deps-deps> Checking include_dir v0.7.4
  1108. 145.20 s gammaloop-workspace-deps-deps> Compiling gammaloop-api v0.1.0 (/build/source/crates/gammaloop-api)
  1109. 145.20 s gammaloop-workspace-deps-deps> Checking fd-lock v4.0.4
  1110. 145.26 s gammaloop-workspace-deps-deps> Checking strip-ansi-escapes v0.2.1
  1111. 145.28 s gammaloop-workspace-deps-deps> Checking itertools v0.13.0
  1112. 145.30 s gammaloop-workspace-deps-deps> Checking strum v0.26.3
  1113. 145.31 s gammaloop-workspace-deps-deps> Compiling test-log-core v0.2.20
  1114. 145.35 s gammaloop-workspace-deps-deps> Checking sysinfo v0.33.1
  1115. 145.40 s gammaloop-workspace-deps-deps> Checking backtrace v0.3.76
  1116. 145.53 s gammaloop-workspace-deps-deps> Checking futures-core v0.3.32
  1117. 145.53 s gammaloop-workspace-deps-deps> Checking futures-task v0.3.32
  1118. 145.60 s gammaloop-workspace-deps-deps> Checking slab v0.4.12
  1119. 145.63 s gammaloop-workspace-deps-deps> Checking sdd v3.0.10
  1120. 145.69 s gammaloop-workspace-deps-deps> Checking futures-util v0.3.32
  1121. 145.82 s gammaloop-workspace-deps-deps> Checking which v8.0.2
  1122. 145.83 s gammaloop-workspace-deps-deps> Checking scc v2.4.0
  1123. 146.73 s gammaloop-workspace-deps-deps> Compiling linnet-py v0.1.0 (/build/source/crates/linnet-py)
  1124. 147.08 s gammaloop-workspace-deps-deps> Checking futures-executor v0.3.32
  1125. 147.10 s gammaloop-workspace-deps-deps> Checking inventory v0.3.24
  1126. 147.14 s gammaloop-workspace-deps-deps> Checking maplit v1.0.2
  1127. 147.20 s gammaloop-workspace-deps-deps> Compiling venial v0.5.0
  1128. 147.22 s gammaloop-workspace-deps-deps> Compiling linnest v0.1.0 (/build/source/crates/linnest)
  1129. 147.23 s gammaloop-workspace-deps-deps> Compiling iai-callgrind-runner v0.14.2
  1130. 147.49 s gammaloop-workspace-deps-deps> Checking wait-timeout v0.2.1
  1131. 147.51 s gammaloop-workspace-deps-deps> Checking cpufeatures v0.3.0
  1132. 147.55 s gammaloop-workspace-deps-deps> Compiling clinnet v0.1.8 (/build/source/crates/clinnet)
  1133. 147.56 s gammaloop-workspace-deps-deps> Checking constant_time_eq v0.4.2
  1134. 147.62 s gammaloop-workspace-deps-deps> Checking base64 v0.21.7
  1135. 147.64 s gammaloop-workspace-deps-deps> Checking arrayref v0.3.9
  1136. 147.68 s gammaloop-workspace-deps-deps> Checking bit-vec v0.8.0
  1137. 147.77 s gammaloop-workspace-deps-deps> Checking quick-error v1.2.3
  1138. 147.80 s gammaloop-workspace-deps-deps> Compiling iai-callgrind v0.14.2
  1139. 147.82 s gammaloop-workspace-deps-deps> Compiling spynso3 v0.1.2 (/build/source/crates/spynso3)
  1140. 147.83 s gammaloop-workspace-deps-deps> Checking rusty-fork v0.3.1
  1141. 147.85 s gammaloop-workspace-deps-deps> Checking bit-set v0.8.0
  1142. 148.08 s gammaloop-workspace-deps-deps> Checking rand_xorshift v0.4.0
  1143. 148.08 s gammaloop-workspace-deps-deps> Checking console v0.15.11
  1144. 148.21 s gammaloop-workspace-deps-deps> Checking unarray v0.1.4
  1145. 148.22 s gammaloop-workspace-deps-deps> Checking pathdiff v0.2.3
  1146. 148.29 s gammaloop-workspace-deps-deps> Checking similar-asserts v1.7.0
  1147. 150.03 s gammaloop-workspace-deps-deps> Compiling serde_derive v1.0.228
  1148. 150.11 s gammaloop-workspace-deps-deps> Compiling zerocopy-derive v0.8.48
  1149. 150.17 s gammaloop-workspace-deps-deps> Compiling tracing-attributes v0.1.31
  1150. 150.45 s gammaloop-workspace-deps-deps> Compiling thiserror-impl v2.0.18
  1151. 150.47 s gammaloop-workspace-deps-deps> Compiling is-macro v0.3.7
  1152. 150.60 s gammaloop-workspace-deps-deps> Compiling pest_derive v2.8.6
  1153. 150.97 s gammaloop-workspace-deps-deps> Compiling duplicate v2.0.1
  1154. 151.06 s gammaloop-workspace-deps-deps> Checking dot-parser v0.5.1
  1155. 151.39 s gammaloop-workspace-deps-deps> Compiling serde_repr v0.1.20
  1156. 151.45 s gammaloop-workspace-deps-deps> Compiling tabled_derive v0.11.0
  1157. 152.21 s gammaloop-workspace-deps-deps> Compiling duplicate v1.0.0
  1158. 152.27 s gammaloop-workspace-deps-deps> Compiling enum-try-as-inner v0.1.1
  1159. 152.72 s gammaloop-workspace-deps-deps> Compiling pyo3-macros v0.28.3
  1160. 152.90 s gammaloop-workspace-deps-deps> Compiling delegate v0.12.0
  1161. 153.32 s gammaloop-workspace-deps-deps> Compiling derive_more v0.99.20
  1162. 153.94 s gammaloop-workspace-deps-deps> Compiling phf_macros v0.13.1
  1163. 154.85 s gammaloop-workspace-deps-deps> Compiling rustpython-parser-core v0.4.0
  1164. 154.97 s gammaloop-workspace-deps-deps> Compiling clap_derive v4.6.1
  1165. 155.05 s gammaloop-workspace-deps-deps> Compiling derive_more-impl v2.1.1
  1166. 155.45 s gammaloop-workspace-deps-deps> Compiling darling_macro v0.23.0
  1167. 156.01 s gammaloop-workspace-deps-deps> Compiling darling_macro v0.14.4
  1168. 157.96 s gammaloop-workspace-deps-deps> Compiling strum_macros v0.27.2
  1169. 158.56 s gammaloop-workspace-deps-deps> Checking kasuari v0.4.12
  1170. 158.86 s gammaloop-workspace-deps-deps> Compiling nalgebra-macros v0.1.0
  1171. 158.93 s gammaloop-workspace-deps-deps> Checking tracing v0.1.44
  1172. 159.44 s gammaloop-workspace-deps-deps> Compiling tracing-subscriber v0.3.23
  1173. 159.49 s gammaloop-workspace-deps-deps> Compiling darling v0.23.0
  1174. 159.70 s gammaloop-workspace-deps-deps> Compiling darling v0.14.4
  1175. 159.77 s gammaloop-workspace-deps-deps> Compiling derive_builder_core v0.11.2
  1176. 161.30 s gammaloop-workspace-deps-deps> Checking phf v0.13.1
  1177. 161.48 s gammaloop-workspace-deps-deps> Compiling thiserror-impl v1.0.69
  1178. 163.38 s gammaloop-workspace-deps-deps> Checking tabled v0.20.0
  1179. 164.88 s gammaloop-workspace-deps-deps> Compiling enum_dispatch v0.3.13
  1180. 164.97 s gammaloop-workspace-deps-deps> Compiling ref-cast-impl v1.0.25
  1181. 165.07 s gammaloop-workspace-deps-deps> Compiling schemars_derive v1.2.1
  1182. 165.30 s gammaloop-workspace-deps-deps> Checking ppv-lite86 v0.2.21
  1183. 165.94 s gammaloop-workspace-deps-deps> Checking rand_chacha v0.9.0
  1184. 166.18 s gammaloop-workspace-deps-deps> Checking num-complex v0.4.6
  1185. 166.20 s gammaloop-workspace-deps-deps> Checking tracing-serde v0.2.0
  1186. 166.38 s gammaloop-workspace-deps-deps> Checking bincode v2.0.1
  1187. 167.46 s gammaloop-workspace-deps-deps> Compiling rand_chacha v0.3.1
  1188. 167.63 s gammaloop-workspace-deps-deps> Compiling num-bigint v0.4.6
  1189. 167.63 s gammaloop-workspace-deps-deps> Checking rand v0.9.4
  1190. 167.81 s gammaloop-workspace-deps-deps> Compiling rand v0.8.6
  1191. 168.06 s gammaloop-workspace-deps-deps> Compiling bincode-trait-derive v0.1.1
  1192. 168.13 s gammaloop-workspace-deps-deps> Checking ndarray v0.17.2
  1193. 168.22 s gammaloop-workspace-deps-deps> Checking simba v0.9.1
  1194. 168.58 s gammaloop-workspace-deps-deps> Compiling phf_generator v0.11.3
  1195. 168.98 s gammaloop-workspace-deps-deps> Compiling phf_codegen v0.11.3
  1196. 169.06 s gammaloop-workspace-deps-deps> Compiling unicode_names2_generator v1.3.0
  1197. 169.09 s gammaloop-workspace-deps-deps> Compiling rustpython-parser v0.4.0
  1198. 169.58 s gammaloop-workspace-deps-deps> Compiling rustpython-ast v0.4.0
  1199. 170.40 s gammaloop-workspace-deps-deps> Checking symjit v2.14.9
  1200. 171.04 s gammaloop-workspace-deps-deps> Checking bitvec v1.0.1
  1201. 171.06 s gammaloop-workspace-deps-deps> Checking serde_spanned v0.6.9
  1202. 171.06 s gammaloop-workspace-deps-deps> Checking xprec v0.2.2
  1203. 171.14 s gammaloop-workspace-deps-deps> Checking toml_datetime v0.6.11
  1204. 171.29 s gammaloop-workspace-deps-deps> Checking toml_edit v0.22.27
  1205. 171.30 s gammaloop-workspace-deps-deps> Checking chrono v0.4.44
  1206. 172.39 s gammaloop-workspace-deps-deps> Checking string-template-plus v0.4.3
  1207. 172.45 s gammaloop-workspace-deps-deps> Compiling unicode_names2 v1.3.0
  1208. 172.87 s gammaloop-workspace-deps-deps> Checking clap v4.6.1
  1209. 172.96 s gammaloop-workspace-deps-deps> Checking half v2.7.1
  1210. 173.05 s gammaloop-workspace-deps-deps> Checking derive_more v2.1.1
  1211. 173.08 s gammaloop-workspace-deps-deps> Checking parking_lot v0.12.5
  1212. 173.09 s gammaloop-workspace-deps-deps> Checking tinytemplate v1.2.1
  1213. 173.14 s gammaloop-workspace-deps-deps> Checking toml v0.8.23
  1214. 173.16 s gammaloop-workspace-deps-deps> Checking ron v0.12.1
  1215. 173.28 s gammaloop-workspace-deps-deps> Checking ciborium-ll v0.2.2
  1216. 173.33 s gammaloop-workspace-deps-deps> Checking rand_distr v0.4.3
  1217. 173.37 s gammaloop-workspace-deps-deps> Checking crossterm v0.28.1
  1218. 173.43 s gammaloop-workspace-deps-deps> Checking ciborium v0.2.2
  1219. 173.57 s gammaloop-workspace-deps-deps> Checking num-rational v0.4.2
  1220. 173.63 s gammaloop-workspace-deps-deps> Compiling derive_builder_macro v0.11.2
  1221. 173.91 s gammaloop-workspace-deps-deps> Checking criterion v0.5.1
  1222. 174.01 s gammaloop-workspace-deps-deps> Checking simba v0.6.0
  1223. 174.17 s gammaloop-workspace-deps-deps> Checking num v0.4.3
  1224. 174.19 s gammaloop-workspace-deps-deps> Checking crossterm v0.29.0
  1225. 174.28 s gammaloop-workspace-deps-deps> Checking tracing-error v0.2.1
  1226. 174.37 s gammaloop-workspace-deps-deps> Checking serde-big-array v0.5.1
  1227. 174.46 s gammaloop-workspace-deps-deps> Checking insta v1.47.2
  1228. 174.60 s gammaloop-workspace-deps-deps> Compiling deprecate-until v1.0.0
  1229. 174.66 s gammaloop-workspace-deps-deps> Checking color-eyre v0.6.5
  1230. 175.07 s gammaloop-workspace-deps-deps> Checking tracing-appender v0.2.5
  1231. 175.09 s gammaloop-workspace-deps-deps> Checking tracing-indicatif v0.3.14
  1232. 175.20 s gammaloop-workspace-deps-deps> Checking typed-index-collections v3.5.0
  1233. 175.21 s gammaloop-workspace-deps-deps> Checking json5 v0.4.1
  1234. 175.44 s gammaloop-workspace-deps-deps> Checking serde_yaml v0.9.34+deprecated
  1235. 175.45 s gammaloop-workspace-deps-deps> Checking vectorize v0.2.0
  1236. 175.51 s gammaloop-workspace-deps-deps> Compiling rust-embed-impl v8.11.0
  1237. 175.63 s gammaloop-workspace-deps-deps> Checking clap_complete v4.6.3
  1238. 175.73 s gammaloop-workspace-deps-deps> Compiling strum_macros v0.26.4
  1239. 175.78 s gammaloop-workspace-deps-deps> Compiling test-log-macros v0.2.20
  1240. 175.86 s gammaloop-workspace-deps-deps> Checking clap_complete_nushell v4.6.0
  1241. 176.02 s gammaloop-workspace-deps-deps> Checking pathfinding v4.15.0
  1242. 176.03 s gammaloop-workspace-deps-deps> Compiling gammaloop-integration-tests v0.1.0 (/build/source/tests)
  1243. 176.16 s gammaloop-workspace-deps-deps> Compiling serial_test_derive v3.4.0
  1244. 176.31 s gammaloop-workspace-deps-deps> Checking derive_builder v0.11.2
  1245. 176.39 s gammaloop-workspace-deps-deps> Checking strum v0.27.2
  1246. 176.47 s gammaloop-workspace-deps-deps> Checking ratatui-core v0.1.0
  1247. 177.41 s gammaloop-workspace-deps-deps> Checking nalgebra v0.29.0
  1248. 177.54 s gammaloop-workspace-deps-deps> Compiling blake3 v1.8.5
  1249. 177.79 s gammaloop-workspace-deps-deps> Checking ratatui-widgets v0.3.0
  1250. 177.85 s gammaloop-workspace-deps-deps> Checking ratatui-crossterm v0.1.0
  1251. 178.74 s gammaloop-workspace-deps-deps> Checking ratatui-macros v0.7.0
  1252. 179.18 s gammaloop-workspace-deps-deps> Checking test-log v0.2.20
  1253. 179.18 s gammaloop-workspace-deps-deps> Checking ratatui v0.30.0
  1254. 179.18 s gammaloop-workspace-deps-deps> Compiling wasm-minimal-protocol v0.2.0
  1255. 179.18 s gammaloop-workspace-deps-deps> Compiling iai-callgrind-macros v0.5.1
  1256. 179.18 s gammaloop-workspace-deps-deps> Checking bincode v1.3.3
  1257. 179.64 s gammaloop-workspace-deps-deps> Checking ron v0.8.1
  1258. 180.07 s gammaloop-workspace-deps-deps> Checking proptest v1.11.0
  1259. 180.13 s gammaloop-workspace-deps-deps> Checking kurbo v0.11.3
  1260. 181.03 s gammaloop-workspace-deps-deps> Checking rust-embed v8.11.0
  1261. 181.48 s gammaloop-workspace-deps-deps> Checking schemars v1.2.1
  1262. 182.00 s gammaloop-workspace-deps-deps> Checking serial_test v3.4.0
  1263. 182.57 s gammaloop-workspace-deps-deps> Checking statrs v0.16.1
  1264. 183.35 s gammaloop-workspace-deps-deps> Checking momtrop v0.3.0
  1265. 183.97 s gammaloop-workspace-deps-deps> Checking reedline v0.42.0
  1266. 185.13 s gammaloop-workspace-deps-deps> Compiling pyo3-stub-gen-derive v0.17.2
  1267. 188.28 s gammaloop-workspace-deps-deps> Checking pyo3-stub-gen v0.17.2
  1268. 224.46 s gammaloop-workspace-deps-deps> Checking numerica v1.4.3
  1269. 225.66 s gammaloop-workspace-deps-deps> Checking graphica v1.2.1
  1270. 387.14 s gammaloop-workspace-deps-deps> Finished `dev-optim` profile [optimized + debuginfo] target(s) in 4m 20s
  1271. 387.20 s gammaloop-workspace-deps-deps> +++ command cargo build --profile dev-optim --locked --workspace
  1272. 387.50 s gammaloop-workspace-deps-deps> Compiling proc-macro2 v1.0.106
  1273. 387.50 s gammaloop-workspace-deps-deps> Compiling unicode-ident v1.0.24
  1274. 387.50 s gammaloop-workspace-deps-deps> Compiling cfg-if v1.0.4
  1275. 387.50 s gammaloop-workspace-deps-deps> Compiling memchr v2.8.0
  1276. 387.50 s gammaloop-workspace-deps-deps> Compiling once_cell v1.21.4
  1277. 387.51 s gammaloop-workspace-deps-deps> Compiling itoa v1.0.18
  1278. 387.52 s gammaloop-workspace-deps-deps> Compiling unicode-width v0.2.2
  1279. 387.53 s gammaloop-workspace-deps-deps> Compiling quote v1.0.45
  1280. 387.53 s gammaloop-workspace-deps-deps> Compiling log v0.4.29
  1281. 387.53 s gammaloop-workspace-deps-deps> Compiling either v1.15.0
  1282. 387.54 s gammaloop-workspace-deps-deps> Compiling serde_core v1.0.228
  1283. 387.54 s gammaloop-workspace-deps-deps> Compiling libc v0.2.186
  1284. 387.54 s gammaloop-workspace-deps-deps> Compiling libm v0.2.16
  1285. 387.54 s gammaloop-workspace-deps-deps> Compiling equivalent v1.0.2
  1286. 387.55 s gammaloop-workspace-deps-deps> Compiling zerocopy v0.8.48
  1287. 387.57 s gammaloop-workspace-deps-deps> Compiling crossbeam-utils v0.8.21
  1288. 387.57 s gammaloop-workspace-deps-deps> Compiling zmij v1.0.21
  1289. 387.57 s gammaloop-workspace-deps-deps> Compiling getrandom v0.2.17
  1290. 387.59 s gammaloop-workspace-deps-deps> Compiling bytemuck v1.25.0
  1291. 387.60 s gammaloop-workspace-deps-deps> Compiling lazy_static v1.5.0
  1292. 387.66 s gammaloop-workspace-deps-deps> Compiling siphasher v1.0.2
  1293. 387.72 s gammaloop-workspace-deps-deps> Compiling hashbrown v0.17.0
  1294. 387.73 s gammaloop-workspace-deps-deps> Compiling pin-project-lite v0.2.17
  1295. 387.75 s gammaloop-workspace-deps-deps> Compiling regex-syntax v0.8.10
  1296. 387.77 s gammaloop-workspace-deps-deps> Compiling safe_arch v0.7.4
  1297. 387.78 s gammaloop-workspace-deps-deps> Compiling tracing-core v0.1.36
  1298. 387.79 s gammaloop-workspace-deps-deps> Compiling static_assertions v1.1.0
  1299. 387.80 s gammaloop-workspace-deps-deps> Compiling anyhow v1.0.102
  1300. 387.81 s gammaloop-workspace-deps-deps> Compiling rand_core v0.6.4
  1301. 387.84 s gammaloop-workspace-deps-deps> Compiling foldhash v0.2.0
  1302. 387.86 s gammaloop-workspace-deps-deps> Compiling allocator-api2 v0.2.21
  1303. 387.97 s gammaloop-workspace-deps-deps> Compiling crossbeam-epoch v0.9.18
  1304. 388.09 s gammaloop-workspace-deps-deps> Compiling aho-corasick v1.1.4
  1305. 388.22 s gammaloop-workspace-deps-deps> Compiling syn v2.0.117
  1306. 388.33 s gammaloop-workspace-deps-deps> Compiling crossbeam-deque v0.8.6
  1307. 388.44 s gammaloop-workspace-deps-deps> Compiling wide v0.7.33
  1308. 388.52 s gammaloop-workspace-deps-deps> Compiling rayon-core v1.13.0
  1309. 388.52 s gammaloop-workspace-deps-deps> Compiling hashbrown v0.16.1
  1310. 388.56 s gammaloop-workspace-deps-deps> Compiling phf_shared v0.11.3
  1311. 388.66 s gammaloop-workspace-deps-deps> Compiling num-traits v0.2.19
  1312. 388.80 s gammaloop-workspace-deps-deps> Compiling nu-ansi-term v0.50.3
  1313. 388.84 s gammaloop-workspace-deps-deps> Compiling powerfmt v0.2.0
  1314. 389.21 s gammaloop-workspace-deps-deps> Compiling deranged v0.5.8
  1315. 389.22 s gammaloop-workspace-deps-deps> Compiling tracing-log v0.2.0
  1316. 389.25 s gammaloop-workspace-deps-deps> Compiling sharded-slab v0.1.7
  1317. 389.34 s gammaloop-workspace-deps-deps> Compiling thread_local v1.1.9
  1318. 389.47 s gammaloop-workspace-deps-deps> Compiling num-integer v0.1.46
  1319. 389.54 s gammaloop-workspace-deps-deps> Compiling regex-automata v0.4.14
  1320. 389.59 s gammaloop-workspace-deps-deps> Compiling num-conv v0.2.1
  1321. 389.71 s gammaloop-workspace-deps-deps> Compiling num_threads v0.1.7
  1322. 389.75 s gammaloop-workspace-deps-deps> Compiling time-core v0.1.8
  1323. 389.75 s gammaloop-workspace-deps-deps> Compiling safe_arch v1.0.0
  1324. 389.87 s gammaloop-workspace-deps-deps> Compiling bitflags v2.11.1
  1325. 389.88 s gammaloop-workspace-deps-deps> Compiling serde_json v1.0.149
  1326. 389.95 s gammaloop-workspace-deps-deps> Compiling indexmap v2.14.0
  1327. 389.97 s gammaloop-workspace-deps-deps> Compiling rayon v1.12.0
  1328. 390.00 s gammaloop-workspace-deps-deps> Compiling itertools v0.14.0
  1329. 390.03 s gammaloop-workspace-deps-deps> Compiling az v1.3.0
  1330. 390.35 s gammaloop-workspace-deps-deps> Compiling wide v1.3.0
  1331. 390.44 s gammaloop-workspace-deps-deps> Compiling arrayvec v0.7.6
  1332. 390.61 s gammaloop-workspace-deps-deps> Compiling time v0.3.47
  1333. 390.68 s gammaloop-workspace-deps-deps> Compiling approx v0.5.1
  1334. 390.79 s gammaloop-workspace-deps-deps> Compiling getrandom v0.3.4
  1335. 390.87 s gammaloop-workspace-deps-deps> Compiling indenter v0.3.4
  1336. 390.98 s gammaloop-workspace-deps-deps> Compiling bitflags v1.3.2
  1337. 390.98 s gammaloop-workspace-deps-deps> Compiling alloc-no-stdlib v2.0.4
  1338. 391.03 s gammaloop-workspace-deps-deps> Compiling dyn-clone v1.0.20
  1339. 391.06 s gammaloop-workspace-deps-deps> Compiling rawpointer v0.2.1
  1340. 391.09 s gammaloop-workspace-deps-deps> Compiling foldhash v0.1.5
  1341. 391.12 s gammaloop-workspace-deps-deps> Compiling matrixmultiply v0.3.10
  1342. 391.13 s gammaloop-workspace-deps-deps> Compiling alloc-stdlib v0.2.2
  1343. 391.21 s gammaloop-workspace-deps-deps> Compiling eyre v0.6.12
  1344. 391.24 s gammaloop-workspace-deps-deps> Compiling hashbrown v0.15.5
  1345. 391.30 s gammaloop-workspace-deps-deps> Compiling syn v1.0.109
  1346. 391.88 s gammaloop-workspace-deps-deps> Compiling getopts v0.2.24
  1347. 391.93 s gammaloop-workspace-deps-deps> Compiling fixedbitset v0.5.7
  1348. 391.94 s gammaloop-workspace-deps-deps> Compiling unty v0.0.4
  1349. 391.95 s gammaloop-workspace-deps-deps> Compiling colored v3.1.1
  1350. 392.00 s gammaloop-workspace-deps-deps> Compiling pyo3-macros-backend v0.28.3
  1351. 392.52 s gammaloop-workspace-deps-deps> Compiling const-random-macro v0.1.16
  1352. 392.70 s gammaloop-workspace-deps-deps> Compiling matchers v0.2.0
  1353. 392.73 s gammaloop-workspace-deps-deps> Compiling linux-raw-sys v0.12.1
  1354. 392.95 s gammaloop-workspace-deps-deps> Compiling pyo3-ffi v0.28.3
  1355. 393.08 s gammaloop-workspace-deps-deps> Compiling rand_core v0.9.5
  1356. 393.12 s gammaloop-workspace-deps-deps> Compiling rustix v1.1.4
  1357. 393.18 s gammaloop-workspace-deps-deps> Compiling ppv-lite86 v0.2.21
  1358. 393.19 s gammaloop-workspace-deps-deps> Compiling rustpython-parser-vendored v0.4.0
  1359. 393.20 s gammaloop-workspace-deps-deps> Compiling const-random v0.1.18
  1360. 393.24 s gammaloop-workspace-deps-deps> Compiling spec_math v0.1.6
  1361. 393.29 s gammaloop-workspace-deps-deps> Compiling strsim v0.11.1
  1362. 393.30 s gammaloop-workspace-deps-deps> Compiling num-bigint v0.4.6
  1363. 393.54 s gammaloop-workspace-deps-deps> Compiling rand_chacha v0.3.1
  1364. 393.59 s gammaloop-workspace-deps-deps> Compiling brotli-decompressor v5.0.0
  1365. 394.48 s gammaloop-workspace-deps-deps> Compiling rand v0.8.6
  1366. 394.63 s gammaloop-workspace-deps-deps> Compiling phf v0.11.3
  1367. 394.82 s gammaloop-workspace-deps-deps> Compiling rustc-hash v2.1.2
  1368. 394.91 s gammaloop-workspace-deps-deps> Compiling unicode-segmentation v1.13.2
  1369. 395.02 s gammaloop-workspace-deps-deps> Compiling ucd-trie v0.1.7
  1370. 395.03 s gammaloop-workspace-deps-deps> Compiling utf8parse v0.2.2
  1371. 395.12 s gammaloop-workspace-deps-deps> Compiling fnv v1.0.7
  1372. 395.19 s gammaloop-workspace-deps-deps> Compiling phf_generator v0.11.3
  1373. 395.21 s gammaloop-workspace-deps-deps> Compiling pest v2.8.6
  1374. 395.23 s gammaloop-workspace-deps-deps> Compiling anstyle-parse v1.0.0
  1375. 395.42 s gammaloop-workspace-deps-deps> Compiling phf_codegen v0.11.3
  1376. 395.43 s gammaloop-workspace-deps-deps> Compiling brotli v8.0.2
  1377. 395.55 s gammaloop-workspace-deps-deps> Compiling unicode_names2_generator v1.3.0
  1378. 395.66 s gammaloop-workspace-deps-deps> Compiling rustpython-parser v0.4.0
  1379. 395.69 s gammaloop-workspace-deps-deps> Compiling bincode v2.0.1
  1380. 395.90 s gammaloop-workspace-deps-deps> Compiling itertools v0.11.0
  1381. 396.65 s gammaloop-workspace-deps-deps> Compiling gmp-mpfr-sys v1.7.1
  1382. 396.89 s gammaloop-workspace-deps-deps> Compiling libloading v0.9.0
  1383. 397.16 s gammaloop-workspace-deps-deps> Compiling tinyjson v2.5.1
  1384. 397.24 s gammaloop-workspace-deps-deps> Compiling append-only-vec v0.1.8
  1385. 397.29 s gammaloop-workspace-deps-deps> Compiling winnow v0.7.15
  1386. 397.39 s gammaloop-workspace-deps-deps> Compiling byteorder v1.5.0
  1387. 397.39 s gammaloop-workspace-deps-deps> Compiling colorchoice v1.0.5
  1388. 397.47 s gammaloop-workspace-deps-deps> Compiling anstyle v1.0.14
  1389. 397.55 s gammaloop-workspace-deps-deps> Compiling is_terminal_polyfill v1.70.2
  1390. 397.60 s gammaloop-workspace-deps-deps> Compiling bytes v1.11.1
  1391. 397.63 s gammaloop-workspace-deps-deps> Compiling self_cell v1.2.2
  1392. 397.71 s gammaloop-workspace-deps-deps> Compiling anstyle-query v1.1.5
  1393. 397.72 s gammaloop-workspace-deps-deps> Compiling pest_meta v2.8.6
  1394. 397.78 s gammaloop-workspace-deps-deps> Compiling anstream v1.0.0
  1395. 397.96 s gammaloop-workspace-deps-deps> Compiling num-complex v0.4.6
  1396. 398.04 s gammaloop-workspace-deps-deps> Compiling ahash v0.8.12
  1397. 398.35 s gammaloop-workspace-deps-deps> Compiling typenum v1.20.0
  1398. 398.49 s gammaloop-workspace-deps-deps> Compiling rand_chacha v0.9.0
  1399. 398.51 s gammaloop-workspace-deps-deps> Compiling regex v1.12.3
  1400. 398.79 s gammaloop-workspace-deps-deps> Compiling pest_generator v2.8.6
  1401. 398.89 s gammaloop-workspace-deps-deps> Compiling petgraph v0.8.3
  1402. 399.12 s gammaloop-workspace-deps-deps> Compiling region v3.0.2
  1403. 399.19 s gammaloop-workspace-deps-deps> Compiling vte v0.14.1
  1404. 399.20 s gammaloop-workspace-deps-deps> Compiling wasmtime-jit-icache-coherence v34.0.2
  1405. 399.31 s gammaloop-workspace-deps-deps> Compiling toml_write v0.1.2
  1406. 399.32 s gammaloop-workspace-deps-deps> Compiling unicode_names2 v1.3.0
  1407. 399.34 s gammaloop-workspace-deps-deps> Compiling rug v1.30.0
  1408. 399.35 s gammaloop-workspace-deps-deps> Compiling simba v0.9.1
  1409. 399.41 s gammaloop-workspace-deps-deps> Compiling symbolica v1.5.1
  1410. 399.53 s gammaloop-workspace-deps-deps> Compiling rand v0.9.4
  1411. 399.87 s gammaloop-workspace-deps-deps> Compiling tap v1.0.1
  1412. 399.97 s gammaloop-workspace-deps-deps> Compiling minimal-lexical v0.2.1
  1413. 400.07 s gammaloop-workspace-deps-deps> Compiling serde v1.0.228
  1414. 400.42 s gammaloop-workspace-deps-deps> Compiling nom v7.1.3
  1415. 401.06 s gammaloop-workspace-deps-deps> Compiling wyz v0.5.1
  1416. 401.24 s gammaloop-workspace-deps-deps> Compiling uncased v0.9.10
  1417. 401.47 s gammaloop-workspace-deps-deps> Compiling proc-macro2-diagnostics v0.10.1
  1418. 401.94 s gammaloop-workspace-deps-deps> Compiling radium v0.7.0
  1419. 401.96 s gammaloop-workspace-deps-deps> Compiling approx v0.4.0
  1420. 402.15 s gammaloop-workspace-deps-deps> Compiling same-file v1.0.6
  1421. 402.34 s gammaloop-workspace-deps-deps> Compiling scopeguard v1.2.0
  1422. 402.36 s gammaloop-workspace-deps-deps> Compiling funty v2.0.0
  1423. 402.39 s gammaloop-workspace-deps-deps> Compiling walkdir v2.5.0
  1424. 402.41 s gammaloop-workspace-deps-deps> Compiling lock_api v0.4.14
  1425. 402.52 s gammaloop-workspace-deps-deps> Compiling ansitok v0.3.0
  1426. 403.65 s gammaloop-workspace-deps-deps> Compiling errno v0.3.14
  1427. 403.80 s gammaloop-workspace-deps-deps> Compiling option-ext v0.2.0
  1428. 403.88 s gammaloop-workspace-deps-deps> Compiling darling_core v0.14.4
  1429. 403.88 s gammaloop-workspace-deps-deps> Compiling signal-hook-registry v1.4.8
  1430. 404.06 s gammaloop-workspace-deps-deps> Compiling xprec v0.2.2
  1431. 404.48 s gammaloop-workspace-deps-deps> Compiling smartstring v1.0.1
  1432. 404.57 s gammaloop-workspace-deps-deps> Compiling generic-array v0.14.7
  1433. 404.73 s gammaloop-workspace-deps-deps> Compiling terminal_size v0.4.4
  1434. 404.85 s gammaloop-workspace-deps-deps> Compiling darling_core v0.23.0
  1435. 404.86 s gammaloop-workspace-deps-deps> Compiling proc-macro-error-attr2 v2.0.0
  1436. 404.87 s gammaloop-workspace-deps-deps> Compiling clap_lex v1.1.0
  1437. 405.20 s gammaloop-workspace-deps-deps> Compiling winnow v1.0.2
  1438. 405.29 s gammaloop-workspace-deps-deps> Compiling iana-time-zone v0.1.65
  1439. 405.32 s gammaloop-workspace-deps-deps> Compiling ryu v1.0.23
  1440. 405.50 s gammaloop-workspace-deps-deps> Compiling unicase v2.9.0
  1441. 405.58 s gammaloop-workspace-deps-deps> Compiling signal-hook v0.3.18
  1442. 405.73 s gammaloop-workspace-deps-deps> Compiling clap_builder v4.6.0
  1443. 405.75 s gammaloop-workspace-deps-deps> Compiling proc-macro-error-attr v1.0.4
  1444. 405.82 s gammaloop-workspace-deps-deps> Compiling proc-macro-error2 v2.0.1
  1445. 405.88 s gammaloop-workspace-deps-deps> Compiling ansi-str v0.9.0
  1446. 406.09 s gammaloop-workspace-deps-deps> Compiling castaway v0.2.4
  1447. 406.17 s gammaloop-workspace-deps-deps> Compiling serde_spanned v1.1.1
  1448. 406.18 s gammaloop-workspace-deps-deps> Compiling mio v1.2.0
  1449. 406.27 s gammaloop-workspace-deps-deps> Compiling toml_writer v1.1.1+spec-1.1.0
  1450. 406.49 s gammaloop-workspace-deps-deps> Compiling shlex v1.3.0
  1451. 406.61 s gammaloop-workspace-deps-deps> Compiling toml_parser v1.1.2+spec-1.1.0
  1452. 406.77 s gammaloop-workspace-deps-deps> Compiling bytecount v0.6.9
  1453. 406.87 s gammaloop-workspace-deps-deps> Compiling papergrid v0.17.0
  1454. 406.95 s gammaloop-workspace-deps-deps> Compiling proc-macro-error v1.0.4
  1455. 407.09 s gammaloop-workspace-deps-deps> Compiling signal-hook-mio v0.2.5
  1456. 407.14 s gammaloop-workspace-deps-deps> Compiling compact_str v0.9.0
  1457. 407.16 s gammaloop-workspace-deps-deps> Compiling crypto-common v0.1.7
  1458. 407.17 s gammaloop-workspace-deps-deps> Compiling block-buffer v0.10.4
  1459. 407.22 s gammaloop-workspace-deps-deps> Compiling testing_table v0.3.0
  1460. 407.25 s gammaloop-workspace-deps-deps> Compiling env_filter v1.0.1
  1461. 407.29 s gammaloop-workspace-deps-deps> Compiling unicode-truncate v2.0.1
  1462. 407.43 s gammaloop-workspace-deps-deps> Compiling convert_case v0.10.0
  1463. 407.78 s gammaloop-workspace-deps-deps> Compiling num-iter v0.1.45
  1464. 407.87 s gammaloop-workspace-deps-deps> Compiling lru v0.16.4
  1465. 407.90 s gammaloop-workspace-deps-deps> Compiling colored v2.2.0
  1466. 408.03 s gammaloop-workspace-deps-deps> Compiling ciborium-io v0.2.2
  1467. 408.09 s gammaloop-workspace-deps-deps> Compiling linux-raw-sys v0.4.15
  1468. 408.35 s gammaloop-workspace-deps-deps> Compiling ref-ops v0.2.5
  1469. 408.35 s gammaloop-workspace-deps-deps> Compiling jiff v0.2.24
  1470. 408.44 s gammaloop-workspace-deps-deps> Compiling rustix v0.38.44
  1471. 408.57 s gammaloop-workspace-deps-deps> Compiling digest v0.10.7
  1472. 408.76 s gammaloop-workspace-deps-deps> Compiling dirs-sys v0.5.0
  1473. 408.79 s gammaloop-workspace-deps-deps> Compiling rand_xoshiro v0.6.0
  1474. 408.83 s gammaloop-workspace-deps-deps> Compiling features v0.10.0
  1475. 408.86 s gammaloop-workspace-deps-deps> Compiling vte v0.15.0
  1476. 409.04 s gammaloop-workspace-deps-deps> Compiling numerica v1.4.3
  1477. 409.20 s gammaloop-workspace-deps-deps> Compiling toml_datetime v0.7.5+spec-1.1.0
  1478. 409.57 s gammaloop-workspace-deps-deps> Compiling console v0.16.3
  1479. 409.57 s gammaloop-workspace-deps-deps> Compiling phf_shared v0.13.1
  1480. 409.82 s gammaloop-workspace-deps-deps> Compiling plotters-backend v0.3.7
  1481. 409.86 s gammaloop-workspace-deps-deps> Compiling gat-lending-iterator v0.1.8
  1482. 409.93 s gammaloop-workspace-deps-deps> Compiling cpufeatures v0.2.17
  1483. 409.97 s gammaloop-workspace-deps-deps> Compiling constcat v0.5.1
  1484. 410.03 s gammaloop-workspace-deps-deps> Compiling fastrand v2.4.1
  1485. 410.07 s gammaloop-workspace-deps-deps> Compiling plotters-svg v0.3.7
  1486. 410.11 s gammaloop-workspace-deps-deps> Compiling cc v1.2.61
  1487. 410.16 s gammaloop-workspace-deps-deps> Compiling phf_generator v0.13.1
  1488. 410.26 s gammaloop-workspace-deps-deps> Compiling sha2 v0.10.9
  1489. 410.54 s gammaloop-workspace-deps-deps> Compiling toml v0.9.12+spec-1.1.0
  1490. 410.65 s gammaloop-workspace-deps-deps> Compiling vt100 v0.16.2
  1491. 411.57 s gammaloop-workspace-deps-deps> Compiling graphica v1.2.1
  1492. 411.60 s gammaloop-workspace-deps-deps> Compiling env_logger v0.11.10
  1493. 412.24 s gammaloop-workspace-deps-deps> Compiling dirs v6.0.0
  1494. 412.38 s gammaloop-workspace-deps-deps> Compiling portable-atomic v1.13.1
  1495. 412.45 s gammaloop-workspace-deps-deps> Compiling line-clipping v0.3.7
  1496. 412.80 s gammaloop-workspace-deps-deps> Compiling itertools v0.10.5
  1497. 413.04 s gammaloop-workspace-deps-deps> Compiling gimli v0.32.3
  1498. 413.20 s gammaloop-workspace-deps-deps> Compiling joinery v2.1.0
  1499. 413.32 s gammaloop-workspace-deps-deps> Compiling unit-prefix v0.5.2
  1500. 413.45 s gammaloop-workspace-deps-deps> Compiling adler2 v2.0.1
  1501. 413.60 s gammaloop-workspace-deps-deps> Compiling cast v0.3.0
  1502. 413.61 s gammaloop-workspace-deps-deps> Compiling miniz_oxide v0.8.9
  1503. 413.67 s gammaloop-workspace-deps-deps> Compiling indicatif v0.18.4
  1504. 413.76 s gammaloop-workspace-deps-deps> Compiling titlecase v2.2.1
  1505. 414.25 s gammaloop-workspace-deps-deps> Compiling criterion-plot v0.5.0
  1506. 414.42 s gammaloop-workspace-deps-deps> Compiling shellexpand v3.1.2
  1507. 414.66 s gammaloop-workspace-deps-deps> Compiling rust-embed-utils v8.11.0
  1508. 415.00 s gammaloop-workspace-deps-deps> Compiling owo-colors v4.3.0
  1509. 415.49 s gammaloop-workspace-deps-deps> Compiling serde_derive v1.0.228
  1510. 415.61 s gammaloop-workspace-deps-deps> Compiling zerocopy-derive v0.8.48
  1511. 415.64 s gammaloop-workspace-deps-deps> Compiling tracing-attributes v0.1.31
  1512. 416.00 s gammaloop-workspace-deps-deps> Compiling thiserror-impl v2.0.18
  1513. 416.01 s gammaloop-workspace-deps-deps> Compiling is-macro v0.3.7
  1514. 416.08 s gammaloop-workspace-deps-deps> Compiling bincode-trait-derive v0.1.1
  1515. 416.31 s gammaloop-workspace-deps-deps> Compiling pest_derive v2.8.6
  1516. 416.91 s gammaloop-workspace-deps-deps> Compiling dot-parser v0.5.1
  1517. 416.93 s gammaloop-workspace-deps-deps> Compiling duplicate v2.0.1
  1518. 416.96 s gammaloop-workspace-deps-deps> Compiling serde_repr v0.1.20
  1519. 417.84 s gammaloop-workspace-deps-deps> Compiling clap_derive v4.6.1
  1520. 418.58 s gammaloop-workspace-deps-deps> Compiling darling_macro v0.14.4
  1521. 419.70 s gammaloop-workspace-deps-deps> Compiling strum_macros v0.27.2
  1522. 420.36 s gammaloop-workspace-deps-deps> Compiling pyo3-macros v0.28.3
  1523. 421.07 s gammaloop-workspace-deps-deps> Compiling tabled_derive v0.11.0
  1524. 421.68 s gammaloop-workspace-deps-deps> Compiling duplicate v1.0.0
  1525. 421.93 s gammaloop-workspace-deps-deps> Compiling darling v0.14.4
  1526. 421.99 s gammaloop-workspace-deps-deps> Compiling derive_builder_core v0.11.2
  1527. 422.16 s gammaloop-workspace-deps-deps> Compiling enum-try-as-inner v0.1.1
  1528. 422.70 s gammaloop-workspace-deps-deps> Compiling derive_more v0.99.20
  1529. 422.87 s gammaloop-workspace-deps-deps> Compiling derive_more-impl v2.1.1
  1530. 423.82 s gammaloop-workspace-deps-deps> Compiling rustpython-parser-core v0.4.0
  1531. 424.03 s gammaloop-workspace-deps-deps> Compiling rustpython-ast v0.4.0
  1532. 424.31 s gammaloop-workspace-deps-deps> Compiling delegate v0.12.0
  1533. 425.30 s gammaloop-workspace-deps-deps> Compiling darling_macro v0.23.0
  1534. 426.44 s gammaloop-workspace-deps-deps> Compiling nalgebra-macros v0.1.0
  1535. 428.65 s gammaloop-workspace-deps-deps> Compiling darling v0.23.0
  1536. 428.71 s gammaloop-workspace-deps-deps> Compiling instability v0.3.12
  1537. 428.85 s gammaloop-workspace-deps-deps> Compiling thiserror v2.0.18
  1538. 428.90 s gammaloop-workspace-deps-deps> Compiling kasuari v0.4.12
  1539. 429.52 s gammaloop-workspace-deps-deps> Compiling tracing v0.1.44
  1540. 429.90 s gammaloop-workspace-deps-deps> Compiling tracing-subscriber v0.3.23
  1541. 429.93 s gammaloop-workspace-deps-deps> Compiling thiserror-impl v1.0.69
  1542. 430.59 s gammaloop-workspace-deps-deps> Compiling ref-cast-impl v1.0.25
  1543. 430.77 s gammaloop-workspace-deps-deps> Compiling phf_macros v0.13.1
  1544. 430.93 s gammaloop-workspace-deps-deps> Compiling enum_dispatch v0.3.13
  1545. 431.71 s gammaloop-workspace-deps-deps> Compiling derive_more v2.1.1
  1546. 431.75 s gammaloop-workspace-deps-deps> Compiling addr2line v0.25.1
  1547. 431.83 s gammaloop-workspace-deps-deps> Compiling clap v4.6.1
  1548. 431.89 s gammaloop-workspace-deps-deps> Compiling object v0.37.3
  1549. 432.18 s gammaloop-workspace-deps-deps> Compiling derive_builder_macro v0.11.2
  1550. 432.24 s gammaloop-workspace-deps-deps> Compiling plotters v0.3.7
  1551. 432.92 s gammaloop-workspace-deps-deps> Compiling half v2.7.1
  1552. 434.46 s gammaloop-workspace-deps-deps> Compiling smallvec v1.15.1
  1553. 434.58 s gammaloop-workspace-deps-deps> Compiling tracing-serde v0.2.0
  1554. 434.87 s gammaloop-workspace-deps-deps> Compiling pyo3 v0.28.3
  1555. 434.97 s gammaloop-workspace-deps-deps> Compiling ndarray v0.17.2
  1556. 435.46 s gammaloop-workspace-deps-deps> Compiling toml_datetime v0.6.11
  1557. 435.89 s gammaloop-workspace-deps-deps> Compiling serde_spanned v0.6.9
  1558. 436.22 s gammaloop-workspace-deps-deps> Compiling symjit v2.14.9
  1559. 436.22 s gammaloop-workspace-deps-deps> Compiling toml_edit v0.22.27
  1560. 436.49 s gammaloop-workspace-deps-deps> Compiling parking_lot_core v0.9.12
  1561. 436.75 s gammaloop-workspace-deps-deps> Compiling cgmath v0.18.0
  1562. 436.77 s gammaloop-workspace-deps-deps> Compiling bitvec v1.0.1
  1563. 436.85 s gammaloop-workspace-deps-deps> Compiling parking_lot v0.12.5
  1564. 437.68 s gammaloop-workspace-deps-deps> Compiling num-rational v0.4.2
  1565. 438.25 s gammaloop-workspace-deps-deps> Compiling toml v0.8.23
  1566. 439.43 s gammaloop-workspace-deps-deps> Compiling figment v0.10.19
  1567. 439.73 s gammaloop-workspace-deps-deps> Compiling chrono v0.4.44
  1568. 440.00 s gammaloop-workspace-deps-deps> Compiling numpy v0.28.0
  1569. 440.48 s gammaloop-workspace-deps-deps> Compiling strum v0.27.2
  1570. 440.60 s gammaloop-workspace-deps-deps> Compiling ratatui-core v0.1.0
  1571. 440.84 s gammaloop-workspace-deps-deps> Compiling num v0.4.3
  1572. 440.90 s gammaloop-workspace-deps-deps> Compiling ciborium-ll v0.2.2
  1573. 441.12 s gammaloop-workspace-deps-deps> Compiling tabled v0.20.0
  1574. 441.42 s gammaloop-workspace-deps-deps> Compiling ciborium v0.2.2
  1575. 442.24 s gammaloop-workspace-deps-deps> Compiling pyo3-stub-gen-derive v0.17.2
  1576. 443.50 s gammaloop-workspace-deps-deps> Compiling crossterm v0.28.1
  1577. 443.50 s gammaloop-workspace-deps-deps> Compiling simba v0.6.0
  1578. 444.38 s gammaloop-workspace-deps-deps> Compiling rand_distr v0.4.3
  1579. 444.73 s gammaloop-workspace-deps-deps> Compiling ratatui-widgets v0.3.0
  1580. 444.96 s gammaloop-workspace-deps-deps> Compiling thiserror v1.0.69
  1581. 444.97 s gammaloop-workspace-deps-deps> Compiling crossterm v0.29.0
  1582. 445.03 s gammaloop-workspace-deps-deps> Compiling tracing-error v0.2.1
  1583. 445.13 s gammaloop-workspace-deps-deps> Compiling derive_builder v0.11.2
  1584. 445.21 s gammaloop-workspace-deps-deps> Compiling tinytemplate v1.2.1
  1585. 445.25 s gammaloop-workspace-deps-deps> Compiling serde-big-array v0.5.1
  1586. 445.36 s gammaloop-workspace-deps-deps> Compiling xpct v0.5.1
  1587. 445.77 s gammaloop-workspace-deps-deps> Compiling serde_derive_internals v0.29.1
  1588. 446.81 s gammaloop-workspace-deps-deps> Compiling amd v0.2.2
  1589. 447.19 s gammaloop-workspace-deps-deps> Compiling nalgebra v0.29.0
  1590. 447.27 s gammaloop-workspace-deps-deps> Compiling is-terminal v0.4.17
  1591. 447.36 s gammaloop-workspace-deps-deps> Compiling subprocess v0.2.15
  1592. 447.40 s gammaloop-workspace-deps-deps> Compiling rust_lisp v0.18.0
  1593. 448.35 s gammaloop-workspace-deps-deps> Compiling oorandom v11.1.5
  1594. 448.38 s gammaloop-workspace-deps-deps> Compiling anes v0.1.6
  1595. 448.46 s gammaloop-workspace-deps-deps> Compiling rustc-demangle v0.1.27
  1596. 448.52 s gammaloop-workspace-deps-deps> Compiling criterion v0.5.1
  1597. 448.63 s gammaloop-workspace-deps-deps> Compiling deprecate-until v1.0.0
  1598. 449.15 s gammaloop-workspace-deps-deps> Compiling clarabel v0.11.1
  1599. 449.69 s gammaloop-workspace-deps-deps> Compiling backtrace v0.3.76
  1600. 449.87 s gammaloop-workspace-deps-deps> Compiling string-template-plus v0.4.3
  1601. 450.58 s gammaloop-workspace-deps-deps> Compiling phf v0.13.1
  1602. 450.71 s gammaloop-workspace-deps-deps> Compiling ratatui-macros v0.7.0
  1603. 450.78 s gammaloop-workspace-deps-deps> Compiling ratatui-crossterm v0.1.0
  1604. 450.98 s gammaloop-workspace-deps-deps> Compiling color-spantrace v0.3.0
  1605. 451.62 s gammaloop-workspace-deps-deps> Compiling ref-cast v1.0.25
  1606. 451.68 s gammaloop-workspace-deps-deps> Compiling nix v0.31.2
  1607. 451.73 s gammaloop-workspace-deps-deps> Compiling rust-embed-impl v8.11.0
  1608. 452.41 s gammaloop-workspace-deps-deps> Compiling brotli-decompressor v4.0.3
  1609. 452.92 s gammaloop-workspace-deps-deps> Compiling include_dir_macros v0.7.4
  1610. 452.98 s gammaloop-workspace-deps-deps> Compiling integer-sqrt v0.1.5
  1611. 453.05 s gammaloop-workspace-deps-deps> Compiling crossbeam-channel v0.5.15
  1612. 453.25 s gammaloop-workspace-deps-deps> Compiling itertools v0.12.1
  1613. 453.59 s gammaloop-workspace-deps-deps> Compiling unsafe-libyaml v0.2.11
  1614. 453.78 s gammaloop-workspace-deps-deps> Compiling version-compare v0.2.1
  1615. 453.99 s gammaloop-workspace-deps-deps> Compiling statrs v0.16.1
  1616. 454.03 s gammaloop-workspace-deps-deps> Compiling symlink v0.1.0
  1617. 454.08 s gammaloop-workspace-deps-deps> Compiling tracing-appender v0.2.5
  1618. 454.44 s gammaloop-workspace-deps-deps> Compiling serde_yaml v0.9.34+deprecated
  1619. 454.71 s gammaloop-workspace-deps-deps> Compiling momtrop v0.3.0
  1620. 455.10 s gammaloop-workspace-deps-deps> Compiling include_dir v0.7.4
  1621. 455.26 s gammaloop-workspace-deps-deps> Compiling brotli v7.0.0
  1622. 456.01 s gammaloop-workspace-deps-deps> Compiling rust-embed v8.11.0
  1623. 456.09 s gammaloop-workspace-deps-deps> Compiling pathfinding v4.15.0
  1624. 456.63 s gammaloop-workspace-deps-deps> Compiling ctrlc v3.5.2
  1625. 456.89 s gammaloop-workspace-deps-deps> Compiling color-eyre v0.6.5
  1626. 456.97 s gammaloop-workspace-deps-deps> Compiling ratatui v0.30.0
  1627. 457.50 s gammaloop-workspace-deps-deps> Compiling slotmap v1.1.1
  1628. 457.59 s gammaloop-workspace-deps-deps> Compiling tracing-indicatif v0.3.14
  1629. 457.76 s gammaloop-workspace-deps-deps> Compiling typed-index-collections v3.5.0
  1630. 457.80 s gammaloop-workspace-deps-deps> Compiling json5 v0.4.1
  1631. 457.83 s gammaloop-workspace-deps-deps> Compiling vectorize v0.2.0
  1632. 457.89 s gammaloop-workspace-deps-deps> Compiling clap_complete v4.6.3
  1633. 457.91 s gammaloop-workspace-deps-deps> Compiling strum_macros v0.26.4
  1634. 458.06 s gammaloop-workspace-deps-deps> Compiling gammaloop-api v0.1.0 (/build/source/crates/gammaloop-api)
  1635. 458.25 s gammaloop-workspace-deps-deps> Compiling strip-ansi-escapes v0.2.1
  1636. 458.36 s gammaloop-workspace-deps-deps> Compiling fd-lock v4.0.4
  1637. 458.42 s gammaloop-workspace-deps-deps> Compiling schemars_derive v1.2.1
  1638. 458.47 s gammaloop-workspace-deps-deps> Compiling itertools v0.13.0
  1639. 458.51 s gammaloop-workspace-deps-deps> Compiling ringbuffer v0.16.0
  1640. 458.93 s gammaloop-workspace-deps-deps> Compiling strum v0.26.3
  1641. 458.96 s gammaloop-workspace-deps-deps> Compiling slab v0.4.12
  1642. 459.03 s gammaloop-workspace-deps-deps> Compiling base62 v2.2.4
  1643. 459.14 s gammaloop-workspace-deps-deps> Compiling futures-core v0.3.32
  1644. 459.27 s gammaloop-workspace-deps-deps> Compiling futures-task v0.3.32
  1645. 459.29 s gammaloop-workspace-deps-deps> Compiling clap_complete_nushell v4.6.0
  1646. 459.38 s gammaloop-workspace-deps-deps> Compiling futures-util v0.3.32
  1647. 459.40 s gammaloop-workspace-deps-deps> Compiling typeid v1.0.3
  1648. 459.49 s gammaloop-workspace-deps-deps> Compiling gammaloop-tracing-filter v0.1.0 (/build/source/crates/gammaloop-tracing-filter)
  1649. 459.54 s gammaloop-workspace-deps-deps> Compiling getrandom v0.4.2
  1650. 459.56 s gammaloop-workspace-deps-deps> Compiling blake3 v1.8.5
  1651. 459.73 s gammaloop-workspace-deps-deps> Compiling sysinfo v0.33.1
  1652. 459.75 s gammaloop-workspace-deps-deps> Compiling toml_datetime v1.1.1+spec-1.1.0
  1653. 460.21 s gammaloop-workspace-deps-deps> Compiling maplit v1.0.2
  1654. 460.22 s gammaloop-workspace-deps-deps> Compiling inventory v0.3.24
  1655. 460.30 s gammaloop-workspace-deps-deps> Compiling sdd v3.0.10
  1656. 460.58 s gammaloop-workspace-deps-deps> Compiling scc v2.4.0
  1657. 460.73 s gammaloop-workspace-deps-deps> Compiling tempfile v3.27.0
  1658. 460.73 s gammaloop-workspace-deps-deps> Compiling toml_edit v0.25.11+spec-1.1.0
  1659. 461.12 s gammaloop-workspace-deps-deps> Compiling ron v0.12.1
  1660. 461.15 s gammaloop-workspace-deps-deps> Compiling gammaloop-integration-tests v0.1.0 (/build/source/tests)
  1661. 461.41 s gammaloop-workspace-deps-deps> Compiling futures-executor v0.3.32
  1662. 461.66 s gammaloop-workspace-deps-deps> Compiling serial_test_derive v3.4.0
  1663. 461.74 s gammaloop-workspace-deps-deps> Compiling venial v0.5.0
  1664. 462.22 s gammaloop-workspace-deps-deps> Compiling similar v2.7.0
  1665. 462.38 s gammaloop-workspace-deps-deps> Compiling constant_time_eq v0.4.2
  1666. 462.40 s gammaloop-workspace-deps-deps> Compiling cpufeatures v0.3.0
  1667. 462.45 s gammaloop-workspace-deps-deps> Compiling arrayref v0.3.9
  1668. 462.54 s gammaloop-workspace-deps-deps> Compiling which v8.0.2
  1669. 462.61 s gammaloop-workspace-deps-deps> Compiling pathdiff v0.2.3
  1670. 463.14 s gammaloop-workspace-deps-deps> Compiling insta v1.47.2
  1671. 463.58 s gammaloop-workspace-deps-deps> Compiling clinnet v0.1.8 (/build/source/crates/clinnet)
  1672. 463.86 s gammaloop-workspace-deps-deps> Compiling pyo3-stub-gen v0.17.2
  1673. 466.41 s gammaloop-workspace-deps-deps> Compiling wasm-minimal-protocol v0.2.0
  1674. 468.28 s gammaloop-workspace-deps-deps> Compiling serial_test v3.4.0
  1675. 468.91 s gammaloop-workspace-deps-deps> Compiling reedline v0.42.0
  1676. 469.42 s gammaloop-workspace-deps-deps> Compiling schemars v1.2.1
  1677. 494.41 s gammaloop-workspace-deps-deps> Compiling linnet v0.17.0 (/build/source/crates/linnet)
  1678. 494.42 s gammaloop-workspace-deps-deps> Compiling vakint v0.1.2 (/build/source/crates/vakint)
  1679. 661.80 s gammaloop-workspace-deps-deps> Compiling spenso-macros v0.3.2 (/build/source/crates/spenso-macros)
  1680. 661.93 s gammaloop-workspace-deps-deps> Compiling spenso v0.6.0 (/build/source/crates/spenso)
  1681. 661.96 s gammaloop-workspace-deps-deps> Compiling idenso v0.3.0 (/build/source/crates/idenso)
  1682. 661.98 s gammaloop-workspace-deps-deps> Compiling spenso-hep-lib v0.1.7 (/build/source/crates/spenso-hep-lib)
  1683. 662.00 s gammaloop-workspace-deps-deps> Compiling gammalooprs v0.3.3 (/build/source/crates/gammalooprs)
  1684. 662.00 s gammaloop-workspace-deps-deps> Compiling spynso3 v0.1.2 (/build/source/crates/spynso3)
  1685. 788.94 s gammaloop-workspace-deps-deps> Compiling linnet-py v0.1.0 (/build/source/crates/linnet-py)
  1686. 788.95 s gammaloop-workspace-deps-deps> Compiling linnest v0.1.0 (/build/source/crates/linnest)
  1687. 789.23 s gammaloop-workspace-deps-deps> Finished `dev-optim` profile [optimized + debuginfo] target(s) in 6m 42s
  1688. 789.28 s gammaloop-workspace-deps-deps> buildPhase completed in 11 minutes 3 seconds
  1689. 789.28 s gammaloop-workspace-deps-deps> Running phase: checkPhase
  1690. 789.29 s gammaloop-workspace-deps-deps> +++ command cargo test --profile dev-optim --locked --workspace --no-run
  1691. 789.59 s gammaloop-workspace-deps-deps> Compiling proc-macro2 v1.0.106
  1692. 789.60 s gammaloop-workspace-deps-deps> Compiling getrandom v0.2.17
  1693. 789.60 s gammaloop-workspace-deps-deps> Compiling symbolica v1.5.1
  1694. 789.61 s gammaloop-workspace-deps-deps> Compiling regex-automata v0.4.14
  1695. 789.61 s gammaloop-workspace-deps-deps> Compiling serde_json v1.0.149
  1696. 789.62 s gammaloop-workspace-deps-deps> Compiling phf_generator v0.13.1
  1697. 789.62 s gammaloop-workspace-deps-deps> Compiling similar v2.7.0
  1698. 789.63 s gammaloop-workspace-deps-deps> Compiling approx v0.4.0
  1699. 789.64 s gammaloop-workspace-deps-deps> Compiling papergrid v0.17.0
  1700. 789.64 s gammaloop-workspace-deps-deps> Compiling anstream v1.0.0
  1701. 789.64 s gammaloop-workspace-deps-deps> Compiling num-iter v0.1.45
  1702. 789.64 s gammaloop-workspace-deps-deps> Compiling wait-timeout v0.2.1
  1703. 789.64 s gammaloop-workspace-deps-deps> Compiling testing_table v0.3.0
  1704. 789.65 s gammaloop-workspace-deps-deps> Compiling quick-error v1.2.3
  1705. 789.65 s gammaloop-workspace-deps-deps> Compiling bit-vec v0.8.0
  1706. 789.66 s gammaloop-workspace-deps-deps> Compiling base64 v0.21.7
  1707. 789.67 s gammaloop-workspace-deps-deps> Compiling rand_xorshift v0.4.0
  1708. 789.70 s gammaloop-workspace-deps-deps> Compiling rand_core v0.6.4
  1709. 789.72 s gammaloop-workspace-deps-deps> Compiling console v0.15.11
  1710. 789.73 s gammaloop-workspace-deps-deps> Compiling unarray v0.1.4
  1711. 789.77 s gammaloop-workspace-deps-deps> Compiling rusty-fork v0.3.1
  1712. 789.77 s gammaloop-workspace-deps-deps> Compiling const-random-macro v0.1.16
  1713. 789.88 s gammaloop-workspace-deps-deps> Compiling bit-set v0.8.0
  1714. 789.92 s gammaloop-workspace-deps-deps> Compiling rand_xoshiro v0.6.0
  1715. 789.96 s gammaloop-workspace-deps-deps> Compiling quote v1.0.45
  1716. 790.09 s gammaloop-workspace-deps-deps> Compiling syn v2.0.117
  1717. 790.11 s gammaloop-workspace-deps-deps> Compiling syn v1.0.109
  1718. 790.15 s gammaloop-workspace-deps-deps> Compiling venial v0.5.0
  1719. 790.24 s gammaloop-workspace-deps-deps> Compiling similar-asserts v1.7.0
  1720. 790.24 s gammaloop-workspace-deps-deps> Compiling const-random v0.1.18
  1721. 791.03 s gammaloop-workspace-deps-deps> Compiling proc-macro-error-attr2 v2.0.0
  1722. 791.17 s gammaloop-workspace-deps-deps> Compiling proc-macro-error-attr v1.0.4
  1723. 791.31 s gammaloop-workspace-deps-deps> Compiling include_dir_macros v0.7.4
  1724. 791.98 s gammaloop-workspace-deps-deps> Compiling wasm-minimal-protocol v0.2.0
  1725. 792.21 s gammaloop-workspace-deps-deps> Compiling include_dir v0.7.4
  1726. 792.30 s gammaloop-workspace-deps-deps> Compiling matchers v0.2.0
  1727. 792.30 s gammaloop-workspace-deps-deps> Compiling regex v1.12.3
  1728. 792.50 s gammaloop-workspace-deps-deps> Compiling proc-macro-error v1.0.4
  1729. 792.50 s gammaloop-workspace-deps-deps> Compiling darling_core v0.14.4
  1730. 792.83 s gammaloop-workspace-deps-deps> Compiling env_filter v1.0.1
  1731. 792.96 s gammaloop-workspace-deps-deps> Compiling env_logger v0.11.10
  1732. 793.80 s gammaloop-workspace-deps-deps> Compiling pyo3-macros-backend v0.28.3
  1733. 793.87 s gammaloop-workspace-deps-deps> Compiling pest_generator v2.8.6
  1734. 794.13 s gammaloop-workspace-deps-deps> Compiling proc-macro2-diagnostics v0.10.1
  1735. 794.26 s gammaloop-workspace-deps-deps> Compiling proc-macro-error2 v2.0.1
  1736. 794.31 s gammaloop-workspace-deps-deps> Compiling darling_core v0.23.0
  1737. 794.52 s gammaloop-workspace-deps-deps> Compiling serde_derive_internals v0.29.1
  1738. 794.76 s gammaloop-workspace-deps-deps> Compiling test-log-core v0.2.20
  1739. 797.17 s gammaloop-workspace-deps-deps> Compiling duplicate v1.0.0
  1740. 797.44 s gammaloop-workspace-deps-deps> Compiling nalgebra-macros v0.1.0
  1741. 798.68 s gammaloop-workspace-deps-deps> Compiling darling_macro v0.14.4
  1742. 800.72 s gammaloop-workspace-deps-deps> Compiling serde_derive v1.0.228
  1743. 800.76 s gammaloop-workspace-deps-deps> Compiling zerocopy-derive v0.8.48
  1744. 802.70 s gammaloop-workspace-deps-deps> Compiling tracing-attributes v0.1.31
  1745. 802.75 s gammaloop-workspace-deps-deps> Compiling thiserror-impl v2.0.18
  1746. 802.79 s gammaloop-workspace-deps-deps> Compiling is-macro v0.3.7
  1747. 802.85 s gammaloop-workspace-deps-deps> Compiling pest_derive v2.8.6
  1748. 802.96 s gammaloop-workspace-deps-deps> Compiling serde_repr v0.1.20
  1749. 803.16 s gammaloop-workspace-deps-deps> Compiling duplicate v2.0.1
  1750. 803.23 s gammaloop-workspace-deps-deps> Compiling tabled_derive v0.11.0
  1751. 803.23 s gammaloop-workspace-deps-deps> Compiling delegate v0.12.0
  1752. 803.31 s gammaloop-workspace-deps-deps> Compiling dot-parser v0.5.1
  1753. 803.52 s gammaloop-workspace-deps-deps> Compiling pyo3-macros v0.28.3
  1754. 803.53 s gammaloop-workspace-deps-deps> Compiling derive_more v0.99.20
  1755. 803.67 s gammaloop-workspace-deps-deps> Compiling enum-try-as-inner v0.1.1
  1756. 804.59 s gammaloop-workspace-deps-deps> Compiling phf_macros v0.13.1
  1757. 806.19 s gammaloop-workspace-deps-deps> Compiling clap_derive v4.6.1
  1758. 806.44 s gammaloop-workspace-deps-deps> Compiling derive_more-impl v2.1.1
  1759. 807.42 s gammaloop-workspace-deps-deps> Compiling darling_macro v0.23.0
  1760. 808.18 s gammaloop-workspace-deps-deps> Compiling strum_macros v0.27.2
  1761. 808.44 s gammaloop-workspace-deps-deps> Compiling darling v0.14.4
  1762. 808.49 s gammaloop-workspace-deps-deps> Compiling derive_builder_core v0.11.2
  1763. 808.83 s gammaloop-workspace-deps-deps> Compiling rustpython-parser-core v0.4.0
  1764. 808.96 s gammaloop-workspace-deps-deps> Compiling zerocopy v0.8.48
  1765. 809.03 s gammaloop-workspace-deps-deps> Compiling thiserror-impl v1.0.69
  1766. 809.82 s gammaloop-workspace-deps-deps> Compiling phf v0.13.1
  1767. 809.95 s gammaloop-workspace-deps-deps> Compiling enum_dispatch v0.3.13
  1768. 810.13 s gammaloop-workspace-deps-deps> Compiling serde v1.0.228
  1769. 810.54 s gammaloop-workspace-deps-deps> Compiling darling v0.23.0
  1770. 810.60 s gammaloop-workspace-deps-deps> Compiling smallvec v1.15.1
  1771. 810.72 s gammaloop-workspace-deps-deps> Compiling num-complex v0.4.6
  1772. 810.86 s gammaloop-workspace-deps-deps> Compiling tracing-serde v0.2.0
  1773. 810.97 s gammaloop-workspace-deps-deps> Compiling num-bigint v0.4.6
  1774. 811.16 s gammaloop-workspace-deps-deps> Compiling bincode v2.0.1
  1775. 811.36 s gammaloop-workspace-deps-deps> Compiling thiserror v2.0.18
  1776. 811.42 s gammaloop-workspace-deps-deps> Compiling simba v0.9.1
  1777. 811.96 s gammaloop-workspace-deps-deps> Compiling ppv-lite86 v0.2.21
  1778. 812.00 s gammaloop-workspace-deps-deps> Compiling bincode-trait-derive v0.1.1
  1779. 812.30 s gammaloop-workspace-deps-deps> Compiling rand_chacha v0.3.1
  1780. 812.43 s gammaloop-workspace-deps-deps> Compiling rand_chacha v0.9.0
  1781. 812.83 s gammaloop-workspace-deps-deps> Compiling rand v0.8.6
  1782. 813.03 s gammaloop-workspace-deps-deps> Compiling pyo3 v0.28.3
  1783. 813.10 s gammaloop-workspace-deps-deps> Compiling rand v0.9.4
  1784. 813.12 s gammaloop-workspace-deps-deps> Compiling ahash v0.8.12
  1785. 813.19 s gammaloop-workspace-deps-deps> Compiling tracing v0.1.44
  1786. 813.19 s gammaloop-workspace-deps-deps> Compiling rustpython-ast v0.4.0
  1787. 813.30 s gammaloop-workspace-deps-deps> Compiling ndarray v0.17.2
  1788. 813.51 s gammaloop-workspace-deps-deps> Compiling tracing-subscriber v0.3.23
  1789. 813.77 s gammaloop-workspace-deps-deps> Compiling phf_generator v0.11.3
  1790. 813.80 s gammaloop-workspace-deps-deps> Compiling rug v1.30.0
  1791. 814.19 s gammaloop-workspace-deps-deps> Compiling phf_codegen v0.11.3
  1792. 814.30 s gammaloop-workspace-deps-deps> Compiling unicode_names2_generator v1.3.0
  1793. 814.41 s gammaloop-workspace-deps-deps> Compiling rustpython-parser v0.4.0
  1794. 815.03 s gammaloop-workspace-deps-deps> Compiling xprec v0.2.2
  1795. 815.78 s gammaloop-workspace-deps-deps> Compiling symjit v2.14.9
  1796. 815.80 s gammaloop-workspace-deps-deps> Compiling smartstring v1.0.1
  1797. 817.48 s gammaloop-workspace-deps-deps> Compiling unicode_names2 v1.3.0
  1798. 817.72 s gammaloop-workspace-deps-deps> Compiling numpy v0.28.0
  1799. 817.83 s gammaloop-workspace-deps-deps> Compiling bitvec v1.0.1
  1800. 818.19 s gammaloop-workspace-deps-deps> Compiling serde_spanned v0.6.9
  1801. 818.21 s gammaloop-workspace-deps-deps> Compiling toml_datetime v0.6.11
  1802. 818.43 s gammaloop-workspace-deps-deps> Compiling toml_edit v0.22.27
  1803. 818.47 s gammaloop-workspace-deps-deps> Compiling cgmath v0.18.0
  1804. 819.45 s gammaloop-workspace-deps-deps> Compiling chrono v0.4.44
  1805. 820.39 s gammaloop-workspace-deps-deps> Compiling toml v0.8.23
  1806. 821.24 s gammaloop-workspace-deps-deps> Compiling numerica v1.4.3
  1807. 821.53 s gammaloop-workspace-deps-deps> Compiling figment v0.10.19
  1808. 821.96 s gammaloop-workspace-deps-deps> Compiling num-rational v0.4.2
  1809. 822.31 s gammaloop-workspace-deps-deps> Compiling num v0.4.3
  1810. 822.36 s gammaloop-workspace-deps-deps> Compiling tabled v0.20.0
  1811. 822.38 s gammaloop-workspace-deps-deps> Compiling string-template-plus v0.4.3
  1812. 823.14 s gammaloop-workspace-deps-deps> Compiling half v2.7.1
  1813. 823.43 s gammaloop-workspace-deps-deps> Compiling ciborium-ll v0.2.2
  1814. 823.57 s gammaloop-workspace-deps-deps> Compiling clap v4.6.1
  1815. 823.63 s gammaloop-workspace-deps-deps> Compiling ciborium v0.2.2
  1816. 823.68 s gammaloop-workspace-deps-deps> Compiling parking_lot_core v0.9.12
  1817. 823.69 s gammaloop-workspace-deps-deps> Compiling ron v0.12.1
  1818. 823.76 s gammaloop-workspace-deps-deps> Compiling tinytemplate v1.2.1
  1819. 824.00 s gammaloop-workspace-deps-deps> Compiling parking_lot v0.12.5
  1820. 824.76 s gammaloop-workspace-deps-deps> Compiling graphica v1.2.1
  1821. 824.79 s gammaloop-workspace-deps-deps> Compiling insta v1.47.2
  1822. 825.40 s gammaloop-workspace-deps-deps> Compiling criterion v0.5.1
  1823. 825.59 s gammaloop-workspace-deps-deps> Compiling derive_more v2.1.1
  1824. 825.66 s gammaloop-workspace-deps-deps> Compiling strum v0.27.2
  1825. 825.70 s gammaloop-workspace-deps-deps> Compiling kasuari v0.4.12
  1826. 825.86 s gammaloop-workspace-deps-deps> Compiling instability v0.3.12
  1827. 826.42 s gammaloop-workspace-deps-deps> Compiling ratatui-core v0.1.0
  1828. 828.90 s gammaloop-workspace-deps-deps> Compiling crossterm v0.28.1
  1829. 828.99 s gammaloop-workspace-deps-deps> Compiling derive_builder_macro v0.11.2
  1830. 829.44 s gammaloop-workspace-deps-deps> Compiling rand_distr v0.4.3
  1831. 830.00 s gammaloop-workspace-deps-deps> Compiling simba v0.6.0
  1832. 831.24 s gammaloop-workspace-deps-deps> Compiling crossterm v0.29.0
  1833. 832.98 s gammaloop-workspace-deps-deps> Compiling derive_builder v0.11.2
  1834. 833.00 s gammaloop-workspace-deps-deps> Compiling thiserror v1.0.69
  1835. 833.08 s gammaloop-workspace-deps-deps> Compiling tracing-error v0.2.1
  1836. 833.14 s gammaloop-workspace-deps-deps> Compiling serde-big-array v0.5.1
  1837. 833.30 s gammaloop-workspace-deps-deps> Compiling ref-cast-impl v1.0.25
  1838. 833.42 s gammaloop-workspace-deps-deps> Compiling color-spantrace v0.3.0
  1839. 834.26 s gammaloop-workspace-deps-deps> Compiling clarabel v0.11.1
  1840. 834.39 s gammaloop-workspace-deps-deps> Compiling deprecate-until v1.0.0
  1841. 834.77 s gammaloop-workspace-deps-deps> Compiling schemars_derive v1.2.1
  1842. 834.79 s gammaloop-workspace-deps-deps> Compiling color-eyre v0.6.5
  1843. 836.20 s gammaloop-workspace-deps-deps> Compiling nalgebra v0.29.0
  1844. 836.52 s gammaloop-workspace-deps-deps> Compiling pathfinding v4.15.0
  1845. 836.62 s gammaloop-workspace-deps-deps> Compiling ratatui-widgets v0.3.0
  1846. 836.69 s gammaloop-workspace-deps-deps> Compiling ratatui-crossterm v0.1.0
  1847. 837.10 s gammaloop-workspace-deps-deps> Compiling tracing-appender v0.2.5
  1848. 837.35 s gammaloop-workspace-deps-deps> Compiling tracing-indicatif v0.3.14
  1849. 838.70 s gammaloop-workspace-deps-deps> Compiling ratatui-macros v0.7.0
  1850. 838.77 s gammaloop-workspace-deps-deps> Compiling ratatui v0.30.0
  1851. 838.97 s gammaloop-workspace-deps-deps> Compiling ref-cast v1.0.25
  1852. 838.98 s gammaloop-workspace-deps-deps> Compiling typed-index-collections v3.5.0
  1853. 839.05 s gammaloop-workspace-deps-deps> Compiling serde_yaml v0.9.34+deprecated
  1854. 839.47 s gammaloop-workspace-deps-deps> Compiling vectorize v0.2.0
  1855. 839.58 s gammaloop-workspace-deps-deps> Compiling json5 v0.4.1
  1856. 839.59 s gammaloop-workspace-deps-deps> Compiling slotmap v1.1.1
  1857. 839.66 s gammaloop-workspace-deps-deps> Compiling rust-embed-impl v8.11.0
  1858. 840.36 s gammaloop-workspace-deps-deps> Compiling clap_complete v4.6.3
  1859. 840.59 s gammaloop-workspace-deps-deps> Compiling gammaloop-tracing-filter v0.1.0 (/build/source/crates/gammaloop-tracing-filter)
  1860. 840.68 s gammaloop-workspace-deps-deps> Compiling strum_macros v0.26.4
  1861. 840.71 s gammaloop-workspace-deps-deps> Compiling pyo3-stub-gen-derive v0.17.2
  1862. 841.53 s gammaloop-workspace-deps-deps> Compiling clap_complete_nushell v4.6.0
  1863. 841.79 s gammaloop-workspace-deps-deps> Compiling test-log-macros v0.2.20
  1864. 842.17 s gammaloop-workspace-deps-deps> Compiling serial_test_derive v3.4.0
  1865. 845.58 s gammaloop-workspace-deps-deps> Compiling test-log v0.2.20
  1866. 846.53 s gammaloop-workspace-deps-deps> Compiling iai-callgrind-macros v0.5.1
  1867. 846.69 s gammaloop-workspace-deps-deps> Compiling rust-embed v8.11.0
  1868. 847.13 s gammaloop-workspace-deps-deps> Compiling ron v0.8.1
  1869. 847.48 s gammaloop-workspace-deps-deps> Compiling statrs v0.16.1
  1870. 847.57 s gammaloop-workspace-deps-deps> Compiling bincode v1.3.3
  1871. 848.31 s gammaloop-workspace-deps-deps> Compiling iai-callgrind-runner v0.14.2
  1872. 848.37 s gammaloop-workspace-deps-deps> Compiling linnet v0.17.0 (/build/source/crates/linnet)
  1873. 848.47 s gammaloop-workspace-deps-deps> Compiling proptest v1.11.0
  1874. 849.32 s gammaloop-workspace-deps-deps> Compiling momtrop v0.3.0
  1875. 850.02 s gammaloop-workspace-deps-deps> Compiling kurbo v0.11.3
  1876. 850.42 s gammaloop-workspace-deps-deps> Compiling clinnet v0.1.8 (/build/source/crates/clinnet)
  1877. 852.75 s gammaloop-workspace-deps-deps> Compiling serial_test v3.4.0
  1878. 855.22 s gammaloop-workspace-deps-deps> Compiling schemars v1.2.1
  1879. 857.46 s gammaloop-workspace-deps-deps> Compiling reedline v0.42.0
  1880. 857.78 s gammaloop-workspace-deps-deps> Compiling iai-callgrind v0.14.2
  1881. 860.42 s gammaloop-workspace-deps-deps> Compiling pyo3-stub-gen v0.17.2
  1882. 899.66 s gammaloop-workspace-deps-deps> Compiling vakint v0.1.2 (/build/source/crates/vakint)
  1883. 1064.17 s gammaloop-workspace-deps-deps> Compiling spenso-macros v0.3.2 (/build/source/crates/spenso-macros)
  1884. 1064.35 s gammaloop-workspace-deps-deps> Compiling spenso v0.6.0 (/build/source/crates/spenso)
  1885. 1064.38 s gammaloop-workspace-deps-deps> Compiling idenso v0.3.0 (/build/source/crates/idenso)
  1886. 1064.40 s gammaloop-workspace-deps-deps> Compiling spenso-hep-lib v0.1.7 (/build/source/crates/spenso-hep-lib)
  1887. 1064.43 s gammaloop-workspace-deps-deps> Compiling gammalooprs v0.3.3 (/build/source/crates/gammalooprs)
  1888. 1064.43 s gammaloop-workspace-deps-deps> Compiling spynso3 v0.1.2 (/build/source/crates/spynso3)
  1889. 1220.42 s gammaloop-workspace-deps-deps> Compiling gammaloop-api v0.1.0 (/build/source/crates/gammaloop-api)
  1890. 1220.44 s gammaloop-workspace-deps-deps> Compiling linnest v0.1.0 (/build/source/crates/linnest)
  1891. 1220.44 s gammaloop-workspace-deps-deps> Compiling linnet-py v0.1.0 (/build/source/crates/linnet-py)
  1892. 1220.63 s gammaloop-workspace-deps-deps> Compiling gammaloop-integration-tests v0.1.0 (/build/source/tests)
  1893. 1221.30 s gammaloop-workspace-deps-deps> Finished `dev-optim` profile [optimized + debuginfo] target(s) in 7m 12s
  1894. 1221.33 s gammaloop-workspace-deps-deps> Executable unittests src/main.rs (target/dev-optim/deps/linnet-100def7db1c5983f)
  1895. 1221.33 s gammaloop-workspace-deps-deps> Executable unittests src/lib.rs (target/dev-optim/deps/gammaloop_api-f32f03271f911d01)
  1896. 1221.33 s gammaloop-workspace-deps-deps> Executable unittests src/cli.rs (target/dev-optim/deps/gammaloop-02fb4433a93a11a8)
  1897. 1221.33 s gammaloop-workspace-deps-deps> Executable unittests src/lib.rs (target/dev-optim/deps/gammaloop_integration_tests-bdc362596fd4d9ae)
  1898. 1221.33 s gammaloop-workspace-deps-deps> Executable tests/test_cli.rs (target/dev-optim/deps/test_cli-045bbd355fab5f79)
  1899. 1221.33 s gammaloop-workspace-deps-deps> Executable tests/test_clustering.rs (target/dev-optim/deps/test_clustering-4ab5743b6be1e268)
  1900. 1221.33 s gammaloop-workspace-deps-deps> Executable tests/test_differential.rs (target/dev-optim/deps/test_differential-f521d7739df95dad)
  1901. 1221.33 s gammaloop-workspace-deps-deps> Executable tests/test_evaluation_api.rs (target/dev-optim/deps/test_evaluation_api-f5fc87d924b6fc24)
  1902. 1221.33 s gammaloop-workspace-deps-deps> Executable tests/test_evaluation_command.rs (target/dev-optim/deps/test_evaluation_command-81e0a6bcec0efc91)
  1903. 1221.33 s gammaloop-workspace-deps-deps> Executable tests/test_feyngen.rs (target/dev-optim/deps/test_feyngen-99903300d790406b)
  1904. 1221.33 s gammaloop-workspace-deps-deps> Executable tests/test_python_api.rs (target/dev-optim/deps/test_python_api-53de1da62651237d)
  1905. 1221.33 s gammaloop-workspace-deps-deps> Executable tests/test_runs.rs (target/dev-optim/deps/test_runs-5a092b7d26a7ea08)
  1906. 1221.33 s gammaloop-workspace-deps-deps> Executable tests/uv.rs (target/dev-optim/deps/uv-7f5e7a74943e7cc8)
  1907. 1221.33 s gammaloop-workspace-deps-deps> Executable unittests src/lib.rs (target/dev-optim/deps/gammaloop_tracing_filter-9a4348007109c79e)
  1908. 1221.33 s gammaloop-workspace-deps-deps> Executable unittests src/lib.rs (target/dev-optim/deps/gammalooprs-329186ddb903bcc5)
  1909. 1221.33 s gammaloop-workspace-deps-deps> Executable tests/test_renormalization.rs (target/dev-optim/deps/test_renormalization-95e27e1486f7069b)
  1910. 1221.33 s gammaloop-workspace-deps-deps> Executable unittests src/lib.rs (target/dev-optim/deps/idenso-8c0054270d65e2ee)
  1911. 1221.33 s gammaloop-workspace-deps-deps> Executable tests/network_informed.rs (target/dev-optim/deps/network_informed-48ba3f9ef67ac703)
  1912. 1221.33 s gammaloop-workspace-deps-deps> Executable unittests src/lib.rs (target/dev-optim/deps/linnest-bdfe7a171c56e8ff)
  1913. 1221.33 s gammaloop-workspace-deps-deps> Executable unittests src/lib.rs (target/dev-optim/deps/linnet-1d419bad15b53834)
  1914. 1221.33 s gammaloop-workspace-deps-deps> Executable unittests src/lib.rs (target/dev-optim/deps/linnet_py-e96780e3be62b306)
  1915. 1221.33 s gammaloop-workspace-deps-deps> Executable unittests src/bin/stubgen.rs (target/dev-optim/deps/stubgen-507884456132ea26)
  1916. 1221.33 s gammaloop-workspace-deps-deps> Executable unittests src/spenso.rs (target/dev-optim/deps/spenso-45d9e3a62a4b7c85)
  1917. 1221.33 s gammaloop-workspace-deps-deps> Executable tests/three_loop.rs (target/dev-optim/deps/three_loop-89e4751b89707d62)
  1918. 1221.33 s gammaloop-workspace-deps-deps> Executable unittests src/lib.rs (target/dev-optim/deps/spenso_hep_lib-a69e866f82b03e4b)
  1919. 1221.33 s gammaloop-workspace-deps-deps> Executable tests/exterior_product.rs (target/dev-optim/deps/exterior_product-2e37c61398c6cf00)
  1920. 1221.33 s gammaloop-workspace-deps-deps> Executable tests/gamma_algebra_validate.rs (target/dev-optim/deps/gamma_algebra_validate-16b6c15bd149c931)
  1921. 1221.33 s gammaloop-workspace-deps-deps> Executable unittests src/lib.rs (target/dev-optim/deps/spenso_macros-1107c9c01bd550d6)
  1922. 1221.33 s gammaloop-workspace-deps-deps> Executable tests/derive_rep.rs (target/dev-optim/deps/derive_rep-8191deb84c2c5c46)
  1923. 1221.33 s gammaloop-workspace-deps-deps> Executable unittests src/lib.rs (target/dev-optim/deps/spynso3-0bbbc23f1e2b22f8)
  1924. 1221.33 s gammaloop-workspace-deps-deps> Executable unittests src/lib.rs (target/dev-optim/deps/vakint-d0b77c331dc50c23)
  1925. 1221.33 s gammaloop-workspace-deps-deps> Executable tests/input_matching_tests.rs (target/dev-optim/deps/input_matching_tests-d5d8977b89ed5643)
  1926. 1221.33 s gammaloop-workspace-deps-deps> Executable tests/integral_alphaloop_vs_matad_tests.rs (target/dev-optim/deps/integral_alphaloop_vs_matad_tests-53bda35e1fd02367)
  1927. 1221.33 s gammaloop-workspace-deps-deps> Executable tests/integral_comparison_vs_pysecdec_tests.rs (target/dev-optim/deps/integral_comparison_vs_pysecdec_tests-bdca86ded5005937)
  1928. 1221.33 s gammaloop-workspace-deps-deps> Executable tests/integral_evaluation_analytic_tests.rs (target/dev-optim/deps/integral_evaluation_analytic_tests-fe0e00e168c92874)
  1929. 1221.33 s gammaloop-workspace-deps-deps> Executable tests/integral_evaluation_freeform_tests.rs (target/dev-optim/deps/integral_evaluation_freeform_tests-513e13036f1dd0de)
  1930. 1221.33 s gammaloop-workspace-deps-deps> Executable tests/integral_evaluation_pysecdec_tests.rs (target/dev-optim/deps/integral_evaluation_pysecdec_tests-474885bf8743c54e)
  1931. 1221.33 s gammaloop-workspace-deps-deps> Executable tests/tensor_reduction_tests.rs (target/dev-optim/deps/tensor_reduction_tests-36dc158bac4f9d42)
  1932. 1221.33 s gammaloop-workspace-deps-deps> Executable tests/test_utils.rs (target/dev-optim/deps/test_utils-1f8f4b937228b7ec)
  1933. 1221.35 s gammaloop-workspace-deps-deps> checkPhase completed in 7 minutes 12 seconds
  1934. 1221.35 s gammaloop-workspace-deps-deps> Running phase: installPhase
  1935. 1221.36 s gammaloop-workspace-deps-deps> no previous artifacts found, compressing and installing full archive of target to /nix/store/g91zjhbw7sfq2h1pijj7b8hn2fp9z646-gammaloop-workspace-deps-deps-0.1.0/target.tar.zst
  1936. 1226.66 s gammaloop-workspace-deps-deps> /*stdin*\ : 21.42% ( 6.97 GiB => 1.49 GiB, /nix/store/g91zjhbw7sfq2h1pijj7b8hn2fp9z646-gammaloop-workspace-deps-deps-0.1.0/target.tar.zst)
  1937. 1226.70 s gammaloop-workspace-deps-deps> Running phase: fixupPhase
  1938. 1226.71 s gammaloop-workspace-deps-deps> shrinking RPATHs of ELF executables and libraries in /nix/store/g91zjhbw7sfq2h1pijj7b8hn2fp9z646-gammaloop-workspace-deps-deps-0.1.0
  1939. 1226.72 s gammaloop-workspace-deps-deps> checking for references to /build/ in /nix/store/g91zjhbw7sfq2h1pijj7b8hn2fp9z646-gammaloop-workspace-deps-deps-0.1.0...
  1940. 1226.73 s gammaloop-workspace-deps-deps> patching script interpreter paths in /nix/store/g91zjhbw7sfq2h1pijj7b8hn2fp9z646-gammaloop-workspace-deps-deps-0.1.0
  1941. 1229.57 s gammaloop-workspace-deps-deps (post)> Uploading to the NixCI cache: /nix/store/g91zjhbw7sfq2h1pijj7b8hn2fp9z646-gammaloop-workspace-deps-deps-0.1.0
  1942. 1229.62 s gammaloop-workspace-deps-deps (post)> warning: 'warn-short-path-literals' is deprecated, use 'lint-short-path-literals = ignore' instead
  1943. 1229.66 s gammaloop-workspace-deps-deps (post)> copying 1 paths...
  1944. 1229.66 s gammaloop-workspace-deps-deps (post)> copying path '/nix/store/g91zjhbw7sfq2h1pijj7b8hn2fp9z646-gammaloop-workspace-deps-deps-0.1.0' to 'https://cache.nix-ci.com'...
  1945. 1368.48 s gammaloop-workspace-deps-deps (post)> warning: 'warn-short-path-literals' is deprecated, use 'lint-short-path-literals = ignore' instead
  1946. 1368.63 s gammaloop-workspace-deps-deps (post)> copying 0 paths...
  1947. 1368.76 s [110/112 built, 5 copied [1/110/111 built, 5 copigammaloop-nextest-core-nextest> Running phase: unpackPhase
  1948. 1368.76 s gammaloop-nextest-core-nextest> unpacking source archive /nix/store/2gfjwwccz6smw12y5x0gwjf4f3jnyqpn-source
  1949. 1368.83 s gammaloop-nextest-core-nextest> source root is source
  1950. 1368.85 s gammaloop-nextest-core-nextest> Running phase: patchPhase
  1951. 1368.85 s gammaloop-nextest-core-nextest> Executing configureCargoCommonVars
  1952. 1368.86 s gammaloop-nextest-core-nextest> decompressing cargo artifacts from /nix/store/g91zjhbw7sfq2h1pijj7b8hn2fp9z646-gammaloop-workspace-deps-deps-0.1.0/target.tar.zst to target
  1953. 1389.38 s gammaloop-nextest-core-nextest> Running phase: updateAutotoolsGnuConfigScriptsPhase
  1954. 1389.45 s gammaloop-nextest-core-nextest> Running phase: configurePhase
  1955. 1389.63 s gammaloop-nextest-core-nextest> will append /build/source/.cargo-home/config.toml with contents of /nix/store/56mr0d5hrl1xh08y02lfig5azk7f8563-vendor-cargo-deps/config.toml
  1956. 1389.63 s gammaloop-nextest-core-nextest> default configurePhase, nothing to do
  1957. 1389.64 s gammaloop-nextest-core-nextest> Running phase: buildPhase
  1958. 1390.08 s gammaloop-nextest-core-nextest> +++ command cargo --version
  1959. 1390.09 s gammaloop-nextest-core-nextest> cargo 1.95.0 (f2d3ce0bd 2026-03-21)
  1960. 1390.09 s gammaloop-nextest-core-nextest> +++ command cargo nextest --version
  1961. 1390.10 s gammaloop-nextest-core-nextest> cargo-nextest 0.9.133
  1962. 1390.10 s gammaloop-nextest-core-nextest> release: 0.9.133
  1963. 1390.10 s gammaloop-nextest-core-nextest> host: x86_64-unknown-linux-gnu
  1964. 1390.11 s gammaloop-nextest-core-nextest> Running phase: checkPhase
  1965. 1390.47 s gammaloop-nextest-core-nextest> +++ command cargo nextest run --cargo-profile dev-optim --locked -p gammaloop-api -p gammaloop-tracing-filter -p gammalooprs --profile ci_gammaloop --no-fail-fast --final-status-level fail --no-tests=pass --run-ignored all
  1966. 1394.60 s gammaloop-nextest-core-nextest> Compiling syn v2.0.117
  1967. 1394.61 s gammaloop-nextest-core-nextest> Compiling tiny-keccak v2.0.2
  1968. 1394.61 s gammaloop-nextest-core-nextest> Compiling getrandom v0.2.17
  1969. 1394.61 s gammaloop-nextest-core-nextest> Compiling num-integer v0.1.46
  1970. 1394.62 s gammaloop-nextest-core-nextest> Compiling indexmap v2.14.0
  1971. 1394.63 s gammaloop-nextest-core-nextest> Compiling symbolica v1.5.1
  1972. 1394.64 s gammaloop-nextest-core-nextest> Compiling vakint v0.1.2 (/build/source/crates/vakint)
  1973. 1394.65 s gammaloop-nextest-core-nextest> Compiling gammalooprs v0.3.3 (/build/source/crates/gammalooprs)
  1974. 1394.66 s gammaloop-nextest-core-nextest> Compiling gammaloop-api v0.1.0 (/build/source/crates/gammaloop-api)
  1975. 1394.94 s gammaloop-nextest-core-nextest> Compiling num-iter v0.1.45
  1976. 1395.62 s gammaloop-nextest-core-nextest> Compiling const-random-macro v0.1.16
  1977. 1395.63 s gammaloop-nextest-core-nextest> Compiling petgraph v0.8.3
  1978. 1395.99 s gammaloop-nextest-core-nextest> Compiling const-random v0.1.18
  1979. 1397.50 s gammaloop-nextest-core-nextest> Compiling pest_generator v2.8.6
  1980. 1397.50 s gammaloop-nextest-core-nextest> Compiling darling_core v0.23.0
  1981. 1397.50 s gammaloop-nextest-core-nextest> Compiling proc-macro2-diagnostics v0.10.1
  1982. 1397.50 s gammaloop-nextest-core-nextest> Compiling proc-macro-error2 v2.0.1
  1983. 1397.50 s gammaloop-nextest-core-nextest> Compiling serde_derive_internals v0.29.1
  1984. 1408.97 s gammaloop-nextest-core-nextest> Compiling serde_derive v1.0.228
  1985. 1409.24 s gammaloop-nextest-core-nextest> Compiling zerocopy-derive v0.8.48
  1986. 1411.30 s gammaloop-nextest-core-nextest> Compiling tracing-attributes v0.1.31
  1987. 1411.71 s gammaloop-nextest-core-nextest> Compiling thiserror-impl v2.0.18
  1988. 1412.04 s gammaloop-nextest-core-nextest> Compiling bincode-trait-derive v0.1.1
  1989. 1412.10 s gammaloop-nextest-core-nextest> Compiling strum_macros v0.27.2
  1990. 1412.29 s gammaloop-nextest-core-nextest> Compiling pest_derive v2.8.6
  1991. 1412.39 s gammaloop-nextest-core-nextest> Compiling clap_derive v4.6.1
  1992. 1412.55 s gammaloop-nextest-core-nextest> Compiling derive_more-impl v2.1.1
  1993. 1412.78 s gammaloop-nextest-core-nextest> Compiling serde_repr v0.1.20
  1994. 1413.25 s gammaloop-nextest-core-nextest> Compiling duplicate v2.0.1
  1995. 1413.87 s gammaloop-nextest-core-nextest> Compiling tabled_derive v0.11.0
  1996. 1414.11 s gammaloop-nextest-core-nextest> Compiling dot-parser v0.5.1
  1997. 1414.38 s gammaloop-nextest-core-nextest> Compiling darling_macro v0.23.0
  1998. 1418.01 s gammaloop-nextest-core-nextest> Compiling enum-try-as-inner v0.1.1
  1999. 1425.31 s gammaloop-nextest-core-nextest> Compiling thiserror-impl v1.0.69
  2000. 1427.02 s gammaloop-nextest-core-nextest> Compiling darling v0.23.0
  2001. 1427.18 s gammaloop-nextest-core-nextest> Compiling instability v0.3.12
  2002. 1428.29 s gammaloop-nextest-core-nextest> Compiling delegate v0.12.0
  2003. 1429.65 s gammaloop-nextest-core-nextest> Compiling derive_more v0.99.20
  2004. 1432.99 s gammaloop-nextest-core-nextest> Compiling phf_macros v0.13.1
  2005. 1435.63 s gammaloop-nextest-core-nextest> Compiling enum_dispatch v0.3.13
  2006. 1439.07 s gammaloop-nextest-core-nextest> Compiling ref-cast-impl v1.0.25
  2007. 1447.94 s gammaloop-nextest-core-nextest> Compiling derive_more v2.1.1
  2008. 1448.24 s gammaloop-nextest-core-nextest> Compiling schemars_derive v1.2.1
  2009. 1459.22 s gammaloop-nextest-core-nextest> Compiling zerocopy v0.8.48
  2010. 1464.32 s gammaloop-nextest-core-nextest> Compiling deprecate-until v1.0.0
  2011. 1464.54 s gammaloop-nextest-core-nextest> Compiling phf v0.13.1
  2012. 1464.87 s gammaloop-nextest-core-nextest> Compiling rust-embed-impl v8.11.0
  2013. 1465.89 s gammaloop-nextest-core-nextest> Compiling ref-cast v1.0.25
  2014. 1465.93 s gammaloop-nextest-core-nextest> Compiling strum_macros v0.26.4
  2015. 1466.37 s gammaloop-nextest-core-nextest> Compiling thiserror v2.0.18
  2016. 1466.56 s gammaloop-nextest-core-nextest> Compiling kasuari v0.4.12
  2017. 1467.65 s gammaloop-nextest-core-nextest> Compiling tracing v0.1.44
  2018. 1468.80 s gammaloop-nextest-core-nextest> Compiling tracing-subscriber v0.3.23
  2019. 1468.89 s gammaloop-nextest-core-nextest> Compiling tabled v0.20.0
  2020. 1469.01 s gammaloop-nextest-core-nextest> Compiling pathfinding v4.15.0
  2021. 1474.84 s gammaloop-nextest-core-nextest> Compiling clap v4.6.1
  2022. 1475.02 s gammaloop-nextest-core-nextest> Compiling clap_complete v4.6.3
  2023. 1477.47 s gammaloop-nextest-core-nextest> Compiling thiserror v1.0.69
  2024. 1477.63 s gammaloop-nextest-core-nextest> Compiling clap_complete_nushell v4.6.0
  2025. 1479.75 s gammaloop-nextest-core-nextest> Compiling ppv-lite86 v0.2.21
  2026. 1480.12 s gammaloop-nextest-core-nextest> Compiling half v2.7.1
  2027. 1481.33 s gammaloop-nextest-core-nextest> Compiling rand_chacha v0.9.0
  2028. 1481.62 s gammaloop-nextest-core-nextest> Compiling rand_chacha v0.3.1
  2029. 1482.88 s gammaloop-nextest-core-nextest> Compiling rand v0.9.4
  2030. 1484.51 s gammaloop-nextest-core-nextest> Compiling rand v0.8.6
  2031. 1484.79 s gammaloop-nextest-core-nextest> Compiling strum v0.27.2
  2032. 1485.23 s gammaloop-nextest-core-nextest> Compiling ratatui-core v0.1.0
  2033. 1485.24 s gammaloop-nextest-core-nextest> Compiling ciborium-ll v0.2.2
  2034. 1485.25 s gammaloop-nextest-core-nextest> Compiling rust-embed v8.11.0
  2035. 1488.87 s gammaloop-nextest-core-nextest> Compiling rand_distr v0.4.3
  2036. 1489.03 s gammaloop-nextest-core-nextest> Compiling serde v1.0.228
  2037. 1489.71 s gammaloop-nextest-core-nextest> Compiling ratatui-widgets v0.3.0
  2038. 1492.07 s gammaloop-nextest-core-nextest> Compiling smallvec v1.15.1
  2039. 1492.39 s gammaloop-nextest-core-nextest> Compiling num-complex v0.4.6
  2040. 1492.82 s gammaloop-nextest-core-nextest> Compiling tracing-serde v0.2.0
  2041. 1495.04 s gammaloop-nextest-core-nextest> Compiling ahash v0.8.12
  2042. 1496.00 s gammaloop-nextest-core-nextest> Compiling bincode v2.0.1
  2043. 1496.21 s gammaloop-nextest-core-nextest> Compiling simba v0.9.1
  2044. 1496.53 s gammaloop-nextest-core-nextest> Compiling num-bigint v0.4.6
  2045. 1498.74 s gammaloop-nextest-core-nextest> Compiling rug v1.30.0
  2046. 1499.72 s gammaloop-nextest-core-nextest> Compiling serde_spanned v0.6.9
  2047. 1500.08 s gammaloop-nextest-core-nextest> Compiling toml_datetime v0.6.11
  2048. 1500.77 s gammaloop-nextest-core-nextest> Compiling symjit v2.14.9
  2049. 1501.28 s gammaloop-nextest-core-nextest> Compiling toml_edit v0.22.27
  2050. 1501.94 s gammaloop-nextest-core-nextest> Compiling parking_lot_core v0.9.12
  2051. 1502.69 s gammaloop-nextest-core-nextest> Compiling smartstring v1.0.1
  2052. 1503.13 s gammaloop-nextest-core-nextest> Compiling parking_lot v0.12.5
  2053. 1504.36 s gammaloop-nextest-core-nextest> Compiling num-rational v0.4.2
  2054. 1504.75 s gammaloop-nextest-core-nextest> Compiling bitvec v1.0.1
  2055. 1506.07 s gammaloop-nextest-core-nextest> Compiling num v0.4.3
  2056. 1506.32 s gammaloop-nextest-core-nextest> Compiling crossterm v0.28.1
  2057. 1507.14 s gammaloop-nextest-core-nextest> Compiling simba v0.6.0
  2058. 1507.16 s gammaloop-nextest-core-nextest> Compiling chrono v0.4.44
  2059. 1509.93 s gammaloop-nextest-core-nextest> Compiling crossterm v0.29.0
  2060. 1512.47 s gammaloop-nextest-core-nextest> Compiling toml v0.8.23
  2061. 1512.78 s gammaloop-nextest-core-nextest> Compiling tracing-error v0.2.1
  2062. 1512.92 s gammaloop-nextest-core-nextest> Compiling serde-big-array v0.5.1
  2063. 1513.15 s gammaloop-nextest-core-nextest> Compiling ciborium v0.2.2
  2064. 1513.42 s gammaloop-nextest-core-nextest> Compiling figment v0.10.19
  2065. 1517.15 s gammaloop-nextest-core-nextest> Compiling tinytemplate v1.2.1
  2066. 1520.66 s gammaloop-nextest-core-nextest> Compiling xprec v0.2.2
  2067. 1521.28 s gammaloop-nextest-core-nextest> Compiling criterion v0.5.1
  2068. 1522.87 s gammaloop-nextest-core-nextest> Compiling ratatui-crossterm v0.1.0
  2069. 1523.44 s gammaloop-nextest-core-nextest> Compiling clarabel v0.11.1
  2070. 1524.04 s gammaloop-nextest-core-nextest> Compiling string-template-plus v0.4.3
  2071. 1524.07 s gammaloop-nextest-core-nextest> Compiling color-spantrace v0.3.0
  2072. 1525.63 s gammaloop-nextest-core-nextest> Compiling ratatui-macros v0.7.0
  2073. 1526.02 s gammaloop-nextest-core-nextest> Compiling ratatui v0.30.0
  2074. 1526.52 s gammaloop-nextest-core-nextest> Compiling nalgebra v0.29.0
  2075. 1526.88 s gammaloop-nextest-core-nextest> Compiling color-eyre v0.6.5
  2076. 1527.72 s gammaloop-nextest-core-nextest> Compiling tracing-indicatif v0.3.14
  2077. 1528.96 s gammaloop-nextest-core-nextest> Compiling tracing-appender v0.2.5
  2078. 1529.60 s gammaloop-nextest-core-nextest> Compiling typed-index-collections v3.5.0
  2079. 1531.36 s gammaloop-nextest-core-nextest> Compiling schemars v1.2.1
  2080. 1532.52 s gammaloop-nextest-core-nextest> Compiling slotmap v1.1.1
  2081. 1534.21 s gammaloop-nextest-core-nextest> Compiling json5 v0.4.1
  2082. 1534.51 s gammaloop-nextest-core-nextest> Compiling vectorize v0.2.0
  2083. 1534.87 s gammaloop-nextest-core-nextest> Compiling serde_yaml v0.9.34+deprecated
  2084. 1535.78 s gammaloop-nextest-core-nextest> Compiling gammaloop-tracing-filter v0.1.0 (/build/source/crates/gammaloop-tracing-filter)
  2085. 1537.29 s gammaloop-nextest-core-nextest> Compiling reedline v0.42.0
  2086. 1539.17 s gammaloop-nextest-core-nextest> Compiling numerica v1.4.3
  2087. 1541.54 s gammaloop-nextest-core-nextest> Compiling ndarray v0.17.2
  2088. 1543.32 s gammaloop-nextest-core-nextest> Compiling ron v0.12.1
  2089. 1555.16 s gammaloop-nextest-core-nextest> Compiling insta v1.47.2
  2090. 1557.05 s gammaloop-nextest-core-nextest> Compiling graphica v1.2.1
  2091. 1562.41 s gammaloop-nextest-core-nextest> Compiling statrs v0.16.1
  2092. 1567.12 s gammaloop-nextest-core-nextest> Compiling momtrop v0.3.0
  2093. 1614.56 s gammaloop-nextest-core-nextest> Compiling linnet v0.17.0 (/build/source/crates/linnet)
  2094. 1900.12 s gammaloop-nextest-core-nextest> Compiling spenso-macros v0.3.2 (/build/source/crates/spenso-macros)
  2095. 1900.99 s gammaloop-nextest-core-nextest> Compiling spenso v0.6.0 (/build/source/crates/spenso)
  2096. 1908.68 s gammaloop-nextest-core-nextest> Compiling idenso v0.3.0 (/build/source/crates/idenso)
  2097. 1910.79 s gammaloop-nextest-core-nextest> Compiling spenso-hep-lib v0.1.7 (/build/source/crates/spenso-hep-lib)
  2098. 2638.37 s gammaloop-nextest-core-nextest> Finished `dev-optim` profile [optimized + debuginfo] target(s) in 20m 44s
  2099. 2638.63 s gammaloop-nextest-core-nextest> ------------
  2100. 2638.63 s gammaloop-nextest-core-nextest> Nextest run ID 44472e18-ade9-4370-a7cf-287136ed00ab with nextest profile: ci_gammaloop
  2101. 2638.63 s gammaloop-nextest-core-nextest> Starting 649 tests across 5 binaries (58 tests skipped via profile.ci_gammaloop.default-filter)
  2102. 2657.27 s gammaloop-nextest-core-nextest> FAIL [ 15.263s] (644/649) gammalooprs cff::generation::tests_cff::thermal_bugblatter
  2103. 2657.28 s gammaloop-nextest-core-nextest> stdout ---
  2104. 2657.28 s gammaloop-nextest-core-nextest>
  2105. 2657.28 s gammaloop-nextest-core-nextest> running 1 test
  2106. 2657.28 s gammaloop-nextest-core-nextest> test cff::generation::tests_cff::thermal_bugblatter ... FAILED
  2107. 2657.28 s gammaloop-nextest-core-nextest>
  2108. 2657.28 s gammaloop-nextest-core-nextest> failures:
  2109. 2657.28 s gammaloop-nextest-core-nextest>
  2110. 2657.28 s gammaloop-nextest-core-nextest> failures:
  2111. 2657.28 s gammaloop-nextest-core-nextest> cff::generation::tests_cff::thermal_bugblatter
  2112. 2657.28 s gammaloop-nextest-core-nextest>
  2113. 2657.28 s gammaloop-nextest-core-nextest> test result: FAILED. 0 passed; 1 failed; 0 ignored; 0 measured; 390 filtered out; finished in 15.20s
  2114. 2657.28 s gammaloop-nextest-core-nextest>
  2115. 2657.28 s gammaloop-nextest-core-nextest> stderr ---
  2116. 2657.28 s gammaloop-nextest-core-nextest>
  2117. 2657.28 s gammaloop-nextest-core-nextest> thread 'cff::generation::tests_cff::thermal_bugblatter' (5404) panicked at crates/gammalooprs/src/cff/generation.rs:2883:9:
  2118. 2657.28 s gammaloop-nextest-core-nextest> relative error: +5.180025306920632e-10 (ground truth: +1.3084677423579079e0 vs reproduced: +1.3084677430356975e0)
  2119. 2657.28 s gammaloop-nextest-core-nextest> stack backtrace:
  2120. 2657.28 s gammaloop-nextest-core-nextest> 0: __rustc::rust_begin_unwind
  2121. 2657.28 s gammaloop-nextest-core-nextest> at /rustc/59807616e1fa2540724bfbac14d7976d7e4a3860/library/std/src/panicking.rs:689:5
  2122. 2657.28 s gammaloop-nextest-core-nextest> 1: core::panicking::panic_fmt
  2123. 2657.28 s gammaloop-nextest-core-nextest> at /rustc/59807616e1fa2540724bfbac14d7976d7e4a3860/library/core/src/panicking.rs:80:14
  2124. 2657.28 s gammaloop-nextest-core-nextest> 2: gammalooprs::cff::generation::tests_cff::thermal_bugblatter
  2125. 2657.28 s gammaloop-nextest-core-nextest> at ./src/cff/generation.rs:2883:9
  2126. 2657.28 s gammaloop-nextest-core-nextest> 3: gammalooprs::cff::generation::tests_cff::thermal_bugblatter::{{closure}}
  2127. 2657.28 s gammaloop-nextest-core-nextest> at ./src/cff/generation.rs:2800:28
  2128. 2657.28 s gammaloop-nextest-core-nextest> 4: core::ops::function::FnOnce::call_once
  2129. 2657.28 s gammaloop-nextest-core-nextest> at /rustc/59807616e1fa2540724bfbac14d7976d7e4a3860/library/core/src/ops/function.rs:250:5
  2130. 2657.28 s gammaloop-nextest-core-nextest> 5: <fn() -> core::result::Result<(), alloc::string::String> as core::ops::function::FnOnce<()>>::call_once
  2131. 2657.28 s gammaloop-nextest-core-nextest> at /rustc/59807616e1fa2540724bfbac14d7976d7e4a3860/library/core/src/ops/function.rs:250:5
  2132. 2657.28 s gammaloop-nextest-core-nextest> note: Some details are omitted, run with `RUST_BACKTRACE=full` for a verbose backtrace.
  2133. 2657.28 s gammaloop-nextest-core-nextest>
  2134. 2679.11 s gammaloop-nextest-core-nextest> ------------
  2135. 2679.14 s gammaloop-nextest-core-nextest> Summary [ 40.471s] 649 tests run: 648 passed, 1 failed, 58 skipped
  2136. 2679.14 s gammaloop-nextest-core-nextest> FAIL [ 15.263s] (644/649) gammalooprs cff::generation::tests_cff::thermal_bugblatter
  2137. 2679.14 s gammaloop-nextest-core-nextest> stdout ---
  2138. 2679.14 s gammaloop-nextest-core-nextest>
  2139. 2679.14 s gammaloop-nextest-core-nextest> running 1 test
  2140. 2679.14 s gammaloop-nextest-core-nextest> test cff::generation::tests_cff::thermal_bugblatter ... FAILED
  2141. 2679.14 s gammaloop-nextest-core-nextest>
  2142. 2679.14 s gammaloop-nextest-core-nextest> failures:
  2143. 2679.14 s gammaloop-nextest-core-nextest>
  2144. 2679.14 s gammaloop-nextest-core-nextest> failures:
  2145. 2679.14 s gammaloop-nextest-core-nextest> cff::generation::tests_cff::thermal_bugblatter
  2146. 2679.14 s gammaloop-nextest-core-nextest>
  2147. 2679.14 s gammaloop-nextest-core-nextest> test result: FAILED. 0 passed; 1 failed; 0 ignored; 0 measured; 390 filtered out; finished in 15.20s
  2148. 2679.14 s gammaloop-nextest-core-nextest>
  2149. 2679.14 s gammaloop-nextest-core-nextest> stderr ---
  2150. 2679.14 s gammaloop-nextest-core-nextest>
  2151. 2679.14 s gammaloop-nextest-core-nextest> thread 'cff::generation::tests_cff::thermal_bugblatter' (5404) panicked at crates/gammalooprs/src/cff/generation.rs:2883:9:
  2152. 2679.14 s gammaloop-nextest-core-nextest> relative error: +5.180025306920632e-10 (ground truth: +1.3084677423579079e0 vs reproduced: +1.3084677430356975e0)
  2153. 2679.14 s gammaloop-nextest-core-nextest> stack backtrace:
  2154. 2679.14 s gammaloop-nextest-core-nextest> 0: __rustc::rust_begin_unwind
  2155. 2679.14 s gammaloop-nextest-core-nextest> at /rustc/59807616e1fa2540724bfbac14d7976d7e4a3860/library/std/src/panicking.rs:689:5
  2156. 2679.14 s gammaloop-nextest-core-nextest> 1: core::panicking::panic_fmt
  2157. 2679.14 s gammaloop-nextest-core-nextest> at /rustc/59807616e1fa2540724bfbac14d7976d7e4a3860/library/core/src/panicking.rs:80:14
  2158. 2679.14 s gammaloop-nextest-core-nextest> 2: gammalooprs::cff::generation::tests_cff::thermal_bugblatter
  2159. 2679.14 s gammaloop-nextest-core-nextest> at ./src/cff/generation.rs:2883:9
  2160. 2679.14 s gammaloop-nextest-core-nextest> 3: gammalooprs::cff::generation::tests_cff::thermal_bugblatter::{{closure}}
  2161. 2679.14 s gammaloop-nextest-core-nextest> at ./src/cff/generation.rs:2800:28
  2162. 2679.14 s gammaloop-nextest-core-nextest> 4: core::ops::function::FnOnce::call_once
  2163. 2679.14 s gammaloop-nextest-core-nextest> at /rustc/59807616e1fa2540724bfbac14d7976d7e4a3860/library/core/src/ops/function.rs:250:5
  2164. 2679.14 s gammaloop-nextest-core-nextest> 5: <fn() -> core::result::Result<(), alloc::string::String> as core::ops::function::FnOnce<()>>::call_once
  2165. 2679.14 s gammaloop-nextest-core-nextest> at /rustc/59807616e1fa2540724bfbac14d7976d7e4a3860/library/core/src/ops/function.rs:250:5
  2166. 2679.14 s gammaloop-nextest-core-nextest> note: Some details are omitted, run with `RUST_BACKTRACE=full` for a verbose backtrace.
  2167. 2679.14 s gammaloop-nextest-core-nextest>
  2168. 2679.14 s gammaloop-nextest-core-nextest> error: test run failed
  2169. 2679.41 s gammaloop-nextest-core-nextest>
  2170. 2679.41 s gammaloop-nextest-core-nextest> ========== nextest test summary ==========
  2171. 2679.41 s gammaloop-nextest-core-nextest> report: target/nextest/ci_gammaloop/junit.xml
  2172. 2679.41 s gammaloop-nextest-core-nextest> tests: 649, failures: 1, errors: 0
  2173. 2679.41 s gammaloop-nextest-core-nextest>
  2174. 2679.41 s gammaloop-nextest-core-nextest> 1. gammalooprs::cff::generation::tests_cff::thermal_bugblatter
  2175. 2679.41 s gammaloop-nextest-core-nextest> failure: test failure with exit code 101
  2176. 2679.41 s gammaloop-nextest-core-nextest> thread 'cff::generation::tests_cff::thermal_bugblatter' (5404) panicked at crates/gammalooprs/src/cff/generation.rs:2883:9:
  2177. 2679.41 s gammaloop-nextest-core-nextest> relative error: +5.180025306920632e-10 (ground truth: +1.3084677423579079e0 vs reproduced: +1.3084677430356975e0)
  2178. 2679.41 s gammaloop-nextest-core-nextest> stack backtrace:
  2179. 2679.41 s gammaloop-nextest-core-nextest> 0: __rustc::rust_begin_unwind
  2180. 2679.41 s gammaloop-nextest-core-nextest> at /rustc/59807616e1fa2540724bfbac14d7976d7e4a3860/library/std/src/panicking.rs:689:5
  2181. 2679.41 s gammaloop-nextest-core-nextest> 1: core::panicking::panic_fmt
  2182. 2679.41 s gammaloop-nextest-core-nextest> at /rustc/59807616e1fa2540724bfbac14d7976d7e4a3860/library/core/src/panicking.rs:80:14
  2183. 2679.41 s gammaloop-nextest-core-nextest> 2: gammalooprs::cff::generation::tests_cff::thermal_bugblatter
  2184. 2679.41 s gammaloop-nextest-core-nextest> at ./src/cff/generation.rs:2883:9
  2185. 2679.41 s gammaloop-nextest-core-nextest> 3: gammalooprs::cff::generation::tests_cff::thermal_bugblatter::{{closure}}
  2186. 2679.41 s gammaloop-nextest-core-nextest> at ./src/cff/generation.rs:2800:28
  2187. 2679.41 s gammaloop-nextest-core-nextest> 4: core::ops::function::FnOnce::call_once
  2188. 2679.41 s gammaloop-nextest-core-nextest> at /rustc/59807616e1fa2540724bfbac14d7976d7e4a3860/library/core/src/ops/function.rs:250:5
  2189. 2679.41 s gammaloop-nextest-core-nextest> 5: <fn() -> core::result::Result<(), alloc::string::String> as core::ops::function::FnOnce<()>>::call_once
  2190. 2679.41 s gammaloop-nextest-core-nextest> at /rustc/59807616e1fa2540724bfbac14d7976d7e4a3860/library/core/src/ops/function.rs:250:5
  2191. 2679.41 s gammaloop-nextest-core-nextest> note: Some details are omitted, run with `RUST_BACKTRACE=full` for a verbose backtrace.
  2192. 2679.41 s gammaloop-nextest-core-nextest> system-out
  2193. 2679.41 s gammaloop-nextest-core-nextest> running 1 test
  2194. 2679.41 s gammaloop-nextest-core-nextest> test cff::generation::tests_cff::thermal_bugblatter ... FAILED
  2195. 2679.41 s gammaloop-nextest-core-nextest>
  2196. 2679.41 s gammaloop-nextest-core-nextest> failures:
  2197. 2679.41 s gammaloop-nextest-core-nextest>
  2198. 2679.41 s gammaloop-nextest-core-nextest> failures:
  2199. 2679.41 s gammaloop-nextest-core-nextest> cff::generation::tests_cff::thermal_bugblatter
  2200. 2679.41 s gammaloop-nextest-core-nextest>
  2201. 2679.41 s gammaloop-nextest-core-nextest> test result: FAILED. 0 passed; 1 failed; 0 ignored; 0 measured; 390 filtered out; finished in 15.20s
  2202. 2679.41 s gammaloop-nextest-core-nextest> system-err
  2203. 2679.41 s gammaloop-nextest-core-nextest> thread 'cff::generation::tests_cff::thermal_bugblatter' (5404) panicked at crates/gammalooprs/src/cff/generation.rs:2883:9:
  2204. 2679.41 s gammaloop-nextest-core-nextest> relative error: +5.180025306920632e-10 (ground truth: +1.3084677423579079e0 vs reproduced: +1.3084677430356975e0)
  2205. 2679.41 s gammaloop-nextest-core-nextest> stack backtrace:
  2206. 2679.41 s gammaloop-nextest-core-nextest> 0: __rustc::rust_begin_unwind
  2207. 2679.41 s gammaloop-nextest-core-nextest> at /rustc/59807616e1fa2540724bfbac14d7976d7e4a3860/library/std/src/panicking.rs:689:5
  2208. 2679.41 s gammaloop-nextest-core-nextest> 1: core::panicking::panic_fmt
  2209. 2679.41 s gammaloop-nextest-core-nextest> at /rustc/59807616e1fa2540724bfbac14d7976d7e4a3860/library/core/src/panicking.rs:80:14
  2210. 2679.41 s gammaloop-nextest-core-nextest> 2: gammalooprs::cff::generation::tests_cff::thermal_bugblatter
  2211. 2679.41 s gammaloop-nextest-core-nextest> at ./src/cff/generation.rs:2883:9
  2212. 2679.41 s gammaloop-nextest-core-nextest> 3: gammalooprs::cff::generation::tests_cff::thermal_bugblatter::{{closure}}
  2213. 2679.41 s gammaloop-nextest-core-nextest> at ./src/cff/generation.rs:2800:28
  2214. 2679.41 s gammaloop-nextest-core-nextest> 4: core::ops::function::FnOnce::call_once
  2215. 2679.41 s gammaloop-nextest-core-nextest> at /rustc/59807616e1fa2540724bfbac14d7976d7e4a3860/library/core/src/ops/function.rs:250:5
  2216. 2679.41 s gammaloop-nextest-core-nextest> 5: <fn() -> core::result::Result<(), alloc::string::String> as core::ops::function::FnOnce<()>>::call_once
  2217. 2679.41 s gammaloop-nextest-core-nextest> at /rustc/59807616e1fa2540724bfbac14d7976d7e4a3860/library/core/src/ops/function.rs:250:5
  2218. 2679.41 s gammaloop-nextest-core-nextest> note: Some details are omitted, run with `RUST_BACKTRACE=full` for a verbose backtrace.
  2219. 2679.41 s gammaloop-nextest-core-nextest> =========================================
  2220. 2682.25 s [110 built (1 failed), 5error: Cannot build '/nix/store/x99f4l4rhn4rxfh9pva0mbx49rp8n02k-gammaloop-nextest-core-nextest-0.1.0.drv'.
  2221. 2682.25 s Reason: builder failed with exit code 100.
  2222. 2682.25 s Output paths:
  2223. 2682.25 s /nix/store/fd2mrd8wif4zz2cw9bvy45fi89nggxj5-gammaloop-nextest-core-nextest-0.1.0
  2224. 2682.25 s Last 273 log lines:
  2225. 2682.25 s > Running phase: unpackPhase
  2226. 2682.25 s > unpacking source archive /nix/store/2gfjwwccz6smw12y5x0gwjf4f3jnyqpn-source
  2227. 2682.25 s > source root is source
  2228. 2682.25 s > Running phase: patchPhase
  2229. 2682.25 s > Executing configureCargoCommonVars
  2230. 2682.25 s > decompressing cargo artifacts from /nix/store/g91zjhbw7sfq2h1pijj7b8hn2fp9z646-gammaloop-workspace-deps-deps-0.1.0/target.tar.zst to target
  2231. 2682.25 s > Running phase: updateAutotoolsGnuConfigScriptsPhase
  2232. 2682.25 s > Running phase: configurePhase
  2233. 2682.25 s > will append /build/source/.cargo-home/config.toml with contents of /nix/store/56mr0d5hrl1xh08y02lfig5azk7f8563-vendor-cargo-deps/config.toml
  2234. 2682.25 s > default configurePhase, nothing to do
  2235. 2682.25 s > Running phase: buildPhase
  2236. 2682.25 s > +++ command cargo --version
  2237. 2682.25 s > cargo 1.95.0 (f2d3ce0bd 2026-03-21)
  2238. 2682.25 s > +++ command cargo nextest --version
  2239. 2682.25 s > cargo-nextest 0.9.133
  2240. 2682.25 s > release: 0.9.133
  2241. 2682.25 s > host: x86_64-unknown-linux-gnu
  2242. 2682.25 s > Running phase: checkPhase
  2243. 2682.25 s > +++ command cargo nextest run --cargo-profile dev-optim --locked -p gammaloop-api -p gammaloop-tracing-filter -p gammalooprs --profile ci_gammaloop --no-fail-fast --final-status-level fail --no-tests=pass --run-ignored all
  2244. 2682.25 s > Compiling syn v2.0.117
  2245. 2682.25 s > Compiling tiny-keccak v2.0.2
  2246. 2682.25 s > Compiling getrandom v0.2.17
  2247. 2682.25 s > Compiling num-integer v0.1.46
  2248. 2682.25 s > Compiling indexmap v2.14.0
  2249. 2682.25 s > Compiling symbolica v1.5.1
  2250. 2682.25 s > Compiling vakint v0.1.2 (/build/source/crates/vakint)
  2251. 2682.25 s > Compiling gammalooprs v0.3.3 (/build/source/crates/gammalooprs)
  2252. 2682.25 s > Compiling gammaloop-api v0.1.0 (/build/source/crates/gammaloop-api)
  2253. 2682.25 s > Compiling num-iter v0.1.45
  2254. 2682.25 s > Compiling const-random-macro v0.1.16
  2255. 2682.25 s > Compiling petgraph v0.8.3
  2256. 2682.25 s > Compiling const-random v0.1.18
  2257. 2682.25 s > Compiling pest_generator v2.8.6
  2258. 2682.25 s > Compiling darling_core v0.23.0
  2259. 2682.25 s > Compiling proc-macro2-diagnostics v0.10.1
  2260. 2682.25 s > Compiling proc-macro-error2 v2.0.1
  2261. 2682.25 s > Compiling serde_derive_internals v0.29.1
  2262. 2682.25 s > Compiling serde_derive v1.0.228
  2263. 2682.25 s > Compiling zerocopy-derive v0.8.48
  2264. 2682.25 s > Compiling tracing-attributes v0.1.31
  2265. 2682.25 s > Compiling thiserror-impl v2.0.18
  2266. 2682.25 s > Compiling bincode-trait-derive v0.1.1
  2267. 2682.25 s > Compiling strum_macros v0.27.2
  2268. 2682.25 s > Compiling pest_derive v2.8.6
  2269. 2682.25 s > Compiling clap_derive v4.6.1
  2270. 2682.25 s > Compiling derive_more-impl v2.1.1
  2271. 2682.25 s > Compiling serde_repr v0.1.20
  2272. 2682.25 s > Compiling duplicate v2.0.1
  2273. 2682.25 s > Compiling tabled_derive v0.11.0
  2274. 2682.25 s > Compiling dot-parser v0.5.1
  2275. 2682.25 s > Compiling darling_macro v0.23.0
  2276. 2682.25 s > Compiling enum-try-as-inner v0.1.1
  2277. 2682.25 s > Compiling thiserror-impl v1.0.69
  2278. 2682.25 s > Compiling darling v0.23.0
  2279. 2682.25 s > Compiling instability v0.3.12
  2280. 2682.25 s > Compiling delegate v0.12.0
  2281. 2682.25 s > Compiling derive_more v0.99.20
  2282. 2682.25 s > Compiling phf_macros v0.13.1
  2283. 2682.25 s > Compiling enum_dispatch v0.3.13
  2284. 2682.25 s > Compiling ref-cast-impl v1.0.25
  2285. 2682.25 s > Compiling derive_more v2.1.1
  2286. 2682.25 s > Compiling schemars_derive v1.2.1
  2287. 2682.25 s > Compiling zerocopy v0.8.48
  2288. 2682.25 s > Compiling deprecate-until v1.0.0
  2289. 2682.25 s > Compiling phf v0.13.1
  2290. 2682.25 s > Compiling rust-embed-impl v8.11.0
  2291. 2682.25 s > Compiling ref-cast v1.0.25
  2292. 2682.25 s > Compiling strum_macros v0.26.4
  2293. 2682.25 s > Compiling thiserror v2.0.18
  2294. 2682.25 s > Compiling kasuari v0.4.12
  2295. 2682.25 s > Compiling tracing v0.1.44
  2296. 2682.25 s > Compiling tracing-subscriber v0.3.23
  2297. 2682.25 s > Compiling tabled v0.20.0
  2298. 2682.25 s > Compiling pathfinding v4.15.0
  2299. 2682.25 s > Compiling clap v4.6.1
  2300. 2682.25 s > Compiling clap_complete v4.6.3
  2301. 2682.25 s > Compiling thiserror v1.0.69
  2302. 2682.25 s > Compiling clap_complete_nushell v4.6.0
  2303. 2682.25 s > Compiling ppv-lite86 v0.2.21
  2304. 2682.25 s > Compiling half v2.7.1
  2305. 2682.25 s > Compiling rand_chacha v0.9.0
  2306. 2682.25 s > Compiling rand_chacha v0.3.1
  2307. 2682.25 s > Compiling rand v0.9.4
  2308. 2682.25 s > Compiling rand v0.8.6
  2309. 2682.25 s > Compiling strum v0.27.2
  2310. 2682.25 s > Compiling ratatui-core v0.1.0
  2311. 2682.25 s > Compiling ciborium-ll v0.2.2
  2312. 2682.25 s > Compiling rust-embed v8.11.0
  2313. 2682.25 s > Compiling rand_distr v0.4.3
  2314. 2682.25 s > Compiling serde v1.0.228
  2315. 2682.25 s > Compiling ratatui-widgets v0.3.0
  2316. 2682.25 s > Compiling smallvec v1.15.1
  2317. 2682.25 s > Compiling num-complex v0.4.6
  2318. 2682.25 s > Compiling tracing-serde v0.2.0
  2319. 2682.25 s > Compiling ahash v0.8.12
  2320. 2682.25 s > Compiling bincode v2.0.1
  2321. 2682.25 s > Compiling simba v0.9.1
  2322. 2682.25 s > Compiling num-bigint v0.4.6
  2323. 2682.25 s > Compiling rug v1.30.0
  2324. 2682.25 s > Compiling serde_spanned v0.6.9
  2325. 2682.25 s > Compiling toml_datetime v0.6.11
  2326. 2682.25 s > Compiling symjit v2.14.9
  2327. 2682.25 s > Compiling toml_edit v0.22.27
  2328. 2682.25 s > Compiling parking_lot_core v0.9.12
  2329. 2682.25 s > Compiling smartstring v1.0.1
  2330. 2682.25 s > Compiling parking_lot v0.12.5
  2331. 2682.25 s > Compiling num-rational v0.4.2
  2332. 2682.25 s > Compiling bitvec v1.0.1
  2333. 2682.25 s > Compiling num v0.4.3
  2334. 2682.25 s > Compiling crossterm v0.28.1
  2335. 2682.25 s > Compiling simba v0.6.0
  2336. 2682.25 s > Compiling chrono v0.4.44
  2337. 2682.25 s > Compiling crossterm v0.29.0
  2338. 2682.25 s > Compiling toml v0.8.23
  2339. 2682.25 s > Compiling tracing-error v0.2.1
  2340. 2682.25 s > Compiling serde-big-array v0.5.1
  2341. 2682.25 s > Compiling ciborium v0.2.2
  2342. 2682.25 s > Compiling figment v0.10.19
  2343. 2682.25 s > Compiling tinytemplate v1.2.1
  2344. 2682.25 s > Compiling xprec v0.2.2
  2345. 2682.25 s > Compiling criterion v0.5.1
  2346. 2682.25 s > Compiling ratatui-crossterm v0.1.0
  2347. 2682.25 s > Compiling clarabel v0.11.1
  2348. 2682.25 s > Compiling string-template-plus v0.4.3
  2349. 2682.25 s > Compiling color-spantrace v0.3.0
  2350. 2682.25 s > Compiling ratatui-macros v0.7.0
  2351. 2682.25 s > Compiling ratatui v0.30.0
  2352. 2682.25 s > Compiling nalgebra v0.29.0
  2353. 2682.25 s > Compiling color-eyre v0.6.5
  2354. 2682.25 s > Compiling tracing-indicatif v0.3.14
  2355. 2682.25 s > Compiling tracing-appender v0.2.5
  2356. 2682.25 s > Compiling typed-index-collections v3.5.0
  2357. 2682.25 s > Compiling schemars v1.2.1
  2358. 2682.25 s > Compiling slotmap v1.1.1
  2359. 2682.25 s > Compiling json5 v0.4.1
  2360. 2682.25 s > Compiling vectorize v0.2.0
  2361. 2682.25 s > Compiling serde_yaml v0.9.34+deprecated
  2362. 2682.25 s > Compiling gammaloop-tracing-filter v0.1.0 (/build/source/crates/gammaloop-tracing-filter)
  2363. 2682.25 s > Compiling reedline v0.42.0
  2364. 2682.25 s > Compiling numerica v1.4.3
  2365. 2682.25 s > Compiling ndarray v0.17.2
  2366. 2682.25 s > Compiling ron v0.12.1
  2367. 2682.25 s > Compiling insta v1.47.2
  2368. 2682.25 s > Compiling graphica v1.2.1
  2369. 2682.25 s > Compiling statrs v0.16.1
  2370. 2682.25 s > Compiling momtrop v0.3.0
  2371. 2682.26 s > Compiling linnet v0.17.0 (/build/source/crates/linnet)
  2372. 2682.26 s > Compiling spenso-macros v0.3.2 (/build/source/crates/spenso-macros)
  2373. 2682.26 s > Compiling spenso v0.6.0 (/build/source/crates/spenso)
  2374. 2682.26 s > Compiling idenso v0.3.0 (/build/source/crates/idenso)
  2375. 2682.26 s > Compiling spenso-hep-lib v0.1.7 (/build/source/crates/spenso-hep-lib)
  2376. 2682.26 s > Finished `dev-optim` profile [optimized + debuginfo] target(s) in 20m 44s
  2377. 2682.26 s > ------------
  2378. 2682.26 s > Nextest run ID 44472e18-ade9-4370-a7cf-287136ed00ab with nextest profile: ci_gammaloop
  2379. 2682.26 s > Starting 649 tests across 5 binaries (58 tests skipped via profile.ci_gammaloop.default-filter)
  2380. 2682.26 s > FAIL [ 15.263s] (644/649) gammalooprs cff::generation::tests_cff::thermal_bugblatter
  2381. 2682.26 s > stdout ---
  2382. 2682.26 s >
  2383. 2682.26 s > running 1 test
  2384. 2682.26 s > test cff::generation::tests_cff::thermal_bugblatter ... FAILED
  2385. 2682.26 s >
  2386. 2682.26 s > failures:
  2387. 2682.26 s >
  2388. 2682.26 s > failures:
  2389. 2682.26 s > cff::generation::tests_cff::thermal_bugblatter
  2390. 2682.26 s >
  2391. 2682.26 s > test result: FAILED. 0 passed; 1 failed; 0 ignored; 0 measured; 390 filtered out; finished in 15.20s
  2392. 2682.26 s >
  2393. 2682.26 s > stderr ---
  2394. 2682.26 s >
  2395. 2682.26 s > thread 'cff::generation::tests_cff::thermal_bugblatter' (5404) panicked at crates/gammalooprs/src/cff/generation.rs:2883:9:
  2396. 2682.26 s > relative error: +5.180025306920632e-10 (ground truth: +1.3084677423579079e0 vs reproduced: +1.3084677430356975e0)
  2397. 2682.26 s > stack backtrace:
  2398. 2682.26 s > 0: __rustc::rust_begin_unwind
  2399. 2682.26 s > at /rustc/59807616e1fa2540724bfbac14d7976d7e4a3860/library/std/src/panicking.rs:689:5
  2400. 2682.26 s > 1: core::panicking::panic_fmt
  2401. 2682.26 s > at /rustc/59807616e1fa2540724bfbac14d7976d7e4a3860/library/core/src/panicking.rs:80:14
  2402. 2682.26 s > 2: gammalooprs::cff::generation::tests_cff::thermal_bugblatter
  2403. 2682.26 s > at ./src/cff/generation.rs:2883:9
  2404. 2682.26 s > 3: gammalooprs::cff::generation::tests_cff::thermal_bugblatter::{{closure}}
  2405. 2682.26 s > at ./src/cff/generation.rs:2800:28
  2406. 2682.26 s > 4: core::ops::function::FnOnce::call_once
  2407. 2682.26 s > at /rustc/59807616e1fa2540724bfbac14d7976d7e4a3860/library/core/src/ops/function.rs:250:5
  2408. 2682.26 s > 5: <fn() -> core::result::Result<(), alloc::string::String> as core::ops::function::FnOnce<()>>::call_once
  2409. 2682.26 s > at /rustc/59807616e1fa2540724bfbac14d7976d7e4a3860/library/core/src/ops/function.rs:250:5
  2410. 2682.26 s > note: Some details are omitted, run with `RUST_BACKTRACE=full` for a verbose backtrace.
  2411. 2682.26 s >
  2412. 2682.26 s > ------------
  2413. 2682.26 s > Summary [ 40.471s] 649 tests run: 648 passed, 1 failed, 58 skipped
  2414. 2682.26 s > FAIL [ 15.263s] (644/649) gammalooprs cff::generation::tests_cff::thermal_bugblatter
  2415. 2682.26 s > stdout ---
  2416. 2682.26 s >
  2417. 2682.26 s > running 1 test
  2418. 2682.26 s > test cff::generation::tests_cff::thermal_bugblatter ... FAILED
  2419. 2682.26 s >
  2420. 2682.26 s > failures:
  2421. 2682.26 s >
  2422. 2682.26 s > failures:
  2423. 2682.26 s > cff::generation::tests_cff::thermal_bugblatter
  2424. 2682.26 s >
  2425. 2682.26 s > test result: FAILED. 0 passed; 1 failed; 0 ignored; 0 measured; 390 filtered out; finished in 15.20s
  2426. 2682.26 s >
  2427. 2682.26 s > stderr ---
  2428. 2682.26 s >
  2429. 2682.26 s > thread 'cff::generation::tests_cff::thermal_bugblatter' (5404) panicked at crates/gammalooprs/src/cff/generation.rs:2883:9:
  2430. 2682.26 s > relative error: +5.180025306920632e-10 (ground truth: +1.3084677423579079e0 vs reproduced: +1.3084677430356975e0)
  2431. 2682.26 s > stack backtrace:
  2432. 2682.26 s > 0: __rustc::rust_begin_unwind
  2433. 2682.26 s > at /rustc/59807616e1fa2540724bfbac14d7976d7e4a3860/library/std/src/panicking.rs:689:5
  2434. 2682.26 s > 1: core::panicking::panic_fmt
  2435. 2682.26 s > at /rustc/59807616e1fa2540724bfbac14d7976d7e4a3860/library/core/src/panicking.rs:80:14
  2436. 2682.26 s > 2: gammalooprs::cff::generation::tests_cff::thermal_bugblatter
  2437. 2682.26 s > at ./src/cff/generation.rs:2883:9
  2438. 2682.26 s > 3: gammalooprs::cff::generation::tests_cff::thermal_bugblatter::{{closure}}
  2439. 2682.26 s > at ./src/cff/generation.rs:2800:28
  2440. 2682.26 s > 4: core::ops::function::FnOnce::call_once
  2441. 2682.26 s > at /rustc/59807616e1fa2540724bfbac14d7976d7e4a3860/library/core/src/ops/function.rs:250:5
  2442. 2682.26 s > 5: <fn() -> core::result::Result<(), alloc::string::String> as core::ops::function::FnOnce<()>>::call_once
  2443. 2682.26 s > at /rustc/59807616e1fa2540724bfbac14d7976d7e4a3860/library/core/src/ops/function.rs:250:5
  2444. 2682.26 s > note: Some details are omitted, run with `RUST_BACKTRACE=full` for a verbose backtrace.
  2445. 2682.26 s >
  2446. 2682.26 s > error: test run failed
  2447. 2682.26 s >
  2448. 2682.26 s > ========== nextest test summary ==========
  2449. 2682.26 s > report: target/nextest/ci_gammaloop/junit.xml
  2450. 2682.26 s > tests: 649, failures: 1, errors: 0
  2451. 2682.26 s >
  2452. 2682.26 s > 1. gammalooprs::cff::generation::tests_cff::thermal_bugblatter
  2453. 2682.26 s > failure: test failure with exit code 101
  2454. 2682.26 s > thread 'cff::generation::tests_cff::thermal_bugblatter' (5404) panicked at crates/gammalooprs/src/cff/generation.rs:2883:9:
  2455. 2682.26 s > relative error: +5.180025306920632e-10 (ground truth: +1.3084677423579079e0 vs reproduced: +1.3084677430356975e0)
  2456. 2682.26 s > stack backtrace:
  2457. 2682.26 s > 0: __rustc::rust_begin_unwind
  2458. 2682.26 s > at /rustc/59807616e1fa2540724bfbac14d7976d7e4a3860/library/std/src/panicking.rs:689:5
  2459. 2682.26 s > 1: core::panicking::panic_fmt
  2460. 2682.26 s > at /rustc/59807616e1fa2540724bfbac14d7976d7e4a3860/library/core/src/panicking.rs:80:14
  2461. 2682.26 s > 2: gammalooprs::cff::generation::tests_cff::thermal_bugblatter
  2462. 2682.26 s > at ./src/cff/generation.rs:2883:9
  2463. 2682.26 s > 3: gammalooprs::cff::generation::tests_cff::thermal_bugblatter::{{closure}}
  2464. 2682.26 s > at ./src/cff/generation.rs:2800:28
  2465. 2682.26 s > 4: core::ops::function::FnOnce::call_once
  2466. 2682.26 s > at /rustc/59807616e1fa2540724bfbac14d7976d7e4a3860/library/core/src/ops/function.rs:250:5
  2467. 2682.26 s > 5: <fn() -> core::result::Result<(), alloc::string::String> as core::ops::function::FnOnce<()>>::call_once
  2468. 2682.26 s > at /rustc/59807616e1fa2540724bfbac14d7976d7e4a3860/library/core/src/ops/function.rs:250:5
  2469. 2682.26 s > note: Some details are omitted, run with `RUST_BACKTRACE=full` for a verbose backtrace.
  2470. 2682.26 s > system-out
  2471. 2682.26 s > running 1 test
  2472. 2682.26 s > test cff::generation::tests_cff::thermal_bugblatter ... FAILED
  2473. 2682.26 s >
  2474. 2682.26 s > failures:
  2475. 2682.26 s >
  2476. 2682.26 s > failures:
  2477. 2682.26 s > cff::generation::tests_cff::thermal_bugblatter
  2478. 2682.26 s >
  2479. 2682.26 s > test result: FAILED. 0 passed; 1 failed; 0 ignored; 0 measured; 390 filtered out; finished in 15.20s
  2480. 2682.26 s > system-err
  2481. 2682.26 s > thread 'cff::generation::tests_cff::thermal_bugblatter' (5404) panicked at crates/gammalooprs/src/cff/generation.rs:2883:9:
  2482. 2682.26 s > relative error: +5.180025306920632e-10 (ground truth: +1.3084677423579079e0 vs reproduced: +1.3084677430356975e0)
  2483. 2682.26 s > stack backtrace:
  2484. 2682.26 s > 0: __rustc::rust_begin_unwind
  2485. 2682.26 s > at /rustc/59807616e1fa2540724bfbac14d7976d7e4a3860/library/std/src/panicking.rs:689:5
  2486. 2682.26 s > 1: core::panicking::panic_fmt
  2487. 2682.26 s > at /rustc/59807616e1fa2540724bfbac14d7976d7e4a3860/library/core/src/panicking.rs:80:14
  2488. 2682.26 s > 2: gammalooprs::cff::generation::tests_cff::thermal_bugblatter
  2489. 2682.26 s > at ./src/cff/generation.rs:2883:9
  2490. 2682.26 s > 3: gammalooprs::cff::generation::tests_cff::thermal_bugblatter::{{closure}}
  2491. 2682.26 s > at ./src/cff/generation.rs:2800:28
  2492. 2682.26 s > 4: core::ops::function::FnOnce::call_once
  2493. 2682.26 s > at /rustc/59807616e1fa2540724bfbac14d7976d7e4a3860/library/core/src/ops/function.rs:250:5
  2494. 2682.26 s > 5: <fn() -> core::result::Result<(), alloc::string::String> as core::ops::function::FnOnce<()>>::call_once
  2495. 2682.26 s > at /rustc/59807616e1fa2540724bfbac14d7976d7e4a3860/library/core/src/ops/function.rs:250:5
  2496. 2682.26 s > note: Some details are omitted, run with `RUST_BACKTRACE=full` for a verbose backtrace.
  2497. 2682.26 s > =========================================
  2498. 2682.26 s For full logs, run:
  2499. 2682.26 s nix log /nix/store/x99f4l4rhn4rxfh9pva0mbx49rp8n02k-gammaloop-nextest-core-nextest-0.1.0.drv
  2500. 2682.39 s Run failed.