1. 0.01 s $ /nix/store/bhv6xyvqw6gjs3j488gi1z6wdv18bdpa-coreutils-9.11/bin/timeout --kill-after=15s 7200s /nix/store/bxgja2ppiqi6w2bgn0r07d7mgnl1k6k2-nix-2.34.8/bin/nix --extra-experimental-features nix-command --extra-experimental-features flakes flake clone git+https://github.com/alphal00p/gammaloop --dest /tmp/nix-ci-worker/stable-pwd/repo/
  2. 0.13 s Cloning into '/tmp/nix-ci-worker/stable-pwd/repo'...
  3. 0.92 s remote: Enumerating objects: 162134, done.
  4. 1.03 s remote: Counting objects: 0% (1/3710) remote: Counting objects: 1% (38/3710) remote: Counting objects: 2% (75/3710) remote: Counting objects: 3% (112/3710) remote: Counting objects: 4% (149/3710) remote: Counting objects: 5% (186/3710) remote: Counting objects: 6% (223/3710) remote: Counting objects: 7% (260/3710) remote: Counting objects: 8% (297/3710) remote: Counting objects: 9% (334/3710) remote: Counting objects: 10% (371/3710) remote: Counting objects: 11% (409/3710) remote: Counting objects: 12% (446/3710) remote: Counting objects: 13% (483/3710) remote: Counting objects: 14% (520/3710) remote: Counting objects: 15% (557/3710) remote: Counting objects: 16% (594/3710) remote: Counting objects: 17% (631/3710) remote: Counting objects: 18% (668/3710) remote: Counting objects: 19% (705/3710) remote: Counting objects: 20% (742/3710) remote: Counting objects: 21% (780/3710) remote: Counting objects: 22% (817/3710) remote: Counting objects: 23% (854/3710) remote: Counting objects: 24% (891/3710) remote: Counting objects: 25% (928/3710) remote: Counting objects: 26% (965/3710) remote: Counting objects: 27% (1002/3710) remote: Counting objects: 28% (1039/3710) remote: Counting objects: 29% (1076/3710) remote: Counting objects: 30% (1113/3710) remote: Counting objects: 31% (1151/3710) remote: Counting objects: 32% (1188/3710) remote: Counting objects: 33% (1225/3710) remote: Counting objects: 34% (1262/3710) remote: Counting objects: 35% (1299/3710) remote: Counting objects: 36% (1336/3710) remote: Counting objects: 37% (1373/3710) remote: Counting objects: 38% (1410/3710) remote: Counting objects: 39% (1447/3710) remote: Counting objects: 40% (1484/3710) remote: Counting objects: 41% (1522/3710) remote: Counting objects: 42% (1559/3710) remote: Counting objects: 43% (1596/3710) remote: Counting objects: 44% (1633/3710) remote: Counting objects: 45% (1670/3710) remote: Counting objects: 46% (1707/3710) remote: Counting objects: 47% (1744/3710) remote: Counting objects: 48% (1781/3710) remote: Counting objects: 49% (1818/3710) remote: Counting objects: 50% (1855/3710) remote: Counting objects: 51% (1893/3710) remote: Counting objects: 52% (1930/3710) remote: Counting objects: 53% (1967/3710) remote: Counting objects: 54% (2004/3710) remote: Counting objects: 55% (2041/3710) remote: Counting objects: 56% (2078/3710) remote: Counting objects: 57% (2115/3710) remote: Counting objects: 58% (2152/3710) remote: Counting objects: 59% (2189/3710) remote: Counting objects: 60% (2226/3710) remote: Counting objects: 61% (2264/3710) remote: Counting objects: 62% (2301/3710) remote: Counting objects: 63% (2338/3710) remote: Counting objects: 64% (2375/3710) remote: Counting objects: 65% (2412/3710) remote: Counting objects: 66% (2449/3710) remote: Counting objects: 67% (2486/3710) remote: Counting objects: 68% (2523/3710) remote: Counting objects: 69% (2560/3710) remote: Counting objects: 70% (2597/3710) remote: Counting objects: 71% (2635/3710) remote: Counting objects: 72% (2672/3710) remote: Counting objects: 73% (2709/3710) remote: Counting objects: 74% (2746/3710) remote: Counting objects: 75% (2783/3710) remote: Counting objects: 76% (2820/3710) remote: Counting objects: 77% (2857/3710) remote: Counting objects: 78% (2894/3710) remote: Counting objects: 79% (2931/3710) remote: Counting objects: 80% (2968/3710) remote: Counting objects: 81% (3006/3710) remote: Counting objects: 82% (3043/3710) remote: Counting objects: 83% (3080/3710) remote: Counting objects: 84% (3117/3710) remote: Counting objects: 85% (3154/3710) remote: Counting objects: 86% (3191/3710) remote: Counting objects: 87% (3228/3710) remote: Counting objects: 88% (3265/3710) remote: Counting objects: 89% (3302/3710) remote: Counting objects: 90% (3339/3710) remote: Counting objects: 91% (3377/3710) remote: Counting objects: 92% (3414/3710) remote: Counting objects: 93% (3451/3710) remote: Counting objects: 94% (3488/3710) remote: Counting objects: 95% (3525/3710) remote: Counting objects: 96% (3562/3710) remote: Counting objects: 97% (3599/3710) remote: Counting objects: 98% (3636/3710) remote: Counting objects: 99% (3673/3710) remote: Counting objects: 100% (3710/3710) remote: Counting objects: 100% (3710/3710), done.
  5. 2.93 s remote: Compressing objects: 0% (1/1481) remote: Compressing objects: 1% (15/1481) remote: Compressing objects: 2% (30/1481) remote: Compressing objects: 3% (45/1481) remote: Compressing objects: 4% (60/1481) remote: Compressing objects: 5% (75/1481) remote: Compressing objects: 6% (89/1481) remote: Compressing objects: 7% (104/1481) remote: Compressing objects: 8% (119/1481) remote: Compressing objects: 9% (134/1481) remote: Compressing objects: 10% (149/1481) remote: Compressing objects: 11% (163/1481) remote: Compressing objects: 12% (178/1481) remote: Compressing objects: 13% (193/1481) remote: Compressing objects: 14% (208/1481) remote: Compressing objects: 15% (223/1481) remote: Compressing objects: 16% (237/1481) remote: Compressing objects: 17% (252/1481) remote: Compressing objects: 18% (267/1481) remote: Compressing objects: 19% (282/1481) remote: Compressing objects: 20% (297/1481) remote: Compressing objects: 21% (312/1481) remote: Compressing objects: 22% (326/1481) remote: Compressing objects: 23% (341/1481) remote: Compressing objects: 24% (356/1481) remote: Compressing objects: 25% (371/1481) remote: Compressing objects: 26% (386/1481) remote: Compressing objects: 27% (400/1481) remote: Compressing objects: 28% (415/1481) remote: Compressing objects: 29% (430/1481) remote: Compressing objects: 30% (445/1481) remote: Compressing objects: 31% (460/1481) remote: Compressing objects: 32% (474/1481) remote: Compressing objects: 32% (482/1481) remote: Compressing objects: 33% (489/1481) remote: Compressing objects: 34% (504/1481) remote: Compressing objects: 35% (519/1481) remote: Compressing objects: 36% (534/1481) remote: Compressing objects: 37% (548/1481) remote: Compressing objects: 38% (563/1481) remote: Compressing objects: 39% (578/1481) remote: Compressing objects: 40% (593/1481) remote: Compressing objects: 41% (608/1481) remote: Compressing objects: 42% (623/1481) remote: Compressing objects: 43% (637/1481) remote: Compressing objects: 44% (652/1481) remote: Compressing objects: 44% (660/1481) remote: Compressing objects: 45% (667/1481) remote: Compressing objects: 46% (682/1481) remote: Compressing objects: 47% (697/1481) remote: Compressing objects: 48% (711/1481) remote: Compressing objects: 49% (726/1481) remote: Compressing objects: 50% (741/1481) remote: Compressing objects: 51% (756/1481) remote: Compressing objects: 52% (771/1481) remote: Compressing objects: 53% (785/1481) remote: Compressing objects: 54% (800/1481) remote: Compressing objects: 55% (815/1481) remote: Compressing objects: 56% (830/1481) remote: Compressing objects: 57% (845/1481) remote: Compressing objects: 58% (859/1481) remote: Compressing objects: 59% (874/1481) remote: Compressing objects: 60% (889/1481) remote: Compressing objects: 61% (904/1481) remote: Compressing objects: 62% (919/1481) remote: Compressing objects: 63% (934/1481) remote: Compressing objects: 64% (948/1481) remote: Compressing objects: 65% (963/1481) remote: Compressing objects: 66% (978/1481) remote: Compressing objects: 67% (993/1481) remote: Compressing objects: 68% (1008/1481) remote: Compressing objects: 69% (1022/1481) remote: Compressing objects: 70% (1037/1481) remote: Compressing objects: 71% (1052/1481) remote: Compressing objects: 72% (1067/1481) remote: Compressing objects: 73% (1082/1481) remote: Compressing objects: 74% (1096/1481) remote: Compressing objects: 75% (1111/1481) remote: Compressing objects: 76% (1126/1481) remote: Compressing objects: 77% (1141/1481) remote: Compressing objects: 78% (1156/1481) remote: Compressing objects: 79% (1170/1481) remote: Compressing objects: 80% (1185/1481) remote: Compressing objects: 81% (1200/1481) remote: Compressing objects: 82% (1215/1481) remote: Compressing objects: 83% (1230/1481) remote: Compressing objects: 84% (1245/1481) remote: Compressing objects: 85% (1259/1481) remote: Compressing objects: 86% (1274/1481) remote: Compressing objects: 87% (1289/1481) remote: Compressing objects: 88% (1304/1481) remote: Compressing objects: 89% (1319/1481) remote: Compressing objects: 90% (1333/1481) remote: Compressing objects: 91% (1348/1481) remote: Compressing objects: 92% (1363/1481) remote: Compressing objects: 93% (1378/1481) remote: Compressing objects: 94% (1393/1481) remote: Compressing objects: 95% (1407/1481) remote: Compressing objects: 96% (1422/1481) remote: Compressing objects: 97% (1437/1481) remote: Compressing objects: 98% (1452/1481) remote: Compressing objects: 99% (1467/1481) remote: Compressing objects: 100% (1481/1481) remote: Compressing objects: 100% (1481/1481), done.
  6. 17.51 s Receiving objects: 0% (1/162134) Receiving objects: 1% (1622/162134) Receiving objects: 2% (3243/162134) Receiving objects: 3% (4865/162134) Receiving objects: 4% (6486/162134) Receiving objects: 5% (8107/162134), 17.96 MiB | 32.47 MiB/s Receiving objects: 6% (9729/162134), 17.96 MiB | 32.47 MiB/s Receiving objects: 6% (9937/162134), 17.96 MiB | 32.47 MiB/s Receiving objects: 7% (11350/162134), 36.82 MiB | 34.97 MiB/s Receiving objects: 8% (12971/162134), 36.82 MiB | 34.97 MiB/s Receiving objects: 9% (14593/162134), 36.82 MiB | 34.97 MiB/s Receiving objects: 10% (16214/162134), 36.82 MiB | 34.97 MiB/s Receiving objects: 11% (17835/162134), 36.82 MiB | 34.97 MiB/s Receiving objects: 12% (19457/162134), 52.90 MiB | 33.77 MiB/s Receiving objects: 13% (21078/162134), 52.90 MiB | 33.77 MiB/s Receiving objects: 13% (21824/162134), 52.90 MiB | 33.77 MiB/s Receiving objects: 14% (22699/162134), 52.90 MiB | 33.77 MiB/s Receiving objects: 15% (24321/162134), 72.32 MiB | 35.01 MiB/s Receiving objects: 16% (25942/162134), 72.32 MiB | 35.01 MiB/s Receiving objects: 17% (27563/162134), 88.28 MiB | 34.22 MiB/s Receiving objects: 18% (29185/162134), 88.28 MiB | 34.22 MiB/s Receiving objects: 18% (29513/162134), 88.28 MiB | 34.22 MiB/s Receiving objects: 19% (30806/162134), 88.28 MiB | 34.22 MiB/s Receiving objects: 20% (32427/162134), 107.91 MiB | 34.35 MiB/s Receiving objects: 21% (34049/162134), 107.91 MiB | 34.35 MiB/s Receiving objects: 22% (35670/162134), 107.91 MiB | 34.35 MiB/s Receiving objects: 23% (37291/162134), 127.45 MiB | 35.00 MiB/s Receiving objects: 24% (38913/162134), 127.45 MiB | 35.00 MiB/s Receiving objects: 24% (39105/162134), 127.45 MiB | 35.00 MiB/s Receiving objects: 25% (40534/162134), 143.42 MiB | 34.50 MiB/s Receiving objects: 26% (42155/162134), 143.42 MiB | 34.50 MiB/s Receiving objects: 27% (43777/162134), 143.42 MiB | 34.50 MiB/s Receiving objects: 28% (45398/162134), 143.42 MiB | 34.50 MiB/s Receiving objects: 29% (47019/162134), 143.42 MiB | 34.50 MiB/s Receiving objects: 30% (48641/162134), 162.96 MiB | 35.00 MiB/s Receiving objects: 31% (50262/162134), 162.96 MiB | 35.00 MiB/s Receiving objects: 32% (51883/162134), 162.96 MiB | 35.00 MiB/s Receiving objects: 33% (53505/162134), 162.96 MiB | 35.00 MiB/s Receiving objects: 34% (55126/162134), 162.96 MiB | 35.00 MiB/s Receiving objects: 35% (56747/162134), 162.96 MiB | 35.00 MiB/s Receiving objects: 36% (58369/162134), 162.96 MiB | 35.00 MiB/s Receiving objects: 36% (59628/162134), 162.96 MiB | 35.00 MiB/s Receiving objects: 37% (59990/162134), 162.96 MiB | 35.00 MiB/s Receiving objects: 38% (61611/162134), 162.96 MiB | 35.00 MiB/s Receiving objects: 39% (63233/162134), 178.67 MiB | 34.81 MiB/s Receiving objects: 40% (64854/162134), 178.67 MiB | 34.81 MiB/s Receiving objects: 41% (66475/162134), 178.67 MiB | 34.81 MiB/s Receiving objects: 42% (68097/162134), 178.67 MiB | 34.81 MiB/s Receiving objects: 43% (69718/162134), 178.67 MiB | 34.81 MiB/s Receiving objects: 44% (71339/162134), 178.67 MiB | 34.81 MiB/s Receiving objects: 45% (72961/162134), 198.20 MiB | 34.96 MiB/s Receiving objects: 46% (74582/162134), 198.20 MiB | 34.96 MiB/s Receiving objects: 47% (76203/162134), 198.20 MiB | 34.96 MiB/s Receiving objects: 48% (77825/162134), 198.20 MiB | 34.96 MiB/s Receiving objects: 48% (77847/162134), 198.20 MiB | 34.96 MiB/s Receiving objects: 48% (78084/162134), 234.04 MiB | 34.54 MiB/s Receiving objects: 49% (79446/162134), 273.23 MiB | 35.42 MiB/s Receiving objects: 49% (80331/162134), 273.23 MiB | 35.42 MiB/s Receiving objects: 50% (81067/162134), 273.23 MiB | 35.42 MiB/s Receiving objects: 51% (82689/162134), 289.08 MiB | 34.52 MiB/s Receiving objects: 51% (83694/162134), 308.24 MiB | 35.32 MiB/s Receiving objects: 52% (84310/162134), 308.24 MiB | 35.32 MiB/s Receiving objects: 53% (85932/162134), 308.24 MiB | 35.32 MiB/s Receiving objects: 54% (87553/162134), 308.24 MiB | 35.32 MiB/s Receiving objects: 55% (89174/162134), 324.58 MiB | 34.53 MiB/s Receiving objects: 56% (90796/162134), 324.58 MiB | 34.53 MiB/s Receiving objects: 57% (92417/162134), 324.58 MiB | 34.53 MiB/s Receiving objects: 58% (94038/162134), 324.58 MiB | 34.53 MiB/s Receiving objects: 59% (95660/162134), 324.58 MiB | 34.53 MiB/s Receiving objects: 60% (97281/162134), 324.58 MiB | 34.53 MiB/s Receiving objects: 61% (98902/162134), 324.58 MiB | 34.53 MiB/s Receiving objects: 62% (100524/162134), 324.58 MiB | 34.53 MiB/s Receiving objects: 63% (102145/162134), 324.58 MiB | 34.53 MiB/s Receiving objects: 64% (103766/162134), 324.58 MiB | 34.53 MiB/s Receiving objects: 65% (105388/162134), 324.58 MiB | 34.53 MiB/s Receiving objects: 66% (107009/162134), 324.58 MiB | 34.53 MiB/s Receiving objects: 67% (108630/162134), 324.58 MiB | 34.53 MiB/s Receiving objects: 68% (110252/162134), 324.58 MiB | 34.53 MiB/s Receiving objects: 69% (111873/162134), 324.58 MiB | 34.53 MiB/s Receiving objects: 70% (113494/162134), 324.58 MiB | 34.53 MiB/s Receiving objects: 71% (115116/162134), 324.58 MiB | 34.53 MiB/s Receiving objects: 72% (116737/162134), 324.58 MiB | 34.53 MiB/s Receiving objects: 73% (118358/162134), 324.58 MiB | 34.53 MiB/s Receiving objects: 74% (119980/162134), 324.58 MiB | 34.53 MiB/s Receiving objects: 75% (121601/162134), 324.58 MiB | 34.53 MiB/s Receiving objects: 75% (122878/162134), 342.65 MiB | 35.14 MiB/s Receiving objects: 76% (123222/162134), 342.65 MiB | 35.14 MiB/s Receiving objects: 77% (124844/162134), 359.76 MiB | 34.52 MiB/s Receiving objects: 78% (126465/162134), 359.76 MiB | 34.52 MiB/s Receiving objects: 79% (128086/162134), 359.76 MiB | 34.52 MiB/s Receiving objects: 80% (129708/162134), 359.76 MiB | 34.52 MiB/s Receiving objects: 81% (131329/162134), 359.76 MiB | 34.52 MiB/s Receiving objects: 82% (132950/162134), 359.76 MiB | 34.52 MiB/s Receiving objects: 82% (133434/162134), 379.16 MiB | 35.34 MiB/s Receiving objects: 83% (134572/162134), 395.27 MiB | 34.93 MiB/s Receiving objects: 84% (136193/162134), 395.27 MiB | 34.93 MiB/s Receiving objects: 85% (137814/162134), 395.27 MiB | 34.93 MiB/s Receiving objects: 86% (139436/162134), 414.54 MiB | 35.32 MiB/s Receiving objects: 86% (139510/162134), 414.54 MiB | 35.32 MiB/s Receiving objects: 87% (141057/162134), 414.54 MiB | 35.32 MiB/s Receiving objects: 88% (142678/162134), 414.54 MiB | 35.32 MiB/s Receiving objects: 89% (144300/162134), 414.54 MiB | 35.32 MiB/s Receiving objects: 90% (145921/162134), 430.75 MiB | 34.49 MiB/s Receiving objects: 91% (147542/162134), 449.89 MiB | 35.31 MiB/s Receiving objects: 91% (148059/162134), 449.89 MiB | 35.31 MiB/s Receiving objects: 92% (149164/162134), 449.89 MiB | 35.31 MiB/s Receiving objects: 93% (150785/162134), 449.89 MiB | 35.31 MiB/s Receiving objects: 94% (152406/162134), 462.79 MiB | 33.77 MiB/s Receiving objects: 95% (154028/162134), 480.06 MiB | 34.08 MiB/s Receiving objects: 95% (154855/162134), 480.06 MiB | 34.08 MiB/s Receiving objects: 96% (155649/162134), 480.06 MiB | 34.08 MiB/s Receiving objects: 97% (157270/162134), 480.06 MiB | 34.08 MiB/s Receiving objects: 98% (158892/162134), 480.06 MiB | 34.08 MiB/s Receiving objects: 99% (160513/162134), 494.61 MiB | 33.21 MiB/s remote: Total 162134 (delta 2584), reused 2717 (delta 2211), pack-reused 158424 (from 3)
  7. 17.51 s Receiving objects: 100% (162134/162134), 494.61 MiB | 33.21 MiB/s Receiving objects: 100% (162134/162134), 500.56 MiB | 34.33 MiB/s, done.
  8. 22.46 s Resolving deltas: 0% (0/105592) Resolving deltas: 1% (1056/105592) Resolving deltas: 2% (2112/105592) Resolving deltas: 3% (3168/105592) Resolving deltas: 4% (4225/105592) Resolving deltas: 5% (5280/105592) Resolving deltas: 6% (6336/105592) Resolving deltas: 7% (7392/105592) Resolving deltas: 8% (8448/105592) Resolving deltas: 9% (9504/105592) Resolving deltas: 10% (10560/105592) Resolving deltas: 11% (11616/105592) Resolving deltas: 12% (12672/105592) Resolving deltas: 13% (13727/105592) Resolving deltas: 14% (14783/105592) Resolving deltas: 15% (15840/105592) Resolving deltas: 16% (16895/105592) Resolving deltas: 17% (17951/105592) Resolving deltas: 18% (19007/105592) Resolving deltas: 19% (20065/105592) Resolving deltas: 20% (21119/105592) Resolving deltas: 21% (22175/105592) Resolving deltas: 22% (23231/105592) Resolving deltas: 22% (23655/105592) Resolving deltas: 23% (24287/105592) Resolving deltas: 24% (25343/105592) Resolving deltas: 25% (26398/105592) Resolving deltas: 26% (27454/105592) Resolving deltas: 27% (28510/105592) Resolving deltas: 28% (29566/105592) Resolving deltas: 29% (30622/105592) Resolving deltas: 30% (31678/105592) Resolving deltas: 31% (32734/105592) Resolving deltas: 32% (33790/105592) Resolving deltas: 33% (34849/105592) Resolving deltas: 34% (35902/105592) Resolving deltas: 35% (36958/105592) Resolving deltas: 36% (38014/105592) Resolving deltas: 37% (39070/105592) Resolving deltas: 38% (40125/105592) Resolving deltas: 39% (41182/105592) Resolving deltas: 40% (42237/105592) Resolving deltas: 40% (42795/105592) Resolving deltas: 41% (43294/105592) Resolving deltas: 42% (44349/105592) Resolving deltas: 43% (45405/105592) Resolving deltas: 44% (46461/105592) Resolving deltas: 45% (47517/105592) Resolving deltas: 46% (48573/105592) Resolving deltas: 47% (49630/105592) Resolving deltas: 48% (50685/105592) Resolving deltas: 49% (51741/105592) Resolving deltas: 49% (52766/105592) Resolving deltas: 50% (52796/105592) Resolving deltas: 51% (53852/105592) Resolving deltas: 52% (54908/105592) Resolving deltas: 53% (55964/105592) Resolving deltas: 54% (57020/105592) Resolving deltas: 55% (58076/105592) Resolving deltas: 56% (59132/105592) Resolving deltas: 57% (60189/105592) Resolving deltas: 58% (61244/105592) Resolving deltas: 59% (62300/105592) Resolving deltas: 60% (63356/105592) Resolving deltas: 61% (64412/105592) Resolving deltas: 62% (65469/105592) Resolving deltas: 63% (66524/105592) Resolving deltas: 64% (67579/105592) Resolving deltas: 65% (68635/105592) Resolving deltas: 66% (69691/105592) Resolving deltas: 67% (70747/105592) Resolving deltas: 68% (71803/105592) Resolving deltas: 69% (72859/105592) Resolving deltas: 70% (73916/105592) Resolving deltas: 71% (74972/105592) Resolving deltas: 72% (76027/105592) Resolving deltas: 73% (77083/105592) Resolving deltas: 74% (78139/105592) Resolving deltas: 75% (79194/105592) Resolving deltas: 76% (80250/105592) Resolving deltas: 77% (81306/105592) Resolving deltas: 78% (82362/105592) Resolving deltas: 79% (83418/105592) Resolving deltas: 80% (84474/105592) Resolving deltas: 81% (85530/105592) Resolving deltas: 82% (86586/105592) Resolving deltas: 83% (87642/105592) Resolving deltas: 84% (88698/105592) Resolving deltas: 85% (89754/105592) Resolving deltas: 86% (90810/105592) Resolving deltas: 87% (91866/105592) Resolving deltas: 88% (92921/105592) Resolving deltas: 88% (93568/105592) Resolving deltas: 89% (93977/105592) Resolving deltas: 90% (95033/105592) Resolving deltas: 91% (96089/105592) Resolving deltas: 92% (97145/105592) Resolving deltas: 93% (98201/105592) Resolving deltas: 94% (99257/105592) Resolving deltas: 95% (100313/105592) Resolving deltas: 96% (101369/105592) Resolving deltas: 97% (102425/105592) Resolving deltas: 98% (103481/105592) Resolving deltas: 99% (104537/105592) Resolving deltas: 100% (105592/105592) Resolving deltas: 100% (105592/105592), done.
  9. 23.33 s Fetching commit 850623213381026bc4a5649876fbf8a3192532a7 for idenso-epsilon-components ...
  10. 23.33 s $ /nix/store/b1wn5clix1mz4vpfih7x9cnj9qfh7c6h-git-2.54.0/bin/git fetch origin 850623213381026bc4a5649876fbf8a3192532a7
  11. 23.76 s From https://github.com/alphal00p/gammaloop
  12. 23.76 s * branch 850623213381026bc4a5649876fbf8a3192532a7 -> FETCH_HEAD
  13. 23.84 s $ /nix/store/bhv6xyvqw6gjs3j488gi1z6wdv18bdpa-coreutils-9.11/bin/timeout --kill-after=15s 7200s /nix/store/b1wn5clix1mz4vpfih7x9cnj9qfh7c6h-git-2.54.0/bin/git -c advice.detachedHead=false checkout 850623213381026bc4a5649876fbf8a3192532a7
  14. 24.34 s HEAD is now at 850623213 nix-ci: enable NixCI for final review
  15. 24.35 s $ /nix/store/bhv6xyvqw6gjs3j488gi1z6wdv18bdpa-coreutils-9.11/bin/timeout --kill-after=15s 7200s /nix/store/bxgja2ppiqi6w2bgn0r07d7mgnl1k6k2-nix-2.34.8/bin/nix --extra-experimental-features nix-command --extra-experimental-features flakes --log-format internal-json run .#packages.x86_64-linux.nix-ci-check-gammaloop-nextest-clinnet --print-build-logs
  16. 24.75 s warning: ignoring untrusted flake configuration setting 'extra-substituters'.
  17. 24.75 s Pass '--accept-flake-config' to trust it
  18. 24.75 s warning: ignoring untrusted flake configuration setting 'extra-trusted-public-keys'.
  19. 24.75 s Pass '--accept-flake-config' to trust it
  20. 32.27 s
  21. 36.42 s evaluating derivation 'gdo you want to allow configuration setting 'extra-substituters' to be set to 'https://cache.nix-ci.com' (y/N)? do you want to permanently mark this value as untrusted (y/N)? warning: ignoring untrusted flake configuration setting 'extra-substituters'.
  22. 36.42 s Pass '--accept-flake-config' to trust it
  23. 36.42 s do you want to allow configuration setting 'extra-trusted-public-keys' to be set to 'nix-ci:g3xV5BDTLtIBZr/A00IU1x0EtKKlb7YLgBN2SgYgM6A=' (y/N)? do you want to permanently mark this value as untrusted (y/N)? warning: ignoring untrusted flake configuration setting 'extra-trusted-public-keys'.
  24. 36.42 s Pass '--accept-flake-config' to trust it
  25. 46.14 s copying '/nix/store/wnbi evaluating derivation 'g copying '/nix/store/wnbi evaluating derivation 'g copying '/nix/store/wnbi evaluating derivation 'g copying '/nix/store/wnbi evaluating derivation 'g copying '/nix/store/wnbi evaluating derivation 'g copying '/nix/store/wnbi evaluating derivation 'g copying '/nix/store/wnbi evaluating derivation 'g copying '/nix/store/wnbi evaluating derivation 'g copying '/nix/store/wnbi evaluating derivation 'g copying '/nix/store/wnbi evaluating derivation 'g querying info about miss
  26. 57.81 s [0/1 built] [1/0/1 built] building ggammaloop-nextest-clinnet> Nextest worker budget: 16
  27. 57.93 s gammaloop-nextest-clinnet> Extracting 4 binaries (including 1 non-test binary), 1 build script output directory, and 1 linked path to /build/source
  28. 58.04 s gammaloop-nextest-clinnet> Extracted 16 files to /build/source in 0.11s
  29. 58.09 s gammaloop-nextest-clinnet> ------------
  30. 58.09 s gammaloop-nextest-clinnet> Nextest run ID f5c50711-a294-4ae4-be9e-1e7723344438 with nextest profile: ci_gammaloop
  31. 58.09 s gammaloop-nextest-clinnet> Starting 38 tests across 3 binaries
  32. 139.50 s gammaloop-nextest-clinnet> FAIL [ 81.327s] (32/38) clinnet::public_typst_behavior public_linnest_endpoint_anchor_distances_stay_local
  33. 139.50 s gammaloop-nextest-clinnet> stdout ---
  34. 139.50 s gammaloop-nextest-clinnet>
  35. 139.50 s gammaloop-nextest-clinnet> running 1 test
  36. 139.50 s gammaloop-nextest-clinnet> test public_linnest_endpoint_anchor_distances_stay_local has been running for over 60 seconds
  37. 139.50 s gammaloop-nextest-clinnet> test public_linnest_endpoint_anchor_distances_stay_local ... FAILED
  38. 139.50 s gammaloop-nextest-clinnet>
  39. 139.50 s gammaloop-nextest-clinnet> failures:
  40. 139.50 s gammaloop-nextest-clinnet>
  41. 139.50 s gammaloop-nextest-clinnet> failures:
  42. 139.50 s gammaloop-nextest-clinnet> public_linnest_endpoint_anchor_distances_stay_local
  43. 139.50 s gammaloop-nextest-clinnet>
  44. 139.50 s gammaloop-nextest-clinnet> test result: FAILED. 0 passed; 1 failed; 0 ignored; 0 measured; 17 filtered out; finished in 81.23s
  45. 139.50 s gammaloop-nextest-clinnet>
  46. 139.50 s gammaloop-nextest-clinnet> stderr ---
  47. 139.50 s gammaloop-nextest-clinnet>
  48. 139.50 s gammaloop-nextest-clinnet> thread 'public_linnest_endpoint_anchor_distances_stay_local' (310) panicked at crates/clinnet/tests/public_typst_behavior.rs:81:55:
  49. 139.50 s gammaloop-nextest-clinnet> called `Result::unwrap()` on an `Err` value: typst failed while compiling template /build/.tmp6vAyYD/.clinnet/templates/linnest-public-behavior.svg
  50. 139.50 s gammaloop-nextest-clinnet>
  51. 139.50 s gammaloop-nextest-clinnet> Command executed:
  52. 139.50 s gammaloop-nextest-clinnet> "typst" "c" "/build/.tmp6vAyYD/.clinnet/templates/linnest-public-behavior.typ" "/build/.tmp6vAyYD/.clinnet/templates/linnest-public-behavior.svg" "--root" "/build/.tmp6vAyYD/.clinnet/templates"
  53. 139.50 s gammaloop-nextest-clinnet>
  54. 139.50 s gammaloop-nextest-clinnet> Typst stdout:
  55. 139.50 s gammaloop-nextest-clinnet>
  56. 139.50 s gammaloop-nextest-clinnet>
  57. 139.50 s gammaloop-nextest-clinnet> Typst stderr:
  58. 139.50 s gammaloop-nextest-clinnet>
  59. 139.50 s gammaloop-nextest-clinnet>
  60. 139.50 s gammaloop-nextest-clinnet> Location:
  61. 139.50 s gammaloop-nextest-clinnet> crates/clinnet/src/lib.rs:741:13
  62. 139.50 s gammaloop-nextest-clinnet> stack backtrace:
  63. 139.50 s gammaloop-nextest-clinnet> 0: __rustc::rust_begin_unwind
  64. 139.50 s gammaloop-nextest-clinnet> 1: core::panicking::panic_fmt
  65. 139.50 s gammaloop-nextest-clinnet> 2: core::result::unwrap_failed
  66. 139.50 s gammaloop-nextest-clinnet> 3: public_typst_behavior::render
  67. 139.50 s gammaloop-nextest-clinnet> 4: <std::sync::once::Once>::call_once_force::<<std::sync::once_lock::OnceLock<alloc::string::String>>::initialize<<std::sync::once_lock::OnceLock<alloc::string::String>>::get_or_init<public_typst_behavior::linnest_public_svg::{closure#0}>::{closure#0}, !>::{closure#0}>::{closure#0}
  68. 139.50 s gammaloop-nextest-clinnet> 5: <std::sys::sync::once::futex::Once>::call
  69. 139.50 s gammaloop-nextest-clinnet> 6: <std::sync::once_lock::OnceLock<alloc::string::String>>::initialize::<<std::sync::once_lock::OnceLock<alloc::string::String>>::get_or_init<public_typst_behavior::linnest_public_svg::{closure#0}>::{closure#0}, !>
  70. 139.50 s gammaloop-nextest-clinnet> 7: <public_typst_behavior::public_linnest_endpoint_anchor_distances_stay_local::{closure#0} as core::ops::function::FnOnce<()>>::call_once
  71. 139.50 s gammaloop-nextest-clinnet> note: Some details are omitted, run with `RUST_BACKTRACE=full` for a verbose backtrace.
  72. 139.50 s gammaloop-nextest-clinnet>
  73. 142.91 s gammaloop-nextest-clinnet> FAIL [ 84.696s] (33/38) clinnet::public_typst_behavior public_linnest_fixture_assertions_hold
  74. 142.92 s gammaloop-nextest-clinnet> stdout ---
  75. 142.92 s gammaloop-nextest-clinnet>
  76. 142.92 s gammaloop-nextest-clinnet> running 1 test
  77. 142.92 s gammaloop-nextest-clinnet> test public_linnest_fixture_assertions_hold has been running for over 60 seconds
  78. 142.92 s gammaloop-nextest-clinnet> test public_linnest_fixture_assertions_hold ... FAILED
  79. 142.92 s gammaloop-nextest-clinnet>
  80. 142.92 s gammaloop-nextest-clinnet> failures:
  81. 142.92 s gammaloop-nextest-clinnet>
  82. 142.92 s gammaloop-nextest-clinnet> failures:
  83. 142.92 s gammaloop-nextest-clinnet> public_linnest_fixture_assertions_hold
  84. 142.92 s gammaloop-nextest-clinnet>
  85. 142.92 s gammaloop-nextest-clinnet> test result: FAILED. 0 passed; 1 failed; 0 ignored; 0 measured; 17 filtered out; finished in 84.68s
  86. 142.92 s gammaloop-nextest-clinnet>
  87. 142.92 s gammaloop-nextest-clinnet> stderr ---
  88. 142.92 s gammaloop-nextest-clinnet>
  89. 142.92 s gammaloop-nextest-clinnet> thread 'public_linnest_fixture_assertions_hold' (280) panicked at crates/clinnet/tests/public_typst_behavior.rs:81:55:
  90. 142.92 s gammaloop-nextest-clinnet> called `Result::unwrap()` on an `Err` value: typst failed while compiling template /build/.tmpVGjxYb/.clinnet/templates/linnest-public-behavior.svg
  91. 142.92 s gammaloop-nextest-clinnet>
  92. 142.92 s gammaloop-nextest-clinnet> Command executed:
  93. 142.92 s gammaloop-nextest-clinnet> "typst" "c" "/build/.tmpVGjxYb/.clinnet/templates/linnest-public-behavior.typ" "/build/.tmpVGjxYb/.clinnet/templates/linnest-public-behavior.svg" "--root" "/build/.tmpVGjxYb/.clinnet/templates"
  94. 142.92 s gammaloop-nextest-clinnet>
  95. 142.92 s gammaloop-nextest-clinnet> Typst stdout:
  96. 142.92 s gammaloop-nextest-clinnet>
  97. 142.92 s gammaloop-nextest-clinnet>
  98. 142.92 s gammaloop-nextest-clinnet> Typst stderr:
  99. 142.92 s gammaloop-nextest-clinnet>
  100. 142.92 s gammaloop-nextest-clinnet>
  101. 142.92 s gammaloop-nextest-clinnet> Location:
  102. 142.92 s gammaloop-nextest-clinnet> crates/clinnet/src/lib.rs:741:13
  103. 142.92 s gammaloop-nextest-clinnet> stack backtrace:
  104. 142.92 s gammaloop-nextest-clinnet> 0: __rustc::rust_begin_unwind
  105. 142.92 s gammaloop-nextest-clinnet> 1: core::panicking::panic_fmt
  106. 142.92 s gammaloop-nextest-clinnet> 2: core::result::unwrap_failed
  107. 142.92 s gammaloop-nextest-clinnet> 3: public_typst_behavior::render
  108. 142.92 s gammaloop-nextest-clinnet> 4: <std::sync::once::Once>::call_once_force::<<std::sync::once_lock::OnceLock<alloc::string::String>>::initialize<<std::sync::once_lock::OnceLock<alloc::string::String>>::get_or_init<public_typst_behavior::linnest_public_svg::{closure#0}>::{closure#0}, !>::{closure#0}>::{closure#0}
  109. 142.92 s gammaloop-nextest-clinnet> 5: <std::sys::sync::once::futex::Once>::call
  110. 142.92 s gammaloop-nextest-clinnet> 6: <std::sync::once_lock::OnceLock<alloc::string::String>>::initialize::<<std::sync::once_lock::OnceLock<alloc::string::String>>::get_or_init<public_typst_behavior::linnest_public_svg::{closure#0}>::{closure#0}, !>
  111. 142.92 s gammaloop-nextest-clinnet> 7: <public_typst_behavior::public_linnest_fixture_assertions_hold::{closure#0} as core::ops::function::FnOnce<()>>::call_once
  112. 142.92 s gammaloop-nextest-clinnet> note: Some details are omitted, run with `RUST_BACKTRACE=full` for a verbose backtrace.
  113. 142.92 s gammaloop-nextest-clinnet>
  114. 153.72 s gammaloop-nextest-clinnet> FAIL [ 95.413s] (34/38) clinnet::public_typst_behavior public_linnest_labels_follow_their_carriers
  115. 153.72 s gammaloop-nextest-clinnet> stdout ---
  116. 153.72 s gammaloop-nextest-clinnet>
  117. 153.72 s gammaloop-nextest-clinnet> running 1 test
  118. 153.72 s gammaloop-nextest-clinnet> test public_linnest_labels_follow_their_carriers has been running for over 60 seconds
  119. 153.72 s gammaloop-nextest-clinnet> test public_linnest_labels_follow_their_carriers ... FAILED
  120. 153.72 s gammaloop-nextest-clinnet>
  121. 153.72 s gammaloop-nextest-clinnet> failures:
  122. 153.72 s gammaloop-nextest-clinnet>
  123. 153.72 s gammaloop-nextest-clinnet> failures:
  124. 153.72 s gammaloop-nextest-clinnet> public_linnest_labels_follow_their_carriers
  125. 153.72 s gammaloop-nextest-clinnet>
  126. 153.72 s gammaloop-nextest-clinnet> test result: FAILED. 0 passed; 1 failed; 0 ignored; 0 measured; 17 filtered out; finished in 95.40s
  127. 153.72 s gammaloop-nextest-clinnet>
  128. 153.72 s gammaloop-nextest-clinnet> stderr ---
  129. 153.72 s gammaloop-nextest-clinnet>
  130. 153.72 s gammaloop-nextest-clinnet> thread 'public_linnest_labels_follow_their_carriers' (281) panicked at crates/clinnet/tests/public_typst_behavior.rs:81:55:
  131. 153.72 s gammaloop-nextest-clinnet> called `Result::unwrap()` on an `Err` value: typst failed while compiling template /build/.tmpZqOxvW/.clinnet/templates/linnest-public-behavior.svg
  132. 153.72 s gammaloop-nextest-clinnet>
  133. 153.72 s gammaloop-nextest-clinnet> Command executed:
  134. 153.72 s gammaloop-nextest-clinnet> "typst" "c" "/build/.tmpZqOxvW/.clinnet/templates/linnest-public-behavior.typ" "/build/.tmpZqOxvW/.clinnet/templates/linnest-public-behavior.svg" "--root" "/build/.tmpZqOxvW/.clinnet/templates"
  135. 153.72 s gammaloop-nextest-clinnet>
  136. 153.72 s gammaloop-nextest-clinnet> Typst stdout:
  137. 153.72 s gammaloop-nextest-clinnet>
  138. 153.72 s gammaloop-nextest-clinnet>
  139. 153.72 s gammaloop-nextest-clinnet> Typst stderr:
  140. 153.72 s gammaloop-nextest-clinnet>
  141. 153.72 s gammaloop-nextest-clinnet>
  142. 153.72 s gammaloop-nextest-clinnet> Location:
  143. 153.72 s gammaloop-nextest-clinnet> crates/clinnet/src/lib.rs:741:13
  144. 153.72 s gammaloop-nextest-clinnet> stack backtrace:
  145. 153.72 s gammaloop-nextest-clinnet> 0: __rustc::rust_begin_unwind
  146. 153.72 s gammaloop-nextest-clinnet> 1: core::panicking::panic_fmt
  147. 153.72 s gammaloop-nextest-clinnet> 2: core::result::unwrap_failed
  148. 153.72 s gammaloop-nextest-clinnet> 3: public_typst_behavior::render
  149. 153.72 s gammaloop-nextest-clinnet> 4: <std::sync::once::Once>::call_once_force::<<std::sync::once_lock::OnceLock<alloc::string::String>>::initialize<<std::sync::once_lock::OnceLock<alloc::string::String>>::get_or_init<public_typst_behavior::linnest_public_svg::{closure#0}>::{closure#0}, !>::{closure#0}>::{closure#0}
  150. 153.72 s gammaloop-nextest-clinnet> 5: <std::sys::sync::once::futex::Once>::call
  151. 153.72 s gammaloop-nextest-clinnet> 6: <std::sync::once_lock::OnceLock<alloc::string::String>>::initialize::<<std::sync::once_lock::OnceLock<alloc::string::String>>::get_or_init<public_typst_behavior::linnest_public_svg::{closure#0}>::{closure#0}, !>
  152. 153.72 s gammaloop-nextest-clinnet> 7: <public_typst_behavior::public_linnest_labels_follow_their_carriers::{closure#0} as core::ops::function::FnOnce<()>>::call_once
  153. 153.72 s gammaloop-nextest-clinnet> note: Some details are omitted, run with `RUST_BACKTRACE=full` for a verbose backtrace.
  154. 153.72 s gammaloop-nextest-clinnet>
  155. 164.46 s gammaloop-nextest-clinnet> ------------
  156. 164.46 s gammaloop-nextest-clinnet> Summary [ 106.380s] 38 tests run: 35 passed, 3 failed, 0 skipped
  157. 164.47 s gammaloop-nextest-clinnet> FAIL [ 81.327s] (32/38) clinnet::public_typst_behavior public_linnest_endpoint_anchor_distances_stay_local
  158. 164.47 s gammaloop-nextest-clinnet> stdout ---
  159. 164.47 s gammaloop-nextest-clinnet>
  160. 164.47 s gammaloop-nextest-clinnet> running 1 test
  161. 164.47 s gammaloop-nextest-clinnet> test public_linnest_endpoint_anchor_distances_stay_local has been running for over 60 seconds
  162. 164.47 s gammaloop-nextest-clinnet> test public_linnest_endpoint_anchor_distances_stay_local ... FAILED
  163. 164.47 s gammaloop-nextest-clinnet>
  164. 164.47 s gammaloop-nextest-clinnet> failures:
  165. 164.47 s gammaloop-nextest-clinnet>
  166. 164.47 s gammaloop-nextest-clinnet> failures:
  167. 164.47 s gammaloop-nextest-clinnet> public_linnest_endpoint_anchor_distances_stay_local
  168. 164.47 s gammaloop-nextest-clinnet>
  169. 164.47 s gammaloop-nextest-clinnet> test result: FAILED. 0 passed; 1 failed; 0 ignored; 0 measured; 17 filtered out; finished in 81.23s
  170. 164.47 s gammaloop-nextest-clinnet>
  171. 164.47 s gammaloop-nextest-clinnet> stderr ---
  172. 164.47 s gammaloop-nextest-clinnet>
  173. 164.47 s gammaloop-nextest-clinnet> thread 'public_linnest_endpoint_anchor_distances_stay_local' (310) panicked at crates/clinnet/tests/public_typst_behavior.rs:81:55:
  174. 164.47 s gammaloop-nextest-clinnet> called `Result::unwrap()` on an `Err` value: typst failed while compiling template /build/.tmp6vAyYD/.clinnet/templates/linnest-public-behavior.svg
  175. 164.47 s gammaloop-nextest-clinnet>
  176. 164.47 s gammaloop-nextest-clinnet> Command executed:
  177. 164.47 s gammaloop-nextest-clinnet> "typst" "c" "/build/.tmp6vAyYD/.clinnet/templates/linnest-public-behavior.typ" "/build/.tmp6vAyYD/.clinnet/templates/linnest-public-behavior.svg" "--root" "/build/.tmp6vAyYD/.clinnet/templates"
  178. 164.47 s gammaloop-nextest-clinnet>
  179. 164.47 s gammaloop-nextest-clinnet> Typst stdout:
  180. 164.47 s gammaloop-nextest-clinnet>
  181. 164.47 s gammaloop-nextest-clinnet>
  182. 164.47 s gammaloop-nextest-clinnet> Typst stderr:
  183. 164.47 s gammaloop-nextest-clinnet>
  184. 164.47 s gammaloop-nextest-clinnet>
  185. 164.47 s gammaloop-nextest-clinnet> Location:
  186. 164.47 s gammaloop-nextest-clinnet> crates/clinnet/src/lib.rs:741:13
  187. 164.47 s gammaloop-nextest-clinnet> stack backtrace:
  188. 164.47 s gammaloop-nextest-clinnet> 0: __rustc::rust_begin_unwind
  189. 164.47 s gammaloop-nextest-clinnet> 1: core::panicking::panic_fmt
  190. 164.47 s gammaloop-nextest-clinnet> 2: core::result::unwrap_failed
  191. 164.47 s gammaloop-nextest-clinnet> 3: public_typst_behavior::render
  192. 164.47 s gammaloop-nextest-clinnet> 4: <std::sync::once::Once>::call_once_force::<<std::sync::once_lock::OnceLock<alloc::string::String>>::initialize<<std::sync::once_lock::OnceLock<alloc::string::String>>::get_or_init<public_typst_behavior::linnest_public_svg::{closure#0}>::{closure#0}, !>::{closure#0}>::{closure#0}
  193. 164.47 s gammaloop-nextest-clinnet> 5: <std::sys::sync::once::futex::Once>::call
  194. 164.47 s gammaloop-nextest-clinnet> 6: <std::sync::once_lock::OnceLock<alloc::string::String>>::initialize::<<std::sync::once_lock::OnceLock<alloc::string::String>>::get_or_init<public_typst_behavior::linnest_public_svg::{closure#0}>::{closure#0}, !>
  195. 164.47 s gammaloop-nextest-clinnet> 7: <public_typst_behavior::public_linnest_endpoint_anchor_distances_stay_local::{closure#0} as core::ops::function::FnOnce<()>>::call_once
  196. 164.47 s gammaloop-nextest-clinnet> note: Some details are omitted, run with `RUST_BACKTRACE=full` for a verbose backtrace.
  197. 164.47 s gammaloop-nextest-clinnet>
  198. 164.47 s gammaloop-nextest-clinnet> FAIL [ 84.696s] (33/38) clinnet::public_typst_behavior public_linnest_fixture_assertions_hold
  199. 164.47 s gammaloop-nextest-clinnet> stdout ---
  200. 164.47 s gammaloop-nextest-clinnet>
  201. 164.47 s gammaloop-nextest-clinnet> running 1 test
  202. 164.47 s gammaloop-nextest-clinnet> test public_linnest_fixture_assertions_hold has been running for over 60 seconds
  203. 164.47 s gammaloop-nextest-clinnet> test public_linnest_fixture_assertions_hold ... FAILED
  204. 164.47 s gammaloop-nextest-clinnet>
  205. 164.47 s gammaloop-nextest-clinnet> failures:
  206. 164.47 s gammaloop-nextest-clinnet>
  207. 164.47 s gammaloop-nextest-clinnet> failures:
  208. 164.47 s gammaloop-nextest-clinnet> public_linnest_fixture_assertions_hold
  209. 164.47 s gammaloop-nextest-clinnet>
  210. 164.47 s gammaloop-nextest-clinnet> test result: FAILED. 0 passed; 1 failed; 0 ignored; 0 measured; 17 filtered out; finished in 84.68s
  211. 164.47 s gammaloop-nextest-clinnet>
  212. 164.47 s gammaloop-nextest-clinnet> stderr ---
  213. 164.47 s gammaloop-nextest-clinnet>
  214. 164.47 s gammaloop-nextest-clinnet> thread 'public_linnest_fixture_assertions_hold' (280) panicked at crates/clinnet/tests/public_typst_behavior.rs:81:55:
  215. 164.47 s gammaloop-nextest-clinnet> called `Result::unwrap()` on an `Err` value: typst failed while compiling template /build/.tmpVGjxYb/.clinnet/templates/linnest-public-behavior.svg
  216. 164.47 s gammaloop-nextest-clinnet>
  217. 164.47 s gammaloop-nextest-clinnet> Command executed:
  218. 164.47 s gammaloop-nextest-clinnet> "typst" "c" "/build/.tmpVGjxYb/.clinnet/templates/linnest-public-behavior.typ" "/build/.tmpVGjxYb/.clinnet/templates/linnest-public-behavior.svg" "--root" "/build/.tmpVGjxYb/.clinnet/templates"
  219. 164.47 s gammaloop-nextest-clinnet>
  220. 164.47 s gammaloop-nextest-clinnet> Typst stdout:
  221. 164.47 s gammaloop-nextest-clinnet>
  222. 164.47 s gammaloop-nextest-clinnet>
  223. 164.47 s gammaloop-nextest-clinnet> Typst stderr:
  224. 164.47 s gammaloop-nextest-clinnet>
  225. 164.47 s gammaloop-nextest-clinnet>
  226. 164.47 s gammaloop-nextest-clinnet> Location:
  227. 164.47 s gammaloop-nextest-clinnet> crates/clinnet/src/lib.rs:741:13
  228. 164.47 s gammaloop-nextest-clinnet> stack backtrace:
  229. 164.47 s gammaloop-nextest-clinnet> 0: __rustc::rust_begin_unwind
  230. 164.47 s gammaloop-nextest-clinnet> 1: core::panicking::panic_fmt
  231. 164.47 s gammaloop-nextest-clinnet> 2: core::result::unwrap_failed
  232. 164.47 s gammaloop-nextest-clinnet> 3: public_typst_behavior::render
  233. 164.47 s gammaloop-nextest-clinnet> 4: <std::sync::once::Once>::call_once_force::<<std::sync::once_lock::OnceLock<alloc::string::String>>::initialize<<std::sync::once_lock::OnceLock<alloc::string::String>>::get_or_init<public_typst_behavior::linnest_public_svg::{closure#0}>::{closure#0}, !>::{closure#0}>::{closure#0}
  234. 164.47 s gammaloop-nextest-clinnet> 5: <std::sys::sync::once::futex::Once>::call
  235. 164.47 s gammaloop-nextest-clinnet> 6: <std::sync::once_lock::OnceLock<alloc::string::String>>::initialize::<<std::sync::once_lock::OnceLock<alloc::string::String>>::get_or_init<public_typst_behavior::linnest_public_svg::{closure#0}>::{closure#0}, !>
  236. 164.47 s gammaloop-nextest-clinnet> 7: <public_typst_behavior::public_linnest_fixture_assertions_hold::{closure#0} as core::ops::function::FnOnce<()>>::call_once
  237. 164.47 s gammaloop-nextest-clinnet> note: Some details are omitted, run with `RUST_BACKTRACE=full` for a verbose backtrace.
  238. 164.47 s gammaloop-nextest-clinnet>
  239. 164.47 s gammaloop-nextest-clinnet> FAIL [ 95.413s] (34/38) clinnet::public_typst_behavior public_linnest_labels_follow_their_carriers
  240. 164.47 s gammaloop-nextest-clinnet> stdout ---
  241. 164.47 s gammaloop-nextest-clinnet>
  242. 164.47 s gammaloop-nextest-clinnet> running 1 test
  243. 164.47 s gammaloop-nextest-clinnet> test public_linnest_labels_follow_their_carriers has been running for over 60 seconds
  244. 164.47 s gammaloop-nextest-clinnet> test public_linnest_labels_follow_their_carriers ... FAILED
  245. 164.47 s gammaloop-nextest-clinnet>
  246. 164.47 s gammaloop-nextest-clinnet> failures:
  247. 164.47 s gammaloop-nextest-clinnet>
  248. 164.47 s gammaloop-nextest-clinnet> failures:
  249. 164.47 s gammaloop-nextest-clinnet> public_linnest_labels_follow_their_carriers
  250. 164.47 s gammaloop-nextest-clinnet>
  251. 164.47 s gammaloop-nextest-clinnet> test result: FAILED. 0 passed; 1 failed; 0 ignored; 0 measured; 17 filtered out; finished in 95.40s
  252. 164.47 s gammaloop-nextest-clinnet>
  253. 164.47 s gammaloop-nextest-clinnet> stderr ---
  254. 164.47 s gammaloop-nextest-clinnet>
  255. 164.47 s gammaloop-nextest-clinnet> thread 'public_linnest_labels_follow_their_carriers' (281) panicked at crates/clinnet/tests/public_typst_behavior.rs:81:55:
  256. 164.47 s gammaloop-nextest-clinnet> called `Result::unwrap()` on an `Err` value: typst failed while compiling template /build/.tmpZqOxvW/.clinnet/templates/linnest-public-behavior.svg
  257. 164.47 s gammaloop-nextest-clinnet>
  258. 164.47 s gammaloop-nextest-clinnet> Command executed:
  259. 164.47 s gammaloop-nextest-clinnet> "typst" "c" "/build/.tmpZqOxvW/.clinnet/templates/linnest-public-behavior.typ" "/build/.tmpZqOxvW/.clinnet/templates/linnest-public-behavior.svg" "--root" "/build/.tmpZqOxvW/.clinnet/templates"
  260. 164.47 s gammaloop-nextest-clinnet>
  261. 164.47 s gammaloop-nextest-clinnet> Typst stdout:
  262. 164.47 s gammaloop-nextest-clinnet>
  263. 164.47 s gammaloop-nextest-clinnet>
  264. 164.47 s gammaloop-nextest-clinnet> Typst stderr:
  265. 164.47 s gammaloop-nextest-clinnet>
  266. 164.47 s gammaloop-nextest-clinnet>
  267. 164.47 s gammaloop-nextest-clinnet> Location:
  268. 164.47 s gammaloop-nextest-clinnet> crates/clinnet/src/lib.rs:741:13
  269. 164.47 s gammaloop-nextest-clinnet> stack backtrace:
  270. 164.47 s gammaloop-nextest-clinnet> 0: __rustc::rust_begin_unwind
  271. 164.47 s gammaloop-nextest-clinnet> 1: core::panicking::panic_fmt
  272. 164.47 s gammaloop-nextest-clinnet> 2: core::result::unwrap_failed
  273. 164.47 s gammaloop-nextest-clinnet> 3: public_typst_behavior::render
  274. 164.47 s gammaloop-nextest-clinnet> 4: <std::sync::once::Once>::call_once_force::<<std::sync::once_lock::OnceLock<alloc::string::String>>::initialize<<std::sync::once_lock::OnceLock<alloc::string::String>>::get_or_init<public_typst_behavior::linnest_public_svg::{closure#0}>::{closure#0}, !>::{closure#0}>::{closure#0}
  275. 164.47 s gammaloop-nextest-clinnet> 5: <std::sys::sync::once::futex::Once>::call
  276. 164.47 s gammaloop-nextest-clinnet> 6: <std::sync::once_lock::OnceLock<alloc::string::String>>::initialize::<<std::sync::once_lock::OnceLock<alloc::string::String>>::get_or_init<public_typst_behavior::linnest_public_svg::{closure#0}>::{closure#0}, !>
  277. 164.47 s gammaloop-nextest-clinnet> 7: <public_typst_behavior::public_linnest_labels_follow_their_carriers::{closure#0} as core::ops::function::FnOnce<()>>::call_once
  278. 164.47 s gammaloop-nextest-clinnet> note: Some details are omitted, run with `RUST_BACKTRACE=full` for a verbose backtrace.
  279. 164.47 s gammaloop-nextest-clinnet>
  280. 164.49 s gammaloop-nextest-clinnet> error: test run failed
  281. 164.54 s gammaloop-nextest-clinnet>
  282. 164.54 s gammaloop-nextest-clinnet> ========== nextest test summary ==========
  283. 164.54 s gammaloop-nextest-clinnet> report: target/nextest/ci_gammaloop/junit.xml
  284. 164.54 s gammaloop-nextest-clinnet> tests: 38, failures: 3, errors: 0
  285. 164.54 s gammaloop-nextest-clinnet>
  286. 164.54 s gammaloop-nextest-clinnet> 1. clinnet::public_typst_behavior::public_linnest_endpoint_anchor_distances_stay_local
  287. 164.54 s gammaloop-nextest-clinnet> failure: test failure with exit code 101
  288. 164.54 s gammaloop-nextest-clinnet> thread 'public_linnest_endpoint_anchor_distances_stay_local' (310) panicked at crates/clinnet/tests/public_typst_behavior.rs:81:55:
  289. 164.54 s gammaloop-nextest-clinnet> called `Result::unwrap()` on an `Err` value: typst failed while compiling template /build/.tmp6vAyYD/.clinnet/templates/linnest-public-behavior.svg
  290. 164.54 s gammaloop-nextest-clinnet>
  291. 164.54 s gammaloop-nextest-clinnet> Command executed:
  292. 164.54 s gammaloop-nextest-clinnet> "typst" "c" "/build/.tmp6vAyYD/.clinnet/templates/linnest-public-behavior.typ" "/build/.tmp6vAyYD/.clinnet/templates/linnest-public-behavior.svg" "--root" "/build/.tmp6vAyYD/.clinnet/templates"
  293. 164.54 s gammaloop-nextest-clinnet>
  294. 164.54 s gammaloop-nextest-clinnet> Typst stdout:
  295. 164.54 s gammaloop-nextest-clinnet>
  296. 164.54 s gammaloop-nextest-clinnet>
  297. 164.54 s gammaloop-nextest-clinnet> Typst stderr:
  298. 164.54 s gammaloop-nextest-clinnet>
  299. 164.54 s gammaloop-nextest-clinnet>
  300. 164.54 s gammaloop-nextest-clinnet> Location:
  301. 164.54 s gammaloop-nextest-clinnet> crates/clinnet/src/lib.rs:741:13
  302. 164.54 s gammaloop-nextest-clinnet> stack backtrace:
  303. 164.54 s gammaloop-nextest-clinnet> 0: __rustc::rust_begin_unwind
  304. 164.54 s gammaloop-nextest-clinnet> 1: core::panicking::panic_fmt
  305. 164.54 s gammaloop-nextest-clinnet> 2: core::result::unwrap_failed
  306. 164.54 s gammaloop-nextest-clinnet> 3: public_typst_behavior::render
  307. 164.54 s gammaloop-nextest-clinnet> 4: <std::sync::once::Once>::call_once_force::<<std::sync::once_lock::OnceLock<alloc::string::String>>::initialize<<std::sync::once_lock::OnceLock<alloc::string::String>>::get_or_init<public_typst_behavior::linnest_public_svg::{closure#0}>::{closure#0}, !>::{closure#0}>::{closure#0}
  308. 164.54 s gammaloop-nextest-clinnet> 5: <std::sys::sync::once::futex::Once>::call
  309. 164.54 s gammaloop-nextest-clinnet> 6: <std::sync::once_lock::OnceLock<alloc::string::String>>::initialize::<<std::sync::once_lock::OnceLock<alloc::string::String>>::get_or_init<public_typst_behavior::linnest_public_svg::{closure#0}>::{closure#0}, !>
  310. 164.54 s gammaloop-nextest-clinnet> 7: <public_typst_behavior::public_linnest_endpoint_anchor_distances_stay_local::{closure#0} as core::ops::function::FnOnce<()>>::call_once
  311. 164.54 s gammaloop-nextest-clinnet> note: Some details are omitted, run with `RUST_BACKTRACE=full` for a verbose backtrace.
  312. 164.54 s gammaloop-nextest-clinnet> system-out
  313. 164.54 s gammaloop-nextest-clinnet> running 1 test
  314. 164.54 s gammaloop-nextest-clinnet> test public_linnest_endpoint_anchor_distances_stay_local has been running for over 60 seconds
  315. 164.54 s gammaloop-nextest-clinnet> test public_linnest_endpoint_anchor_distances_stay_local ... FAILED
  316. 164.54 s gammaloop-nextest-clinnet>
  317. 164.54 s gammaloop-nextest-clinnet> failures:
  318. 164.54 s gammaloop-nextest-clinnet>
  319. 164.54 s gammaloop-nextest-clinnet> failures:
  320. 164.54 s gammaloop-nextest-clinnet> public_linnest_endpoint_anchor_distances_stay_local
  321. 164.54 s gammaloop-nextest-clinnet>
  322. 164.54 s gammaloop-nextest-clinnet> test result: FAILED. 0 passed; 1 failed; 0 ignored; 0 measured; 17 filtered out; finished in 81.23s
  323. 164.54 s gammaloop-nextest-clinnet> system-err
  324. 164.54 s gammaloop-nextest-clinnet> thread 'public_linnest_endpoint_anchor_distances_stay_local' (310) panicked at crates/clinnet/tests/public_typst_behavior.rs:81:55:
  325. 164.54 s gammaloop-nextest-clinnet> called `Result::unwrap()` on an `Err` value: typst failed while compiling template /build/.tmp6vAyYD/.clinnet/templates/linnest-public-behavior.svg
  326. 164.54 s gammaloop-nextest-clinnet>
  327. 164.54 s gammaloop-nextest-clinnet> Command executed:
  328. 164.54 s gammaloop-nextest-clinnet> "typst" "c" "/build/.tmp6vAyYD/.clinnet/templates/linnest-public-behavior.typ" "/build/.tmp6vAyYD/.clinnet/templates/linnest-public-behavior.svg" "--root" "/build/.tmp6vAyYD/.clinnet/templates"
  329. 164.54 s gammaloop-nextest-clinnet>
  330. 164.54 s gammaloop-nextest-clinnet> Typst stdout:
  331. 164.54 s gammaloop-nextest-clinnet>
  332. 164.54 s gammaloop-nextest-clinnet>
  333. 164.54 s gammaloop-nextest-clinnet> Typst stderr:
  334. 164.54 s gammaloop-nextest-clinnet>
  335. 164.54 s gammaloop-nextest-clinnet>
  336. 164.54 s gammaloop-nextest-clinnet> Location:
  337. 164.54 s gammaloop-nextest-clinnet> crates/clinnet/src/lib.rs:741:13
  338. 164.54 s gammaloop-nextest-clinnet> stack backtrace:
  339. 164.54 s gammaloop-nextest-clinnet> 0: __rustc::rust_begin_unwind
  340. 164.54 s gammaloop-nextest-clinnet> 1: core::panicking::panic_fmt
  341. 164.54 s gammaloop-nextest-clinnet> 2: core::result::unwrap_failed
  342. 164.54 s gammaloop-nextest-clinnet> 3: public_typst_behavior::render
  343. 164.54 s gammaloop-nextest-clinnet> 4: <std::sync::once::Once>::call_once_force::<<std::sync::once_lock::OnceLock<alloc::string::String>>::initialize<<std::sync::once_lock::OnceLock<alloc::string::String>>::get_or_init<public_typst_behavior::linnest_public_svg::{closure#0}>::{closure#0}, !>::{closure#0}>::{closure#0}
  344. 164.54 s gammaloop-nextest-clinnet> 5: <std::sys::sync::once::futex::Once>::call
  345. 164.54 s gammaloop-nextest-clinnet> 6: <std::sync::once_lock::OnceLock<alloc::string::String>>::initialize::<<std::sync::once_lock::OnceLock<alloc::string::String>>::get_or_init<public_typst_behavior::linnest_public_svg::{closure#0}>::{closure#0}, !>
  346. 164.54 s gammaloop-nextest-clinnet> 7: <public_typst_behavior::public_linnest_endpoint_anchor_distances_stay_local::{closure#0} as core::ops::function::FnOnce<()>>::call_once
  347. 164.54 s gammaloop-nextest-clinnet> note: Some details are omitted, run with `RUST_BACKTRACE=full` for a verbose backtrace.
  348. 164.54 s gammaloop-nextest-clinnet>
  349. 164.54 s gammaloop-nextest-clinnet> 2. clinnet::public_typst_behavior::public_linnest_fixture_assertions_hold
  350. 164.54 s gammaloop-nextest-clinnet> failure: test failure with exit code 101
  351. 164.54 s gammaloop-nextest-clinnet> thread 'public_linnest_fixture_assertions_hold' (280) panicked at crates/clinnet/tests/public_typst_behavior.rs:81:55:
  352. 164.54 s gammaloop-nextest-clinnet> called `Result::unwrap()` on an `Err` value: typst failed while compiling template /build/.tmpVGjxYb/.clinnet/templates/linnest-public-behavior.svg
  353. 164.54 s gammaloop-nextest-clinnet>
  354. 164.54 s gammaloop-nextest-clinnet> Command executed:
  355. 164.54 s gammaloop-nextest-clinnet> "typst" "c" "/build/.tmpVGjxYb/.clinnet/templates/linnest-public-behavior.typ" "/build/.tmpVGjxYb/.clinnet/templates/linnest-public-behavior.svg" "--root" "/build/.tmpVGjxYb/.clinnet/templates"
  356. 164.54 s gammaloop-nextest-clinnet>
  357. 164.54 s gammaloop-nextest-clinnet> Typst stdout:
  358. 164.54 s gammaloop-nextest-clinnet>
  359. 164.54 s gammaloop-nextest-clinnet>
  360. 164.54 s gammaloop-nextest-clinnet> Typst stderr:
  361. 164.54 s gammaloop-nextest-clinnet>
  362. 164.54 s gammaloop-nextest-clinnet>
  363. 164.54 s gammaloop-nextest-clinnet> Location:
  364. 164.54 s gammaloop-nextest-clinnet> crates/clinnet/src/lib.rs:741:13
  365. 164.54 s gammaloop-nextest-clinnet> stack backtrace:
  366. 164.54 s gammaloop-nextest-clinnet> 0: __rustc::rust_begin_unwind
  367. 164.54 s gammaloop-nextest-clinnet> 1: core::panicking::panic_fmt
  368. 164.54 s gammaloop-nextest-clinnet> 2: core::result::unwrap_failed
  369. 164.54 s gammaloop-nextest-clinnet> 3: public_typst_behavior::render
  370. 164.54 s gammaloop-nextest-clinnet> 4: <std::sync::once::Once>::call_once_force::<<std::sync::once_lock::OnceLock<alloc::string::String>>::initialize<<std::sync::once_lock::OnceLock<alloc::string::String>>::get_or_init<public_typst_behavior::linnest_public_svg::{closure#0}>::{closure#0}, !>::{closure#0}>::{closure#0}
  371. 164.54 s gammaloop-nextest-clinnet> 5: <std::sys::sync::once::futex::Once>::call
  372. 164.54 s gammaloop-nextest-clinnet> 6: <std::sync::once_lock::OnceLock<alloc::string::String>>::initialize::<<std::sync::once_lock::OnceLock<alloc::string::String>>::get_or_init<public_typst_behavior::linnest_public_svg::{closure#0}>::{closure#0}, !>
  373. 164.54 s gammaloop-nextest-clinnet> 7: <public_typst_behavior::public_linnest_fixture_assertions_hold::{closure#0} as core::ops::function::FnOnce<()>>::call_once
  374. 164.54 s gammaloop-nextest-clinnet> note: Some details are omitted, run with `RUST_BACKTRACE=full` for a verbose backtrace.
  375. 164.54 s gammaloop-nextest-clinnet> system-out
  376. 164.54 s gammaloop-nextest-clinnet> running 1 test
  377. 164.54 s gammaloop-nextest-clinnet> test public_linnest_fixture_assertions_hold has been running for over 60 seconds
  378. 164.54 s gammaloop-nextest-clinnet> test public_linnest_fixture_assertions_hold ... FAILED
  379. 164.54 s gammaloop-nextest-clinnet>
  380. 164.54 s gammaloop-nextest-clinnet> failures:
  381. 164.54 s gammaloop-nextest-clinnet>
  382. 164.54 s gammaloop-nextest-clinnet> failures:
  383. 164.54 s gammaloop-nextest-clinnet> public_linnest_fixture_assertions_hold
  384. 164.54 s gammaloop-nextest-clinnet>
  385. 164.54 s gammaloop-nextest-clinnet> test result: FAILED. 0 passed; 1 failed; 0 ignored; 0 measured; 17 filtered out; finished in 84.68s
  386. 164.54 s gammaloop-nextest-clinnet> system-err
  387. 164.54 s gammaloop-nextest-clinnet> thread 'public_linnest_fixture_assertions_hold' (280) panicked at crates/clinnet/tests/public_typst_behavior.rs:81:55:
  388. 164.54 s gammaloop-nextest-clinnet> called `Result::unwrap()` on an `Err` value: typst failed while compiling template /build/.tmpVGjxYb/.clinnet/templates/linnest-public-behavior.svg
  389. 164.54 s gammaloop-nextest-clinnet>
  390. 164.54 s gammaloop-nextest-clinnet> Command executed:
  391. 164.54 s gammaloop-nextest-clinnet> "typst" "c" "/build/.tmpVGjxYb/.clinnet/templates/linnest-public-behavior.typ" "/build/.tmpVGjxYb/.clinnet/templates/linnest-public-behavior.svg" "--root" "/build/.tmpVGjxYb/.clinnet/templates"
  392. 164.54 s gammaloop-nextest-clinnet>
  393. 164.54 s gammaloop-nextest-clinnet> Typst stdout:
  394. 164.54 s gammaloop-nextest-clinnet>
  395. 164.54 s gammaloop-nextest-clinnet>
  396. 164.54 s gammaloop-nextest-clinnet> Typst stderr:
  397. 164.54 s gammaloop-nextest-clinnet>
  398. 164.54 s gammaloop-nextest-clinnet>
  399. 164.54 s gammaloop-nextest-clinnet> Location:
  400. 164.54 s gammaloop-nextest-clinnet> crates/clinnet/src/lib.rs:741:13
  401. 164.54 s gammaloop-nextest-clinnet> stack backtrace:
  402. 164.54 s gammaloop-nextest-clinnet> 0: __rustc::rust_begin_unwind
  403. 164.54 s gammaloop-nextest-clinnet> 1: core::panicking::panic_fmt
  404. 164.54 s gammaloop-nextest-clinnet> 2: core::result::unwrap_failed
  405. 164.54 s gammaloop-nextest-clinnet> 3: public_typst_behavior::render
  406. 164.54 s gammaloop-nextest-clinnet> 4: <std::sync::once::Once>::call_once_force::<<std::sync::once_lock::OnceLock<alloc::string::String>>::initialize<<std::sync::once_lock::OnceLock<alloc::string::String>>::get_or_init<public_typst_behavior::linnest_public_svg::{closure#0}>::{closure#0}, !>::{closure#0}>::{closure#0}
  407. 164.54 s gammaloop-nextest-clinnet> 5: <std::sys::sync::once::futex::Once>::call
  408. 164.54 s gammaloop-nextest-clinnet> 6: <std::sync::once_lock::OnceLock<alloc::string::String>>::initialize::<<std::sync::once_lock::OnceLock<alloc::string::String>>::get_or_init<public_typst_behavior::linnest_public_svg::{closure#0}>::{closure#0}, !>
  409. 164.54 s gammaloop-nextest-clinnet> 7: <public_typst_behavior::public_linnest_fixture_assertions_hold::{closure#0} as core::ops::function::FnOnce<()>>::call_once
  410. 164.54 s gammaloop-nextest-clinnet> note: Some details are omitted, run with `RUST_BACKTRACE=full` for a verbose backtrace.
  411. 164.54 s gammaloop-nextest-clinnet>
  412. 164.54 s gammaloop-nextest-clinnet> 3. clinnet::public_typst_behavior::public_linnest_labels_follow_their_carriers
  413. 164.54 s gammaloop-nextest-clinnet> failure: test failure with exit code 101
  414. 164.54 s gammaloop-nextest-clinnet> thread 'public_linnest_labels_follow_their_carriers' (281) panicked at crates/clinnet/tests/public_typst_behavior.rs:81:55:
  415. 164.54 s gammaloop-nextest-clinnet> called `Result::unwrap()` on an `Err` value: typst failed while compiling template /build/.tmpZqOxvW/.clinnet/templates/linnest-public-behavior.svg
  416. 164.54 s gammaloop-nextest-clinnet>
  417. 164.54 s gammaloop-nextest-clinnet> Command executed:
  418. 164.54 s gammaloop-nextest-clinnet> "typst" "c" "/build/.tmpZqOxvW/.clinnet/templates/linnest-public-behavior.typ" "/build/.tmpZqOxvW/.clinnet/templates/linnest-public-behavior.svg" "--root" "/build/.tmpZqOxvW/.clinnet/templates"
  419. 164.54 s gammaloop-nextest-clinnet>
  420. 164.54 s gammaloop-nextest-clinnet> Typst stdout:
  421. 164.54 s gammaloop-nextest-clinnet>
  422. 164.54 s gammaloop-nextest-clinnet>
  423. 164.54 s gammaloop-nextest-clinnet> Typst stderr:
  424. 164.54 s gammaloop-nextest-clinnet>
  425. 164.54 s gammaloop-nextest-clinnet>
  426. 164.54 s gammaloop-nextest-clinnet> Location:
  427. 164.54 s gammaloop-nextest-clinnet> crates/clinnet/src/lib.rs:741:13
  428. 164.54 s gammaloop-nextest-clinnet> stack backtrace:
  429. 164.54 s gammaloop-nextest-clinnet> 0: __rustc::rust_begin_unwind
  430. 164.54 s gammaloop-nextest-clinnet> 1: core::panicking::panic_fmt
  431. 164.54 s gammaloop-nextest-clinnet> 2: core::result::unwrap_failed
  432. 164.54 s gammaloop-nextest-clinnet> 3: public_typst_behavior::render
  433. 164.54 s gammaloop-nextest-clinnet> 4: <std::sync::once::Once>::call_once_force::<<std::sync::once_lock::OnceLock<alloc::string::String>>::initialize<<std::sync::once_lock::OnceLock<alloc::string::String>>::get_or_init<public_typst_behavior::linnest_public_svg::{closure#0}>::{closure#0}, !>::{closure#0}>::{closure#0}
  434. 164.54 s gammaloop-nextest-clinnet> 5: <std::sys::sync::once::futex::Once>::call
  435. 164.54 s gammaloop-nextest-clinnet> 6: <std::sync::once_lock::OnceLock<alloc::string::String>>::initialize::<<std::sync::once_lock::OnceLock<alloc::string::String>>::get_or_init<public_typst_behavior::linnest_public_svg::{closure#0}>::{closure#0}, !>
  436. 164.54 s gammaloop-nextest-clinnet> 7: <public_typst_behavior::public_linnest_labels_follow_their_carriers::{closure#0} as core::ops::function::FnOnce<()>>::call_once
  437. 164.54 s gammaloop-nextest-clinnet> note: Some details are omitted, run with `RUST_BACKTRACE=full` for a verbose backtrace.
  438. 164.54 s gammaloop-nextest-clinnet> system-out
  439. 164.54 s gammaloop-nextest-clinnet> running 1 test
  440. 164.54 s gammaloop-nextest-clinnet> test public_linnest_labels_follow_their_carriers has been running for over 60 seconds
  441. 164.54 s gammaloop-nextest-clinnet> test public_linnest_labels_follow_their_carriers ... FAILED
  442. 164.54 s gammaloop-nextest-clinnet>
  443. 164.54 s gammaloop-nextest-clinnet> failures:
  444. 164.54 s gammaloop-nextest-clinnet>
  445. 164.54 s gammaloop-nextest-clinnet> failures:
  446. 164.54 s gammaloop-nextest-clinnet> public_linnest_labels_follow_their_carriers
  447. 164.54 s gammaloop-nextest-clinnet>
  448. 164.54 s gammaloop-nextest-clinnet> test result: FAILED. 0 passed; 1 failed; 0 ignored; 0 measured; 17 filtered out; finished in 95.40s
  449. 164.54 s gammaloop-nextest-clinnet> system-err
  450. 164.54 s gammaloop-nextest-clinnet> thread 'public_linnest_labels_follow_their_carriers' (281) panicked at crates/clinnet/tests/public_typst_behavior.rs:81:55:
  451. 164.54 s gammaloop-nextest-clinnet> called `Result::unwrap()` on an `Err` value: typst failed while compiling template /build/.tmpZqOxvW/.clinnet/templates/linnest-public-behavior.svg
  452. 164.54 s gammaloop-nextest-clinnet>
  453. 164.54 s gammaloop-nextest-clinnet> Command executed:
  454. 164.54 s gammaloop-nextest-clinnet> "typst" "c" "/build/.tmpZqOxvW/.clinnet/templates/linnest-public-behavior.typ" "/build/.tmpZqOxvW/.clinnet/templates/linnest-public-behavior.svg" "--root" "/build/.tmpZqOxvW/.clinnet/templates"
  455. 164.54 s gammaloop-nextest-clinnet>
  456. 164.54 s gammaloop-nextest-clinnet> Typst stdout:
  457. 164.54 s gammaloop-nextest-clinnet>
  458. 164.54 s gammaloop-nextest-clinnet>
  459. 164.54 s gammaloop-nextest-clinnet> Typst stderr:
  460. 164.54 s gammaloop-nextest-clinnet>
  461. 164.54 s gammaloop-nextest-clinnet>
  462. 164.54 s gammaloop-nextest-clinnet> Location:
  463. 164.54 s gammaloop-nextest-clinnet> crates/clinnet/src/lib.rs:741:13
  464. 164.54 s gammaloop-nextest-clinnet> stack backtrace:
  465. 164.54 s gammaloop-nextest-clinnet> 0: __rustc::rust_begin_unwind
  466. 164.54 s gammaloop-nextest-clinnet> 1: core::panicking::panic_fmt
  467. 164.54 s gammaloop-nextest-clinnet> 2: core::result::unwrap_failed
  468. 164.54 s gammaloop-nextest-clinnet> 3: public_typst_behavior::render
  469. 164.54 s gammaloop-nextest-clinnet> 4: <std::sync::once::Once>::call_once_force::<<std::sync::once_lock::OnceLock<alloc::string::String>>::initialize<<std::sync::once_lock::OnceLock<alloc::string::String>>::get_or_init<public_typst_behavior::linnest_public_svg::{closure#0}>::{closure#0}, !>::{closure#0}>::{closure#0}
  470. 164.54 s gammaloop-nextest-clinnet> 5: <std::sys::sync::once::futex::Once>::call
  471. 164.54 s gammaloop-nextest-clinnet> 6: <std::sync::once_lock::OnceLock<alloc::string::String>>::initialize::<<std::sync::once_lock::OnceLock<alloc::string::String>>::get_or_init<public_typst_behavior::linnest_public_svg::{closure#0}>::{closure#0}, !>
  472. 164.54 s gammaloop-nextest-clinnet> 7: <public_typst_behavior::public_linnest_labels_follow_their_carriers::{closure#0} as core::ops::function::FnOnce<()>>::call_once
  473. 164.54 s gammaloop-nextest-clinnet> note: Some details are omitted, run with `RUST_BACKTRACE=full` for a verbose backtrace.
  474. 164.54 s gammaloop-nextest-clinnet> =========================================
  475. 164.68 s [0 built (1 failed)]error: Cannot build '/nix/store/4pqspwvh8pi9s2vg9g6mfsggpl9ynwzx-gammaloop-nextest-clinnet.drv'.
  476. 164.68 s Reason: builder failed with exit code 100.
  477. 164.68 s Output paths:
  478. 164.68 s /nix/store/v9zka7gxdrym1pq03r0i4w2q43fgdwcq-gammaloop-nextest-clinnet
  479. 164.68 s Last 449 log lines:
  480. 164.68 s > Nextest worker budget: 16
  481. 164.68 s > Extracting 4 binaries (including 1 non-test binary), 1 build script output directory, and 1 linked path to /build/source
  482. 164.68 s > Extracted 16 files to /build/source in 0.11s
  483. 164.68 s > ------------
  484. 164.68 s > Nextest run ID f5c50711-a294-4ae4-be9e-1e7723344438 with nextest profile: ci_gammaloop
  485. 164.68 s > Starting 38 tests across 3 binaries
  486. 164.68 s > FAIL [ 81.327s] (32/38) clinnet::public_typst_behavior public_linnest_endpoint_anchor_distances_stay_local
  487. 164.68 s > stdout ---
  488. 164.68 s >
  489. 164.68 s > running 1 test
  490. 164.68 s > test public_linnest_endpoint_anchor_distances_stay_local has been running for over 60 seconds
  491. 164.68 s > test public_linnest_endpoint_anchor_distances_stay_local ... FAILED
  492. 164.68 s >
  493. 164.68 s > failures:
  494. 164.68 s >
  495. 164.68 s > failures:
  496. 164.68 s > public_linnest_endpoint_anchor_distances_stay_local
  497. 164.68 s >
  498. 164.68 s > test result: FAILED. 0 passed; 1 failed; 0 ignored; 0 measured; 17 filtered out; finished in 81.23s
  499. 164.68 s >
  500. 164.68 s > stderr ---
  501. 164.68 s >
  502. 164.68 s > thread 'public_linnest_endpoint_anchor_distances_stay_local' (310) panicked at crates/clinnet/tests/public_typst_behavior.rs:81:55:
  503. 164.68 s > called `Result::unwrap()` on an `Err` value: typst failed while compiling template /build/.tmp6vAyYD/.clinnet/templates/linnest-public-behavior.svg
  504. 164.68 s >
  505. 164.68 s > Command executed:
  506. 164.68 s > "typst" "c" "/build/.tmp6vAyYD/.clinnet/templates/linnest-public-behavior.typ" "/build/.tmp6vAyYD/.clinnet/templates/linnest-public-behavior.svg" "--root" "/build/.tmp6vAyYD/.clinnet/templates"
  507. 164.68 s >
  508. 164.68 s > Typst stdout:
  509. 164.68 s >
  510. 164.68 s >
  511. 164.68 s > Typst stderr:
  512. 164.68 s >
  513. 164.68 s >
  514. 164.68 s > Location:
  515. 164.68 s > crates/clinnet/src/lib.rs:741:13
  516. 164.68 s > stack backtrace:
  517. 164.68 s > 0: __rustc::rust_begin_unwind
  518. 164.68 s > 1: core::panicking::panic_fmt
  519. 164.68 s > 2: core::result::unwrap_failed
  520. 164.68 s > 3: public_typst_behavior::render
  521. 164.68 s > 4: <std::sync::once::Once>::call_once_force::<<std::sync::once_lock::OnceLock<alloc::string::String>>::initialize<<std::sync::once_lock::OnceLock<alloc::string::String>>::get_or_init<public_typst_behavior::linnest_public_svg::{closure#0}>::{closure#0}, !>::{closure#0}>::{closure#0}
  522. 164.68 s > 5: <std::sys::sync::once::futex::Once>::call
  523. 164.68 s > 6: <std::sync::once_lock::OnceLock<alloc::string::String>>::initialize::<<std::sync::once_lock::OnceLock<alloc::string::String>>::get_or_init<public_typst_behavior::linnest_public_svg::{closure#0}>::{closure#0}, !>
  524. 164.68 s > 7: <public_typst_behavior::public_linnest_endpoint_anchor_distances_stay_local::{closure#0} as core::ops::function::FnOnce<()>>::call_once
  525. 164.68 s > note: Some details are omitted, run with `RUST_BACKTRACE=full` for a verbose backtrace.
  526. 164.68 s >
  527. 164.68 s > FAIL [ 84.696s] (33/38) clinnet::public_typst_behavior public_linnest_fixture_assertions_hold
  528. 164.68 s > stdout ---
  529. 164.68 s >
  530. 164.68 s > running 1 test
  531. 164.68 s > test public_linnest_fixture_assertions_hold has been running for over 60 seconds
  532. 164.68 s > test public_linnest_fixture_assertions_hold ... FAILED
  533. 164.68 s >
  534. 164.68 s > failures:
  535. 164.68 s >
  536. 164.68 s > failures:
  537. 164.68 s > public_linnest_fixture_assertions_hold
  538. 164.68 s >
  539. 164.68 s > test result: FAILED. 0 passed; 1 failed; 0 ignored; 0 measured; 17 filtered out; finished in 84.68s
  540. 164.68 s >
  541. 164.68 s > stderr ---
  542. 164.68 s >
  543. 164.68 s > thread 'public_linnest_fixture_assertions_hold' (280) panicked at crates/clinnet/tests/public_typst_behavior.rs:81:55:
  544. 164.68 s > called `Result::unwrap()` on an `Err` value: typst failed while compiling template /build/.tmpVGjxYb/.clinnet/templates/linnest-public-behavior.svg
  545. 164.68 s >
  546. 164.68 s > Command executed:
  547. 164.68 s > "typst" "c" "/build/.tmpVGjxYb/.clinnet/templates/linnest-public-behavior.typ" "/build/.tmpVGjxYb/.clinnet/templates/linnest-public-behavior.svg" "--root" "/build/.tmpVGjxYb/.clinnet/templates"
  548. 164.68 s >
  549. 164.68 s > Typst stdout:
  550. 164.68 s >
  551. 164.68 s >
  552. 164.68 s > Typst stderr:
  553. 164.68 s >
  554. 164.68 s >
  555. 164.68 s > Location:
  556. 164.68 s > crates/clinnet/src/lib.rs:741:13
  557. 164.68 s > stack backtrace:
  558. 164.68 s > 0: __rustc::rust_begin_unwind
  559. 164.68 s > 1: core::panicking::panic_fmt
  560. 164.68 s > 2: core::result::unwrap_failed
  561. 164.68 s > 3: public_typst_behavior::render
  562. 164.68 s > 4: <std::sync::once::Once>::call_once_force::<<std::sync::once_lock::OnceLock<alloc::string::String>>::initialize<<std::sync::once_lock::OnceLock<alloc::string::String>>::get_or_init<public_typst_behavior::linnest_public_svg::{closure#0}>::{closure#0}, !>::{closure#0}>::{closure#0}
  563. 164.68 s > 5: <std::sys::sync::once::futex::Once>::call
  564. 164.68 s > 6: <std::sync::once_lock::OnceLock<alloc::string::String>>::initialize::<<std::sync::once_lock::OnceLock<alloc::string::String>>::get_or_init<public_typst_behavior::linnest_public_svg::{closure#0}>::{closure#0}, !>
  565. 164.68 s > 7: <public_typst_behavior::public_linnest_fixture_assertions_hold::{closure#0} as core::ops::function::FnOnce<()>>::call_once
  566. 164.68 s > note: Some details are omitted, run with `RUST_BACKTRACE=full` for a verbose backtrace.
  567. 164.68 s >
  568. 164.68 s > FAIL [ 95.413s] (34/38) clinnet::public_typst_behavior public_linnest_labels_follow_their_carriers
  569. 164.68 s > stdout ---
  570. 164.68 s >
  571. 164.68 s > running 1 test
  572. 164.68 s > test public_linnest_labels_follow_their_carriers has been running for over 60 seconds
  573. 164.68 s > test public_linnest_labels_follow_their_carriers ... FAILED
  574. 164.68 s >
  575. 164.68 s > failures:
  576. 164.68 s >
  577. 164.68 s > failures:
  578. 164.68 s > public_linnest_labels_follow_their_carriers
  579. 164.68 s >
  580. 164.68 s > test result: FAILED. 0 passed; 1 failed; 0 ignored; 0 measured; 17 filtered out; finished in 95.40s
  581. 164.68 s >
  582. 164.68 s > stderr ---
  583. 164.68 s >
  584. 164.68 s > thread 'public_linnest_labels_follow_their_carriers' (281) panicked at crates/clinnet/tests/public_typst_behavior.rs:81:55:
  585. 164.68 s > called `Result::unwrap()` on an `Err` value: typst failed while compiling template /build/.tmpZqOxvW/.clinnet/templates/linnest-public-behavior.svg
  586. 164.68 s >
  587. 164.68 s > Command executed:
  588. 164.68 s > "typst" "c" "/build/.tmpZqOxvW/.clinnet/templates/linnest-public-behavior.typ" "/build/.tmpZqOxvW/.clinnet/templates/linnest-public-behavior.svg" "--root" "/build/.tmpZqOxvW/.clinnet/templates"
  589. 164.68 s >
  590. 164.68 s > Typst stdout:
  591. 164.68 s >
  592. 164.68 s >
  593. 164.68 s > Typst stderr:
  594. 164.68 s >
  595. 164.68 s >
  596. 164.68 s > Location:
  597. 164.68 s > crates/clinnet/src/lib.rs:741:13
  598. 164.68 s > stack backtrace:
  599. 164.68 s > 0: __rustc::rust_begin_unwind
  600. 164.68 s > 1: core::panicking::panic_fmt
  601. 164.68 s > 2: core::result::unwrap_failed
  602. 164.68 s > 3: public_typst_behavior::render
  603. 164.68 s > 4: <std::sync::once::Once>::call_once_force::<<std::sync::once_lock::OnceLock<alloc::string::String>>::initialize<<std::sync::once_lock::OnceLock<alloc::string::String>>::get_or_init<public_typst_behavior::linnest_public_svg::{closure#0}>::{closure#0}, !>::{closure#0}>::{closure#0}
  604. 164.68 s > 5: <std::sys::sync::once::futex::Once>::call
  605. 164.68 s > 6: <std::sync::once_lock::OnceLock<alloc::string::String>>::initialize::<<std::sync::once_lock::OnceLock<alloc::string::String>>::get_or_init<public_typst_behavior::linnest_public_svg::{closure#0}>::{closure#0}, !>
  606. 164.68 s > 7: <public_typst_behavior::public_linnest_labels_follow_their_carriers::{closure#0} as core::ops::function::FnOnce<()>>::call_once
  607. 164.68 s > note: Some details are omitted, run with `RUST_BACKTRACE=full` for a verbose backtrace.
  608. 164.68 s >
  609. 164.68 s > ------------
  610. 164.68 s > Summary [ 106.380s] 38 tests run: 35 passed, 3 failed, 0 skipped
  611. 164.68 s > FAIL [ 81.327s] (32/38) clinnet::public_typst_behavior public_linnest_endpoint_anchor_distances_stay_local
  612. 164.68 s > stdout ---
  613. 164.68 s >
  614. 164.68 s > running 1 test
  615. 164.68 s > test public_linnest_endpoint_anchor_distances_stay_local has been running for over 60 seconds
  616. 164.68 s > test public_linnest_endpoint_anchor_distances_stay_local ... FAILED
  617. 164.68 s >
  618. 164.68 s > failures:
  619. 164.68 s >
  620. 164.68 s > failures:
  621. 164.68 s > public_linnest_endpoint_anchor_distances_stay_local
  622. 164.68 s >
  623. 164.68 s > test result: FAILED. 0 passed; 1 failed; 0 ignored; 0 measured; 17 filtered out; finished in 81.23s
  624. 164.68 s >
  625. 164.68 s > stderr ---
  626. 164.68 s >
  627. 164.68 s > thread 'public_linnest_endpoint_anchor_distances_stay_local' (310) panicked at crates/clinnet/tests/public_typst_behavior.rs:81:55:
  628. 164.68 s > called `Result::unwrap()` on an `Err` value: typst failed while compiling template /build/.tmp6vAyYD/.clinnet/templates/linnest-public-behavior.svg
  629. 164.68 s >
  630. 164.68 s > Command executed:
  631. 164.68 s > "typst" "c" "/build/.tmp6vAyYD/.clinnet/templates/linnest-public-behavior.typ" "/build/.tmp6vAyYD/.clinnet/templates/linnest-public-behavior.svg" "--root" "/build/.tmp6vAyYD/.clinnet/templates"
  632. 164.68 s >
  633. 164.68 s > Typst stdout:
  634. 164.68 s >
  635. 164.68 s >
  636. 164.68 s > Typst stderr:
  637. 164.68 s >
  638. 164.68 s >
  639. 164.68 s > Location:
  640. 164.68 s > crates/clinnet/src/lib.rs:741:13
  641. 164.68 s > stack backtrace:
  642. 164.68 s > 0: __rustc::rust_begin_unwind
  643. 164.68 s > 1: core::panicking::panic_fmt
  644. 164.68 s > 2: core::result::unwrap_failed
  645. 164.68 s > 3: public_typst_behavior::render
  646. 164.68 s > 4: <std::sync::once::Once>::call_once_force::<<std::sync::once_lock::OnceLock<alloc::string::String>>::initialize<<std::sync::once_lock::OnceLock<alloc::string::String>>::get_or_init<public_typst_behavior::linnest_public_svg::{closure#0}>::{closure#0}, !>::{closure#0}>::{closure#0}
  647. 164.68 s > 5: <std::sys::sync::once::futex::Once>::call
  648. 164.68 s > 6: <std::sync::once_lock::OnceLock<alloc::string::String>>::initialize::<<std::sync::once_lock::OnceLock<alloc::string::String>>::get_or_init<public_typst_behavior::linnest_public_svg::{closure#0}>::{closure#0}, !>
  649. 164.68 s > 7: <public_typst_behavior::public_linnest_endpoint_anchor_distances_stay_local::{closure#0} as core::ops::function::FnOnce<()>>::call_once
  650. 164.68 s > note: Some details are omitted, run with `RUST_BACKTRACE=full` for a verbose backtrace.
  651. 164.68 s >
  652. 164.68 s > FAIL [ 84.696s] (33/38) clinnet::public_typst_behavior public_linnest_fixture_assertions_hold
  653. 164.68 s > stdout ---
  654. 164.68 s >
  655. 164.68 s > running 1 test
  656. 164.68 s > test public_linnest_fixture_assertions_hold has been running for over 60 seconds
  657. 164.68 s > test public_linnest_fixture_assertions_hold ... FAILED
  658. 164.68 s >
  659. 164.68 s > failures:
  660. 164.68 s >
  661. 164.68 s > failures:
  662. 164.68 s > public_linnest_fixture_assertions_hold
  663. 164.68 s >
  664. 164.68 s > test result: FAILED. 0 passed; 1 failed; 0 ignored; 0 measured; 17 filtered out; finished in 84.68s
  665. 164.68 s >
  666. 164.68 s > stderr ---
  667. 164.68 s >
  668. 164.68 s > thread 'public_linnest_fixture_assertions_hold' (280) panicked at crates/clinnet/tests/public_typst_behavior.rs:81:55:
  669. 164.68 s > called `Result::unwrap()` on an `Err` value: typst failed while compiling template /build/.tmpVGjxYb/.clinnet/templates/linnest-public-behavior.svg
  670. 164.68 s >
  671. 164.68 s > Command executed:
  672. 164.68 s > "typst" "c" "/build/.tmpVGjxYb/.clinnet/templates/linnest-public-behavior.typ" "/build/.tmpVGjxYb/.clinnet/templates/linnest-public-behavior.svg" "--root" "/build/.tmpVGjxYb/.clinnet/templates"
  673. 164.68 s >
  674. 164.68 s > Typst stdout:
  675. 164.68 s >
  676. 164.68 s >
  677. 164.68 s > Typst stderr:
  678. 164.68 s >
  679. 164.68 s >
  680. 164.68 s > Location:
  681. 164.68 s > crates/clinnet/src/lib.rs:741:13
  682. 164.68 s > stack backtrace:
  683. 164.68 s > 0: __rustc::rust_begin_unwind
  684. 164.68 s > 1: core::panicking::panic_fmt
  685. 164.68 s > 2: core::result::unwrap_failed
  686. 164.68 s > 3: public_typst_behavior::render
  687. 164.68 s > 4: <std::sync::once::Once>::call_once_force::<<std::sync::once_lock::OnceLock<alloc::string::String>>::initialize<<std::sync::once_lock::OnceLock<alloc::string::String>>::get_or_init<public_typst_behavior::linnest_public_svg::{closure#0}>::{closure#0}, !>::{closure#0}>::{closure#0}
  688. 164.68 s > 5: <std::sys::sync::once::futex::Once>::call
  689. 164.68 s > 6: <std::sync::once_lock::OnceLock<alloc::string::String>>::initialize::<<std::sync::once_lock::OnceLock<alloc::string::String>>::get_or_init<public_typst_behavior::linnest_public_svg::{closure#0}>::{closure#0}, !>
  690. 164.68 s > 7: <public_typst_behavior::public_linnest_fixture_assertions_hold::{closure#0} as core::ops::function::FnOnce<()>>::call_once
  691. 164.68 s > note: Some details are omitted, run with `RUST_BACKTRACE=full` for a verbose backtrace.
  692. 164.68 s >
  693. 164.68 s > FAIL [ 95.413s] (34/38) clinnet::public_typst_behavior public_linnest_labels_follow_their_carriers
  694. 164.68 s > stdout ---
  695. 164.68 s >
  696. 164.68 s > running 1 test
  697. 164.68 s > test public_linnest_labels_follow_their_carriers has been running for over 60 seconds
  698. 164.68 s > test public_linnest_labels_follow_their_carriers ... FAILED
  699. 164.68 s >
  700. 164.68 s > failures:
  701. 164.68 s >
  702. 164.68 s > failures:
  703. 164.68 s > public_linnest_labels_follow_their_carriers
  704. 164.68 s >
  705. 164.68 s > test result: FAILED. 0 passed; 1 failed; 0 ignored; 0 measured; 17 filtered out; finished in 95.40s
  706. 164.68 s >
  707. 164.68 s > stderr ---
  708. 164.68 s >
  709. 164.68 s > thread 'public_linnest_labels_follow_their_carriers' (281) panicked at crates/clinnet/tests/public_typst_behavior.rs:81:55:
  710. 164.68 s > called `Result::unwrap()` on an `Err` value: typst failed while compiling template /build/.tmpZqOxvW/.clinnet/templates/linnest-public-behavior.svg
  711. 164.68 s >
  712. 164.68 s > Command executed:
  713. 164.68 s > "typst" "c" "/build/.tmpZqOxvW/.clinnet/templates/linnest-public-behavior.typ" "/build/.tmpZqOxvW/.clinnet/templates/linnest-public-behavior.svg" "--root" "/build/.tmpZqOxvW/.clinnet/templates"
  714. 164.68 s >
  715. 164.68 s > Typst stdout:
  716. 164.68 s >
  717. 164.68 s >
  718. 164.68 s > Typst stderr:
  719. 164.68 s >
  720. 164.68 s >
  721. 164.68 s > Location:
  722. 164.68 s > crates/clinnet/src/lib.rs:741:13
  723. 164.68 s > stack backtrace:
  724. 164.68 s > 0: __rustc::rust_begin_unwind
  725. 164.68 s > 1: core::panicking::panic_fmt
  726. 164.68 s > 2: core::result::unwrap_failed
  727. 164.68 s > 3: public_typst_behavior::render
  728. 164.68 s > 4: <std::sync::once::Once>::call_once_force::<<std::sync::once_lock::OnceLock<alloc::string::String>>::initialize<<std::sync::once_lock::OnceLock<alloc::string::String>>::get_or_init<public_typst_behavior::linnest_public_svg::{closure#0}>::{closure#0}, !>::{closure#0}>::{closure#0}
  729. 164.68 s > 5: <std::sys::sync::once::futex::Once>::call
  730. 164.68 s > 6: <std::sync::once_lock::OnceLock<alloc::string::String>>::initialize::<<std::sync::once_lock::OnceLock<alloc::string::String>>::get_or_init<public_typst_behavior::linnest_public_svg::{closure#0}>::{closure#0}, !>
  731. 164.68 s > 7: <public_typst_behavior::public_linnest_labels_follow_their_carriers::{closure#0} as core::ops::function::FnOnce<()>>::call_once
  732. 164.68 s > note: Some details are omitted, run with `RUST_BACKTRACE=full` for a verbose backtrace.
  733. 164.68 s >
  734. 164.68 s > error: test run failed
  735. 164.68 s >
  736. 164.68 s > ========== nextest test summary ==========
  737. 164.68 s > report: target/nextest/ci_gammaloop/junit.xml
  738. 164.68 s > tests: 38, failures: 3, errors: 0
  739. 164.68 s >
  740. 164.68 s > 1. clinnet::public_typst_behavior::public_linnest_endpoint_anchor_distances_stay_local
  741. 164.68 s > failure: test failure with exit code 101
  742. 164.68 s > thread 'public_linnest_endpoint_anchor_distances_stay_local' (310) panicked at crates/clinnet/tests/public_typst_behavior.rs:81:55:
  743. 164.68 s > called `Result::unwrap()` on an `Err` value: typst failed while compiling template /build/.tmp6vAyYD/.clinnet/templates/linnest-public-behavior.svg
  744. 164.68 s >
  745. 164.68 s > Command executed:
  746. 164.68 s > "typst" "c" "/build/.tmp6vAyYD/.clinnet/templates/linnest-public-behavior.typ" "/build/.tmp6vAyYD/.clinnet/templates/linnest-public-behavior.svg" "--root" "/build/.tmp6vAyYD/.clinnet/templates"
  747. 164.68 s >
  748. 164.68 s > Typst stdout:
  749. 164.68 s >
  750. 164.68 s >
  751. 164.68 s > Typst stderr:
  752. 164.68 s >
  753. 164.68 s >
  754. 164.68 s > Location:
  755. 164.68 s > crates/clinnet/src/lib.rs:741:13
  756. 164.68 s > stack backtrace:
  757. 164.68 s > 0: __rustc::rust_begin_unwind
  758. 164.68 s > 1: core::panicking::panic_fmt
  759. 164.68 s > 2: core::result::unwrap_failed
  760. 164.68 s > 3: public_typst_behavior::render
  761. 164.68 s > 4: <std::sync::once::Once>::call_once_force::<<std::sync::once_lock::OnceLock<alloc::string::String>>::initialize<<std::sync::once_lock::OnceLock<alloc::string::String>>::get_or_init<public_typst_behavior::linnest_public_svg::{closure#0}>::{closure#0}, !>::{closure#0}>::{closure#0}
  762. 164.68 s > 5: <std::sys::sync::once::futex::Once>::call
  763. 164.68 s > 6: <std::sync::once_lock::OnceLock<alloc::string::String>>::initialize::<<std::sync::once_lock::OnceLock<alloc::string::String>>::get_or_init<public_typst_behavior::linnest_public_svg::{closure#0}>::{closure#0}, !>
  764. 164.68 s > 7: <public_typst_behavior::public_linnest_endpoint_anchor_distances_stay_local::{closure#0} as core::ops::function::FnOnce<()>>::call_once
  765. 164.68 s > note: Some details are omitted, run with `RUST_BACKTRACE=full` for a verbose backtrace.
  766. 164.68 s > system-out
  767. 164.68 s > running 1 test
  768. 164.68 s > test public_linnest_endpoint_anchor_distances_stay_local has been running for over 60 seconds
  769. 164.68 s > test public_linnest_endpoint_anchor_distances_stay_local ... FAILED
  770. 164.68 s >
  771. 164.68 s > failures:
  772. 164.68 s >
  773. 164.68 s > failures:
  774. 164.68 s > public_linnest_endpoint_anchor_distances_stay_local
  775. 164.68 s >
  776. 164.68 s > test result: FAILED. 0 passed; 1 failed; 0 ignored; 0 measured; 17 filtered out; finished in 81.23s
  777. 164.68 s > system-err
  778. 164.68 s > thread 'public_linnest_endpoint_anchor_distances_stay_local' (310) panicked at crates/clinnet/tests/public_typst_behavior.rs:81:55:
  779. 164.68 s > called `Result::unwrap()` on an `Err` value: typst failed while compiling template /build/.tmp6vAyYD/.clinnet/templates/linnest-public-behavior.svg
  780. 164.68 s >
  781. 164.68 s > Command executed:
  782. 164.68 s > "typst" "c" "/build/.tmp6vAyYD/.clinnet/templates/linnest-public-behavior.typ" "/build/.tmp6vAyYD/.clinnet/templates/linnest-public-behavior.svg" "--root" "/build/.tmp6vAyYD/.clinnet/templates"
  783. 164.68 s >
  784. 164.68 s > Typst stdout:
  785. 164.68 s >
  786. 164.68 s >
  787. 164.68 s > Typst stderr:
  788. 164.68 s >
  789. 164.68 s >
  790. 164.68 s > Location:
  791. 164.68 s > crates/clinnet/src/lib.rs:741:13
  792. 164.68 s > stack backtrace:
  793. 164.68 s > 0: __rustc::rust_begin_unwind
  794. 164.68 s > 1: core::panicking::panic_fmt
  795. 164.68 s > 2: core::result::unwrap_failed
  796. 164.68 s > 3: public_typst_behavior::render
  797. 164.68 s > 4: <std::sync::once::Once>::call_once_force::<<std::sync::once_lock::OnceLock<alloc::string::String>>::initialize<<std::sync::once_lock::OnceLock<alloc::string::String>>::get_or_init<public_typst_behavior::linnest_public_svg::{closure#0}>::{closure#0}, !>::{closure#0}>::{closure#0}
  798. 164.68 s > 5: <std::sys::sync::once::futex::Once>::call
  799. 164.68 s > 6: <std::sync::once_lock::OnceLock<alloc::string::String>>::initialize::<<std::sync::once_lock::OnceLock<alloc::string::String>>::get_or_init<public_typst_behavior::linnest_public_svg::{closure#0}>::{closure#0}, !>
  800. 164.68 s > 7: <public_typst_behavior::public_linnest_endpoint_anchor_distances_stay_local::{closure#0} as core::ops::function::FnOnce<()>>::call_once
  801. 164.68 s > note: Some details are omitted, run with `RUST_BACKTRACE=full` for a verbose backtrace.
  802. 164.68 s >
  803. 164.68 s > 2. clinnet::public_typst_behavior::public_linnest_fixture_assertions_hold
  804. 164.68 s > failure: test failure with exit code 101
  805. 164.68 s > thread 'public_linnest_fixture_assertions_hold' (280) panicked at crates/clinnet/tests/public_typst_behavior.rs:81:55:
  806. 164.68 s > called `Result::unwrap()` on an `Err` value: typst failed while compiling template /build/.tmpVGjxYb/.clinnet/templates/linnest-public-behavior.svg
  807. 164.68 s >
  808. 164.68 s > Command executed:
  809. 164.68 s > "typst" "c" "/build/.tmpVGjxYb/.clinnet/templates/linnest-public-behavior.typ" "/build/.tmpVGjxYb/.clinnet/templates/linnest-public-behavior.svg" "--root" "/build/.tmpVGjxYb/.clinnet/templates"
  810. 164.68 s >
  811. 164.68 s > Typst stdout:
  812. 164.68 s >
  813. 164.68 s >
  814. 164.68 s > Typst stderr:
  815. 164.68 s >
  816. 164.68 s >
  817. 164.68 s > Location:
  818. 164.68 s > crates/clinnet/src/lib.rs:741:13
  819. 164.68 s > stack backtrace:
  820. 164.68 s > 0: __rustc::rust_begin_unwind
  821. 164.68 s > 1: core::panicking::panic_fmt
  822. 164.68 s > 2: core::result::unwrap_failed
  823. 164.68 s > 3: public_typst_behavior::render
  824. 164.68 s > 4: <std::sync::once::Once>::call_once_force::<<std::sync::once_lock::OnceLock<alloc::string::String>>::initialize<<std::sync::once_lock::OnceLock<alloc::string::String>>::get_or_init<public_typst_behavior::linnest_public_svg::{closure#0}>::{closure#0}, !>::{closure#0}>::{closure#0}
  825. 164.68 s > 5: <std::sys::sync::once::futex::Once>::call
  826. 164.68 s > 6: <std::sync::once_lock::OnceLock<alloc::string::String>>::initialize::<<std::sync::once_lock::OnceLock<alloc::string::String>>::get_or_init<public_typst_behavior::linnest_public_svg::{closure#0}>::{closure#0}, !>
  827. 164.68 s > 7: <public_typst_behavior::public_linnest_fixture_assertions_hold::{closure#0} as core::ops::function::FnOnce<()>>::call_once
  828. 164.68 s > note: Some details are omitted, run with `RUST_BACKTRACE=full` for a verbose backtrace.
  829. 164.68 s > system-out
  830. 164.68 s > running 1 test
  831. 164.68 s > test public_linnest_fixture_assertions_hold has been running for over 60 seconds
  832. 164.68 s > test public_linnest_fixture_assertions_hold ... FAILED
  833. 164.68 s >
  834. 164.68 s > failures:
  835. 164.68 s >
  836. 164.68 s > failures:
  837. 164.68 s > public_linnest_fixture_assertions_hold
  838. 164.68 s >
  839. 164.68 s > test result: FAILED. 0 passed; 1 failed; 0 ignored; 0 measured; 17 filtered out; finished in 84.68s
  840. 164.68 s > system-err
  841. 164.68 s > thread 'public_linnest_fixture_assertions_hold' (280) panicked at crates/clinnet/tests/public_typst_behavior.rs:81:55:
  842. 164.68 s > called `Result::unwrap()` on an `Err` value: typst failed while compiling template /build/.tmpVGjxYb/.clinnet/templates/linnest-public-behavior.svg
  843. 164.68 s >
  844. 164.68 s > Command executed:
  845. 164.68 s > "typst" "c" "/build/.tmpVGjxYb/.clinnet/templates/linnest-public-behavior.typ" "/build/.tmpVGjxYb/.clinnet/templates/linnest-public-behavior.svg" "--root" "/build/.tmpVGjxYb/.clinnet/templates"
  846. 164.68 s >
  847. 164.68 s > Typst stdout:
  848. 164.68 s >
  849. 164.68 s >
  850. 164.68 s > Typst stderr:
  851. 164.68 s >
  852. 164.68 s >
  853. 164.68 s > Location:
  854. 164.68 s > crates/clinnet/src/lib.rs:741:13
  855. 164.68 s > stack backtrace:
  856. 164.68 s > 0: __rustc::rust_begin_unwind
  857. 164.68 s > 1: core::panicking::panic_fmt
  858. 164.68 s > 2: core::result::unwrap_failed
  859. 164.68 s > 3: public_typst_behavior::render
  860. 164.68 s > 4: <std::sync::once::Once>::call_once_force::<<std::sync::once_lock::OnceLock<alloc::string::String>>::initialize<<std::sync::once_lock::OnceLock<alloc::string::String>>::get_or_init<public_typst_behavior::linnest_public_svg::{closure#0}>::{closure#0}, !>::{closure#0}>::{closure#0}
  861. 164.68 s > 5: <std::sys::sync::once::futex::Once>::call
  862. 164.68 s > 6: <std::sync::once_lock::OnceLock<alloc::string::String>>::initialize::<<std::sync::once_lock::OnceLock<alloc::string::String>>::get_or_init<public_typst_behavior::linnest_public_svg::{closure#0}>::{closure#0}, !>
  863. 164.68 s > 7: <public_typst_behavior::public_linnest_fixture_assertions_hold::{closure#0} as core::ops::function::FnOnce<()>>::call_once
  864. 164.68 s > note: Some details are omitted, run with `RUST_BACKTRACE=full` for a verbose backtrace.
  865. 164.68 s >
  866. 164.68 s > 3. clinnet::public_typst_behavior::public_linnest_labels_follow_their_carriers
  867. 164.68 s > failure: test failure with exit code 101
  868. 164.68 s > thread 'public_linnest_labels_follow_their_carriers' (281) panicked at crates/clinnet/tests/public_typst_behavior.rs:81:55:
  869. 164.68 s > called `Result::unwrap()` on an `Err` value: typst failed while compiling template /build/.tmpZqOxvW/.clinnet/templates/linnest-public-behavior.svg
  870. 164.68 s >
  871. 164.68 s > Command executed:
  872. 164.68 s > "typst" "c" "/build/.tmpZqOxvW/.clinnet/templates/linnest-public-behavior.typ" "/build/.tmpZqOxvW/.clinnet/templates/linnest-public-behavior.svg" "--root" "/build/.tmpZqOxvW/.clinnet/templates"
  873. 164.68 s >
  874. 164.68 s > Typst stdout:
  875. 164.68 s >
  876. 164.68 s >
  877. 164.68 s > Typst stderr:
  878. 164.68 s >
  879. 164.68 s >
  880. 164.68 s > Location:
  881. 164.68 s > crates/clinnet/src/lib.rs:741:13
  882. 164.68 s > stack backtrace:
  883. 164.68 s > 0: __rustc::rust_begin_unwind
  884. 164.68 s > 1: core::panicking::panic_fmt
  885. 164.68 s > 2: core::result::unwrap_failed
  886. 164.68 s > 3: public_typst_behavior::render
  887. 164.68 s > 4: <std::sync::once::Once>::call_once_force::<<std::sync::once_lock::OnceLock<alloc::string::String>>::initialize<<std::sync::once_lock::OnceLock<alloc::string::String>>::get_or_init<public_typst_behavior::linnest_public_svg::{closure#0}>::{closure#0}, !>::{closure#0}>::{closure#0}
  888. 164.68 s > 5: <std::sys::sync::once::futex::Once>::call
  889. 164.68 s > 6: <std::sync::once_lock::OnceLock<alloc::string::String>>::initialize::<<std::sync::once_lock::OnceLock<alloc::string::String>>::get_or_init<public_typst_behavior::linnest_public_svg::{closure#0}>::{closure#0}, !>
  890. 164.68 s > 7: <public_typst_behavior::public_linnest_labels_follow_their_carriers::{closure#0} as core::ops::function::FnOnce<()>>::call_once
  891. 164.68 s > note: Some details are omitted, run with `RUST_BACKTRACE=full` for a verbose backtrace.
  892. 164.68 s > system-out
  893. 164.68 s > running 1 test
  894. 164.68 s > test public_linnest_labels_follow_their_carriers has been running for over 60 seconds
  895. 164.68 s > test public_linnest_labels_follow_their_carriers ... FAILED
  896. 164.68 s >
  897. 164.68 s > failures:
  898. 164.68 s >
  899. 164.68 s > failures:
  900. 164.68 s > public_linnest_labels_follow_their_carriers
  901. 164.68 s >
  902. 164.68 s > test result: FAILED. 0 passed; 1 failed; 0 ignored; 0 measured; 17 filtered out; finished in 95.40s
  903. 164.68 s > system-err
  904. 164.68 s > thread 'public_linnest_labels_follow_their_carriers' (281) panicked at crates/clinnet/tests/public_typst_behavior.rs:81:55:
  905. 164.68 s > called `Result::unwrap()` on an `Err` value: typst failed while compiling template /build/.tmpZqOxvW/.clinnet/templates/linnest-public-behavior.svg
  906. 164.68 s >
  907. 164.68 s > Command executed:
  908. 164.68 s > "typst" "c" "/build/.tmpZqOxvW/.clinnet/templates/linnest-public-behavior.typ" "/build/.tmpZqOxvW/.clinnet/templates/linnest-public-behavior.svg" "--root" "/build/.tmpZqOxvW/.clinnet/templates"
  909. 164.68 s >
  910. 164.68 s > Typst stdout:
  911. 164.68 s >
  912. 164.68 s >
  913. 164.68 s > Typst stderr:
  914. 164.68 s >
  915. 164.68 s >
  916. 164.68 s > Location:
  917. 164.68 s > crates/clinnet/src/lib.rs:741:13
  918. 164.68 s > stack backtrace:
  919. 164.68 s > 0: __rustc::rust_begin_unwind
  920. 164.68 s > 1: core::panicking::panic_fmt
  921. 164.68 s > 2: core::result::unwrap_failed
  922. 164.68 s > 3: public_typst_behavior::render
  923. 164.68 s > 4: <std::sync::once::Once>::call_once_force::<<std::sync::once_lock::OnceLock<alloc::string::String>>::initialize<<std::sync::once_lock::OnceLock<alloc::string::String>>::get_or_init<public_typst_behavior::linnest_public_svg::{closure#0}>::{closure#0}, !>::{closure#0}>::{closure#0}
  924. 164.68 s > 5: <std::sys::sync::once::futex::Once>::call
  925. 164.68 s > 6: <std::sync::once_lock::OnceLock<alloc::string::String>>::initialize::<<std::sync::once_lock::OnceLock<alloc::string::String>>::get_or_init<public_typst_behavior::linnest_public_svg::{closure#0}>::{closure#0}, !>
  926. 164.68 s > 7: <public_typst_behavior::public_linnest_labels_follow_their_carriers::{closure#0} as core::ops::function::FnOnce<()>>::call_once
  927. 164.68 s > note: Some details are omitted, run with `RUST_BACKTRACE=full` for a verbose backtrace.
  928. 164.68 s > =========================================
  929. 164.68 s For full logs, run:
  930. 164.68 s nix log /nix/store/4pqspwvh8pi9s2vg9g6mfsggpl9ynwzx-gammaloop-nextest-clinnet.drv
  931. 164.98 s Run failed.