test packages.x86_64-linux.nix-ci-check-gammaloop-nextest-clinnet
0.02 s
$ /nix/store/bhv6xyvqw6gjs3j488gi1z6wdv18bdpa-coreutils-9.11/bin/timeout --kill-after=15s 7200s /nix/store/bxgja2ppiqi6w2bgn0r07d7mgnl1k6k2-nix-2.34.8/bin/nix --extra-experimental-features nix-command --extra-experimental-features flakes flake clone git+https://github.com/alphal00p/gammaloop --dest /tmp/nix-ci-worker/stable-pwd/repo/
1.16 s
Cloning into '/tmp/nix-ci-worker/stable-pwd/repo'...
2.35 s
remote: Enumerating objects: 162134, done.
2.46 s
remote: Counting objects: 0% (1/3710)
remote: Counting objects: 1% (38/3710)
remote: Counting objects: 2% (75/3710)
remote: Counting objects: 3% (112/3710)
remote: Counting objects: 4% (149/3710)
remote: Counting objects: 5% (186/3710)
remote: Counting objects: 6% (223/3710)
remote: Counting objects: 7% (260/3710)
remote: Counting objects: 8% (297/3710)
remote: Counting objects: 9% (334/3710)
remote: Counting objects: 10% (371/3710)
remote: Counting objects: 11% (409/3710)
remote: Counting objects: 12% (446/3710)
remote: Counting objects: 13% (483/3710)
remote: Counting objects: 14% (520/3710)
remote: Counting objects: 15% (557/3710)
remote: Counting objects: 16% (594/3710)
remote: Counting objects: 17% (631/3710)
remote: Counting objects: 18% (668/3710)
remote: Counting objects: 19% (705/3710)
remote: Counting objects: 20% (742/3710)
remote: Counting objects: 21% (780/3710)
remote: Counting objects: 22% (817/3710)
remote: Counting objects: 23% (854/3710)
remote: Counting objects: 24% (891/3710)
remote: Counting objects: 25% (928/3710)
remote: Counting objects: 26% (965/3710)
remote: Counting objects: 27% (1002/3710)
remote: Counting objects: 28% (1039/3710)
remote: Counting objects: 29% (1076/3710)
remote: Counting objects: 30% (1113/3710)
remote: Counting objects: 31% (1151/3710)
remote: Counting objects: 32% (1188/3710)
remote: Counting objects: 33% (1225/3710)
remote: Counting objects: 34% (1262/3710)
remote: Counting objects: 35% (1299/3710)
remote: Counting objects: 36% (1336/3710)
remote: Counting objects: 37% (1373/3710)
remote: Counting objects: 38% (1410/3710)
remote: Counting objects: 39% (1447/3710)
remote: Counting objects: 40% (1484/3710)
remote: Counting objects: 41% (1522/3710)
remote: Counting objects: 42% (1559/3710)
remote: Counting objects: 43% (1596/3710)
remote: Counting objects: 44% (1633/3710)
remote: Counting objects: 45% (1670/3710)
remote: Counting objects: 46% (1707/3710)
remote: Counting objects: 47% (1744/3710)
remote: Counting objects: 48% (1781/3710)
remote: Counting objects: 49% (1818/3710)
remote: Counting objects: 50% (1855/3710)
remote: Counting objects: 51% (1893/3710)
remote: Counting objects: 52% (1930/3710)
remote: Counting objects: 53% (1967/3710)
remote: Counting objects: 54% (2004/3710)
remote: Counting objects: 55% (2041/3710)
remote: Counting objects: 56% (2078/3710)
remote: Counting objects: 57% (2115/3710)
remote: Counting objects: 58% (2152/3710)
remote: Counting objects: 59% (2189/3710)
remote: Counting objects: 60% (2226/3710)
remote: Counting objects: 61% (2264/3710)
remote: Counting objects: 62% (2301/3710)
remote: Counting objects: 63% (2338/3710)
remote: Counting objects: 64% (2375/3710)
remote: Counting objects: 65% (2412/3710)
remote: Counting objects: 66% (2449/3710)
remote: Counting objects: 67% (2486/3710)
remote: Counting objects: 68% (2523/3710)
remote: Counting objects: 69% (2560/3710)
remote: Counting objects: 70% (2597/3710)
remote: Counting objects: 71% (2635/3710)
remote: Counting objects: 72% (2672/3710)
remote: Counting objects: 73% (2709/3710)
remote: Counting objects: 74% (2746/3710)
remote: Counting objects: 75% (2783/3710)
remote: Counting objects: 76% (2820/3710)
remote: Counting objects: 77% (2857/3710)
remote: Counting objects: 78% (2894/3710)
remote: Counting objects: 79% (2931/3710)
remote: Counting objects: 80% (2968/3710)
remote: Counting objects: 81% (3006/3710)
remote: Counting objects: 82% (3043/3710)
remote: Counting objects: 83% (3080/3710)
remote: Counting objects: 84% (3117/3710)
remote: Counting objects: 85% (3154/3710)
remote: Counting objects: 86% (3191/3710)
remote: Counting objects: 87% (3228/3710)
remote: Counting objects: 88% (3265/3710)
remote: Counting objects: 89% (3302/3710)
remote: Counting objects: 90% (3339/3710)
remote: Counting objects: 91% (3377/3710)
remote: Counting objects: 92% (3414/3710)
remote: Counting objects: 93% (3451/3710)
remote: Counting objects: 94% (3488/3710)
remote: Counting objects: 95% (3525/3710)
remote: Counting objects: 96% (3562/3710)
remote: Counting objects: 97% (3599/3710)
remote: Counting objects: 98% (3636/3710)
remote: Counting objects: 99% (3673/3710)
remote: Counting objects: 100% (3710/3710)
remote: Counting objects: 100% (3710/3710), done.
4.42 s
remote: Compressing objects: 0% (1/1481)
remote: Compressing objects: 1% (15/1481)
remote: Compressing objects: 2% (30/1481)
remote: Compressing objects: 3% (45/1481)
remote: Compressing objects: 4% (60/1481)
remote: Compressing objects: 5% (75/1481)
remote: Compressing objects: 6% (89/1481)
remote: Compressing objects: 7% (104/1481)
remote: Compressing objects: 8% (119/1481)
remote: Compressing objects: 9% (134/1481)
remote: Compressing objects: 10% (149/1481)
remote: Compressing objects: 11% (163/1481)
remote: Compressing objects: 12% (178/1481)
remote: Compressing objects: 13% (193/1481)
remote: Compressing objects: 14% (208/1481)
remote: Compressing objects: 15% (223/1481)
remote: Compressing objects: 16% (237/1481)
remote: Compressing objects: 17% (252/1481)
remote: Compressing objects: 18% (267/1481)
remote: Compressing objects: 19% (282/1481)
remote: Compressing objects: 20% (297/1481)
remote: Compressing objects: 21% (312/1481)
remote: Compressing objects: 22% (326/1481)
remote: Compressing objects: 23% (341/1481)
remote: Compressing objects: 24% (356/1481)
remote: Compressing objects: 25% (371/1481)
remote: Compressing objects: 26% (386/1481)
remote: Compressing objects: 27% (400/1481)
remote: Compressing objects: 28% (415/1481)
remote: Compressing objects: 28% (424/1481)
remote: Compressing objects: 29% (430/1481)
remote: Compressing objects: 30% (445/1481)
remote: Compressing objects: 31% (460/1481)
remote: Compressing objects: 32% (474/1481)
remote: Compressing objects: 33% (489/1481)
remote: Compressing objects: 34% (504/1481)
remote: Compressing objects: 35% (519/1481)
remote: Compressing objects: 36% (534/1481)
remote: Compressing objects: 37% (548/1481)
remote: Compressing objects: 38% (563/1481)
remote: Compressing objects: 39% (578/1481)
remote: Compressing objects: 40% (593/1481)
remote: Compressing objects: 40% (602/1481)
remote: Compressing objects: 41% (608/1481)
remote: Compressing objects: 42% (623/1481)
remote: Compressing objects: 43% (637/1481)
remote: Compressing objects: 44% (652/1481)
remote: Compressing objects: 45% (667/1481)
remote: Compressing objects: 46% (682/1481)
remote: Compressing objects: 47% (697/1481)
remote: Compressing objects: 48% (711/1481)
remote: Compressing objects: 49% (726/1481)
remote: Compressing objects: 50% (741/1481)
remote: Compressing objects: 51% (756/1481)
remote: Compressing objects: 52% (771/1481)
remote: Compressing objects: 53% (785/1481)
remote: Compressing objects: 54% (800/1481)
remote: Compressing objects: 55% (815/1481)
remote: Compressing objects: 56% (830/1481)
remote: Compressing objects: 57% (845/1481)
remote: Compressing objects: 58% (859/1481)
remote: Compressing objects: 59% (874/1481)
remote: Compressing objects: 60% (889/1481)
remote: Compressing objects: 61% (904/1481)
remote: Compressing objects: 62% (919/1481)
remote: Compressing objects: 63% (934/1481)
remote: Compressing objects: 64% (948/1481)
remote: Compressing objects: 65% (963/1481)
remote: Compressing objects: 66% (978/1481)
remote: Compressing objects: 67% (993/1481)
remote: Compressing objects: 68% (1008/1481)
remote: Compressing objects: 69% (1022/1481)
remote: Compressing objects: 70% (1037/1481)
remote: Compressing objects: 71% (1052/1481)
remote: Compressing objects: 72% (1067/1481)
remote: Compressing objects: 73% (1082/1481)
remote: Compressing objects: 74% (1096/1481)
remote: Compressing objects: 75% (1111/1481)
remote: Compressing objects: 76% (1126/1481)
remote: Compressing objects: 77% (1141/1481)
remote: Compressing objects: 78% (1156/1481)
remote: Compressing objects: 79% (1170/1481)
remote: Compressing objects: 80% (1185/1481)
remote: Compressing objects: 81% (1200/1481)
remote: Compressing objects: 82% (1215/1481)
remote: Compressing objects: 83% (1230/1481)
remote: Compressing objects: 84% (1245/1481)
remote: Compressing objects: 85% (1259/1481)
remote: Compressing objects: 86% (1274/1481)
remote: Compressing objects: 87% (1289/1481)
remote: Compressing objects: 88% (1304/1481)
remote: Compressing objects: 89% (1319/1481)
remote: Compressing objects: 90% (1333/1481)
remote: Compressing objects: 91% (1348/1481)
remote: Compressing objects: 92% (1363/1481)
remote: Compressing objects: 93% (1378/1481)
remote: Compressing objects: 94% (1393/1481)
remote: Compressing objects: 95% (1407/1481)
remote: Compressing objects: 96% (1422/1481)
remote: Compressing objects: 97% (1437/1481)
remote: Compressing objects: 98% (1452/1481)
remote: Compressing objects: 99% (1467/1481)
remote: Compressing objects: 100% (1481/1481)
remote: Compressing objects: 100% (1481/1481), done.
18.24 s
Receiving objects: 0% (1/162134)
Receiving objects: 1% (1622/162134)
Receiving objects: 2% (3243/162134)
Receiving objects: 3% (4865/162134)
Receiving objects: 4% (6486/162134)
Receiving objects: 5% (8107/162134), 17.70 MiB | 35.39 MiB/s
Receiving objects: 6% (9729/162134), 17.70 MiB | 35.39 MiB/s
Receiving objects: 6% (10144/162134), 36.17 MiB | 36.16 MiB/s
Receiving objects: 7% (11350/162134), 36.17 MiB | 36.16 MiB/s
Receiving objects: 8% (12971/162134), 36.17 MiB | 36.16 MiB/s
Receiving objects: 9% (14593/162134), 36.17 MiB | 36.16 MiB/s
Receiving objects: 10% (16214/162134), 36.17 MiB | 36.16 MiB/s
Receiving objects: 11% (17835/162134), 36.17 MiB | 36.16 MiB/s
Receiving objects: 12% (19457/162134), 55.07 MiB | 36.44 MiB/s
Receiving objects: 13% (21078/162134), 55.07 MiB | 36.44 MiB/s
Receiving objects: 14% (22699/162134), 55.07 MiB | 36.44 MiB/s
Receiving objects: 14% (23322/162134), 55.07 MiB | 36.44 MiB/s
Receiving objects: 15% (24321/162134), 73.81 MiB | 36.71 MiB/s
Receiving objects: 16% (25942/162134), 73.81 MiB | 36.71 MiB/s
Receiving objects: 17% (27563/162134), 90.77 MiB | 36.15 MiB/s
Receiving objects: 18% (29185/162134), 90.77 MiB | 36.15 MiB/s
Receiving objects: 19% (30806/162134), 90.77 MiB | 36.15 MiB/s
Receiving objects: 20% (32427/162134), 90.77 MiB | 36.15 MiB/s
Receiving objects: 20% (32510/162134), 109.66 MiB | 36.13 MiB/s
Receiving objects: 21% (34049/162134), 109.66 MiB | 36.13 MiB/s
Receiving objects: 22% (35670/162134), 109.66 MiB | 36.13 MiB/s
Receiving objects: 23% (37291/162134), 128.95 MiB | 36.48 MiB/s
Receiving objects: 24% (38913/162134), 128.95 MiB | 36.48 MiB/s
Receiving objects: 24% (39107/162134), 128.95 MiB | 36.48 MiB/s
Receiving objects: 25% (40534/162134), 141.78 MiB | 35.14 MiB/s
Receiving objects: 26% (42155/162134), 141.78 MiB | 35.14 MiB/s
Receiving objects: 27% (43777/162134), 141.78 MiB | 35.14 MiB/s
Receiving objects: 28% (45398/162134), 157.69 MiB | 34.78 MiB/s
Receiving objects: 29% (47019/162134), 157.69 MiB | 34.78 MiB/s
Receiving objects: 30% (48641/162134), 157.69 MiB | 34.78 MiB/s
Receiving objects: 31% (50262/162134), 157.69 MiB | 34.78 MiB/s
Receiving objects: 32% (51883/162134), 157.69 MiB | 34.78 MiB/s
Receiving objects: 33% (53505/162134), 157.69 MiB | 34.78 MiB/s
Receiving objects: 34% (55126/162134), 157.69 MiB | 34.78 MiB/s
Receiving objects: 35% (56747/162134), 157.69 MiB | 34.78 MiB/s
Receiving objects: 36% (58369/162134), 157.69 MiB | 34.78 MiB/s
Receiving objects: 37% (59990/162134), 157.69 MiB | 34.78 MiB/s
Receiving objects: 37% (60898/162134), 157.69 MiB | 34.78 MiB/s
Receiving objects: 38% (61611/162134), 157.69 MiB | 34.78 MiB/s
Receiving objects: 39% (63233/162134), 177.95 MiB | 35.34 MiB/s
Receiving objects: 40% (64854/162134), 177.95 MiB | 35.34 MiB/s
Receiving objects: 41% (66475/162134), 177.95 MiB | 35.34 MiB/s
Receiving objects: 42% (68097/162134), 177.95 MiB | 35.34 MiB/s
Receiving objects: 43% (69718/162134), 177.95 MiB | 35.34 MiB/s
Receiving objects: 44% (71339/162134), 177.95 MiB | 35.34 MiB/s
Receiving objects: 45% (72961/162134), 196.64 MiB | 35.34 MiB/s
Receiving objects: 46% (74582/162134), 196.64 MiB | 35.34 MiB/s
Receiving objects: 47% (76203/162134), 196.64 MiB | 35.34 MiB/s
Receiving objects: 48% (77825/162134), 196.64 MiB | 35.34 MiB/s
Receiving objects: 48% (77856/162134), 215.69 MiB | 35.42 MiB/s
Receiving objects: 48% (78211/162134), 234.42 MiB | 35.41 MiB/s
Receiving objects: 49% (79446/162134), 271.68 MiB | 35.88 MiB/s
Receiving objects: 50% (81067/162134), 271.68 MiB | 35.88 MiB/s
Receiving objects: 50% (81967/162134), 290.42 MiB | 35.73 MiB/s
Receiving objects: 51% (82689/162134), 290.42 MiB | 35.73 MiB/s
Receiving objects: 52% (84310/162134), 309.35 MiB | 37.08 MiB/s
Receiving objects: 53% (85932/162134), 309.35 MiB | 37.08 MiB/s
Receiving objects: 54% (87553/162134), 309.35 MiB | 37.08 MiB/s
Receiving objects: 54% (88283/162134), 309.35 MiB | 37.08 MiB/s
Receiving objects: 55% (89174/162134), 327.64 MiB | 37.61 MiB/s
Receiving objects: 56% (90796/162134), 327.64 MiB | 37.61 MiB/s
Receiving objects: 57% (92417/162134), 327.64 MiB | 37.61 MiB/s
Receiving objects: 58% (94038/162134), 327.64 MiB | 37.61 MiB/s
Receiving objects: 59% (95660/162134), 327.64 MiB | 37.61 MiB/s
Receiving objects: 60% (97281/162134), 327.64 MiB | 37.61 MiB/s
Receiving objects: 61% (98902/162134), 327.64 MiB | 37.61 MiB/s
Receiving objects: 62% (100524/162134), 327.64 MiB | 37.61 MiB/s
Receiving objects: 63% (102145/162134), 327.64 MiB | 37.61 MiB/s
Receiving objects: 64% (103766/162134), 327.64 MiB | 37.61 MiB/s
Receiving objects: 65% (105388/162134), 327.64 MiB | 37.61 MiB/s
Receiving objects: 66% (107009/162134), 327.64 MiB | 37.61 MiB/s
Receiving objects: 67% (108630/162134), 327.64 MiB | 37.61 MiB/s
Receiving objects: 68% (110252/162134), 327.64 MiB | 37.61 MiB/s
Receiving objects: 69% (111873/162134), 327.64 MiB | 37.61 MiB/s
Receiving objects: 70% (113494/162134), 327.64 MiB | 37.61 MiB/s
Receiving objects: 71% (115116/162134), 327.64 MiB | 37.61 MiB/s
Receiving objects: 72% (116737/162134), 327.64 MiB | 37.61 MiB/s
Receiving objects: 73% (118358/162134), 327.64 MiB | 37.61 MiB/s
Receiving objects: 74% (119980/162134), 327.64 MiB | 37.61 MiB/s
Receiving objects: 75% (121601/162134), 327.64 MiB | 37.61 MiB/s
Receiving objects: 76% (123222/162134), 346.86 MiB | 37.28 MiB/s
Receiving objects: 76% (124027/162134), 346.86 MiB | 37.28 MiB/s
Receiving objects: 77% (124844/162134), 366.28 MiB | 37.48 MiB/s
Receiving objects: 78% (126465/162134), 366.28 MiB | 37.48 MiB/s
Receiving objects: 79% (128086/162134), 366.28 MiB | 37.48 MiB/s
Receiving objects: 80% (129708/162134), 366.28 MiB | 37.48 MiB/s
Receiving objects: 81% (131329/162134), 366.28 MiB | 37.48 MiB/s
Receiving objects: 82% (132950/162134), 366.28 MiB | 37.48 MiB/s
Receiving objects: 82% (134464/162134), 384.95 MiB | 37.44 MiB/s
Receiving objects: 83% (134572/162134), 384.95 MiB | 37.44 MiB/s
Receiving objects: 84% (136193/162134), 403.59 MiB | 37.38 MiB/s
Receiving objects: 85% (137814/162134), 403.59 MiB | 37.38 MiB/s
Receiving objects: 86% (139436/162134), 403.59 MiB | 37.38 MiB/s
Receiving objects: 87% (141057/162134), 403.59 MiB | 37.38 MiB/s
Receiving objects: 88% (142678/162134), 422.51 MiB | 37.61 MiB/s
Receiving objects: 89% (144300/162134), 422.51 MiB | 37.61 MiB/s
Receiving objects: 89% (145256/162134), 422.51 MiB | 37.61 MiB/s
Receiving objects: 90% (145921/162134), 441.75 MiB | 37.57 MiB/s
Receiving objects: 91% (147542/162134), 441.75 MiB | 37.57 MiB/s
Receiving objects: 92% (149164/162134), 441.75 MiB | 37.57 MiB/s
Receiving objects: 93% (150785/162134), 441.75 MiB | 37.57 MiB/s
Receiving objects: 94% (152406/162134), 460.53 MiB | 37.59 MiB/s
Receiving objects: 94% (152861/162134), 460.53 MiB | 37.59 MiB/s
Receiving objects: 95% (154028/162134), 479.22 MiB | 37.52 MiB/s
Receiving objects: 96% (155649/162134), 479.22 MiB | 37.52 MiB/s
Receiving objects: 97% (157270/162134), 479.22 MiB | 37.52 MiB/s
Receiving objects: 98% (158892/162134), 493.79 MiB | 36.69 MiB/s
Receiving objects: 99% (160513/162134), 493.79 MiB | 36.69 MiB/s
remote: Total 162134 (delta 2584), reused 2717 (delta 2211), pack-reused 158424 (from 3)
18.24 s
Receiving objects: 100% (162134/162134), 493.79 MiB | 36.69 MiB/s
Receiving objects: 100% (162134/162134), 500.56 MiB | 36.21 MiB/s, done.
20.58 s
Resolving deltas: 0% (0/105592)
Resolving deltas: 1% (1056/105592)
Resolving deltas: 2% (2112/105592)
Resolving deltas: 3% (3168/105592)
Resolving deltas: 4% (4227/105592)
Resolving deltas: 5% (5280/105592)
Resolving deltas: 6% (6336/105592)
Resolving deltas: 7% (7392/105592)
Resolving deltas: 8% (8448/105592)
Resolving deltas: 9% (9505/105592)
Resolving deltas: 10% (10560/105592)
Resolving deltas: 11% (11617/105592)
Resolving deltas: 12% (12672/105592)
Resolving deltas: 13% (13729/105592)
Resolving deltas: 14% (14783/105592)
Resolving deltas: 15% (15839/105592)
Resolving deltas: 16% (16895/105592)
Resolving deltas: 17% (17951/105592)
Resolving deltas: 18% (19007/105592)
Resolving deltas: 19% (20063/105592)
Resolving deltas: 20% (21119/105592)
Resolving deltas: 21% (22176/105592)
Resolving deltas: 22% (23231/105592)
Resolving deltas: 23% (24288/105592)
Resolving deltas: 24% (25343/105592)
Resolving deltas: 25% (26398/105592)
Resolving deltas: 26% (27456/105592)
Resolving deltas: 27% (28510/105592)
Resolving deltas: 28% (29566/105592)
Resolving deltas: 29% (30622/105592)
Resolving deltas: 30% (31678/105592)
Resolving deltas: 31% (32734/105592)
Resolving deltas: 32% (33790/105592)
Resolving deltas: 33% (34847/105592)
Resolving deltas: 34% (35902/105592)
Resolving deltas: 35% (36958/105592)
Resolving deltas: 36% (38014/105592)
Resolving deltas: 37% (39070/105592)
Resolving deltas: 38% (40125/105592)
Resolving deltas: 39% (41181/105592)
Resolving deltas: 40% (42237/105592)
Resolving deltas: 41% (43293/105592)
Resolving deltas: 42% (44349/105592)
Resolving deltas: 43% (45409/105592)
Resolving deltas: 43% (46265/105592)
Resolving deltas: 44% (46462/105592)
Resolving deltas: 45% (47518/105592)
Resolving deltas: 46% (48573/105592)
Resolving deltas: 47% (49630/105592)
Resolving deltas: 48% (50685/105592)
Resolving deltas: 49% (51741/105592)
Resolving deltas: 50% (52796/105592)
Resolving deltas: 51% (53852/105592)
Resolving deltas: 52% (54908/105592)
Resolving deltas: 53% (55964/105592)
Resolving deltas: 54% (57020/105592)
Resolving deltas: 55% (58076/105592)
Resolving deltas: 56% (59132/105592)
Resolving deltas: 57% (60188/105592)
Resolving deltas: 58% (61244/105592)
Resolving deltas: 59% (62302/105592)
Resolving deltas: 60% (63356/105592)
Resolving deltas: 61% (64413/105592)
Resolving deltas: 62% (65468/105592)
Resolving deltas: 63% (66523/105592)
Resolving deltas: 64% (67581/105592)
Resolving deltas: 65% (68637/105592)
Resolving deltas: 66% (69691/105592)
Resolving deltas: 67% (70747/105592)
Resolving deltas: 68% (71803/105592)
Resolving deltas: 69% (72859/105592)
Resolving deltas: 70% (73915/105592)
Resolving deltas: 71% (74971/105592)
Resolving deltas: 72% (76027/105592)
Resolving deltas: 73% (77083/105592)
Resolving deltas: 74% (78139/105592)
Resolving deltas: 75% (79194/105592)
Resolving deltas: 76% (80250/105592)
Resolving deltas: 77% (81306/105592)
Resolving deltas: 78% (82362/105592)
Resolving deltas: 79% (83418/105592)
Resolving deltas: 80% (84474/105592)
Resolving deltas: 81% (85530/105592)
Resolving deltas: 82% (86586/105592)
Resolving deltas: 83% (87642/105592)
Resolving deltas: 84% (88698/105592)
Resolving deltas: 85% (89754/105592)
Resolving deltas: 86% (90810/105592)
Resolving deltas: 87% (91866/105592)
Resolving deltas: 88% (92921/105592)
Resolving deltas: 89% (93977/105592)
Resolving deltas: 90% (95033/105592)
Resolving deltas: 91% (96089/105592)
Resolving deltas: 92% (97145/105592)
Resolving deltas: 92% (97321/105592)
Resolving deltas: 93% (98201/105592)
Resolving deltas: 94% (99257/105592)
Resolving deltas: 95% (100314/105592)
Resolving deltas: 96% (101369/105592)
Resolving deltas: 97% (102426/105592)
Resolving deltas: 98% (103481/105592)
Resolving deltas: 99% (104537/105592)
Resolving deltas: 100% (105592/105592)
Resolving deltas: 100% (105592/105592), done.
22.44 s
Fetching commit 850623213381026bc4a5649876fbf8a3192532a7 for idenso-epsilon-components ...
22.44 s
$ /nix/store/b1wn5clix1mz4vpfih7x9cnj9qfh7c6h-git-2.54.0/bin/git fetch origin 850623213381026bc4a5649876fbf8a3192532a7
22.82 s
From https://github.com/alphal00p/gammaloop
22.82 s
* branch 850623213381026bc4a5649876fbf8a3192532a7 -> FETCH_HEAD
22.83 s
$ /nix/store/bhv6xyvqw6gjs3j488gi1z6wdv18bdpa-coreutils-9.11/bin/timeout --kill-after=15s 7200s /nix/store/b1wn5clix1mz4vpfih7x9cnj9qfh7c6h-git-2.54.0/bin/git -c advice.detachedHead=false checkout 850623213381026bc4a5649876fbf8a3192532a7
23.18 s
HEAD is now at 850623213 nix-ci: enable NixCI for final review
23.19 s
$ /nix/store/bhv6xyvqw6gjs3j488gi1z6wdv18bdpa-coreutils-9.11/bin/timeout --kill-after=15s 7200s /nix/store/bxgja2ppiqi6w2bgn0r07d7mgnl1k6k2-nix-2.34.8/bin/nix --extra-experimental-features nix-command --extra-experimental-features flakes --log-format internal-json run .#packages.x86_64-linux.nix-ci-check-gammaloop-nextest-clinnet --print-build-logs
23.68 s
warning: ignoring untrusted flake configuration setting 'extra-substituters'.
23.68 s
Pass '--accept-flake-config' to trust it
23.68 s
warning: ignoring untrusted flake configuration setting 'extra-trusted-public-keys'.
23.68 s
Pass '--accept-flake-config' to trust it
28.53 s
28.94 s
evaluating derivation 'gdo you want to allow configuration setting 'extra-substituters' to be set to 'https://cache.nix-ci.com ' (y/N)? do you want to permanently mark this value as untrusted (y/N)? warning: ignoring untrusted flake configuration setting 'extra-substituters'.
28.94 s
Pass '--accept-flake-config' to trust it
28.94 s
do you want to allow configuration setting 'extra-trusted-public-keys' to be set to 'nix-ci:g3xV5BDTLtIBZr/A00IU1x0EtKKlb7YLgBN2SgYgM6A= ' (y/N)? do you want to permanently mark this value as untrusted (y/N)? warning: ignoring untrusted flake configuration setting 'extra-trusted-public-keys'.
28.94 s
Pass '--accept-flake-config' to trust it
35.32 s
copying '/nix/store/wnbi
evaluating derivation 'g
copying '/nix/store/wnbi
evaluating derivation 'g
copying '/nix/store/wnbi
evaluating derivation 'g
copying '/nix/store/wnbi
evaluating derivation 'g
[0 /1 built]
[1 /0 /1 built] building g gammaloop-nextest-clinnet> Nextest worker budget: 16
35.33 s
gammaloop-nextest-clinnet> Extracting 4 binaries (including 1 non-test binary), 1 build script output directory, and 1 linked path to /build/source
35.41 s
gammaloop-nextest-clinnet> Extracted 16 files to /build/source in 0.08s
35.42 s
gammaloop-nextest-clinnet> ------------
35.42 s
gammaloop-nextest-clinnet> Nextest run ID 6af934be-ff29-4c35-894d-348a304fd8dd with nextest profile: ci_gammaloop
35.42 s
gammaloop-nextest-clinnet> Starting 38 tests across 3 binaries
121.86 s
gammaloop-nextest-clinnet> FAIL [ 86.337s] (32/38) clinnet::public_typst_behavior public_linnest_arrow_shafts_and_crossing_gaps
121.86 s
gammaloop-nextest-clinnet> stdout ---
121.86 s
gammaloop-nextest-clinnet>
121.86 s
gammaloop-nextest-clinnet> running 1 test
121.86 s
gammaloop-nextest-clinnet> test public_linnest_arrow_shafts_and_crossing_gaps has been running for over 60 seconds
121.86 s
gammaloop-nextest-clinnet> test public_linnest_arrow_shafts_and_crossing_gaps ... FAILED
121.86 s
gammaloop-nextest-clinnet>
121.86 s
gammaloop-nextest-clinnet> failures:
121.86 s
gammaloop-nextest-clinnet>
121.86 s
gammaloop-nextest-clinnet> failures:
121.86 s
gammaloop-nextest-clinnet> public_linnest_arrow_shafts_and_crossing_gaps
121.86 s
gammaloop-nextest-clinnet>
121.86 s
gammaloop-nextest-clinnet> test result: FAILED. 0 passed; 1 failed; 0 ignored; 0 measured; 17 filtered out; finished in 86.32s
121.86 s
gammaloop-nextest-clinnet>
121.86 s
gammaloop-nextest-clinnet> stderr ---
121.86 s
gammaloop-nextest-clinnet>
121.86 s
gammaloop-nextest-clinnet> thread 'public_linnest_arrow_shafts_and_crossing_gaps' (276) panicked at crates/clinnet/tests/public_typst_behavior.rs:81:55:
121.86 s
gammaloop-nextest-clinnet> called `Result::unwrap()` on an `Err` value: typst failed while compiling template /build/.tmpU5bWsT/.clinnet/templates/linnest-public-behavior.svg
121.86 s
gammaloop-nextest-clinnet>
121.86 s
gammaloop-nextest-clinnet> Command executed:
121.86 s
gammaloop-nextest-clinnet> "typst" "c" "/build/.tmpU5bWsT/.clinnet/templates/linnest-public-behavior.typ" "/build/.tmpU5bWsT/.clinnet/templates/linnest-public-behavior.svg" "--root" "/build/.tmpU5bWsT/.clinnet/templates"
121.86 s
gammaloop-nextest-clinnet>
121.86 s
gammaloop-nextest-clinnet> Typst stdout:
121.86 s
gammaloop-nextest-clinnet>
121.86 s
gammaloop-nextest-clinnet>
121.86 s
gammaloop-nextest-clinnet> Typst stderr:
121.86 s
gammaloop-nextest-clinnet>
121.86 s
gammaloop-nextest-clinnet>
121.86 s
gammaloop-nextest-clinnet> Location:
121.86 s
gammaloop-nextest-clinnet> crates/clinnet/src/lib.rs:741:13
121.86 s
gammaloop-nextest-clinnet> stack backtrace:
121.86 s
gammaloop-nextest-clinnet> 0: __rustc::rust_begin_unwind
121.86 s
gammaloop-nextest-clinnet> 1: core::panicking::panic_fmt
121.86 s
gammaloop-nextest-clinnet> 2: core::result::unwrap_failed
121.86 s
gammaloop-nextest-clinnet> 3: public_typst_behavior::render
121.86 s
gammaloop-nextest-clinnet> 4: <std::sync::once::Once>::call_once_force::<<std::sync::once_lock::OnceLock<alloc::string::String>>::initialize<<std::sync::once_lock::OnceLock<alloc::string::String>>::get_or_init<public_typst_behavior::linnest_public_svg::{closure#0}>::{closure#0}, !>::{closure#0}>::{closure#0}
121.86 s
gammaloop-nextest-clinnet> 5: <std::sys::sync::once::futex::Once>::call
121.86 s
gammaloop-nextest-clinnet> 6: <std::sync::once_lock::OnceLock<alloc::string::String>>::initialize::<<std::sync::once_lock::OnceLock<alloc::string::String>>::get_or_init<public_typst_behavior::linnest_public_svg::{closure#0}>::{closure#0}, !>
121.86 s
gammaloop-nextest-clinnet> 7: <public_typst_behavior::public_linnest_arrow_shafts_and_crossing_gaps::{closure#0} as core::ops::function::FnOnce<()>>::call_once
121.86 s
gammaloop-nextest-clinnet> note: Some details are omitted, run with `RUST_BACKTRACE=full` for a verbose backtrace.
121.86 s
gammaloop-nextest-clinnet>
128.40 s
gammaloop-nextest-clinnet> FAIL [ 92.895s] (33/38) clinnet::public_typst_behavior public_linnest_overlays_follow_the_unit
128.40 s
gammaloop-nextest-clinnet> stdout ---
128.40 s
gammaloop-nextest-clinnet>
128.40 s
gammaloop-nextest-clinnet> running 1 test
128.40 s
gammaloop-nextest-clinnet> test public_linnest_overlays_follow_the_unit has been running for over 60 seconds
128.40 s
gammaloop-nextest-clinnet> test public_linnest_overlays_follow_the_unit ... FAILED
128.40 s
gammaloop-nextest-clinnet>
128.40 s
gammaloop-nextest-clinnet> failures:
128.40 s
gammaloop-nextest-clinnet>
128.40 s
gammaloop-nextest-clinnet> failures:
128.40 s
gammaloop-nextest-clinnet> public_linnest_overlays_follow_the_unit
128.40 s
gammaloop-nextest-clinnet>
128.40 s
gammaloop-nextest-clinnet> test result: FAILED. 0 passed; 1 failed; 0 ignored; 0 measured; 17 filtered out; finished in 92.88s
128.40 s
gammaloop-nextest-clinnet>
128.40 s
gammaloop-nextest-clinnet> stderr ---
128.40 s
gammaloop-nextest-clinnet>
128.40 s
gammaloop-nextest-clinnet> thread 'public_linnest_overlays_follow_the_unit' (318) panicked at crates/clinnet/tests/public_typst_behavior.rs:81:55:
128.40 s
gammaloop-nextest-clinnet> called `Result::unwrap()` on an `Err` value: typst failed while compiling template /build/.tmp12sroF/.clinnet/templates/linnest-public-behavior.svg
128.40 s
gammaloop-nextest-clinnet>
128.40 s
gammaloop-nextest-clinnet> Command executed:
128.40 s
gammaloop-nextest-clinnet> "typst" "c" "/build/.tmp12sroF/.clinnet/templates/linnest-public-behavior.typ" "/build/.tmp12sroF/.clinnet/templates/linnest-public-behavior.svg" "--root" "/build/.tmp12sroF/.clinnet/templates"
128.40 s
gammaloop-nextest-clinnet>
128.40 s
gammaloop-nextest-clinnet> Typst stdout:
128.40 s
gammaloop-nextest-clinnet>
128.40 s
gammaloop-nextest-clinnet>
128.40 s
gammaloop-nextest-clinnet> Typst stderr:
128.40 s
gammaloop-nextest-clinnet>
128.40 s
gammaloop-nextest-clinnet>
128.40 s
gammaloop-nextest-clinnet> Location:
128.40 s
gammaloop-nextest-clinnet> crates/clinnet/src/lib.rs:741:13
128.40 s
gammaloop-nextest-clinnet> stack backtrace:
128.40 s
gammaloop-nextest-clinnet> 0: __rustc::rust_begin_unwind
128.40 s
gammaloop-nextest-clinnet> 1: core::panicking::panic_fmt
128.40 s
gammaloop-nextest-clinnet> 2: core::result::unwrap_failed
128.40 s
gammaloop-nextest-clinnet> 3: public_typst_behavior::render
128.40 s
gammaloop-nextest-clinnet> 4: <std::sync::once::Once>::call_once_force::<<std::sync::once_lock::OnceLock<alloc::string::String>>::initialize<<std::sync::once_lock::OnceLock<alloc::string::String>>::get_or_init<public_typst_behavior::linnest_public_svg::{closure#0}>::{closure#0}, !>::{closure#0}>::{closure#0}
128.40 s
gammaloop-nextest-clinnet> 5: <std::sys::sync::once::futex::Once>::call
128.40 s
gammaloop-nextest-clinnet> 6: <std::sync::once_lock::OnceLock<alloc::string::String>>::initialize::<<std::sync::once_lock::OnceLock<alloc::string::String>>::get_or_init<public_typst_behavior::linnest_public_svg::{closure#0}>::{closure#0}, !>
128.40 s
gammaloop-nextest-clinnet> 7: <public_typst_behavior::public_linnest_overlays_follow_the_unit::{closure#0} as core::ops::function::FnOnce<()>>::call_once
128.40 s
gammaloop-nextest-clinnet> note: Some details are omitted, run with `RUST_BACKTRACE=full` for a verbose backtrace.
128.40 s
gammaloop-nextest-clinnet>
163.38 s
gammaloop-nextest-clinnet> FAIL [ 127.944s] (34/38) clinnet::public_typst_behavior public_linnest_momentum_layers_place_shafts_and_labels
163.38 s
gammaloop-nextest-clinnet> stdout ---
163.38 s
gammaloop-nextest-clinnet>
163.38 s
gammaloop-nextest-clinnet> running 1 test
163.38 s
gammaloop-nextest-clinnet> test public_linnest_momentum_layers_place_shafts_and_labels has been running for over 60 seconds
163.38 s
gammaloop-nextest-clinnet> test public_linnest_momentum_layers_place_shafts_and_labels ... FAILED
163.38 s
gammaloop-nextest-clinnet>
163.38 s
gammaloop-nextest-clinnet> failures:
163.38 s
gammaloop-nextest-clinnet>
163.38 s
gammaloop-nextest-clinnet> failures:
163.38 s
gammaloop-nextest-clinnet> public_linnest_momentum_layers_place_shafts_and_labels
163.38 s
gammaloop-nextest-clinnet>
163.38 s
gammaloop-nextest-clinnet> test result: FAILED. 0 passed; 1 failed; 0 ignored; 0 measured; 17 filtered out; finished in 127.94s
163.38 s
gammaloop-nextest-clinnet>
163.38 s
gammaloop-nextest-clinnet> stderr ---
163.38 s
gammaloop-nextest-clinnet>
163.38 s
gammaloop-nextest-clinnet> thread 'public_linnest_momentum_layers_place_shafts_and_labels' (293) panicked at crates/clinnet/tests/public_typst_behavior.rs:81:55:
163.38 s
gammaloop-nextest-clinnet> called `Result::unwrap()` on an `Err` value: typst failed while compiling template /build/.tmpzWz429/.clinnet/templates/linnest-public-behavior.svg
163.38 s
gammaloop-nextest-clinnet>
163.38 s
gammaloop-nextest-clinnet> Command executed:
163.38 s
gammaloop-nextest-clinnet> "typst" "c" "/build/.tmpzWz429/.clinnet/templates/linnest-public-behavior.typ" "/build/.tmpzWz429/.clinnet/templates/linnest-public-behavior.svg" "--root" "/build/.tmpzWz429/.clinnet/templates"
163.38 s
gammaloop-nextest-clinnet>
163.38 s
gammaloop-nextest-clinnet> Typst stdout:
163.38 s
gammaloop-nextest-clinnet>
163.38 s
gammaloop-nextest-clinnet>
163.38 s
gammaloop-nextest-clinnet> Typst stderr:
163.38 s
gammaloop-nextest-clinnet>
163.38 s
gammaloop-nextest-clinnet>
163.38 s
gammaloop-nextest-clinnet> Location:
163.38 s
gammaloop-nextest-clinnet> crates/clinnet/src/lib.rs:741:13
163.38 s
gammaloop-nextest-clinnet> stack backtrace:
163.38 s
gammaloop-nextest-clinnet> 0: __rustc::rust_begin_unwind
163.38 s
gammaloop-nextest-clinnet> 1: core::panicking::panic_fmt
163.38 s
gammaloop-nextest-clinnet> 2: core::result::unwrap_failed
163.38 s
gammaloop-nextest-clinnet> 3: public_typst_behavior::render
163.38 s
gammaloop-nextest-clinnet> 4: <std::sync::once::Once>::call_once_force::<<std::sync::once_lock::OnceLock<alloc::string::String>>::initialize<<std::sync::once_lock::OnceLock<alloc::string::String>>::get_or_init<public_typst_behavior::linnest_public_svg::{closure#0}>::{closure#0}, !>::{closure#0}>::{closure#0}
163.38 s
gammaloop-nextest-clinnet> 5: <std::sys::sync::once::futex::Once>::call
163.38 s
gammaloop-nextest-clinnet> 6: <std::sync::once_lock::OnceLock<alloc::string::String>>::initialize::<<std::sync::once_lock::OnceLock<alloc::string::String>>::get_or_init<public_typst_behavior::linnest_public_svg::{closure#0}>::{closure#0}, !>
163.38 s
gammaloop-nextest-clinnet> 7: <public_typst_behavior::public_linnest_momentum_layers_place_shafts_and_labels::{closure#0} as core::ops::function::FnOnce<()>>::call_once
163.38 s
gammaloop-nextest-clinnet> note: Some details are omitted, run with `RUST_BACKTRACE=full` for a verbose backtrace.
163.38 s
gammaloop-nextest-clinnet>
174.62 s
gammaloop-nextest-clinnet> ------------
174.62 s
gammaloop-nextest-clinnet> Summary [ 139.196s] 38 tests run: 35 passed (4 slow ), 3 failed , 0 skipped
174.62 s
gammaloop-nextest-clinnet> FAIL [ 86.337s] (32/38) clinnet::public_typst_behavior public_linnest_arrow_shafts_and_crossing_gaps
174.62 s
gammaloop-nextest-clinnet> stdout ---
174.62 s
gammaloop-nextest-clinnet>
174.62 s
gammaloop-nextest-clinnet> running 1 test
174.62 s
gammaloop-nextest-clinnet> test public_linnest_arrow_shafts_and_crossing_gaps has been running for over 60 seconds
174.62 s
gammaloop-nextest-clinnet> test public_linnest_arrow_shafts_and_crossing_gaps ... FAILED
174.62 s
gammaloop-nextest-clinnet>
174.62 s
gammaloop-nextest-clinnet> failures:
174.62 s
gammaloop-nextest-clinnet>
174.62 s
gammaloop-nextest-clinnet> failures:
174.62 s
gammaloop-nextest-clinnet> public_linnest_arrow_shafts_and_crossing_gaps
174.62 s
gammaloop-nextest-clinnet>
174.62 s
gammaloop-nextest-clinnet> test result: FAILED. 0 passed; 1 failed; 0 ignored; 0 measured; 17 filtered out; finished in 86.32s
174.62 s
gammaloop-nextest-clinnet>
174.62 s
gammaloop-nextest-clinnet> stderr ---
174.62 s
gammaloop-nextest-clinnet>
174.62 s
gammaloop-nextest-clinnet> thread 'public_linnest_arrow_shafts_and_crossing_gaps' (276) panicked at crates/clinnet/tests/public_typst_behavior.rs:81:55:
174.62 s
gammaloop-nextest-clinnet> called `Result::unwrap()` on an `Err` value: typst failed while compiling template /build/.tmpU5bWsT/.clinnet/templates/linnest-public-behavior.svg
174.62 s
gammaloop-nextest-clinnet>
174.62 s
gammaloop-nextest-clinnet> Command executed:
174.62 s
gammaloop-nextest-clinnet> "typst" "c" "/build/.tmpU5bWsT/.clinnet/templates/linnest-public-behavior.typ" "/build/.tmpU5bWsT/.clinnet/templates/linnest-public-behavior.svg" "--root" "/build/.tmpU5bWsT/.clinnet/templates"
174.62 s
gammaloop-nextest-clinnet>
174.62 s
gammaloop-nextest-clinnet> Typst stdout:
174.62 s
gammaloop-nextest-clinnet>
174.62 s
gammaloop-nextest-clinnet>
174.62 s
gammaloop-nextest-clinnet> Typst stderr:
174.62 s
gammaloop-nextest-clinnet>
174.62 s
gammaloop-nextest-clinnet>
174.62 s
gammaloop-nextest-clinnet> Location:
174.62 s
gammaloop-nextest-clinnet> crates/clinnet/src/lib.rs:741:13
174.62 s
gammaloop-nextest-clinnet> stack backtrace:
174.62 s
gammaloop-nextest-clinnet> 0: __rustc::rust_begin_unwind
174.62 s
gammaloop-nextest-clinnet> 1: core::panicking::panic_fmt
174.62 s
gammaloop-nextest-clinnet> 2: core::result::unwrap_failed
174.62 s
gammaloop-nextest-clinnet> 3: public_typst_behavior::render
174.62 s
gammaloop-nextest-clinnet> 4: <std::sync::once::Once>::call_once_force::<<std::sync::once_lock::OnceLock<alloc::string::String>>::initialize<<std::sync::once_lock::OnceLock<alloc::string::String>>::get_or_init<public_typst_behavior::linnest_public_svg::{closure#0}>::{closure#0}, !>::{closure#0}>::{closure#0}
174.62 s
gammaloop-nextest-clinnet> 5: <std::sys::sync::once::futex::Once>::call
174.62 s
gammaloop-nextest-clinnet> 6: <std::sync::once_lock::OnceLock<alloc::string::String>>::initialize::<<std::sync::once_lock::OnceLock<alloc::string::String>>::get_or_init<public_typst_behavior::linnest_public_svg::{closure#0}>::{closure#0}, !>
174.62 s
gammaloop-nextest-clinnet> 7: <public_typst_behavior::public_linnest_arrow_shafts_and_crossing_gaps::{closure#0} as core::ops::function::FnOnce<()>>::call_once
174.62 s
gammaloop-nextest-clinnet> note: Some details are omitted, run with `RUST_BACKTRACE=full` for a verbose backtrace.
174.62 s
gammaloop-nextest-clinnet>
174.62 s
gammaloop-nextest-clinnet> FAIL [ 92.895s] (33/38) clinnet::public_typst_behavior public_linnest_overlays_follow_the_unit
174.62 s
gammaloop-nextest-clinnet> stdout ---
174.62 s
gammaloop-nextest-clinnet>
174.62 s
gammaloop-nextest-clinnet> running 1 test
174.62 s
gammaloop-nextest-clinnet> test public_linnest_overlays_follow_the_unit has been running for over 60 seconds
174.62 s
gammaloop-nextest-clinnet> test public_linnest_overlays_follow_the_unit ... FAILED
174.62 s
gammaloop-nextest-clinnet>
174.62 s
gammaloop-nextest-clinnet> failures:
174.62 s
gammaloop-nextest-clinnet>
174.62 s
gammaloop-nextest-clinnet> failures:
174.62 s
gammaloop-nextest-clinnet> public_linnest_overlays_follow_the_unit
174.62 s
gammaloop-nextest-clinnet>
174.62 s
gammaloop-nextest-clinnet> test result: FAILED. 0 passed; 1 failed; 0 ignored; 0 measured; 17 filtered out; finished in 92.88s
174.62 s
gammaloop-nextest-clinnet>
174.62 s
gammaloop-nextest-clinnet> stderr ---
174.62 s
gammaloop-nextest-clinnet>
174.62 s
gammaloop-nextest-clinnet> thread 'public_linnest_overlays_follow_the_unit' (318) panicked at crates/clinnet/tests/public_typst_behavior.rs:81:55:
174.62 s
gammaloop-nextest-clinnet> called `Result::unwrap()` on an `Err` value: typst failed while compiling template /build/.tmp12sroF/.clinnet/templates/linnest-public-behavior.svg
174.62 s
gammaloop-nextest-clinnet>
174.62 s
gammaloop-nextest-clinnet> Command executed:
174.62 s
gammaloop-nextest-clinnet> "typst" "c" "/build/.tmp12sroF/.clinnet/templates/linnest-public-behavior.typ" "/build/.tmp12sroF/.clinnet/templates/linnest-public-behavior.svg" "--root" "/build/.tmp12sroF/.clinnet/templates"
174.62 s
gammaloop-nextest-clinnet>
174.62 s
gammaloop-nextest-clinnet> Typst stdout:
174.62 s
gammaloop-nextest-clinnet>
174.62 s
gammaloop-nextest-clinnet>
174.62 s
gammaloop-nextest-clinnet> Typst stderr:
174.62 s
gammaloop-nextest-clinnet>
174.62 s
gammaloop-nextest-clinnet>
174.62 s
gammaloop-nextest-clinnet> Location:
174.62 s
gammaloop-nextest-clinnet> crates/clinnet/src/lib.rs:741:13
174.62 s
gammaloop-nextest-clinnet> stack backtrace:
174.62 s
gammaloop-nextest-clinnet> 0: __rustc::rust_begin_unwind
174.62 s
gammaloop-nextest-clinnet> 1: core::panicking::panic_fmt
174.62 s
gammaloop-nextest-clinnet> 2: core::result::unwrap_failed
174.62 s
gammaloop-nextest-clinnet> 3: public_typst_behavior::render
174.62 s
gammaloop-nextest-clinnet> 4: <std::sync::once::Once>::call_once_force::<<std::sync::once_lock::OnceLock<alloc::string::String>>::initialize<<std::sync::once_lock::OnceLock<alloc::string::String>>::get_or_init<public_typst_behavior::linnest_public_svg::{closure#0}>::{closure#0}, !>::{closure#0}>::{closure#0}
174.62 s
gammaloop-nextest-clinnet> 5: <std::sys::sync::once::futex::Once>::call
174.62 s
gammaloop-nextest-clinnet> 6: <std::sync::once_lock::OnceLock<alloc::string::String>>::initialize::<<std::sync::once_lock::OnceLock<alloc::string::String>>::get_or_init<public_typst_behavior::linnest_public_svg::{closure#0}>::{closure#0}, !>
174.62 s
gammaloop-nextest-clinnet> 7: <public_typst_behavior::public_linnest_overlays_follow_the_unit::{closure#0} as core::ops::function::FnOnce<()>>::call_once
174.62 s
gammaloop-nextest-clinnet> note: Some details are omitted, run with `RUST_BACKTRACE=full` for a verbose backtrace.
174.62 s
gammaloop-nextest-clinnet>
174.62 s
gammaloop-nextest-clinnet> FAIL [ 127.944s] (34/38) clinnet::public_typst_behavior public_linnest_momentum_layers_place_shafts_and_labels
174.62 s
gammaloop-nextest-clinnet> stdout ---
174.62 s
gammaloop-nextest-clinnet>
174.62 s
gammaloop-nextest-clinnet> running 1 test
174.62 s
gammaloop-nextest-clinnet> test public_linnest_momentum_layers_place_shafts_and_labels has been running for over 60 seconds
174.62 s
gammaloop-nextest-clinnet> test public_linnest_momentum_layers_place_shafts_and_labels ... FAILED
174.62 s
gammaloop-nextest-clinnet>
174.62 s
gammaloop-nextest-clinnet> failures:
174.62 s
gammaloop-nextest-clinnet>
174.62 s
gammaloop-nextest-clinnet> failures:
174.62 s
gammaloop-nextest-clinnet> public_linnest_momentum_layers_place_shafts_and_labels
174.62 s
gammaloop-nextest-clinnet>
174.62 s
gammaloop-nextest-clinnet> test result: FAILED. 0 passed; 1 failed; 0 ignored; 0 measured; 17 filtered out; finished in 127.94s
174.62 s
gammaloop-nextest-clinnet>
174.62 s
gammaloop-nextest-clinnet> stderr ---
174.62 s
gammaloop-nextest-clinnet>
174.62 s
gammaloop-nextest-clinnet> thread 'public_linnest_momentum_layers_place_shafts_and_labels' (293) panicked at crates/clinnet/tests/public_typst_behavior.rs:81:55:
174.62 s
gammaloop-nextest-clinnet> called `Result::unwrap()` on an `Err` value: typst failed while compiling template /build/.tmpzWz429/.clinnet/templates/linnest-public-behavior.svg
174.62 s
gammaloop-nextest-clinnet>
174.62 s
gammaloop-nextest-clinnet> Command executed:
174.62 s
gammaloop-nextest-clinnet> "typst" "c" "/build/.tmpzWz429/.clinnet/templates/linnest-public-behavior.typ" "/build/.tmpzWz429/.clinnet/templates/linnest-public-behavior.svg" "--root" "/build/.tmpzWz429/.clinnet/templates"
174.62 s
gammaloop-nextest-clinnet>
174.62 s
gammaloop-nextest-clinnet> Typst stdout:
174.62 s
gammaloop-nextest-clinnet>
174.62 s
gammaloop-nextest-clinnet>
174.62 s
gammaloop-nextest-clinnet> Typst stderr:
174.62 s
gammaloop-nextest-clinnet>
174.62 s
gammaloop-nextest-clinnet>
174.62 s
gammaloop-nextest-clinnet> Location:
174.62 s
gammaloop-nextest-clinnet> crates/clinnet/src/lib.rs:741:13
174.62 s
gammaloop-nextest-clinnet> stack backtrace:
174.62 s
gammaloop-nextest-clinnet> 0: __rustc::rust_begin_unwind
174.62 s
gammaloop-nextest-clinnet> 1: core::panicking::panic_fmt
174.62 s
gammaloop-nextest-clinnet> 2: core::result::unwrap_failed
174.62 s
gammaloop-nextest-clinnet> 3: public_typst_behavior::render
174.62 s
gammaloop-nextest-clinnet> 4: <std::sync::once::Once>::call_once_force::<<std::sync::once_lock::OnceLock<alloc::string::String>>::initialize<<std::sync::once_lock::OnceLock<alloc::string::String>>::get_or_init<public_typst_behavior::linnest_public_svg::{closure#0}>::{closure#0}, !>::{closure#0}>::{closure#0}
174.62 s
gammaloop-nextest-clinnet> 5: <std::sys::sync::once::futex::Once>::call
174.62 s
gammaloop-nextest-clinnet> 6: <std::sync::once_lock::OnceLock<alloc::string::String>>::initialize::<<std::sync::once_lock::OnceLock<alloc::string::String>>::get_or_init<public_typst_behavior::linnest_public_svg::{closure#0}>::{closure#0}, !>
174.62 s
gammaloop-nextest-clinnet> 7: <public_typst_behavior::public_linnest_momentum_layers_place_shafts_and_labels::{closure#0} as core::ops::function::FnOnce<()>>::call_once
174.62 s
gammaloop-nextest-clinnet> note: Some details are omitted, run with `RUST_BACKTRACE=full` for a verbose backtrace.
174.62 s
gammaloop-nextest-clinnet>
174.63 s
gammaloop-nextest-clinnet> error : test run failed
174.85 s
gammaloop-nextest-clinnet>
174.85 s
gammaloop-nextest-clinnet> ========== nextest test summary ==========
174.85 s
gammaloop-nextest-clinnet> report: target/nextest/ci_gammaloop/junit.xml
174.85 s
gammaloop-nextest-clinnet> tests: 38, failures: 3, errors: 0
174.85 s
gammaloop-nextest-clinnet>
174.85 s
gammaloop-nextest-clinnet> 1. clinnet::public_typst_behavior::public_linnest_arrow_shafts_and_crossing_gaps
174.85 s
gammaloop-nextest-clinnet> failure: test failure with exit code 101
174.85 s
gammaloop-nextest-clinnet> thread 'public_linnest_arrow_shafts_and_crossing_gaps' (276) panicked at crates/clinnet/tests/public_typst_behavior.rs:81:55:
174.85 s
gammaloop-nextest-clinnet> called `Result::unwrap()` on an `Err` value: typst failed while compiling template /build/.tmpU5bWsT/.clinnet/templates/linnest-public-behavior.svg
174.85 s
gammaloop-nextest-clinnet>
174.85 s
gammaloop-nextest-clinnet> Command executed:
174.85 s
gammaloop-nextest-clinnet> "typst" "c" "/build/.tmpU5bWsT/.clinnet/templates/linnest-public-behavior.typ" "/build/.tmpU5bWsT/.clinnet/templates/linnest-public-behavior.svg" "--root" "/build/.tmpU5bWsT/.clinnet/templates"
174.85 s
gammaloop-nextest-clinnet>
174.85 s
gammaloop-nextest-clinnet> Typst stdout:
174.85 s
gammaloop-nextest-clinnet>
174.85 s
gammaloop-nextest-clinnet>
174.85 s
gammaloop-nextest-clinnet> Typst stderr:
174.85 s
gammaloop-nextest-clinnet>
174.85 s
gammaloop-nextest-clinnet>
174.85 s
gammaloop-nextest-clinnet> Location:
174.85 s
gammaloop-nextest-clinnet> crates/clinnet/src/lib.rs:741:13
174.85 s
gammaloop-nextest-clinnet> stack backtrace:
174.85 s
gammaloop-nextest-clinnet> 0: __rustc::rust_begin_unwind
174.85 s
gammaloop-nextest-clinnet> 1: core::panicking::panic_fmt
174.85 s
gammaloop-nextest-clinnet> 2: core::result::unwrap_failed
174.85 s
gammaloop-nextest-clinnet> 3: public_typst_behavior::render
174.85 s
gammaloop-nextest-clinnet> 4: <std::sync::once::Once>::call_once_force::<<std::sync::once_lock::OnceLock<alloc::string::String>>::initialize<<std::sync::once_lock::OnceLock<alloc::string::String>>::get_or_init<public_typst_behavior::linnest_public_svg::{closure#0}>::{closure#0}, !>::{closure#0}>::{closure#0}
174.85 s
gammaloop-nextest-clinnet> 5: <std::sys::sync::once::futex::Once>::call
174.85 s
gammaloop-nextest-clinnet> 6: <std::sync::once_lock::OnceLock<alloc::string::String>>::initialize::<<std::sync::once_lock::OnceLock<alloc::string::String>>::get_or_init<public_typst_behavior::linnest_public_svg::{closure#0}>::{closure#0}, !>
174.85 s
gammaloop-nextest-clinnet> 7: <public_typst_behavior::public_linnest_arrow_shafts_and_crossing_gaps::{closure#0} as core::ops::function::FnOnce<()>>::call_once
174.85 s
gammaloop-nextest-clinnet> note: Some details are omitted, run with `RUST_BACKTRACE=full` for a verbose backtrace.
174.85 s
gammaloop-nextest-clinnet> system-out
174.85 s
gammaloop-nextest-clinnet> running 1 test
174.85 s
gammaloop-nextest-clinnet> test public_linnest_arrow_shafts_and_crossing_gaps has been running for over 60 seconds
174.85 s
gammaloop-nextest-clinnet> test public_linnest_arrow_shafts_and_crossing_gaps ... FAILED
174.85 s
gammaloop-nextest-clinnet>
174.85 s
gammaloop-nextest-clinnet> failures:
174.85 s
gammaloop-nextest-clinnet>
174.85 s
gammaloop-nextest-clinnet> failures:
174.85 s
gammaloop-nextest-clinnet> public_linnest_arrow_shafts_and_crossing_gaps
174.85 s
gammaloop-nextest-clinnet>
174.85 s
gammaloop-nextest-clinnet> test result: FAILED. 0 passed; 1 failed; 0 ignored; 0 measured; 17 filtered out; finished in 86.32s
174.85 s
gammaloop-nextest-clinnet> system-err
174.85 s
gammaloop-nextest-clinnet> thread 'public_linnest_arrow_shafts_and_crossing_gaps' (276) panicked at crates/clinnet/tests/public_typst_behavior.rs:81:55:
174.85 s
gammaloop-nextest-clinnet> called `Result::unwrap()` on an `Err` value: typst failed while compiling template /build/.tmpU5bWsT/.clinnet/templates/linnest-public-behavior.svg
174.85 s
gammaloop-nextest-clinnet>
174.85 s
gammaloop-nextest-clinnet> Command executed:
174.85 s
gammaloop-nextest-clinnet> "typst" "c" "/build/.tmpU5bWsT/.clinnet/templates/linnest-public-behavior.typ" "/build/.tmpU5bWsT/.clinnet/templates/linnest-public-behavior.svg" "--root" "/build/.tmpU5bWsT/.clinnet/templates"
174.85 s
gammaloop-nextest-clinnet>
174.85 s
gammaloop-nextest-clinnet> Typst stdout:
174.85 s
gammaloop-nextest-clinnet>
174.85 s
gammaloop-nextest-clinnet>
174.85 s
gammaloop-nextest-clinnet> Typst stderr:
174.85 s
gammaloop-nextest-clinnet>
174.85 s
gammaloop-nextest-clinnet>
174.85 s
gammaloop-nextest-clinnet> Location:
174.85 s
gammaloop-nextest-clinnet> crates/clinnet/src/lib.rs:741:13
174.85 s
gammaloop-nextest-clinnet> stack backtrace:
174.85 s
gammaloop-nextest-clinnet> 0: __rustc::rust_begin_unwind
174.85 s
gammaloop-nextest-clinnet> 1: core::panicking::panic_fmt
174.85 s
gammaloop-nextest-clinnet> 2: core::result::unwrap_failed
174.85 s
gammaloop-nextest-clinnet> 3: public_typst_behavior::render
174.85 s
gammaloop-nextest-clinnet> 4: <std::sync::once::Once>::call_once_force::<<std::sync::once_lock::OnceLock<alloc::string::String>>::initialize<<std::sync::once_lock::OnceLock<alloc::string::String>>::get_or_init<public_typst_behavior::linnest_public_svg::{closure#0}>::{closure#0}, !>::{closure#0}>::{closure#0}
174.85 s
gammaloop-nextest-clinnet> 5: <std::sys::sync::once::futex::Once>::call
174.85 s
gammaloop-nextest-clinnet> 6: <std::sync::once_lock::OnceLock<alloc::string::String>>::initialize::<<std::sync::once_lock::OnceLock<alloc::string::String>>::get_or_init<public_typst_behavior::linnest_public_svg::{closure#0}>::{closure#0}, !>
174.85 s
gammaloop-nextest-clinnet> 7: <public_typst_behavior::public_linnest_arrow_shafts_and_crossing_gaps::{closure#0} as core::ops::function::FnOnce<()>>::call_once
174.85 s
gammaloop-nextest-clinnet> note: Some details are omitted, run with `RUST_BACKTRACE=full` for a verbose backtrace.
174.85 s
gammaloop-nextest-clinnet>
174.85 s
gammaloop-nextest-clinnet> 2. clinnet::public_typst_behavior::public_linnest_overlays_follow_the_unit
174.85 s
gammaloop-nextest-clinnet> failure: test failure with exit code 101
174.85 s
gammaloop-nextest-clinnet> thread 'public_linnest_overlays_follow_the_unit' (318) panicked at crates/clinnet/tests/public_typst_behavior.rs:81:55:
174.85 s
gammaloop-nextest-clinnet> called `Result::unwrap()` on an `Err` value: typst failed while compiling template /build/.tmp12sroF/.clinnet/templates/linnest-public-behavior.svg
174.85 s
gammaloop-nextest-clinnet>
174.85 s
gammaloop-nextest-clinnet> Command executed:
174.85 s
gammaloop-nextest-clinnet> "typst" "c" "/build/.tmp12sroF/.clinnet/templates/linnest-public-behavior.typ" "/build/.tmp12sroF/.clinnet/templates/linnest-public-behavior.svg" "--root" "/build/.tmp12sroF/.clinnet/templates"
174.85 s
gammaloop-nextest-clinnet>
174.85 s
gammaloop-nextest-clinnet> Typst stdout:
174.85 s
gammaloop-nextest-clinnet>
174.85 s
gammaloop-nextest-clinnet>
174.85 s
gammaloop-nextest-clinnet> Typst stderr:
174.85 s
gammaloop-nextest-clinnet>
174.85 s
gammaloop-nextest-clinnet>
174.85 s
gammaloop-nextest-clinnet> Location:
174.85 s
gammaloop-nextest-clinnet> crates/clinnet/src/lib.rs:741:13
174.85 s
gammaloop-nextest-clinnet> stack backtrace:
174.85 s
gammaloop-nextest-clinnet> 0: __rustc::rust_begin_unwind
174.85 s
gammaloop-nextest-clinnet> 1: core::panicking::panic_fmt
174.85 s
gammaloop-nextest-clinnet> 2: core::result::unwrap_failed
174.85 s
gammaloop-nextest-clinnet> 3: public_typst_behavior::render
174.85 s
gammaloop-nextest-clinnet> 4: <std::sync::once::Once>::call_once_force::<<std::sync::once_lock::OnceLock<alloc::string::String>>::initialize<<std::sync::once_lock::OnceLock<alloc::string::String>>::get_or_init<public_typst_behavior::linnest_public_svg::{closure#0}>::{closure#0}, !>::{closure#0}>::{closure#0}
174.85 s
gammaloop-nextest-clinnet> 5: <std::sys::sync::once::futex::Once>::call
174.85 s
gammaloop-nextest-clinnet> 6: <std::sync::once_lock::OnceLock<alloc::string::String>>::initialize::<<std::sync::once_lock::OnceLock<alloc::string::String>>::get_or_init<public_typst_behavior::linnest_public_svg::{closure#0}>::{closure#0}, !>
174.85 s
gammaloop-nextest-clinnet> 7: <public_typst_behavior::public_linnest_overlays_follow_the_unit::{closure#0} as core::ops::function::FnOnce<()>>::call_once
174.85 s
gammaloop-nextest-clinnet> note: Some details are omitted, run with `RUST_BACKTRACE=full` for a verbose backtrace.
174.85 s
gammaloop-nextest-clinnet> system-out
174.85 s
gammaloop-nextest-clinnet> running 1 test
174.85 s
gammaloop-nextest-clinnet> test public_linnest_overlays_follow_the_unit has been running for over 60 seconds
174.85 s
gammaloop-nextest-clinnet> test public_linnest_overlays_follow_the_unit ... FAILED
174.85 s
gammaloop-nextest-clinnet>
174.85 s
gammaloop-nextest-clinnet> failures:
174.85 s
gammaloop-nextest-clinnet>
174.85 s
gammaloop-nextest-clinnet> failures:
174.85 s
gammaloop-nextest-clinnet> public_linnest_overlays_follow_the_unit
174.85 s
gammaloop-nextest-clinnet>
174.85 s
gammaloop-nextest-clinnet> test result: FAILED. 0 passed; 1 failed; 0 ignored; 0 measured; 17 filtered out; finished in 92.88s
174.85 s
gammaloop-nextest-clinnet> system-err
174.85 s
gammaloop-nextest-clinnet> thread 'public_linnest_overlays_follow_the_unit' (318) panicked at crates/clinnet/tests/public_typst_behavior.rs:81:55:
174.85 s
gammaloop-nextest-clinnet> called `Result::unwrap()` on an `Err` value: typst failed while compiling template /build/.tmp12sroF/.clinnet/templates/linnest-public-behavior.svg
174.85 s
gammaloop-nextest-clinnet>
174.85 s
gammaloop-nextest-clinnet> Command executed:
174.85 s
gammaloop-nextest-clinnet> "typst" "c" "/build/.tmp12sroF/.clinnet/templates/linnest-public-behavior.typ" "/build/.tmp12sroF/.clinnet/templates/linnest-public-behavior.svg" "--root" "/build/.tmp12sroF/.clinnet/templates"
174.85 s
gammaloop-nextest-clinnet>
174.85 s
gammaloop-nextest-clinnet> Typst stdout:
174.85 s
gammaloop-nextest-clinnet>
174.85 s
gammaloop-nextest-clinnet>
174.85 s
gammaloop-nextest-clinnet> Typst stderr:
174.85 s
gammaloop-nextest-clinnet>
174.85 s
gammaloop-nextest-clinnet>
174.85 s
gammaloop-nextest-clinnet> Location:
174.85 s
gammaloop-nextest-clinnet> crates/clinnet/src/lib.rs:741:13
174.85 s
gammaloop-nextest-clinnet> stack backtrace:
174.85 s
gammaloop-nextest-clinnet> 0: __rustc::rust_begin_unwind
174.85 s
gammaloop-nextest-clinnet> 1: core::panicking::panic_fmt
174.85 s
gammaloop-nextest-clinnet> 2: core::result::unwrap_failed
174.85 s
gammaloop-nextest-clinnet> 3: public_typst_behavior::render
174.85 s
gammaloop-nextest-clinnet> 4: <std::sync::once::Once>::call_once_force::<<std::sync::once_lock::OnceLock<alloc::string::String>>::initialize<<std::sync::once_lock::OnceLock<alloc::string::String>>::get_or_init<public_typst_behavior::linnest_public_svg::{closure#0}>::{closure#0}, !>::{closure#0}>::{closure#0}
174.85 s
gammaloop-nextest-clinnet> 5: <std::sys::sync::once::futex::Once>::call
174.85 s
gammaloop-nextest-clinnet> 6: <std::sync::once_lock::OnceLock<alloc::string::String>>::initialize::<<std::sync::once_lock::OnceLock<alloc::string::String>>::get_or_init<public_typst_behavior::linnest_public_svg::{closure#0}>::{closure#0}, !>
174.85 s
gammaloop-nextest-clinnet> 7: <public_typst_behavior::public_linnest_overlays_follow_the_unit::{closure#0} as core::ops::function::FnOnce<()>>::call_once
174.85 s
gammaloop-nextest-clinnet> note: Some details are omitted, run with `RUST_BACKTRACE=full` for a verbose backtrace.
174.85 s
gammaloop-nextest-clinnet>
174.85 s
gammaloop-nextest-clinnet> 3. clinnet::public_typst_behavior::public_linnest_momentum_layers_place_shafts_and_labels
174.85 s
gammaloop-nextest-clinnet> failure: test failure with exit code 101
174.85 s
gammaloop-nextest-clinnet> thread 'public_linnest_momentum_layers_place_shafts_and_labels' (293) panicked at crates/clinnet/tests/public_typst_behavior.rs:81:55:
174.85 s
gammaloop-nextest-clinnet> called `Result::unwrap()` on an `Err` value: typst failed while compiling template /build/.tmpzWz429/.clinnet/templates/linnest-public-behavior.svg
174.85 s
gammaloop-nextest-clinnet>
174.85 s
gammaloop-nextest-clinnet> Command executed:
174.85 s
gammaloop-nextest-clinnet> "typst" "c" "/build/.tmpzWz429/.clinnet/templates/linnest-public-behavior.typ" "/build/.tmpzWz429/.clinnet/templates/linnest-public-behavior.svg" "--root" "/build/.tmpzWz429/.clinnet/templates"
174.85 s
gammaloop-nextest-clinnet>
174.85 s
gammaloop-nextest-clinnet> Typst stdout:
174.85 s
gammaloop-nextest-clinnet>
174.85 s
gammaloop-nextest-clinnet>
174.85 s
gammaloop-nextest-clinnet> Typst stderr:
174.85 s
gammaloop-nextest-clinnet>
174.85 s
gammaloop-nextest-clinnet>
174.85 s
gammaloop-nextest-clinnet> Location:
174.85 s
gammaloop-nextest-clinnet> crates/clinnet/src/lib.rs:741:13
174.85 s
gammaloop-nextest-clinnet> stack backtrace:
174.85 s
gammaloop-nextest-clinnet> 0: __rustc::rust_begin_unwind
174.85 s
gammaloop-nextest-clinnet> 1: core::panicking::panic_fmt
174.85 s
gammaloop-nextest-clinnet> 2: core::result::unwrap_failed
174.85 s
gammaloop-nextest-clinnet> 3: public_typst_behavior::render
174.85 s
gammaloop-nextest-clinnet> 4: <std::sync::once::Once>::call_once_force::<<std::sync::once_lock::OnceLock<alloc::string::String>>::initialize<<std::sync::once_lock::OnceLock<alloc::string::String>>::get_or_init<public_typst_behavior::linnest_public_svg::{closure#0}>::{closure#0}, !>::{closure#0}>::{closure#0}
174.85 s
gammaloop-nextest-clinnet> 5: <std::sys::sync::once::futex::Once>::call
174.85 s
gammaloop-nextest-clinnet> 6: <std::sync::once_lock::OnceLock<alloc::string::String>>::initialize::<<std::sync::once_lock::OnceLock<alloc::string::String>>::get_or_init<public_typst_behavior::linnest_public_svg::{closure#0}>::{closure#0}, !>
174.85 s
gammaloop-nextest-clinnet> 7: <public_typst_behavior::public_linnest_momentum_layers_place_shafts_and_labels::{closure#0} as core::ops::function::FnOnce<()>>::call_once
174.85 s
gammaloop-nextest-clinnet> note: Some details are omitted, run with `RUST_BACKTRACE=full` for a verbose backtrace.
174.85 s
gammaloop-nextest-clinnet> system-out
174.85 s
gammaloop-nextest-clinnet> running 1 test
174.85 s
gammaloop-nextest-clinnet> test public_linnest_momentum_layers_place_shafts_and_labels has been running for over 60 seconds
174.85 s
gammaloop-nextest-clinnet> test public_linnest_momentum_layers_place_shafts_and_labels ... FAILED
174.85 s
gammaloop-nextest-clinnet>
174.85 s
gammaloop-nextest-clinnet> failures:
174.85 s
gammaloop-nextest-clinnet>
174.85 s
gammaloop-nextest-clinnet> failures:
174.85 s
gammaloop-nextest-clinnet> public_linnest_momentum_layers_place_shafts_and_labels
174.85 s
gammaloop-nextest-clinnet>
174.85 s
gammaloop-nextest-clinnet> test result: FAILED. 0 passed; 1 failed; 0 ignored; 0 measured; 17 filtered out; finished in 127.94s
174.85 s
gammaloop-nextest-clinnet> system-err
174.85 s
gammaloop-nextest-clinnet> thread 'public_linnest_momentum_layers_place_shafts_and_labels' (293) panicked at crates/clinnet/tests/public_typst_behavior.rs:81:55:
174.85 s
gammaloop-nextest-clinnet> called `Result::unwrap()` on an `Err` value: typst failed while compiling template /build/.tmpzWz429/.clinnet/templates/linnest-public-behavior.svg
174.85 s
gammaloop-nextest-clinnet>
174.85 s
gammaloop-nextest-clinnet> Command executed:
174.85 s
gammaloop-nextest-clinnet> "typst" "c" "/build/.tmpzWz429/.clinnet/templates/linnest-public-behavior.typ" "/build/.tmpzWz429/.clinnet/templates/linnest-public-behavior.svg" "--root" "/build/.tmpzWz429/.clinnet/templates"
174.85 s
gammaloop-nextest-clinnet>
174.85 s
gammaloop-nextest-clinnet> Typst stdout:
174.85 s
gammaloop-nextest-clinnet>
174.85 s
gammaloop-nextest-clinnet>
174.85 s
gammaloop-nextest-clinnet> Typst stderr:
174.85 s
gammaloop-nextest-clinnet>
174.85 s
gammaloop-nextest-clinnet>
174.85 s
gammaloop-nextest-clinnet> Location:
174.85 s
gammaloop-nextest-clinnet> crates/clinnet/src/lib.rs:741:13
174.85 s
gammaloop-nextest-clinnet> stack backtrace:
174.85 s
gammaloop-nextest-clinnet> 0: __rustc::rust_begin_unwind
174.85 s
gammaloop-nextest-clinnet> 1: core::panicking::panic_fmt
174.85 s
gammaloop-nextest-clinnet> 2: core::result::unwrap_failed
174.85 s
gammaloop-nextest-clinnet> 3: public_typst_behavior::render
174.85 s
gammaloop-nextest-clinnet> 4: <std::sync::once::Once>::call_once_force::<<std::sync::once_lock::OnceLock<alloc::string::String>>::initialize<<std::sync::once_lock::OnceLock<alloc::string::String>>::get_or_init<public_typst_behavior::linnest_public_svg::{closure#0}>::{closure#0}, !>::{closure#0}>::{closure#0}
174.85 s
gammaloop-nextest-clinnet> 5: <std::sys::sync::once::futex::Once>::call
174.85 s
gammaloop-nextest-clinnet> 6: <std::sync::once_lock::OnceLock<alloc::string::String>>::initialize::<<std::sync::once_lock::OnceLock<alloc::string::String>>::get_or_init<public_typst_behavior::linnest_public_svg::{closure#0}>::{closure#0}, !>
174.85 s
gammaloop-nextest-clinnet> 7: <public_typst_behavior::public_linnest_momentum_layers_place_shafts_and_labels::{closure#0} as core::ops::function::FnOnce<()>>::call_once
174.85 s
gammaloop-nextest-clinnet> note: Some details are omitted, run with `RUST_BACKTRACE=full` for a verbose backtrace.
174.85 s
gammaloop-nextest-clinnet> =========================================
175.23 s
[0 built (1 failed )]error: Cannot build '/nix/store/4pqspwvh8pi9s2vg9g6mfsggpl9ynwzx-gammaloop-nextest-clinnet.drv '.
175.23 s
Reason: builder failed with exit code 100 .
175.23 s
Output paths:
175.23 s
/nix/store/v9zka7gxdrym1pq03r0i4w2q43fgdwcq-gammaloop-nextest-clinnet
175.23 s
Last 449 log lines:
175.23 s
> Nextest worker budget: 16
175.23 s
> Extracting 4 binaries (including 1 non-test binary), 1 build script output directory, and 1 linked path to /build/source
175.23 s
> Extracted 16 files to /build/source in 0.08s
175.23 s
> ------------
175.23 s
> Nextest run ID 6af934be-ff29-4c35-894d-348a304fd8dd with nextest profile: ci_gammaloop
175.23 s
> Starting 38 tests across 3 binaries
175.23 s
> FAIL [ 86.337s] (32/38) clinnet::public_typst_behavior public_linnest_arrow_shafts_and_crossing_gaps
175.23 s
> stdout ---
175.23 s
>
175.23 s
> running 1 test
175.23 s
> test public_linnest_arrow_shafts_and_crossing_gaps has been running for over 60 seconds
175.23 s
> test public_linnest_arrow_shafts_and_crossing_gaps ... FAILED
175.23 s
>
175.23 s
> failures:
175.23 s
>
175.23 s
> failures:
175.23 s
> public_linnest_arrow_shafts_and_crossing_gaps
175.23 s
>
175.23 s
> test result: FAILED. 0 passed; 1 failed; 0 ignored; 0 measured; 17 filtered out; finished in 86.32s
175.23 s
>
175.23 s
> stderr ---
175.23 s
>
175.23 s
> thread 'public_linnest_arrow_shafts_and_crossing_gaps' (276) panicked at crates/clinnet/tests/public_typst_behavior.rs:81:55:
175.23 s
> called `Result::unwrap()` on an `Err` value: typst failed while compiling template /build/.tmpU5bWsT/.clinnet/templates/linnest-public-behavior.svg
175.23 s
>
175.23 s
> Command executed:
175.23 s
> "typst" "c" "/build/.tmpU5bWsT/.clinnet/templates/linnest-public-behavior.typ" "/build/.tmpU5bWsT/.clinnet/templates/linnest-public-behavior.svg" "--root" "/build/.tmpU5bWsT/.clinnet/templates"
175.23 s
>
175.23 s
> Typst stdout:
175.23 s
>
175.23 s
>
175.23 s
> Typst stderr:
175.23 s
>
175.23 s
>
175.23 s
> Location:
175.23 s
> crates/clinnet/src/lib.rs:741:13
175.23 s
> stack backtrace:
175.23 s
> 0: __rustc::rust_begin_unwind
175.23 s
> 1: core::panicking::panic_fmt
175.23 s
> 2: core::result::unwrap_failed
175.23 s
> 3: public_typst_behavior::render
175.23 s
> 4: <std::sync::once::Once>::call_once_force::<<std::sync::once_lock::OnceLock<alloc::string::String>>::initialize<<std::sync::once_lock::OnceLock<alloc::string::String>>::get_or_init<public_typst_behavior::linnest_public_svg::{closure#0}>::{closure#0}, !>::{closure#0}>::{closure#0}
175.23 s
> 5: <std::sys::sync::once::futex::Once>::call
175.23 s
> 6: <std::sync::once_lock::OnceLock<alloc::string::String>>::initialize::<<std::sync::once_lock::OnceLock<alloc::string::String>>::get_or_init<public_typst_behavior::linnest_public_svg::{closure#0}>::{closure#0}, !>
175.23 s
> 7: <public_typst_behavior::public_linnest_arrow_shafts_and_crossing_gaps::{closure#0} as core::ops::function::FnOnce<()>>::call_once
175.23 s
> note: Some details are omitted, run with `RUST_BACKTRACE=full` for a verbose backtrace.
175.23 s
>
175.23 s
> FAIL [ 92.895s] (33/38) clinnet::public_typst_behavior public_linnest_overlays_follow_the_unit
175.23 s
> stdout ---
175.23 s
>
175.23 s
> running 1 test
175.23 s
> test public_linnest_overlays_follow_the_unit has been running for over 60 seconds
175.23 s
> test public_linnest_overlays_follow_the_unit ... FAILED
175.23 s
>
175.23 s
> failures:
175.23 s
>
175.23 s
> failures:
175.23 s
> public_linnest_overlays_follow_the_unit
175.23 s
>
175.23 s
> test result: FAILED. 0 passed; 1 failed; 0 ignored; 0 measured; 17 filtered out; finished in 92.88s
175.23 s
>
175.23 s
> stderr ---
175.23 s
>
175.23 s
> thread 'public_linnest_overlays_follow_the_unit' (318) panicked at crates/clinnet/tests/public_typst_behavior.rs:81:55:
175.23 s
> called `Result::unwrap()` on an `Err` value: typst failed while compiling template /build/.tmp12sroF/.clinnet/templates/linnest-public-behavior.svg
175.23 s
>
175.23 s
> Command executed:
175.23 s
> "typst" "c" "/build/.tmp12sroF/.clinnet/templates/linnest-public-behavior.typ" "/build/.tmp12sroF/.clinnet/templates/linnest-public-behavior.svg" "--root" "/build/.tmp12sroF/.clinnet/templates"
175.23 s
>
175.23 s
> Typst stdout:
175.23 s
>
175.23 s
>
175.23 s
> Typst stderr:
175.23 s
>
175.23 s
>
175.23 s
> Location:
175.23 s
> crates/clinnet/src/lib.rs:741:13
175.23 s
> stack backtrace:
175.23 s
> 0: __rustc::rust_begin_unwind
175.23 s
> 1: core::panicking::panic_fmt
175.23 s
> 2: core::result::unwrap_failed
175.23 s
> 3: public_typst_behavior::render
175.23 s
> 4: <std::sync::once::Once>::call_once_force::<<std::sync::once_lock::OnceLock<alloc::string::String>>::initialize<<std::sync::once_lock::OnceLock<alloc::string::String>>::get_or_init<public_typst_behavior::linnest_public_svg::{closure#0}>::{closure#0}, !>::{closure#0}>::{closure#0}
175.23 s
> 5: <std::sys::sync::once::futex::Once>::call
175.23 s
> 6: <std::sync::once_lock::OnceLock<alloc::string::String>>::initialize::<<std::sync::once_lock::OnceLock<alloc::string::String>>::get_or_init<public_typst_behavior::linnest_public_svg::{closure#0}>::{closure#0}, !>
175.23 s
> 7: <public_typst_behavior::public_linnest_overlays_follow_the_unit::{closure#0} as core::ops::function::FnOnce<()>>::call_once
175.23 s
> note: Some details are omitted, run with `RUST_BACKTRACE=full` for a verbose backtrace.
175.23 s
>
175.23 s
> FAIL [ 127.944s] (34/38) clinnet::public_typst_behavior public_linnest_momentum_layers_place_shafts_and_labels
175.23 s
> stdout ---
175.23 s
>
175.23 s
> running 1 test
175.23 s
> test public_linnest_momentum_layers_place_shafts_and_labels has been running for over 60 seconds
175.23 s
> test public_linnest_momentum_layers_place_shafts_and_labels ... FAILED
175.23 s
>
175.23 s
> failures:
175.23 s
>
175.23 s
> failures:
175.23 s
> public_linnest_momentum_layers_place_shafts_and_labels
175.23 s
>
175.23 s
> test result: FAILED. 0 passed; 1 failed; 0 ignored; 0 measured; 17 filtered out; finished in 127.94s
175.23 s
>
175.23 s
> stderr ---
175.23 s
>
175.23 s
> thread 'public_linnest_momentum_layers_place_shafts_and_labels' (293) panicked at crates/clinnet/tests/public_typst_behavior.rs:81:55:
175.23 s
> called `Result::unwrap()` on an `Err` value: typst failed while compiling template /build/.tmpzWz429/.clinnet/templates/linnest-public-behavior.svg
175.23 s
>
175.23 s
> Command executed:
175.23 s
> "typst" "c" "/build/.tmpzWz429/.clinnet/templates/linnest-public-behavior.typ" "/build/.tmpzWz429/.clinnet/templates/linnest-public-behavior.svg" "--root" "/build/.tmpzWz429/.clinnet/templates"
175.23 s
>
175.23 s
> Typst stdout:
175.23 s
>
175.23 s
>
175.23 s
> Typst stderr:
175.23 s
>
175.23 s
>
175.23 s
> Location:
175.23 s
> crates/clinnet/src/lib.rs:741:13
175.23 s
> stack backtrace:
175.23 s
> 0: __rustc::rust_begin_unwind
175.23 s
> 1: core::panicking::panic_fmt
175.23 s
> 2: core::result::unwrap_failed
175.23 s
> 3: public_typst_behavior::render
175.23 s
> 4: <std::sync::once::Once>::call_once_force::<<std::sync::once_lock::OnceLock<alloc::string::String>>::initialize<<std::sync::once_lock::OnceLock<alloc::string::String>>::get_or_init<public_typst_behavior::linnest_public_svg::{closure#0}>::{closure#0}, !>::{closure#0}>::{closure#0}
175.23 s
> 5: <std::sys::sync::once::futex::Once>::call
175.23 s
> 6: <std::sync::once_lock::OnceLock<alloc::string::String>>::initialize::<<std::sync::once_lock::OnceLock<alloc::string::String>>::get_or_init<public_typst_behavior::linnest_public_svg::{closure#0}>::{closure#0}, !>
175.23 s
> 7: <public_typst_behavior::public_linnest_momentum_layers_place_shafts_and_labels::{closure#0} as core::ops::function::FnOnce<()>>::call_once
175.23 s
> note: Some details are omitted, run with `RUST_BACKTRACE=full` for a verbose backtrace.
175.23 s
>
175.23 s
> ------------
175.23 s
> Summary [ 139.196s] 38 tests run: 35 passed (4 slow ), 3 failed , 0 skipped
175.23 s
> FAIL [ 86.337s] (32/38) clinnet::public_typst_behavior public_linnest_arrow_shafts_and_crossing_gaps
175.23 s
> stdout ---
175.23 s
>
175.23 s
> running 1 test
175.23 s
> test public_linnest_arrow_shafts_and_crossing_gaps has been running for over 60 seconds
175.23 s
> test public_linnest_arrow_shafts_and_crossing_gaps ... FAILED
175.23 s
>
175.23 s
> failures:
175.23 s
>
175.23 s
> failures:
175.23 s
> public_linnest_arrow_shafts_and_crossing_gaps
175.23 s
>
175.23 s
> test result: FAILED. 0 passed; 1 failed; 0 ignored; 0 measured; 17 filtered out; finished in 86.32s
175.23 s
>
175.23 s
> stderr ---
175.23 s
>
175.23 s
> thread 'public_linnest_arrow_shafts_and_crossing_gaps' (276) panicked at crates/clinnet/tests/public_typst_behavior.rs:81:55:
175.23 s
> called `Result::unwrap()` on an `Err` value: typst failed while compiling template /build/.tmpU5bWsT/.clinnet/templates/linnest-public-behavior.svg
175.23 s
>
175.23 s
> Command executed:
175.23 s
> "typst" "c" "/build/.tmpU5bWsT/.clinnet/templates/linnest-public-behavior.typ" "/build/.tmpU5bWsT/.clinnet/templates/linnest-public-behavior.svg" "--root" "/build/.tmpU5bWsT/.clinnet/templates"
175.23 s
>
175.23 s
> Typst stdout:
175.23 s
>
175.23 s
>
175.23 s
> Typst stderr:
175.23 s
>
175.23 s
>
175.23 s
> Location:
175.23 s
> crates/clinnet/src/lib.rs:741:13
175.23 s
> stack backtrace:
175.23 s
> 0: __rustc::rust_begin_unwind
175.23 s
> 1: core::panicking::panic_fmt
175.23 s
> 2: core::result::unwrap_failed
175.23 s
> 3: public_typst_behavior::render
175.23 s
> 4: <std::sync::once::Once>::call_once_force::<<std::sync::once_lock::OnceLock<alloc::string::String>>::initialize<<std::sync::once_lock::OnceLock<alloc::string::String>>::get_or_init<public_typst_behavior::linnest_public_svg::{closure#0}>::{closure#0}, !>::{closure#0}>::{closure#0}
175.23 s
> 5: <std::sys::sync::once::futex::Once>::call
175.23 s
> 6: <std::sync::once_lock::OnceLock<alloc::string::String>>::initialize::<<std::sync::once_lock::OnceLock<alloc::string::String>>::get_or_init<public_typst_behavior::linnest_public_svg::{closure#0}>::{closure#0}, !>
175.23 s
> 7: <public_typst_behavior::public_linnest_arrow_shafts_and_crossing_gaps::{closure#0} as core::ops::function::FnOnce<()>>::call_once
175.23 s
> note: Some details are omitted, run with `RUST_BACKTRACE=full` for a verbose backtrace.
175.23 s
>
175.23 s
> FAIL [ 92.895s] (33/38) clinnet::public_typst_behavior public_linnest_overlays_follow_the_unit
175.23 s
> stdout ---
175.23 s
>
175.23 s
> running 1 test
175.23 s
> test public_linnest_overlays_follow_the_unit has been running for over 60 seconds
175.23 s
> test public_linnest_overlays_follow_the_unit ... FAILED
175.23 s
>
175.23 s
> failures:
175.23 s
>
175.23 s
> failures:
175.23 s
> public_linnest_overlays_follow_the_unit
175.23 s
>
175.23 s
> test result: FAILED. 0 passed; 1 failed; 0 ignored; 0 measured; 17 filtered out; finished in 92.88s
175.23 s
>
175.23 s
> stderr ---
175.23 s
>
175.23 s
> thread 'public_linnest_overlays_follow_the_unit' (318) panicked at crates/clinnet/tests/public_typst_behavior.rs:81:55:
175.23 s
> called `Result::unwrap()` on an `Err` value: typst failed while compiling template /build/.tmp12sroF/.clinnet/templates/linnest-public-behavior.svg
175.23 s
>
175.23 s
> Command executed:
175.23 s
> "typst" "c" "/build/.tmp12sroF/.clinnet/templates/linnest-public-behavior.typ" "/build/.tmp12sroF/.clinnet/templates/linnest-public-behavior.svg" "--root" "/build/.tmp12sroF/.clinnet/templates"
175.23 s
>
175.23 s
> Typst stdout:
175.23 s
>
175.23 s
>
175.23 s
> Typst stderr:
175.23 s
>
175.23 s
>
175.23 s
> Location:
175.23 s
> crates/clinnet/src/lib.rs:741:13
175.23 s
> stack backtrace:
175.23 s
> 0: __rustc::rust_begin_unwind
175.23 s
> 1: core::panicking::panic_fmt
175.23 s
> 2: core::result::unwrap_failed
175.23 s
> 3: public_typst_behavior::render
175.23 s
> 4: <std::sync::once::Once>::call_once_force::<<std::sync::once_lock::OnceLock<alloc::string::String>>::initialize<<std::sync::once_lock::OnceLock<alloc::string::String>>::get_or_init<public_typst_behavior::linnest_public_svg::{closure#0}>::{closure#0}, !>::{closure#0}>::{closure#0}
175.23 s
> 5: <std::sys::sync::once::futex::Once>::call
175.23 s
> 6: <std::sync::once_lock::OnceLock<alloc::string::String>>::initialize::<<std::sync::once_lock::OnceLock<alloc::string::String>>::get_or_init<public_typst_behavior::linnest_public_svg::{closure#0}>::{closure#0}, !>
175.23 s
> 7: <public_typst_behavior::public_linnest_overlays_follow_the_unit::{closure#0} as core::ops::function::FnOnce<()>>::call_once
175.23 s
> note: Some details are omitted, run with `RUST_BACKTRACE=full` for a verbose backtrace.
175.23 s
>
175.23 s
> FAIL [ 127.944s] (34/38) clinnet::public_typst_behavior public_linnest_momentum_layers_place_shafts_and_labels
175.23 s
> stdout ---
175.23 s
>
175.23 s
> running 1 test
175.23 s
> test public_linnest_momentum_layers_place_shafts_and_labels has been running for over 60 seconds
175.23 s
> test public_linnest_momentum_layers_place_shafts_and_labels ... FAILED
175.23 s
>
175.23 s
> failures:
175.23 s
>
175.23 s
> failures:
175.23 s
> public_linnest_momentum_layers_place_shafts_and_labels
175.23 s
>
175.23 s
> test result: FAILED. 0 passed; 1 failed; 0 ignored; 0 measured; 17 filtered out; finished in 127.94s
175.23 s
>
175.23 s
> stderr ---
175.23 s
>
175.23 s
> thread 'public_linnest_momentum_layers_place_shafts_and_labels' (293) panicked at crates/clinnet/tests/public_typst_behavior.rs:81:55:
175.23 s
> called `Result::unwrap()` on an `Err` value: typst failed while compiling template /build/.tmpzWz429/.clinnet/templates/linnest-public-behavior.svg
175.23 s
>
175.23 s
> Command executed:
175.23 s
> "typst" "c" "/build/.tmpzWz429/.clinnet/templates/linnest-public-behavior.typ" "/build/.tmpzWz429/.clinnet/templates/linnest-public-behavior.svg" "--root" "/build/.tmpzWz429/.clinnet/templates"
175.23 s
>
175.23 s
> Typst stdout:
175.23 s
>
175.23 s
>
175.23 s
> Typst stderr:
175.23 s
>
175.23 s
>
175.23 s
> Location:
175.23 s
> crates/clinnet/src/lib.rs:741:13
175.23 s
> stack backtrace:
175.23 s
> 0: __rustc::rust_begin_unwind
175.23 s
> 1: core::panicking::panic_fmt
175.23 s
> 2: core::result::unwrap_failed
175.23 s
> 3: public_typst_behavior::render
175.23 s
> 4: <std::sync::once::Once>::call_once_force::<<std::sync::once_lock::OnceLock<alloc::string::String>>::initialize<<std::sync::once_lock::OnceLock<alloc::string::String>>::get_or_init<public_typst_behavior::linnest_public_svg::{closure#0}>::{closure#0}, !>::{closure#0}>::{closure#0}
175.23 s
> 5: <std::sys::sync::once::futex::Once>::call
175.24 s
> 6: <std::sync::once_lock::OnceLock<alloc::string::String>>::initialize::<<std::sync::once_lock::OnceLock<alloc::string::String>>::get_or_init<public_typst_behavior::linnest_public_svg::{closure#0}>::{closure#0}, !>
175.24 s
> 7: <public_typst_behavior::public_linnest_momentum_layers_place_shafts_and_labels::{closure#0} as core::ops::function::FnOnce<()>>::call_once
175.24 s
> note: Some details are omitted, run with `RUST_BACKTRACE=full` for a verbose backtrace.
175.24 s
>
175.24 s
> error : test run failed
175.24 s
>
175.24 s
> ========== nextest test summary ==========
175.24 s
> report: target/nextest/ci_gammaloop/junit.xml
175.24 s
> tests: 38, failures: 3, errors: 0
175.24 s
>
175.24 s
> 1. clinnet::public_typst_behavior::public_linnest_arrow_shafts_and_crossing_gaps
175.24 s
> failure: test failure with exit code 101
175.24 s
> thread 'public_linnest_arrow_shafts_and_crossing_gaps' (276) panicked at crates/clinnet/tests/public_typst_behavior.rs:81:55:
175.24 s
> called `Result::unwrap()` on an `Err` value: typst failed while compiling template /build/.tmpU5bWsT/.clinnet/templates/linnest-public-behavior.svg
175.24 s
>
175.24 s
> Command executed:
175.24 s
> "typst" "c" "/build/.tmpU5bWsT/.clinnet/templates/linnest-public-behavior.typ" "/build/.tmpU5bWsT/.clinnet/templates/linnest-public-behavior.svg" "--root" "/build/.tmpU5bWsT/.clinnet/templates"
175.24 s
>
175.24 s
> Typst stdout:
175.24 s
>
175.24 s
>
175.24 s
> Typst stderr:
175.24 s
>
175.24 s
>
175.24 s
> Location:
175.24 s
> crates/clinnet/src/lib.rs:741:13
175.24 s
> stack backtrace:
175.24 s
> 0: __rustc::rust_begin_unwind
175.24 s
> 1: core::panicking::panic_fmt
175.24 s
> 2: core::result::unwrap_failed
175.24 s
> 3: public_typst_behavior::render
175.24 s
> 4: <std::sync::once::Once>::call_once_force::<<std::sync::once_lock::OnceLock<alloc::string::String>>::initialize<<std::sync::once_lock::OnceLock<alloc::string::String>>::get_or_init<public_typst_behavior::linnest_public_svg::{closure#0}>::{closure#0}, !>::{closure#0}>::{closure#0}
175.24 s
> 5: <std::sys::sync::once::futex::Once>::call
175.24 s
> 6: <std::sync::once_lock::OnceLock<alloc::string::String>>::initialize::<<std::sync::once_lock::OnceLock<alloc::string::String>>::get_or_init<public_typst_behavior::linnest_public_svg::{closure#0}>::{closure#0}, !>
175.24 s
> 7: <public_typst_behavior::public_linnest_arrow_shafts_and_crossing_gaps::{closure#0} as core::ops::function::FnOnce<()>>::call_once
175.24 s
> note: Some details are omitted, run with `RUST_BACKTRACE=full` for a verbose backtrace.
175.24 s
> system-out
175.24 s
> running 1 test
175.24 s
> test public_linnest_arrow_shafts_and_crossing_gaps has been running for over 60 seconds
175.24 s
> test public_linnest_arrow_shafts_and_crossing_gaps ... FAILED
175.24 s
>
175.24 s
> failures:
175.24 s
>
175.24 s
> failures:
175.24 s
> public_linnest_arrow_shafts_and_crossing_gaps
175.24 s
>
175.24 s
> test result: FAILED. 0 passed; 1 failed; 0 ignored; 0 measured; 17 filtered out; finished in 86.32s
175.24 s
> system-err
175.24 s
> thread 'public_linnest_arrow_shafts_and_crossing_gaps' (276) panicked at crates/clinnet/tests/public_typst_behavior.rs:81:55:
175.24 s
> called `Result::unwrap()` on an `Err` value: typst failed while compiling template /build/.tmpU5bWsT/.clinnet/templates/linnest-public-behavior.svg
175.24 s
>
175.24 s
> Command executed:
175.24 s
> "typst" "c" "/build/.tmpU5bWsT/.clinnet/templates/linnest-public-behavior.typ" "/build/.tmpU5bWsT/.clinnet/templates/linnest-public-behavior.svg" "--root" "/build/.tmpU5bWsT/.clinnet/templates"
175.24 s
>
175.24 s
> Typst stdout:
175.24 s
>
175.24 s
>
175.24 s
> Typst stderr:
175.24 s
>
175.24 s
>
175.24 s
> Location:
175.24 s
> crates/clinnet/src/lib.rs:741:13
175.24 s
> stack backtrace:
175.24 s
> 0: __rustc::rust_begin_unwind
175.24 s
> 1: core::panicking::panic_fmt
175.24 s
> 2: core::result::unwrap_failed
175.24 s
> 3: public_typst_behavior::render
175.24 s
> 4: <std::sync::once::Once>::call_once_force::<<std::sync::once_lock::OnceLock<alloc::string::String>>::initialize<<std::sync::once_lock::OnceLock<alloc::string::String>>::get_or_init<public_typst_behavior::linnest_public_svg::{closure#0}>::{closure#0}, !>::{closure#0}>::{closure#0}
175.24 s
> 5: <std::sys::sync::once::futex::Once>::call
175.24 s
> 6: <std::sync::once_lock::OnceLock<alloc::string::String>>::initialize::<<std::sync::once_lock::OnceLock<alloc::string::String>>::get_or_init<public_typst_behavior::linnest_public_svg::{closure#0}>::{closure#0}, !>
175.24 s
> 7: <public_typst_behavior::public_linnest_arrow_shafts_and_crossing_gaps::{closure#0} as core::ops::function::FnOnce<()>>::call_once
175.24 s
> note: Some details are omitted, run with `RUST_BACKTRACE=full` for a verbose backtrace.
175.24 s
>
175.24 s
> 2. clinnet::public_typst_behavior::public_linnest_overlays_follow_the_unit
175.24 s
> failure: test failure with exit code 101
175.24 s
> thread 'public_linnest_overlays_follow_the_unit' (318) panicked at crates/clinnet/tests/public_typst_behavior.rs:81:55:
175.24 s
> called `Result::unwrap()` on an `Err` value: typst failed while compiling template /build/.tmp12sroF/.clinnet/templates/linnest-public-behavior.svg
175.24 s
>
175.24 s
> Command executed:
175.24 s
> "typst" "c" "/build/.tmp12sroF/.clinnet/templates/linnest-public-behavior.typ" "/build/.tmp12sroF/.clinnet/templates/linnest-public-behavior.svg" "--root" "/build/.tmp12sroF/.clinnet/templates"
175.24 s
>
175.24 s
> Typst stdout:
175.24 s
>
175.24 s
>
175.24 s
> Typst stderr:
175.24 s
>
175.24 s
>
175.24 s
> Location:
175.24 s
> crates/clinnet/src/lib.rs:741:13
175.24 s
> stack backtrace:
175.24 s
> 0: __rustc::rust_begin_unwind
175.24 s
> 1: core::panicking::panic_fmt
175.24 s
> 2: core::result::unwrap_failed
175.24 s
> 3: public_typst_behavior::render
175.24 s
> 4: <std::sync::once::Once>::call_once_force::<<std::sync::once_lock::OnceLock<alloc::string::String>>::initialize<<std::sync::once_lock::OnceLock<alloc::string::String>>::get_or_init<public_typst_behavior::linnest_public_svg::{closure#0}>::{closure#0}, !>::{closure#0}>::{closure#0}
175.24 s
> 5: <std::sys::sync::once::futex::Once>::call
175.24 s
> 6: <std::sync::once_lock::OnceLock<alloc::string::String>>::initialize::<<std::sync::once_lock::OnceLock<alloc::string::String>>::get_or_init<public_typst_behavior::linnest_public_svg::{closure#0}>::{closure#0}, !>
175.24 s
> 7: <public_typst_behavior::public_linnest_overlays_follow_the_unit::{closure#0} as core::ops::function::FnOnce<()>>::call_once
175.24 s
> note: Some details are omitted, run with `RUST_BACKTRACE=full` for a verbose backtrace.
175.24 s
> system-out
175.24 s
> running 1 test
175.24 s
> test public_linnest_overlays_follow_the_unit has been running for over 60 seconds
175.24 s
> test public_linnest_overlays_follow_the_unit ... FAILED
175.24 s
>
175.24 s
> failures:
175.24 s
>
175.24 s
> failures:
175.24 s
> public_linnest_overlays_follow_the_unit
175.24 s
>
175.24 s
> test result: FAILED. 0 passed; 1 failed; 0 ignored; 0 measured; 17 filtered out; finished in 92.88s
175.24 s
> system-err
175.24 s
> thread 'public_linnest_overlays_follow_the_unit' (318) panicked at crates/clinnet/tests/public_typst_behavior.rs:81:55:
175.24 s
> called `Result::unwrap()` on an `Err` value: typst failed while compiling template /build/.tmp12sroF/.clinnet/templates/linnest-public-behavior.svg
175.24 s
>
175.24 s
> Command executed:
175.24 s
> "typst" "c" "/build/.tmp12sroF/.clinnet/templates/linnest-public-behavior.typ" "/build/.tmp12sroF/.clinnet/templates/linnest-public-behavior.svg" "--root" "/build/.tmp12sroF/.clinnet/templates"
175.24 s
>
175.24 s
> Typst stdout:
175.24 s
>
175.24 s
>
175.24 s
> Typst stderr:
175.24 s
>
175.24 s
>
175.24 s
> Location:
175.24 s
> crates/clinnet/src/lib.rs:741:13
175.24 s
> stack backtrace:
175.24 s
> 0: __rustc::rust_begin_unwind
175.24 s
> 1: core::panicking::panic_fmt
175.24 s
> 2: core::result::unwrap_failed
175.24 s
> 3: public_typst_behavior::render
175.24 s
> 4: <std::sync::once::Once>::call_once_force::<<std::sync::once_lock::OnceLock<alloc::string::String>>::initialize<<std::sync::once_lock::OnceLock<alloc::string::String>>::get_or_init<public_typst_behavior::linnest_public_svg::{closure#0}>::{closure#0}, !>::{closure#0}>::{closure#0}
175.24 s
> 5: <std::sys::sync::once::futex::Once>::call
175.24 s
> 6: <std::sync::once_lock::OnceLock<alloc::string::String>>::initialize::<<std::sync::once_lock::OnceLock<alloc::string::String>>::get_or_init<public_typst_behavior::linnest_public_svg::{closure#0}>::{closure#0}, !>
175.24 s
> 7: <public_typst_behavior::public_linnest_overlays_follow_the_unit::{closure#0} as core::ops::function::FnOnce<()>>::call_once
175.24 s
> note: Some details are omitted, run with `RUST_BACKTRACE=full` for a verbose backtrace.
175.24 s
>
175.24 s
> 3. clinnet::public_typst_behavior::public_linnest_momentum_layers_place_shafts_and_labels
175.24 s
> failure: test failure with exit code 101
175.24 s
> thread 'public_linnest_momentum_layers_place_shafts_and_labels' (293) panicked at crates/clinnet/tests/public_typst_behavior.rs:81:55:
175.24 s
> called `Result::unwrap()` on an `Err` value: typst failed while compiling template /build/.tmpzWz429/.clinnet/templates/linnest-public-behavior.svg
175.24 s
>
175.24 s
> Command executed:
175.24 s
> "typst" "c" "/build/.tmpzWz429/.clinnet/templates/linnest-public-behavior.typ" "/build/.tmpzWz429/.clinnet/templates/linnest-public-behavior.svg" "--root" "/build/.tmpzWz429/.clinnet/templates"
175.24 s
>
175.24 s
> Typst stdout:
175.24 s
>
175.24 s
>
175.24 s
> Typst stderr:
175.24 s
>
175.24 s
>
175.24 s
> Location:
175.24 s
> crates/clinnet/src/lib.rs:741:13
175.24 s
> stack backtrace:
175.24 s
> 0: __rustc::rust_begin_unwind
175.24 s
> 1: core::panicking::panic_fmt
175.24 s
> 2: core::result::unwrap_failed
175.24 s
> 3: public_typst_behavior::render
175.24 s
> 4: <std::sync::once::Once>::call_once_force::<<std::sync::once_lock::OnceLock<alloc::string::String>>::initialize<<std::sync::once_lock::OnceLock<alloc::string::String>>::get_or_init<public_typst_behavior::linnest_public_svg::{closure#0}>::{closure#0}, !>::{closure#0}>::{closure#0}
175.24 s
> 5: <std::sys::sync::once::futex::Once>::call
175.24 s
> 6: <std::sync::once_lock::OnceLock<alloc::string::String>>::initialize::<<std::sync::once_lock::OnceLock<alloc::string::String>>::get_or_init<public_typst_behavior::linnest_public_svg::{closure#0}>::{closure#0}, !>
175.24 s
> 7: <public_typst_behavior::public_linnest_momentum_layers_place_shafts_and_labels::{closure#0} as core::ops::function::FnOnce<()>>::call_once
175.24 s
> note: Some details are omitted, run with `RUST_BACKTRACE=full` for a verbose backtrace.
175.24 s
> system-out
175.24 s
> running 1 test
175.24 s
> test public_linnest_momentum_layers_place_shafts_and_labels has been running for over 60 seconds
175.24 s
> test public_linnest_momentum_layers_place_shafts_and_labels ... FAILED
175.24 s
>
175.24 s
> failures:
175.24 s
>
175.24 s
> failures:
175.24 s
> public_linnest_momentum_layers_place_shafts_and_labels
175.24 s
>
175.24 s
> test result: FAILED. 0 passed; 1 failed; 0 ignored; 0 measured; 17 filtered out; finished in 127.94s
175.24 s
> system-err
175.24 s
> thread 'public_linnest_momentum_layers_place_shafts_and_labels' (293) panicked at crates/clinnet/tests/public_typst_behavior.rs:81:55:
175.24 s
> called `Result::unwrap()` on an `Err` value: typst failed while compiling template /build/.tmpzWz429/.clinnet/templates/linnest-public-behavior.svg
175.24 s
>
175.24 s
> Command executed:
175.24 s
> "typst" "c" "/build/.tmpzWz429/.clinnet/templates/linnest-public-behavior.typ" "/build/.tmpzWz429/.clinnet/templates/linnest-public-behavior.svg" "--root" "/build/.tmpzWz429/.clinnet/templates"
175.24 s
>
175.24 s
> Typst stdout:
175.24 s
>
175.24 s
>
175.24 s
> Typst stderr:
175.24 s
>
175.24 s
>
175.24 s
> Location:
175.24 s
> crates/clinnet/src/lib.rs:741:13
175.24 s
> stack backtrace:
175.24 s
> 0: __rustc::rust_begin_unwind
175.24 s
> 1: core::panicking::panic_fmt
175.24 s
> 2: core::result::unwrap_failed
175.24 s
> 3: public_typst_behavior::render
175.24 s
> 4: <std::sync::once::Once>::call_once_force::<<std::sync::once_lock::OnceLock<alloc::string::String>>::initialize<<std::sync::once_lock::OnceLock<alloc::string::String>>::get_or_init<public_typst_behavior::linnest_public_svg::{closure#0}>::{closure#0}, !>::{closure#0}>::{closure#0}
175.24 s
> 5: <std::sys::sync::once::futex::Once>::call
175.24 s
> 6: <std::sync::once_lock::OnceLock<alloc::string::String>>::initialize::<<std::sync::once_lock::OnceLock<alloc::string::String>>::get_or_init<public_typst_behavior::linnest_public_svg::{closure#0}>::{closure#0}, !>
175.24 s
> 7: <public_typst_behavior::public_linnest_momentum_layers_place_shafts_and_labels::{closure#0} as core::ops::function::FnOnce<()>>::call_once
175.24 s
> note: Some details are omitted, run with `RUST_BACKTRACE=full` for a verbose backtrace.
175.24 s
> =========================================
175.24 s
For full logs, run:
175.24 s
nix log /nix/store/4pqspwvh8pi9s2vg9g6mfsggpl9ynwzx-gammaloop-nextest-clinnet.drv
175.57 s
Run failed.