0.01 s
$ /nix/store/bhv6xyvqw6gjs3j488gi1z6wdv18bdpa-coreutils-9.11/bin/timeout --kill-after=15s 7200s /nix/store/bxgja2ppiqi6w2bgn0r07d7mgnl1k6k2-nix-2.34.8/bin/nix --extra-experimental-features nix-command --extra-experimental-features flakes flake clone git+https://github.com/alphal00p/gammaloop --dest /tmp/nix-ci-worker/stable-pwd/repo/
0.15 s
Cloning into '/tmp/nix-ci-worker/stable-pwd/repo'...
1.03 s
remote: Enumerating objects: 162134, done.
1.15 s
remote: Counting objects: 0% (1/16812)
remote: Counting objects: 1% (169/16812)
remote: Counting objects: 2% (337/16812)
remote: Counting objects: 3% (505/16812)
remote: Counting objects: 4% (673/16812)
remote: Counting objects: 5% (841/16812)
remote: Counting objects: 6% (1009/16812)
remote: Counting objects: 7% (1177/16812)
remote: Counting objects: 8% (1345/16812)
remote: Counting objects: 9% (1514/16812)
remote: Counting objects: 10% (1682/16812)
remote: Counting objects: 11% (1850/16812)
remote: Counting objects: 12% (2018/16812)
remote: Counting objects: 13% (2186/16812)
remote: Counting objects: 14% (2354/16812)
remote: Counting objects: 15% (2522/16812)
remote: Counting objects: 16% (2690/16812)
remote: Counting objects: 17% (2859/16812)
remote: Counting objects: 18% (3027/16812)
remote: Counting objects: 19% (3195/16812)
remote: Counting objects: 20% (3363/16812)
remote: Counting objects: 21% (3531/16812)
remote: Counting objects: 22% (3699/16812)
remote: Counting objects: 23% (3867/16812)
remote: Counting objects: 24% (4035/16812)
remote: Counting objects: 25% (4203/16812)
remote: Counting objects: 26% (4372/16812)
remote: Counting objects: 27% (4540/16812)
remote: Counting objects: 28% (4708/16812)
remote: Counting objects: 29% (4876/16812)
remote: Counting objects: 30% (5044/16812)
remote: Counting objects: 31% (5212/16812)
remote: Counting objects: 32% (5380/16812)
remote: Counting objects: 33% (5548/16812)
remote: Counting objects: 34% (5717/16812)
remote: Counting objects: 35% (5885/16812)
remote: Counting objects: 36% (6053/16812)
remote: Counting objects: 37% (6221/16812)
remote: Counting objects: 38% (6389/16812)
remote: Counting objects: 39% (6557/16812)
remote: Counting objects: 40% (6725/16812)
remote: Counting objects: 41% (6893/16812)
remote: Counting objects: 42% (7062/16812)
remote: Counting objects: 43% (7230/16812)
remote: Counting objects: 44% (7398/16812)
remote: Counting objects: 45% (7566/16812)
remote: Counting objects: 46% (7734/16812)
remote: Counting objects: 47% (7902/16812)
remote: Counting objects: 48% (8070/16812)
remote: Counting objects: 49% (8238/16812)
remote: Counting objects: 50% (8406/16812)
remote: Counting objects: 51% (8575/16812)
remote: Counting objects: 52% (8743/16812)
remote: Counting objects: 53% (8911/16812)
remote: Counting objects: 54% (9079/16812)
remote: Counting objects: 55% (9247/16812)
remote: Counting objects: 56% (9415/16812)
remote: Counting objects: 57% (9583/16812)
remote: Counting objects: 58% (9751/16812)
remote: Counting objects: 59% (9920/16812)
remote: Counting objects: 60% (10088/16812)
remote: Counting objects: 61% (10256/16812)
remote: Counting objects: 62% (10424/16812)
remote: Counting objects: 63% (10592/16812)
remote: Counting objects: 64% (10760/16812)
remote: Counting objects: 65% (10928/16812)
remote: Counting objects: 66% (11096/16812)
remote: Counting objects: 67% (11265/16812)
remote: Counting objects: 68% (11433/16812)
remote: Counting objects: 69% (11601/16812)
remote: Counting objects: 70% (11769/16812)
remote: Counting objects: 71% (11937/16812)
remote: Counting objects: 72% (12105/16812)
remote: Counting objects: 73% (12273/16812)
remote: Counting objects: 74% (12441/16812)
remote: Counting objects: 75% (12609/16812)
remote: Counting objects: 76% (12778/16812)
remote: Counting objects: 77% (12946/16812)
remote: Counting objects: 78% (13114/16812)
remote: Counting objects: 79% (13282/16812)
remote: Counting objects: 80% (13450/16812)
remote: Counting objects: 81% (13618/16812)
remote: Counting objects: 82% (13786/16812)
remote: Counting objects: 83% (13954/16812)
remote: Counting objects: 84% (14123/16812)
remote: Counting objects: 85% (14291/16812)
remote: Counting objects: 86% (14459/16812)
remote: Counting objects: 87% (14627/16812)
remote: Counting objects: 88% (14795/16812)
remote: Counting objects: 89% (14963/16812)
remote: Counting objects: 90% (15131/16812)
remote: Counting objects: 91% (15299/16812)
remote: Counting objects: 92% (15468/16812)
remote: Counting objects: 93% (15636/16812)
remote: Counting objects: 94% (15804/16812)
remote: Counting objects: 95% (15972/16812)
remote: Counting objects: 96% (16140/16812)
remote: Counting objects: 97% (16308/16812)
remote: Counting objects: 98% (16476/16812)
remote: Counting objects: 99% (16644/16812)
remote: Counting objects: 100% (16812/16812)
remote: Counting objects: 100% (16812/16812), done.
6.99 s
remote: Compressing objects: 0% (1/3844)
remote: Compressing objects: 1% (39/3844)
remote: Compressing objects: 2% (77/3844)
remote: Compressing objects: 3% (116/3844)
remote: Compressing objects: 4% (154/3844)
remote: Compressing objects: 5% (193/3844)
remote: Compressing objects: 6% (231/3844)
remote: Compressing objects: 7% (270/3844)
remote: Compressing objects: 8% (308/3844)
remote: Compressing objects: 9% (346/3844)
remote: Compressing objects: 10% (385/3844)
remote: Compressing objects: 11% (423/3844)
remote: Compressing objects: 11% (454/3844)
remote: Compressing objects: 12% (462/3844)
remote: Compressing objects: 13% (500/3844)
remote: Compressing objects: 13% (536/3844)
remote: Compressing objects: 14% (539/3844)
remote: Compressing objects: 15% (577/3844)
remote: Compressing objects: 16% (616/3844)
remote: Compressing objects: 16% (619/3844)
remote: Compressing objects: 17% (654/3844)
remote: Compressing objects: 18% (692/3844)
remote: Compressing objects: 19% (731/3844)
remote: Compressing objects: 19% (757/3844)
remote: Compressing objects: 20% (769/3844)
remote: Compressing objects: 21% (808/3844)
remote: Compressing objects: 22% (846/3844)
remote: Compressing objects: 23% (885/3844)
remote: Compressing objects: 24% (923/3844)
remote: Compressing objects: 24% (960/3844)
remote: Compressing objects: 25% (961/3844)
remote: Compressing objects: 26% (1000/3844)
remote: Compressing objects: 27% (1038/3844)
remote: Compressing objects: 28% (1077/3844)
remote: Compressing objects: 29% (1115/3844)
remote: Compressing objects: 30% (1154/3844)
remote: Compressing objects: 31% (1192/3844)
remote: Compressing objects: 32% (1231/3844)
remote: Compressing objects: 33% (1269/3844)
remote: Compressing objects: 34% (1307/3844)
remote: Compressing objects: 35% (1346/3844)
remote: Compressing objects: 36% (1384/3844)
remote: Compressing objects: 37% (1423/3844)
remote: Compressing objects: 38% (1461/3844)
remote: Compressing objects: 39% (1500/3844)
remote: Compressing objects: 40% (1538/3844)
remote: Compressing objects: 41% (1577/3844)
remote: Compressing objects: 42% (1615/3844)
remote: Compressing objects: 43% (1653/3844)
remote: Compressing objects: 44% (1692/3844)
remote: Compressing objects: 45% (1730/3844)
remote: Compressing objects: 46% (1769/3844)
remote: Compressing objects: 47% (1807/3844)
remote: Compressing objects: 48% (1846/3844)
remote: Compressing objects: 49% (1884/3844)
remote: Compressing objects: 50% (1922/3844)
remote: Compressing objects: 51% (1961/3844)
remote: Compressing objects: 52% (1999/3844)
remote: Compressing objects: 53% (2038/3844)
remote: Compressing objects: 54% (2076/3844)
remote: Compressing objects: 55% (2115/3844)
remote: Compressing objects: 56% (2153/3844)
remote: Compressing objects: 57% (2192/3844)
remote: Compressing objects: 58% (2230/3844)
remote: Compressing objects: 59% (2268/3844)
remote: Compressing objects: 60% (2307/3844)
remote: Compressing objects: 61% (2345/3844)
remote: Compressing objects: 62% (2384/3844)
remote: Compressing objects: 63% (2422/3844)
remote: Compressing objects: 64% (2461/3844)
remote: Compressing objects: 65% (2499/3844)
remote: Compressing objects: 66% (2538/3844)
remote: Compressing objects: 67% (2576/3844)
remote: Compressing objects: 68% (2614/3844)
remote: Compressing objects: 69% (2653/3844)
remote: Compressing objects: 70% (2691/3844)
remote: Compressing objects: 71% (2730/3844)
remote: Compressing objects: 72% (2768/3844)
remote: Compressing objects: 73% (2807/3844)
remote: Compressing objects: 74% (2845/3844)
remote: Compressing objects: 75% (2883/3844)
remote: Compressing objects: 76% (2922/3844)
remote: Compressing objects: 77% (2960/3844)
remote: Compressing objects: 78% (2999/3844)
remote: Compressing objects: 79% (3037/3844)
remote: Compressing objects: 80% (3076/3844)
remote: Compressing objects: 81% (3114/3844)
remote: Compressing objects: 82% (3153/3844)
remote: Compressing objects: 83% (3191/3844)
remote: Compressing objects: 84% (3229/3844)
remote: Compressing objects: 85% (3268/3844)
remote: Compressing objects: 86% (3306/3844)
remote: Compressing objects: 87% (3345/3844)
remote: Compressing objects: 88% (3383/3844)
remote: Compressing objects: 89% (3422/3844)
remote: Compressing objects: 90% (3460/3844)
remote: Compressing objects: 91% (3499/3844)
remote: Compressing objects: 92% (3537/3844)
remote: Compressing objects: 93% (3575/3844)
remote: Compressing objects: 94% (3614/3844)
remote: Compressing objects: 95% (3652/3844)
remote: Compressing objects: 96% (3691/3844)
remote: Compressing objects: 97% (3729/3844)
remote: Compressing objects: 98% (3768/3844)
remote: Compressing objects: 99% (3806/3844)
remote: Compressing objects: 100% (3844/3844)
remote: Compressing objects: 100% (3844/3844), done.
22.26 s
Receiving objects: 0% (1/162134)
Receiving objects: 1% (1622/162134)
Receiving objects: 2% (3243/162134)
Receiving objects: 3% (4865/162134), 16.40 MiB | 31.86 MiB/s
Receiving objects: 4% (6486/162134), 16.40 MiB | 31.86 MiB/s
Receiving objects: 4% (7501/162134), 16.40 MiB | 31.86 MiB/s
Receiving objects: 5% (8107/162134), 16.40 MiB | 31.86 MiB/s
Receiving objects: 6% (9729/162134), 33.30 MiB | 32.81 MiB/s
Receiving objects: 7% (11350/162134), 48.95 MiB | 32.31 MiB/s
Receiving objects: 7% (11770/162134), 48.95 MiB | 32.31 MiB/s
Receiving objects: 8% (12971/162134), 65.17 MiB | 32.25 MiB/s
Receiving objects: 9% (14593/162134), 65.17 MiB | 32.25 MiB/s
Receiving objects: 10% (16214/162134), 65.17 MiB | 32.25 MiB/s
Receiving objects: 11% (17835/162134), 65.17 MiB | 32.25 MiB/s
Receiving objects: 12% (19457/162134), 65.17 MiB | 32.25 MiB/s
Receiving objects: 13% (21078/162134), 77.96 MiB | 30.93 MiB/s
Receiving objects: 14% (22699/162134), 77.96 MiB | 30.93 MiB/s
Receiving objects: 15% (24321/162134), 77.96 MiB | 30.93 MiB/s
Receiving objects: 16% (25942/162134), 77.96 MiB | 30.93 MiB/s
Receiving objects: 17% (27563/162134), 77.96 MiB | 30.93 MiB/s
Receiving objects: 18% (29185/162134), 77.96 MiB | 30.93 MiB/s
Receiving objects: 19% (30806/162134), 77.96 MiB | 30.93 MiB/s
Receiving objects: 20% (32427/162134), 77.96 MiB | 30.93 MiB/s
Receiving objects: 21% (34049/162134), 77.96 MiB | 30.93 MiB/s
Receiving objects: 22% (35670/162134), 77.96 MiB | 30.93 MiB/s
Receiving objects: 23% (37291/162134), 77.96 MiB | 30.93 MiB/s
Receiving objects: 24% (38913/162134), 77.96 MiB | 30.93 MiB/s
Receiving objects: 25% (40534/162134), 77.96 MiB | 30.93 MiB/s
Receiving objects: 26% (42155/162134), 77.96 MiB | 30.93 MiB/s
Receiving objects: 27% (43777/162134), 77.96 MiB | 30.93 MiB/s
Receiving objects: 28% (45398/162134), 77.96 MiB | 30.93 MiB/s
Receiving objects: 28% (45517/162134), 77.96 MiB | 30.93 MiB/s
Receiving objects: 29% (47019/162134), 99.52 MiB | 32.95 MiB/s
Receiving objects: 30% (48641/162134), 99.52 MiB | 32.95 MiB/s
Receiving objects: 31% (50262/162134), 99.52 MiB | 32.95 MiB/s
Receiving objects: 32% (51883/162134), 99.52 MiB | 32.95 MiB/s
Receiving objects: 33% (53505/162134), 99.52 MiB | 32.95 MiB/s
Receiving objects: 34% (55126/162134), 99.52 MiB | 32.95 MiB/s
Receiving objects: 35% (56747/162134), 115.96 MiB | 32.86 MiB/s
Receiving objects: 36% (58369/162134), 115.96 MiB | 32.86 MiB/s
Receiving objects: 37% (59990/162134), 115.96 MiB | 32.86 MiB/s
Receiving objects: 37% (60791/162134), 115.96 MiB | 32.86 MiB/s
Receiving objects: 38% (61611/162134), 133.69 MiB | 33.19 MiB/s
Receiving objects: 39% (63233/162134), 133.69 MiB | 33.19 MiB/s
Receiving objects: 40% (64854/162134), 133.69 MiB | 33.19 MiB/s
Receiving objects: 41% (66475/162134), 133.69 MiB | 33.19 MiB/s
Receiving objects: 42% (68097/162134), 133.69 MiB | 33.19 MiB/s
Receiving objects: 42% (69687/162134), 150.64 MiB | 33.17 MiB/s
Receiving objects: 43% (69718/162134), 150.64 MiB | 33.17 MiB/s
Receiving objects: 44% (71339/162134), 167.64 MiB | 33.42 MiB/s
Receiving objects: 45% (72961/162134), 167.64 MiB | 33.42 MiB/s
Receiving objects: 46% (74582/162134), 167.64 MiB | 33.42 MiB/s
Receiving objects: 47% (76203/162134), 167.64 MiB | 33.42 MiB/s
Receiving objects: 48% (77825/162134), 167.64 MiB | 33.42 MiB/s
Receiving objects: 49% (79446/162134), 184.84 MiB | 33.38 MiB/s
Receiving objects: 50% (81067/162134), 184.84 MiB | 33.38 MiB/s
Receiving objects: 51% (82689/162134), 184.84 MiB | 33.38 MiB/s
Receiving objects: 52% (84310/162134), 184.84 MiB | 33.38 MiB/s
Receiving objects: 53% (85932/162134), 184.84 MiB | 33.38 MiB/s
Receiving objects: 53% (86184/162134), 184.84 MiB | 33.38 MiB/s
Receiving objects: 54% (87553/162134), 202.52 MiB | 33.82 MiB/s
Receiving objects: 55% (89174/162134), 202.52 MiB | 33.82 MiB/s
Receiving objects: 55% (89800/162134), 219.20 MiB | 33.97 MiB/s
Receiving objects: 56% (90796/162134), 253.53 MiB | 33.93 MiB/s
Receiving objects: 57% (92417/162134), 253.53 MiB | 33.93 MiB/s
Receiving objects: 57% (92885/162134), 253.53 MiB | 33.93 MiB/s
Receiving objects: 58% (94038/162134), 268.55 MiB | 33.27 MiB/s
Receiving objects: 59% (95660/162134), 268.55 MiB | 33.27 MiB/s
Receiving objects: 60% (97281/162134), 284.18 MiB | 32.81 MiB/s
Receiving objects: 61% (98902/162134), 284.18 MiB | 32.81 MiB/s
Receiving objects: 61% (99099/162134), 284.18 MiB | 32.81 MiB/s
Receiving objects: 62% (100524/162134), 300.33 MiB | 32.43 MiB/s
Receiving objects: 63% (102145/162134), 300.33 MiB | 32.43 MiB/s
Receiving objects: 64% (103766/162134), 318.59 MiB | 32.70 MiB/s
Receiving objects: 65% (105388/162134), 318.59 MiB | 32.70 MiB/s
Receiving objects: 66% (107009/162134), 318.59 MiB | 32.70 MiB/s
Receiving objects: 66% (107086/162134), 318.59 MiB | 32.70 MiB/s
Receiving objects: 67% (108630/162134), 318.59 MiB | 32.70 MiB/s
Receiving objects: 68% (110252/162134), 318.59 MiB | 32.70 MiB/s
Receiving objects: 69% (111873/162134), 318.59 MiB | 32.70 MiB/s
Receiving objects: 70% (113494/162134), 318.59 MiB | 32.70 MiB/s
Receiving objects: 71% (115116/162134), 318.59 MiB | 32.70 MiB/s
Receiving objects: 72% (116737/162134), 318.59 MiB | 32.70 MiB/s
Receiving objects: 73% (118358/162134), 335.43 MiB | 32.43 MiB/s
Receiving objects: 74% (119980/162134), 335.43 MiB | 32.43 MiB/s
Receiving objects: 75% (121601/162134), 335.43 MiB | 32.43 MiB/s
Receiving objects: 76% (123222/162134), 354.07 MiB | 32.64 MiB/s
Receiving objects: 77% (124844/162134), 354.07 MiB | 32.64 MiB/s
Receiving objects: 77% (125548/162134), 354.07 MiB | 32.64 MiB/s
Receiving objects: 78% (126465/162134), 354.07 MiB | 32.64 MiB/s
Receiving objects: 79% (128086/162134), 370.29 MiB | 32.24 MiB/s
Receiving objects: 80% (129708/162134), 370.29 MiB | 32.24 MiB/s
Receiving objects: 81% (131329/162134), 370.29 MiB | 32.24 MiB/s
Receiving objects: 81% (131980/162134), 389.10 MiB | 32.75 MiB/s
Receiving objects: 82% (132950/162134), 405.50 MiB | 32.17 MiB/s
Receiving objects: 83% (134572/162134), 405.50 MiB | 32.17 MiB/s
Receiving objects: 83% (135976/162134), 424.20 MiB | 33.33 MiB/s
Receiving objects: 84% (136193/162134), 424.20 MiB | 33.33 MiB/s
Receiving objects: 85% (137814/162134), 424.20 MiB | 33.33 MiB/s
Receiving objects: 86% (139436/162134), 437.33 MiB | 32.77 MiB/s
Receiving objects: 86% (140280/162134), 453.97 MiB | 33.18 MiB/s
Receiving objects: 87% (141057/162134), 453.97 MiB | 33.18 MiB/s
Receiving objects: 88% (142678/162134), 471.56 MiB | 33.03 MiB/s
Receiving objects: 89% (144300/162134), 471.56 MiB | 33.03 MiB/s
Receiving objects: 90% (145921/162134), 471.56 MiB | 33.03 MiB/s
Receiving objects: 91% (147542/162134), 471.56 MiB | 33.03 MiB/s
Receiving objects: 92% (149164/162134), 471.56 MiB | 33.03 MiB/s
Receiving objects: 93% (150785/162134), 471.56 MiB | 33.03 MiB/s
Receiving objects: 94% (152406/162134), 471.56 MiB | 33.03 MiB/s
Receiving objects: 95% (154028/162134), 471.56 MiB | 33.03 MiB/s
Receiving objects: 96% (155649/162134), 471.56 MiB | 33.03 MiB/s
Receiving objects: 97% (157270/162134), 471.56 MiB | 33.03 MiB/s
Receiving objects: 98% (158892/162134), 471.56 MiB | 33.03 MiB/s
Receiving objects: 98% (160475/162134), 489.97 MiB | 33.68 MiB/s
Receiving objects: 99% (160513/162134), 489.97 MiB | 33.68 MiB/s
remote: Total 162134 (delta 14203), reused 13455 (delta 12950), pack-reused 145322 (from 3)
22.26 s
Receiving objects: 100% (162134/162134), 489.97 MiB | 33.68 MiB/s
Receiving objects: 100% (162134/162134), 500.72 MiB | 32.80 MiB/s, done.
24.34 s
Resolving deltas: 0% (0/105841)
Resolving deltas: 1% (1059/105841)
Resolving deltas: 2% (2117/105841)
Resolving deltas: 3% (3176/105841)
Resolving deltas: 4% (4234/105841)
Resolving deltas: 5% (5293/105841)
Resolving deltas: 6% (6351/105841)
Resolving deltas: 7% (7409/105841)
Resolving deltas: 8% (8468/105841)
Resolving deltas: 9% (9526/105841)
Resolving deltas: 10% (10585/105841)
Resolving deltas: 11% (11643/105841)
Resolving deltas: 12% (12702/105841)
Resolving deltas: 13% (13762/105841)
Resolving deltas: 14% (14820/105841)
Resolving deltas: 15% (15877/105841)
Resolving deltas: 16% (16935/105841)
Resolving deltas: 17% (17993/105841)
Resolving deltas: 18% (19052/105841)
Resolving deltas: 19% (20110/105841)
Resolving deltas: 20% (21169/105841)
Resolving deltas: 21% (22227/105841)
Resolving deltas: 22% (23286/105841)
Resolving deltas: 23% (24344/105841)
Resolving deltas: 24% (25402/105841)
Resolving deltas: 25% (26461/105841)
Resolving deltas: 26% (27519/105841)
Resolving deltas: 27% (28578/105841)
Resolving deltas: 28% (29636/105841)
Resolving deltas: 29% (30696/105841)
Resolving deltas: 30% (31753/105841)
Resolving deltas: 31% (32811/105841)
Resolving deltas: 32% (33870/105841)
Resolving deltas: 33% (34928/105841)
Resolving deltas: 34% (35986/105841)
Resolving deltas: 35% (37045/105841)
Resolving deltas: 36% (38104/105841)
Resolving deltas: 37% (39162/105841)
Resolving deltas: 38% (40221/105841)
Resolving deltas: 39% (41279/105841)
Resolving deltas: 40% (42337/105841)
Resolving deltas: 41% (43395/105841)
Resolving deltas: 42% (44454/105841)
Resolving deltas: 43% (45512/105841)
Resolving deltas: 44% (46572/105841)
Resolving deltas: 45% (47630/105841)
Resolving deltas: 46% (48688/105841)
Resolving deltas: 47% (49746/105841)
Resolving deltas: 48% (50804/105841)
Resolving deltas: 49% (51864/105841)
Resolving deltas: 50% (52921/105841)
Resolving deltas: 51% (53979/105841)
Resolving deltas: 52% (55038/105841)
Resolving deltas: 53% (56096/105841)
Resolving deltas: 53% (56531/105841)
Resolving deltas: 54% (57155/105841)
Resolving deltas: 55% (58213/105841)
Resolving deltas: 56% (59271/105841)
Resolving deltas: 57% (60330/105841)
Resolving deltas: 58% (61388/105841)
Resolving deltas: 59% (62447/105841)
Resolving deltas: 60% (63505/105841)
Resolving deltas: 61% (64564/105841)
Resolving deltas: 62% (65622/105841)
Resolving deltas: 63% (66680/105841)
Resolving deltas: 64% (67739/105841)
Resolving deltas: 65% (68797/105841)
Resolving deltas: 66% (69856/105841)
Resolving deltas: 67% (70915/105841)
Resolving deltas: 68% (71973/105841)
Resolving deltas: 69% (73031/105841)
Resolving deltas: 70% (74089/105841)
Resolving deltas: 71% (75148/105841)
Resolving deltas: 72% (76206/105841)
Resolving deltas: 73% (77264/105841)
Resolving deltas: 74% (78323/105841)
Resolving deltas: 75% (79381/105841)
Resolving deltas: 76% (80441/105841)
Resolving deltas: 77% (81498/105841)
Resolving deltas: 78% (82556/105841)
Resolving deltas: 79% (83615/105841)
Resolving deltas: 80% (84673/105841)
Resolving deltas: 81% (85732/105841)
Resolving deltas: 82% (86791/105841)
Resolving deltas: 83% (87849/105841)
Resolving deltas: 84% (88907/105841)
Resolving deltas: 85% (89965/105841)
Resolving deltas: 86% (91024/105841)
Resolving deltas: 87% (92082/105841)
Resolving deltas: 88% (93141/105841)
Resolving deltas: 89% (94199/105841)
Resolving deltas: 90% (95257/105841)
Resolving deltas: 91% (96316/105841)
Resolving deltas: 92% (97374/105841)
Resolving deltas: 93% (98433/105841)
Resolving deltas: 94% (99491/105841)
Resolving deltas: 95% (100549/105841)
Resolving deltas: 96% (101608/105841)
Resolving deltas: 97% (102667/105841)
Resolving deltas: 98% (103726/105841)
Resolving deltas: 98% (104264/105841)
Resolving deltas: 99% (104783/105841)
Resolving deltas: 100% (105841/105841)
Resolving deltas: 100% (105841/105841), done.
25.01 s
Fetching commit 30fb0f28cd3eff2e7ac9987fc78de90b6578e688 for idenso-sum-partner-contraction ...
25.01 s
$ /nix/store/b1wn5clix1mz4vpfih7x9cnj9qfh7c6h-git-2.54.0/bin/git fetch origin 30fb0f28cd3eff2e7ac9987fc78de90b6578e688
25.48 s
From https://github.com/alphal00p/gammaloop
25.48 s
* branch 30fb0f28cd3eff2e7ac9987fc78de90b6578e688 -> FETCH_HEAD
25.49 s
$ /nix/store/bhv6xyvqw6gjs3j488gi1z6wdv18bdpa-coreutils-9.11/bin/timeout --kill-after=15s 7200s /nix/store/b1wn5clix1mz4vpfih7x9cnj9qfh7c6h-git-2.54.0/bin/git -c advice.detachedHead=false checkout 30fb0f28cd3eff2e7ac9987fc78de90b6578e688
25.92 s
HEAD is now at 30fb0f28c nix-ci: enable NixCI for final review
25.93 s
$ /nix/store/bhv6xyvqw6gjs3j488gi1z6wdv18bdpa-coreutils-9.11/bin/timeout --kill-after=15s 7200s /nix/store/bxgja2ppiqi6w2bgn0r07d7mgnl1k6k2-nix-2.34.8/bin/nix --extra-experimental-features nix-command --extra-experimental-features flakes --log-format internal-json run .#packages.x86_64-linux.nix-ci-check-gammaloop-nextest-clinnet --print-build-logs
26.60 s
warning: ignoring untrusted flake configuration setting 'extra-substituters'.
26.60 s
Pass '--accept-flake-config' to trust it
26.60 s
warning: ignoring untrusted flake configuration setting 'extra-trusted-public-keys'.
26.60 s
Pass '--accept-flake-config' to trust it
26.63 s
27.44 s
Downloading cached source from https://cache.nix-ci.com
34.81 s
Downloaded cached source (204.9 MiB) in 7.3s
34.81 s
Progress: 1 of 1 downloaded from cache
49.64 s
fetching Git repository 'https://github.com/alphal00p/momtrop'
50.20 s
remote: Enumerating objects: 735, done.
50.21 s
remote: Counting objects: 0% (1/129)
remote: Counting objects: 1% (2/129)
remote: Counting objects: 2% (3/129)
remote: Counting objects: 3% (4/129)
remote: Counting objects: 4% (6/129)
remote: Counting objects: 5% (7/129)
remote: Counting objects: 6% (8/129)
remote: Counting objects: 7% (10/129)
remote: Counting objects: 8% (11/129)
remote: Counting objects: 9% (12/129)
remote: Counting objects: 10% (13/129)
remote: Counting objects: 11% (15/129)
remote: Counting objects: 12% (16/129)
remote: Counting objects: 13% (17/129)
remote: Counting objects: 14% (19/129)
remote: Counting objects: 15% (20/129)
remote: Counting objects: 16% (21/129)
remote: Counting objects: 17% (22/129)
remote: Counting objects: 18% (24/129)
remote: Counting objects: 19% (25/129)
remote: Counting objects: 20% (26/129)
remote: Counting objects: 21% (28/129)
remote: Counting objects: 22% (29/129)
remote: Counting objects: 23% (30/129)
remote: Counting objects: 24% (31/129)
remote: Counting objects: 25% (33/129)
remote: Counting objects: 26% (34/129)
remote: Counting objects: 27% (35/129)
remote: Counting objects: 28% (37/129)
remote: Counting objects: 29% (38/129)
remote: Counting objects: 30% (39/129)
remote: Counting objects: 31% (40/129)
remote: Counting objects: 32% (42/129)
remote: Counting objects: 33% (43/129)
remote: Counting objects: 34% (44/129)
remote: Counting objects: 35% (46/129)
remote: Counting objects: 36% (47/129)
remote: Counting objects: 37% (48/129)
remote: Counting objects: 38% (50/129)
remote: Counting objects: 39% (51/129)
remote: Counting objects: 40% (52/129)
remote: Counting objects: 41% (53/129)
remote: Counting objects: 42% (55/129)
remote: Counting objects: 43% (56/129)
remote: Counting objects: 44% (57/129)
remote: Counting objects: 45% (59/129)
remote: Counting objects: 46% (60/129)
remote: Counting objects: 47% (61/129)
remote: Counting objects: 48% (62/129)
remote: Counting objects: 49% (64/129)
remote: Counting objects: 50% (65/129)
remote: Counting objects: 51% (66/129)
remote: Counting objects: 52% (68/129)
remote: Counting objects: 53% (69/129)
remote: Counting objects: 54% (70/129)
remote: Counting objects: 55% (71/129)
remote: Counting objects: 56% (73/129)
remote: Counting objects: 57% (74/129)
remote: Counting objects: 58% (75/129)
remote: Counting objects: 59% (77/129)
remote: Counting objects: 60% (78/129)
remote: Counting objects: 61% (79/129)
remote: Counting objects: 62% (80/129)
remote: Counting objects: 63% (82/129)
remote: Counting objects: 64% (83/129)
remote: Counting objects: 65% (84/129)
remote: Counting objects: 66% (86/129)
remote: Counting objects: 67% (87/129)
remote: Counting objects: 68% (88/129)
remote: Counting objects: 69% (90/129)
remote: Counting objects: 70% (91/129)
remote: Counting objects: 71% (92/129)
remote: Counting objects: 72% (93/129)
remote: Counting objects: 73% (95/129)
remote: Counting objects: 74% (96/129)
remote: Counting objects: 75% (97/129)
remote: Counting objects: 76% (99/129)
remote: Counting objects: 77% (100/129)
remote: Counting objects: 78% (101/129)
remote: Counting objects: 79% (102/129)
remote: Counting objects: 80% (104/129)
remote: Counting objects: 81% (105/129)
remote: Counting objects: 82% (106/129)
remote: Counting objects: 83% (108/129)
remote: Counting objects: 84% (109/129)
remote: Counting objects: 85% (110/129)
remote: Counting objects: 86% (111/129)
remote: Counting objects: 87% (113/129)
remote: Counting objects: 88% (114/129)
remote: Counting objects: 89% (115/129)
remote: Counting objects: 90% (117/129)
remote: Counting objects: 91% (118/129)
remote: Counting objects: 92% (119/129)
remote: Counting objects: 93% (120/129)
remote: Counting objects: 94% (122/129)
remote: Counting objects: 95% (123/129)
remote: Counting objects: 96% (124/129)
remote: Counting objects: 97% (126/129)
remote: Counting objects: 98% (127/129)
remote: Counting objects: 99% (128/129)
remote: Counting objects: 100% (129/129)
remote: Counting objects: 100% (129/129), done.
50.21 s
remote: Compressing objects: 1% (1/72)
remote: Compressing objects: 2% (2/72)
remote: Compressing objects: 4% (3/72)
remote: Compressing objects: 5% (4/72)
remote: Compressing objects: 6% (5/72)
remote: Compressing objects: 8% (6/72)
remote: Compressing objects: 9% (7/72)
remote: Compressing objects: 11% (8/72)
remote: Compressing objects: 12% (9/72)
remote: Compressing objects: 13% (10/72)
remote: Compressing objects: 15% (11/72)
remote: Compressing objects: 16% (12/72)
remote: Compressing objects: 18% (13/72)
remote: Compressing objects: 19% (14/72)
remote: Compressing objects: 20% (15/72)
remote: Compressing objects: 22% (16/72)
remote: Compressing objects: 23% (17/72)
remote: Compressing objects: 25% (18/72)
remote: Compressing objects: 26% (19/72)
remote: Compressing objects: 27% (20/72)
remote: Compressing objects: 29% (21/72)
remote: Compressing objects: 30% (22/72)
remote: Compressing objects: 31% (23/72)
remote: Compressing objects: 33% (24/72)
remote: Compressing objects: 34% (25/72)
remote: Compressing objects: 36% (26/72)
remote: Compressing objects: 37% (27/72)
remote: Compressing objects: 38% (28/72)
remote: Compressing objects: 40% (29/72)
remote: Compressing objects: 41% (30/72)
remote: Compressing objects: 43% (31/72)
remote: Compressing objects: 44% (32/72)
remote: Compressing objects: 45% (33/72)
remote: Compressing objects: 47% (34/72)
remote: Compressing objects: 48% (35/72)
remote: Compressing objects: 50% (36/72)
remote: Compressing objects: 51% (37/72)
remote: Compressing objects: 52% (38/72)
remote: Compressing objects: 54% (39/72)
remote: Compressing objects: 55% (40/72)
remote: Compressing objects: 56% (41/72)
remote: Compressing objects: 58% (42/72)
remote: Compressing objects: 59% (43/72)
remote: Compressing objects: 61% (44/72)
remote: Compressing objects: 62% (45/72)
remote: Compressing objects: 63% (46/72)
remote: Compressing objects: 65% (47/72)
remote: Compressing objects: 66% (48/72)
remote: Compressing objects: 68% (49/72)
remote: Compressing objects: 69% (50/72)
remote: Compressing objects: 70% (51/72)
remote: Compressing objects: 72% (52/72)
remote: Compressing objects: 73% (53/72)
remote: Compressing objects: 75% (54/72)
remote: Compressing objects: 76% (55/72)
remote: Compressing objects: 77% (56/72)
remote: Compressing objects: 79% (57/72)
remote: Compressing objects: 80% (58/72)
remote: Compressing objects: 81% (59/72)
remote: Compressing objects: 83% (60/72)
remote: Compressing objects: 84% (61/72)
remote: Compressing objects: 86% (62/72)
remote: Compressing objects: 87% (63/72)
remote: Compressing objects: 88% (64/72)
remote: Compressing objects: 90% (65/72)
remote: Compressing objects: 91% (66/72)
remote: Compressing objects: 93% (67/72)
remote: Compressing objects: 94% (68/72)
remote: Compressing objects: 95% (69/72)
remote: Compressing objects: 97% (70/72)
remote: Compressing objects: 98% (71/72)
remote: Compressing objects: 100% (72/72)
remote: Compressing objects: 100% (72/72), done.
50.24 s
Receiving objects: 0% (1/735)
Receiving objects: 1% (8/735)
Receiving objects: 2% (15/735)
Receiving objects: 3% (23/735)
Receiving objects: 4% (30/735)
Receiving objects: 5% (37/735)
Receiving objects: 6% (45/735)
Receiving objects: 7% (52/735)
Receiving objects: 8% (59/735)
Receiving objects: 9% (67/735)
Receiving objects: 10% (74/735)
Receiving objects: 11% (81/735)
Receiving objects: 12% (89/735)
Receiving objects: 13% (96/735)
Receiving objects: 14% (103/735)
Receiving objects: 15% (111/735)
Receiving objects: 16% (118/735)
Receiving objects: 17% (125/735)
Receiving objects: 18% (133/735)
Receiving objects: 19% (140/735)
Receiving objects: 20% (147/735)
Receiving objects: 21% (155/735)
Receiving objects: 22% (162/735)
Receiving objects: 23% (170/735)
Receiving objects: 24% (177/735)
Receiving objects: 25% (184/735)
Receiving objects: 26% (192/735)
Receiving objects: 27% (199/735)
Receiving objects: 28% (206/735)
Receiving objects: 29% (214/735)
Receiving objects: 30% (221/735)
Receiving objects: 31% (228/735)
Receiving objects: 32% (236/735)
Receiving objects: 33% (243/735)
Receiving objects: 34% (250/735)
Receiving objects: 35% (258/735)
Receiving objects: 36% (265/735)
Receiving objects: 37% (272/735)
Receiving objects: 38% (280/735)
Receiving objects: 39% (287/735)
Receiving objects: 40% (294/735)
Receiving objects: 41% (302/735)
Receiving objects: 42% (309/735)
Receiving objects: 43% (317/735)
Receiving objects: 44% (324/735)
Receiving objects: 45% (331/735)
Receiving objects: 46% (339/735)
Receiving objects: 47% (346/735)
Receiving objects: 48% (353/735)
Receiving objects: 49% (361/735)
Receiving objects: 50% (368/735)
Receiving objects: 51% (375/735)
Receiving objects: 52% (383/735)
Receiving objects: 53% (390/735)
Receiving objects: 54% (397/735)
Receiving objects: 55% (405/735)
Receiving objects: 56% (412/735)
Receiving objects: 57% (419/735)
Receiving objects: 58% (427/735)
Receiving objects: 59% (434/735)
Receiving objects: 60% (441/735)
Receiving objects: 61% (449/735)
Receiving objects: 62% (456/735)
Receiving objects: 63% (464/735)
Receiving objects: 64% (471/735)
Receiving objects: 65% (478/735)
Receiving objects: 66% (486/735)
Receiving objects: 67% (493/735)
Receiving objects: 68% (500/735)
Receiving objects: 69% (508/735)
Receiving objects: 70% (515/735)
Receiving objects: 71% (522/735)
Receiving objects: 72% (530/735)
Receiving objects: 73% (537/735)
Receiving objects: 74% (544/735)
Receiving objects: 75% (552/735)
Receiving objects: 76% (559/735)
Receiving objects: 77% (566/735)
Receiving objects: 78% (574/735)
Receiving objects: 79% (581/735)
Receiving objects: 80% (588/735)
Receiving objects: 81% (596/735)
Receiving objects: 82% (603/735)
Receiving objects: 83% (611/735)
Receiving objects: 84% (618/735)
Receiving objects: 85% (625/735)
Receiving objects: 86% (633/735)
Receiving objects: 87% (640/735)
Receiving objects: 88% (647/735)
Receiving objects: 89% (655/735)
Receiving objects: 90% (662/735)
Receiving objects: 91% (669/735)
Receiving objects: 92% (677/735)
Receiving objects: 93% (684/735)
Receiving objects: 94% (691/735)
Receiving objects: 95% (699/735)
Receiving objects: 96% (706/735)
remote: Total 735 (delta 77), reused 90 (delta 50), pack-reused 606 (from 1)
50.24 s
Receiving objects: 97% (713/735)
Receiving objects: 98% (721/735)
Receiving objects: 99% (728/735)
Receiving objects: 100% (735/735)
Receiving objects: 100% (735/735), 158.80 KiB | 6.11 MiB/s, done.
50.25 s
Resolving deltas: 0% (0/468)
Resolving deltas: 1% (5/468)
Resolving deltas: 2% (10/468)
Resolving deltas: 3% (15/468)
Resolving deltas: 4% (19/468)
Resolving deltas: 5% (24/468)
Resolving deltas: 6% (30/468)
Resolving deltas: 7% (33/468)
Resolving deltas: 8% (38/468)
Resolving deltas: 9% (43/468)
Resolving deltas: 10% (47/468)
Resolving deltas: 11% (52/468)
Resolving deltas: 12% (57/468)
Resolving deltas: 13% (64/468)
Resolving deltas: 14% (66/468)
Resolving deltas: 15% (71/468)
Resolving deltas: 16% (75/468)
Resolving deltas: 17% (80/468)
Resolving deltas: 18% (85/468)
Resolving deltas: 19% (89/468)
Resolving deltas: 20% (94/468)
Resolving deltas: 21% (99/468)
Resolving deltas: 22% (105/468)
Resolving deltas: 23% (108/468)
Resolving deltas: 24% (115/468)
Resolving deltas: 25% (117/468)
Resolving deltas: 26% (122/468)
Resolving deltas: 27% (127/468)
Resolving deltas: 28% (132/468)
Resolving deltas: 29% (136/468)
Resolving deltas: 30% (142/468)
Resolving deltas: 31% (147/468)
Resolving deltas: 32% (150/468)
Resolving deltas: 33% (155/468)
Resolving deltas: 34% (161/468)
Resolving deltas: 35% (164/468)
Resolving deltas: 36% (169/468)
Resolving deltas: 37% (174/468)
Resolving deltas: 38% (178/468)
Resolving deltas: 39% (183/468)
Resolving deltas: 40% (188/468)
Resolving deltas: 41% (192/468)
Resolving deltas: 42% (197/468)
Resolving deltas: 43% (202/468)
Resolving deltas: 44% (207/468)
Resolving deltas: 45% (211/468)
Resolving deltas: 46% (216/468)
Resolving deltas: 47% (220/468)
Resolving deltas: 48% (225/468)
Resolving deltas: 49% (230/468)
Resolving deltas: 50% (234/468)
Resolving deltas: 51% (239/468)
Resolving deltas: 52% (244/468)
Resolving deltas: 53% (249/468)
Resolving deltas: 54% (253/468)
Resolving deltas: 55% (258/468)
Resolving deltas: 56% (263/468)
Resolving deltas: 57% (267/468)
Resolving deltas: 58% (272/468)
Resolving deltas: 59% (277/468)
Resolving deltas: 60% (282/468)
Resolving deltas: 61% (286/468)
Resolving deltas: 62% (292/468)
Resolving deltas: 63% (295/468)
Resolving deltas: 64% (300/468)
Resolving deltas: 65% (305/468)
Resolving deltas: 66% (310/468)
Resolving deltas: 67% (314/468)
Resolving deltas: 68% (319/468)
Resolving deltas: 69% (323/468)
Resolving deltas: 70% (328/468)
Resolving deltas: 71% (333/468)
Resolving deltas: 72% (337/468)
Resolving deltas: 73% (343/468)
Resolving deltas: 74% (348/468)
Resolving deltas: 75% (351/468)
Resolving deltas: 76% (356/468)
Resolving deltas: 77% (361/468)
Resolving deltas: 78% (368/468)
Resolving deltas: 79% (372/468)
Resolving deltas: 80% (375/468)
Resolving deltas: 81% (380/468)
Resolving deltas: 82% (384/468)
Resolving deltas: 83% (389/468)
Resolving deltas: 84% (394/468)
Resolving deltas: 85% (398/468)
Resolving deltas: 86% (403/468)
Resolving deltas: 87% (409/468)
Resolving deltas: 88% (412/468)
Resolving deltas: 89% (417/468)
Resolving deltas: 90% (422/468)
Resolving deltas: 91% (426/468)
Resolving deltas: 92% (432/468)
Resolving deltas: 93% (436/468)
Resolving deltas: 94% (440/468)
Resolving deltas: 95% (445/468)
Resolving deltas: 96% (450/468)
Resolving deltas: 97% (455/468)
Resolving deltas: 98% (459/468)
Resolving deltas: 99% (464/468)
Resolving deltas: 100% (468/468)
Resolving deltas: 100% (468/468), done.
50.26 s
From https://github.com/alphal00p/momtrop
50.26 s
* [new branch] criterion-dev-dependency -> criterion-dev-dependency
50.26 s
* [new branch] float_refactor -> float_refactor
50.26 s
* [new branch] logger_feature -> logger_feature
50.26 s
* [new branch] main -> main
50.26 s
* [new branch] pyo3 -> pyo3
50.26 s
* [new branch] sympol -> sympol
50.26 s
* [new branch] test_branch -> test_branch
50.26 s
* [new ref] refs/pull/1/head -> refs/pull/1/head
50.26 s
* [new ref] refs/pull/2/head -> refs/pull/2/head
50.26 s
* [new ref] refs/pull/3/head -> refs/pull/3/head
50.26 s
* [new ref] refs/pull/4/head -> refs/pull/4/head
50.26 s
* [new tag] v0.2.0 -> v0.2.0
50.26 s
* [new tag] v0.2.1 -> v0.2.1
50.26 s
* [new tag] v0.3.0 -> v0.3.0
50.28 s
fetching Git repository 'https://github.com/symbolica-dev/symbolica'
50.93 s
remote: Enumerating objects: 10796, done.
51.05 s
remote: Counting objects: 0% (1/2650)
remote: Counting objects: 1% (27/2650)
remote: Counting objects: 2% (53/2650)
remote: Counting objects: 3% (80/2650)
remote: Counting objects: 4% (106/2650)
remote: Counting objects: 5% (133/2650)
remote: Counting objects: 6% (159/2650)
remote: Counting objects: 7% (186/2650)
remote: Counting objects: 8% (212/2650)
remote: Counting objects: 9% (239/2650)
remote: Counting objects: 10% (265/2650)
remote: Counting objects: 11% (292/2650)
remote: Counting objects: 12% (318/2650)
remote: Counting objects: 13% (345/2650)
remote: Counting objects: 14% (371/2650)
remote: Counting objects: 15% (398/2650)
remote: Counting objects: 16% (424/2650)
remote: Counting objects: 17% (451/2650)
remote: Counting objects: 18% (477/2650)
remote: Counting objects: 19% (504/2650)
remote: Counting objects: 20% (530/2650)
remote: Counting objects: 21% (557/2650)
remote: Counting objects: 22% (583/2650)
remote: Counting objects: 23% (610/2650)
remote: Counting objects: 24% (636/2650)
remote: Counting objects: 25% (663/2650)
remote: Counting objects: 26% (689/2650)
remote: Counting objects: 27% (716/2650)
remote: Counting objects: 28% (742/2650)
remote: Counting objects: 29% (769/2650)
remote: Counting objects: 30% (795/2650)
remote: Counting objects: 31% (822/2650)
remote: Counting objects: 32% (848/2650)
remote: Counting objects: 33% (875/2650)
remote: Counting objects: 34% (901/2650)
remote: Counting objects: 35% (928/2650)
remote: Counting objects: 36% (954/2650)
remote: Counting objects: 37% (981/2650)
remote: Counting objects: 38% (1007/2650)
remote: Counting objects: 39% (1034/2650)
remote: Counting objects: 40% (1060/2650)
remote: Counting objects: 41% (1087/2650)
remote: Counting objects: 42% (1113/2650)
remote: Counting objects: 43% (1140/2650)
remote: Counting objects: 44% (1166/2650)
remote: Counting objects: 45% (1193/2650)
remote: Counting objects: 46% (1219/2650)
remote: Counting objects: 47% (1246/2650)
remote: Counting objects: 48% (1272/2650)
remote: Counting objects: 49% (1299/2650)
remote: Counting objects: 50% (1325/2650)
remote: Counting objects: 51% (1352/2650)
remote: Counting objects: 52% (1378/2650)
remote: Counting objects: 53% (1405/2650)
remote: Counting objects: 54% (1431/2650)
remote: Counting objects: 55% (1458/2650)
remote: Counting objects: 56% (1484/2650)
remote: Counting objects: 57% (1511/2650)
remote: Counting objects: 58% (1537/2650)
remote: Counting objects: 59% (1564/2650)
remote: Counting objects: 60% (1590/2650)
remote: Counting objects: 61% (1617/2650)
remote: Counting objects: 62% (1643/2650)
remote: Counting objects: 63% (1670/2650)
remote: Counting objects: 64% (1696/2650)
remote: Counting objects: 65% (1723/2650)
remote: Counting objects: 66% (1749/2650)
remote: Counting objects: 67% (1776/2650)
remote: Counting objects: 68% (1802/2650)
remote: Counting objects: 69% (1829/2650)
remote: Counting objects: 70% (1855/2650)
remote: Counting objects: 71% (1882/2650)
remote: Counting objects: 72% (1908/2650)
remote: Counting objects: 73% (1935/2650)
remote: Counting objects: 74% (1961/2650)
remote: Counting objects: 75% (1988/2650)
remote: Counting objects: 76% (2014/2650)
remote: Counting objects: 77% (2041/2650)
remote: Counting objects: 78% (2067/2650)
remote: Counting objects: 79% (2094/2650)
remote: Counting objects: 80% (2120/2650)
remote: Counting objects: 81% (2147/2650)
remote: Counting objects: 82% (2173/2650)
remote: Counting objects: 83% (2200/2650)
remote: Counting objects: 84% (2226/2650)
remote: Counting objects: 85% (2253/2650)
remote: Counting objects: 86% (2279/2650)
remote: Counting objects: 87% (2306/2650)
remote: Counting objects: 88% (2332/2650)
remote: Counting objects: 89% (2359/2650)
remote: Counting objects: 90% (2385/2650)
remote: Counting objects: 91% (2412/2650)
remote: Counting objects: 92% (2438/2650)
remote: Counting objects: 93% (2465/2650)
remote: Counting objects: 94% (2491/2650)
remote: Counting objects: 95% (2518/2650)
remote: Counting objects: 96% (2544/2650)
remote: Counting objects: 97% (2571/2650)
remote: Counting objects: 98% (2597/2650)
remote: Counting objects: 99% (2624/2650)
remote: Counting objects: 100% (2650/2650)
remote: Counting objects: 100% (2650/2650), done.
51.73 s
remote: Compressing objects: 0% (1/270)
remote: Compressing objects: 1% (3/270)
remote: Compressing objects: 2% (6/270)
remote: Compressing objects: 3% (9/270)
remote: Compressing objects: 4% (11/270)
remote: Compressing objects: 5% (14/270)
remote: Compressing objects: 6% (17/270)
remote: Compressing objects: 7% (19/270)
remote: Compressing objects: 8% (22/270)
remote: Compressing objects: 9% (25/270)
remote: Compressing objects: 10% (27/270)
remote: Compressing objects: 11% (30/270)
remote: Compressing objects: 12% (33/270)
remote: Compressing objects: 13% (36/270)
remote: Compressing objects: 14% (38/270)
remote: Compressing objects: 15% (41/270)
remote: Compressing objects: 16% (44/270)
remote: Compressing objects: 17% (46/270)
remote: Compressing objects: 18% (49/270)
remote: Compressing objects: 19% (52/270)
remote: Compressing objects: 20% (54/270)
remote: Compressing objects: 21% (57/270)
remote: Compressing objects: 22% (60/270)
remote: Compressing objects: 23% (63/270)
remote: Compressing objects: 24% (65/270)
remote: Compressing objects: 25% (68/270)
remote: Compressing objects: 26% (71/270)
remote: Compressing objects: 27% (73/270)
remote: Compressing objects: 28% (76/270)
remote: Compressing objects: 29% (79/270)
remote: Compressing objects: 30% (81/270)
remote: Compressing objects: 31% (84/270)
remote: Compressing objects: 32% (87/270)
remote: Compressing objects: 33% (90/270)
remote: Compressing objects: 34% (92/270)
remote: Compressing objects: 35% (95/270)
remote: Compressing objects: 36% (98/270)
remote: Compressing objects: 37% (100/270)
remote: Compressing objects: 38% (103/270)
remote: Compressing objects: 39% (106/270)
remote: Compressing objects: 40% (108/270)
remote: Compressing objects: 41% (111/270)
remote: Compressing objects: 42% (114/270)
remote: Compressing objects: 43% (117/270)
remote: Compressing objects: 44% (119/270)
remote: Compressing objects: 45% (122/270)
remote: Compressing objects: 46% (125/270)
remote: Compressing objects: 47% (127/270)
remote: Compressing objects: 48% (130/270)
remote: Compressing objects: 49% (133/270)
remote: Compressing objects: 50% (135/270)
remote: Compressing objects: 51% (138/270)
remote: Compressing objects: 52% (141/270)
remote: Compressing objects: 53% (144/270)
remote: Compressing objects: 54% (146/270)
remote: Compressing objects: 55% (149/270)
remote: Compressing objects: 56% (152/270)
remote: Compressing objects: 57% (154/270)
remote: Compressing objects: 58% (157/270)
remote: Compressing objects: 59% (160/270)
remote: Compressing objects: 60% (162/270)
remote: Compressing objects: 61% (165/270)
remote: Compressing objects: 62% (168/270)
remote: Compressing objects: 63% (171/270)
remote: Compressing objects: 64% (173/270)
remote: Compressing objects: 65% (176/270)
remote: Compressing objects: 66% (179/270)
remote: Compressing objects: 67% (181/270)
remote: Compressing objects: 68% (184/270)
remote: Compressing objects: 69% (187/270)
remote: Compressing objects: 70% (189/270)
remote: Compressing objects: 71% (192/270)
remote: Compressing objects: 72% (195/270)
remote: Compressing objects: 73% (198/270)
remote: Compressing objects: 74% (200/270)
remote: Compressing objects: 75% (203/270)
remote: Compressing objects: 76% (206/270)
remote: Compressing objects: 77% (208/270)
remote: Compressing objects: 78% (211/270)
remote: Compressing objects: 79% (214/270)
remote: Compressing objects: 80% (216/270)
remote: Compressing objects: 81% (219/270)
remote: Compressing objects: 82% (222/270)
remote: Compressing objects: 83% (225/270)
remote: Compressing objects: 84% (227/270)
remote: Compressing objects: 85% (230/270)
remote: Compressing objects: 86% (233/270)
remote: Compressing objects: 87% (235/270)
remote: Compressing objects: 88% (238/270)
remote: Compressing objects: 89% (241/270)
remote: Compressing objects: 90% (243/270)
remote: Compressing objects: 91% (246/270)
remote: Compressing objects: 92% (249/270)
remote: Compressing objects: 93% (252/270)
remote: Compressing objects: 94% (254/270)
remote: Compressing objects: 95% (257/270)
remote: Compressing objects: 96% (260/270)
remote: Compressing objects: 97% (262/270)
remote: Compressing objects: 98% (265/270)
remote: Compressing objects: 99% (268/270)
remote: Compressing objects: 100% (270/270)
remote: Compressing objects: 100% (270/270), done.
53.09 s
Receiving objects: 0% (1/10796)
Receiving objects: 0% (16/10796), 30.85 MiB | 29.94 MiB/s
Receiving objects: 1% (108/10796), 30.85 MiB | 29.94 MiB/s
Receiving objects: 2% (216/10796), 30.85 MiB | 29.94 MiB/s
Receiving objects: 3% (324/10796), 30.85 MiB | 29.94 MiB/s
Receiving objects: 4% (432/10796), 30.85 MiB | 29.94 MiB/s
Receiving objects: 5% (540/10796), 30.85 MiB | 29.94 MiB/s
Receiving objects: 6% (648/10796), 30.85 MiB | 29.94 MiB/s
Receiving objects: 7% (756/10796), 30.85 MiB | 29.94 MiB/s
Receiving objects: 8% (864/10796), 30.85 MiB | 29.94 MiB/s
Receiving objects: 9% (972/10796), 30.85 MiB | 29.94 MiB/s
Receiving objects: 10% (1080/10796), 30.85 MiB | 29.94 MiB/s
Receiving objects: 11% (1188/10796), 30.85 MiB | 29.94 MiB/s
Receiving objects: 12% (1296/10796), 30.85 MiB | 29.94 MiB/s
Receiving objects: 13% (1404/10796), 30.85 MiB | 29.94 MiB/s
Receiving objects: 14% (1512/10796), 30.85 MiB | 29.94 MiB/s
Receiving objects: 15% (1620/10796), 30.85 MiB | 29.94 MiB/s
Receiving objects: 16% (1728/10796), 30.85 MiB | 29.94 MiB/s
Receiving objects: 17% (1836/10796), 30.85 MiB | 29.94 MiB/s
Receiving objects: 18% (1944/10796), 30.85 MiB | 29.94 MiB/s
Receiving objects: 19% (2052/10796), 30.85 MiB | 29.94 MiB/s
Receiving objects: 20% (2160/10796), 30.85 MiB | 29.94 MiB/s
Receiving objects: 21% (2268/10796), 30.85 MiB | 29.94 MiB/s
Receiving objects: 22% (2376/10796), 30.85 MiB | 29.94 MiB/s
Receiving objects: 23% (2484/10796), 30.85 MiB | 29.94 MiB/s
Receiving objects: 24% (2592/10796), 30.85 MiB | 29.94 MiB/s
Receiving objects: 25% (2699/10796), 30.85 MiB | 29.94 MiB/s
Receiving objects: 26% (2807/10796), 30.85 MiB | 29.94 MiB/s
Receiving objects: 27% (2915/10796), 30.85 MiB | 29.94 MiB/s
Receiving objects: 28% (3023/10796), 30.85 MiB | 29.94 MiB/s
Receiving objects: 29% (3131/10796), 30.85 MiB | 29.94 MiB/s
Receiving objects: 30% (3239/10796), 30.85 MiB | 29.94 MiB/s
Receiving objects: 31% (3347/10796), 30.85 MiB | 29.94 MiB/s
Receiving objects: 32% (3455/10796), 30.85 MiB | 29.94 MiB/s
Receiving objects: 33% (3563/10796), 30.85 MiB | 29.94 MiB/s
Receiving objects: 34% (3671/10796), 30.85 MiB | 29.94 MiB/s
Receiving objects: 35% (3779/10796), 30.85 MiB | 29.94 MiB/s
Receiving objects: 36% (3887/10796), 30.85 MiB | 29.94 MiB/s
Receiving objects: 37% (3995/10796), 30.85 MiB | 29.94 MiB/s
Receiving objects: 38% (4103/10796), 30.85 MiB | 29.94 MiB/s
Receiving objects: 39% (4211/10796), 30.85 MiB | 29.94 MiB/s
Receiving objects: 40% (4319/10796), 30.85 MiB | 29.94 MiB/s
Receiving objects: 41% (4427/10796), 30.85 MiB | 29.94 MiB/s
Receiving objects: 42% (4535/10796), 30.85 MiB | 29.94 MiB/s
Receiving objects: 43% (4643/10796), 30.85 MiB | 29.94 MiB/s
Receiving objects: 44% (4751/10796), 30.85 MiB | 29.94 MiB/s
Receiving objects: 45% (4859/10796), 30.85 MiB | 29.94 MiB/s
Receiving objects: 46% (4967/10796), 30.85 MiB | 29.94 MiB/s
Receiving objects: 47% (5075/10796), 30.85 MiB | 29.94 MiB/s
Receiving objects: 48% (5183/10796), 30.85 MiB | 29.94 MiB/s
Receiving objects: 49% (5291/10796), 30.85 MiB | 29.94 MiB/s
Receiving objects: 50% (5398/10796), 30.85 MiB | 29.94 MiB/s
Receiving objects: 51% (5506/10796), 30.85 MiB | 29.94 MiB/s
Receiving objects: 52% (5614/10796), 30.85 MiB | 29.94 MiB/s
Receiving objects: 53% (5722/10796), 30.85 MiB | 29.94 MiB/s
Receiving objects: 54% (5830/10796), 30.85 MiB | 29.94 MiB/s
Receiving objects: 55% (5938/10796), 30.85 MiB | 29.94 MiB/s
Receiving objects: 56% (6046/10796), 30.85 MiB | 29.94 MiB/s
Receiving objects: 57% (6154/10796), 30.85 MiB | 29.94 MiB/s
Receiving objects: 58% (6262/10796), 30.85 MiB | 29.94 MiB/s
Receiving objects: 59% (6370/10796), 30.85 MiB | 29.94 MiB/s
Receiving objects: 60% (6478/10796), 30.85 MiB | 29.94 MiB/s
Receiving objects: 61% (6586/10796), 30.85 MiB | 29.94 MiB/s
Receiving objects: 62% (6694/10796), 30.85 MiB | 29.94 MiB/s
Receiving objects: 63% (6802/10796), 30.85 MiB | 29.94 MiB/s
Receiving objects: 64% (6910/10796), 30.85 MiB | 29.94 MiB/s
Receiving objects: 65% (7018/10796), 30.85 MiB | 29.94 MiB/s
Receiving objects: 66% (7126/10796), 30.85 MiB | 29.94 MiB/s
Receiving objects: 67% (7234/10796), 30.85 MiB | 29.94 MiB/s
Receiving objects: 68% (7342/10796), 30.85 MiB | 29.94 MiB/s
Receiving objects: 69% (7450/10796), 30.85 MiB | 29.94 MiB/s
Receiving objects: 70% (7558/10796), 30.85 MiB | 29.94 MiB/s
Receiving objects: 71% (7666/10796), 30.85 MiB | 29.94 MiB/s
Receiving objects: 72% (7774/10796), 30.85 MiB | 29.94 MiB/s
Receiving objects: 73% (7882/10796), 30.85 MiB | 29.94 MiB/s
Receiving objects: 74% (7990/10796), 30.85 MiB | 29.94 MiB/s
Receiving objects: 75% (8097/10796), 30.85 MiB | 29.94 MiB/s
Receiving objects: 76% (8205/10796), 30.85 MiB | 29.94 MiB/s
Receiving objects: 77% (8313/10796), 30.85 MiB | 29.94 MiB/s
Receiving objects: 78% (8421/10796), 30.85 MiB | 29.94 MiB/s
Receiving objects: 79% (8529/10796), 30.85 MiB | 29.94 MiB/s
Receiving objects: 80% (8637/10796), 30.85 MiB | 29.94 MiB/s
Receiving objects: 81% (8745/10796), 30.85 MiB | 29.94 MiB/s
Receiving objects: 82% (8853/10796), 30.85 MiB | 29.94 MiB/s
Receiving objects: 83% (8961/10796), 30.85 MiB | 29.94 MiB/s
Receiving objects: 84% (9069/10796), 30.85 MiB | 29.94 MiB/s
Receiving objects: 85% (9177/10796), 30.85 MiB | 29.94 MiB/s
Receiving objects: 86% (9285/10796), 30.85 MiB | 29.94 MiB/s
Receiving objects: 87% (9393/10796), 30.85 MiB | 29.94 MiB/s
Receiving objects: 88% (9501/10796), 30.85 MiB | 29.94 MiB/s
Receiving objects: 89% (9609/10796), 30.85 MiB | 29.94 MiB/s
Receiving objects: 90% (9717/10796), 30.85 MiB | 29.94 MiB/s
Receiving objects: 91% (9825/10796), 30.85 MiB | 29.94 MiB/s
Receiving objects: 92% (9933/10796), 30.85 MiB | 29.94 MiB/s
Receiving objects: 93% (10041/10796), 30.85 MiB | 29.94 MiB/s
Receiving objects: 94% (10149/10796), 30.85 MiB | 29.94 MiB/s
Receiving objects: 95% (10257/10796), 30.85 MiB | 29.94 MiB/s
Receiving objects: 96% (10365/10796), 30.85 MiB | 29.94 MiB/s
Receiving objects: 97% (10473/10796), 30.85 MiB | 29.94 MiB/s
Receiving objects: 98% (10581/10796), 30.85 MiB | 29.94 MiB/s
Receiving objects: 99% (10689/10796), 30.85 MiB | 29.94 MiB/s
remote: Total 10796 (delta 2516), reused 2380 (delta 2380), pack-reused 8146 (from 4)
53.09 s
Receiving objects: 100% (10796/10796), 30.85 MiB | 29.94 MiB/s
Receiving objects: 100% (10796/10796), 41.20 MiB | 30.75 MiB/s, done.
53.26 s
Resolving deltas: 0% (0/8360)
Resolving deltas: 1% (84/8360)
Resolving deltas: 2% (168/8360)
Resolving deltas: 3% (252/8360)
Resolving deltas: 4% (335/8360)
Resolving deltas: 5% (418/8360)
Resolving deltas: 6% (502/8360)
Resolving deltas: 7% (586/8360)
Resolving deltas: 8% (669/8360)
Resolving deltas: 9% (753/8360)
Resolving deltas: 10% (837/8360)
Resolving deltas: 11% (920/8360)
Resolving deltas: 12% (1004/8360)
Resolving deltas: 13% (1087/8360)
Resolving deltas: 14% (1171/8360)
Resolving deltas: 15% (1255/8360)
Resolving deltas: 16% (1338/8360)
Resolving deltas: 17% (1422/8360)
Resolving deltas: 18% (1505/8360)
Resolving deltas: 19% (1589/8360)
Resolving deltas: 20% (1672/8360)
Resolving deltas: 21% (1756/8360)
Resolving deltas: 22% (1840/8360)
Resolving deltas: 23% (1923/8360)
Resolving deltas: 24% (2007/8360)
Resolving deltas: 25% (2090/8360)
Resolving deltas: 26% (2174/8360)
Resolving deltas: 27% (2258/8360)
Resolving deltas: 28% (2341/8360)
Resolving deltas: 29% (2426/8360)
Resolving deltas: 30% (2508/8360)
Resolving deltas: 31% (2592/8360)
Resolving deltas: 32% (2676/8360)
Resolving deltas: 33% (2759/8360)
Resolving deltas: 34% (2843/8360)
Resolving deltas: 35% (2926/8360)
Resolving deltas: 36% (3010/8360)
Resolving deltas: 37% (3094/8360)
Resolving deltas: 38% (3177/8360)
Resolving deltas: 39% (3261/8360)
Resolving deltas: 40% (3344/8360)
Resolving deltas: 41% (3428/8360)
Resolving deltas: 42% (3512/8360)
Resolving deltas: 43% (3596/8360)
Resolving deltas: 44% (3679/8360)
Resolving deltas: 45% (3762/8360)
Resolving deltas: 46% (3846/8360)
Resolving deltas: 47% (3931/8360)
Resolving deltas: 48% (4013/8360)
Resolving deltas: 49% (4098/8360)
Resolving deltas: 50% (4180/8360)
Resolving deltas: 51% (4265/8360)
Resolving deltas: 52% (4348/8360)
Resolving deltas: 53% (4431/8360)
Resolving deltas: 54% (4517/8360)
Resolving deltas: 55% (4598/8360)
Resolving deltas: 56% (4682/8360)
Resolving deltas: 57% (4766/8360)
Resolving deltas: 58% (4849/8360)
Resolving deltas: 59% (4933/8360)
Resolving deltas: 60% (5016/8360)
Resolving deltas: 61% (5100/8360)
Resolving deltas: 62% (5184/8360)
Resolving deltas: 63% (5267/8360)
Resolving deltas: 64% (5351/8360)
Resolving deltas: 65% (5434/8360)
Resolving deltas: 66% (5518/8360)
Resolving deltas: 67% (5602/8360)
Resolving deltas: 68% (5685/8360)
Resolving deltas: 69% (5770/8360)
Resolving deltas: 70% (5853/8360)
Resolving deltas: 71% (5936/8360)
Resolving deltas: 72% (6020/8360)
Resolving deltas: 73% (6104/8360)
Resolving deltas: 74% (6188/8360)
Resolving deltas: 75% (6270/8360)
Resolving deltas: 76% (6354/8360)
Resolving deltas: 77% (6438/8360)
Resolving deltas: 78% (6521/8360)
Resolving deltas: 79% (6605/8360)
Resolving deltas: 80% (6688/8360)
Resolving deltas: 81% (6772/8360)
Resolving deltas: 82% (6856/8360)
Resolving deltas: 83% (6939/8360)
Resolving deltas: 84% (7023/8360)
Resolving deltas: 85% (7106/8360)
Resolving deltas: 86% (7190/8360)
Resolving deltas: 87% (7274/8360)
Resolving deltas: 88% (7357/8360)
Resolving deltas: 89% (7441/8360)
Resolving deltas: 90% (7524/8360)
Resolving deltas: 91% (7608/8360)
Resolving deltas: 92% (7692/8360)
Resolving deltas: 93% (7775/8360)
Resolving deltas: 94% (7859/8360)
Resolving deltas: 95% (7942/8360)
Resolving deltas: 96% (8026/8360)
Resolving deltas: 97% (8110/8360)
Resolving deltas: 98% (8193/8360)
Resolving deltas: 99% (8277/8360)
Resolving deltas: 100% (8360/8360)
Resolving deltas: 100% (8360/8360), done.
53.33 s
From https://github.com/symbolica-dev/symbolica
53.33 s
* branch c78cffc20f318df1fce50539a587cbe8ffc717c0 -> FETCH_HEAD
53.96 s
fetching Git repository 'https://github.com/symbolica-dev/symbolica-typst-plugin'
54.51 s
remote: Enumerating objects: 1722, done.
54.51 s
remote: Counting objects: 0% (1/221)
remote: Counting objects: 1% (3/221)
remote: Counting objects: 2% (5/221)
remote: Counting objects: 3% (7/221)
remote: Counting objects: 4% (9/221)
remote: Counting objects: 5% (12/221)
remote: Counting objects: 6% (14/221)
remote: Counting objects: 7% (16/221)
remote: Counting objects: 8% (18/221)
remote: Counting objects: 9% (20/221)
remote: Counting objects: 10% (23/221)
remote: Counting objects: 11% (25/221)
remote: Counting objects: 12% (27/221)
remote: Counting objects: 13% (29/221)
remote: Counting objects: 14% (31/221)
remote: Counting objects: 15% (34/221)
remote: Counting objects: 16% (36/221)
remote: Counting objects: 17% (38/221)
remote: Counting objects: 18% (40/221)
remote: Counting objects: 19% (42/221)
remote: Counting objects: 20% (45/221)
remote: Counting objects: 21% (47/221)
remote: Counting objects: 22% (49/221)
remote: Counting objects: 23% (51/221)
remote: Counting objects: 24% (54/221)
remote: Counting objects: 25% (56/221)
remote: Counting objects: 26% (58/221)
remote: Counting objects: 27% (60/221)
remote: Counting objects: 28% (62/221)
remote: Counting objects: 29% (65/221)
remote: Counting objects: 30% (67/221)
remote: Counting objects: 31% (69/221)
remote: Counting objects: 32% (71/221)
remote: Counting objects: 33% (73/221)
remote: Counting objects: 34% (76/221)
remote: Counting objects: 35% (78/221)
remote: Counting objects: 36% (80/221)
remote: Counting objects: 37% (82/221)
remote: Counting objects: 38% (84/221)
remote: Counting objects: 39% (87/221)
remote: Counting objects: 40% (89/221)
remote: Counting objects: 41% (91/221)
remote: Counting objects: 42% (93/221)
remote: Counting objects: 43% (96/221)
remote: Counting objects: 44% (98/221)
remote: Counting objects: 45% (100/221)
remote: Counting objects: 46% (102/221)
remote: Counting objects: 47% (104/221)
remote: Counting objects: 48% (107/221)
remote: Counting objects: 49% (109/221)
remote: Counting objects: 50% (111/221)
remote: Counting objects: 51% (113/221)
remote: Counting objects: 52% (115/221)
remote: Counting objects: 53% (118/221)
remote: Counting objects: 54% (120/221)
remote: Counting objects: 55% (122/221)
remote: Counting objects: 56% (124/221)
remote: Counting objects: 57% (126/221)
remote: Counting objects: 58% (129/221)
remote: Counting objects: 59% (131/221)
remote: Counting objects: 60% (133/221)
remote: Counting objects: 61% (135/221)
remote: Counting objects: 62% (138/221)
remote: Counting objects: 63% (140/221)
remote: Counting objects: 64% (142/221)
remote: Counting objects: 65% (144/221)
remote: Counting objects: 66% (146/221)
remote: Counting objects: 67% (149/221)
remote: Counting objects: 68% (151/221)
remote: Counting objects: 69% (153/221)
remote: Counting objects: 70% (155/221)
remote: Counting objects: 71% (157/221)
remote: Counting objects: 72% (160/221)
remote: Counting objects: 73% (162/221)
remote: Counting objects: 74% (164/221)
remote: Counting objects: 75% (166/221)
remote: Counting objects: 76% (168/221)
remote: Counting objects: 77% (171/221)
remote: Counting objects: 78% (173/221)
remote: Counting objects: 79% (175/221)
remote: Counting objects: 80% (177/221)
remote: Counting objects: 81% (180/221)
remote: Counting objects: 82% (182/221)
remote: Counting objects: 83% (184/221)
remote: Counting objects: 84% (186/221)
remote: Counting objects: 85% (188/221)
remote: Counting objects: 86% (191/221)
remote: Counting objects: 87% (193/221)
remote: Counting objects: 88% (195/221)
remote: Counting objects: 89% (197/221)
remote: Counting objects: 90% (199/221)
remote: Counting objects: 91% (202/221)
remote: Counting objects: 92% (204/221)
remote: Counting objects: 93% (206/221)
remote: Counting objects: 94% (208/221)
remote: Counting objects: 95% (210/221)
remote: Counting objects: 96% (213/221)
remote: Counting objects: 97% (215/221)
remote: Counting objects: 98% (217/221)
remote: Counting objects: 99% (219/221)
remote: Counting objects: 100% (221/221)
remote: Counting objects: 100% (221/221), done.
54.63 s
remote: Compressing objects: 0% (1/155)
remote: Compressing objects: 1% (2/155)
remote: Compressing objects: 2% (4/155)
remote: Compressing objects: 3% (5/155)
remote: Compressing objects: 4% (7/155)
remote: Compressing objects: 5% (8/155)
remote: Compressing objects: 6% (10/155)
remote: Compressing objects: 7% (11/155)
remote: Compressing objects: 8% (13/155)
remote: Compressing objects: 9% (14/155)
remote: Compressing objects: 10% (16/155)
remote: Compressing objects: 11% (18/155)
remote: Compressing objects: 12% (19/155)
remote: Compressing objects: 13% (21/155)
remote: Compressing objects: 14% (22/155)
remote: Compressing objects: 15% (24/155)
remote: Compressing objects: 16% (25/155)
remote: Compressing objects: 17% (27/155)
remote: Compressing objects: 18% (28/155)
remote: Compressing objects: 19% (30/155)
remote: Compressing objects: 20% (31/155)
remote: Compressing objects: 21% (33/155)
remote: Compressing objects: 22% (35/155)
remote: Compressing objects: 23% (36/155)
remote: Compressing objects: 24% (38/155)
remote: Compressing objects: 25% (39/155)
remote: Compressing objects: 26% (41/155)
remote: Compressing objects: 27% (42/155)
remote: Compressing objects: 28% (44/155)
remote: Compressing objects: 29% (45/155)
remote: Compressing objects: 30% (47/155)
remote: Compressing objects: 31% (49/155)
remote: Compressing objects: 32% (50/155)
remote: Compressing objects: 33% (52/155)
remote: Compressing objects: 34% (53/155)
remote: Compressing objects: 35% (55/155)
remote: Compressing objects: 36% (56/155)
remote: Compressing objects: 37% (58/155)
remote: Compressing objects: 38% (59/155)
remote: Compressing objects: 39% (61/155)
remote: Compressing objects: 40% (62/155)
remote: Compressing objects: 41% (64/155)
remote: Compressing objects: 42% (66/155)
remote: Compressing objects: 43% (67/155)
remote: Compressing objects: 44% (69/155)
remote: Compressing objects: 45% (70/155)
remote: Compressing objects: 46% (72/155)
remote: Compressing objects: 47% (73/155)
remote: Compressing objects: 48% (75/155)
remote: Compressing objects: 49% (76/155)
remote: Compressing objects: 50% (78/155)
remote: Compressing objects: 51% (80/155)
remote: Compressing objects: 52% (81/155)
remote: Compressing objects: 53% (83/155)
remote: Compressing objects: 54% (84/155)
remote: Compressing objects: 55% (86/155)
remote: Compressing objects: 56% (87/155)
remote: Compressing objects: 57% (89/155)
remote: Compressing objects: 58% (90/155)
remote: Compressing objects: 59% (92/155)
remote: Compressing objects: 60% (93/155)
remote: Compressing objects: 61% (95/155)
remote: Compressing objects: 62% (97/155)
remote: Compressing objects: 63% (98/155)
remote: Compressing objects: 64% (100/155)
remote: Compressing objects: 65% (101/155)
remote: Compressing objects: 66% (103/155)
remote: Compressing objects: 67% (104/155)
remote: Compressing objects: 68% (106/155)
remote: Compressing objects: 69% (107/155)
remote: Compressing objects: 70% (109/155)
remote: Compressing objects: 71% (111/155)
remote: Compressing objects: 72% (112/155)
remote: Compressing objects: 73% (114/155)
remote: Compressing objects: 74% (115/155)
remote: Compressing objects: 75% (117/155)
remote: Compressing objects: 76% (118/155)
remote: Compressing objects: 77% (120/155)
remote: Compressing objects: 78% (121/155)
remote: Compressing objects: 79% (123/155)
remote: Compressing objects: 80% (124/155)
remote: Compressing objects: 81% (126/155)
remote: Compressing objects: 82% (128/155)
remote: Compressing objects: 83% (129/155)
remote: Compressing objects: 84% (131/155)
remote: Compressing objects: 85% (132/155)
remote: Compressing objects: 86% (134/155)
remote: Compressing objects: 87% (135/155)
remote: Compressing objects: 88% (137/155)
remote: Compressing objects: 89% (138/155)
remote: Compressing objects: 90% (140/155)
remote: Compressing objects: 91% (142/155)
remote: Compressing objects: 92% (143/155)
remote: Compressing objects: 93% (145/155)
remote: Compressing objects: 94% (146/155)
remote: Compressing objects: 95% (148/155)
remote: Compressing objects: 96% (149/155)
remote: Compressing objects: 97% (151/155)
remote: Compressing objects: 98% (152/155)
remote: Compressing objects: 99% (154/155)
remote: Compressing objects: 100% (155/155)
remote: Compressing objects: 100% (155/155), done.
63.92 s
Receiving objects: 0% (1/1722)
Receiving objects: 1% (18/1722)
Receiving objects: 2% (35/1722)
Receiving objects: 3% (52/1722)
Receiving objects: 4% (69/1722)
Receiving objects: 5% (87/1722)
Receiving objects: 6% (104/1722)
Receiving objects: 7% (121/1722)
Receiving objects: 8% (138/1722)
Receiving objects: 9% (155/1722)
Receiving objects: 10% (173/1722)
Receiving objects: 11% (190/1722)
Receiving objects: 12% (207/1722)
Receiving objects: 13% (224/1722)
Receiving objects: 14% (242/1722)
Receiving objects: 15% (259/1722), 16.30 MiB | 32.34 MiB/s
Receiving objects: 15% (273/1722), 32.32 MiB | 30.98 MiB/s
Receiving objects: 16% (276/1722), 32.32 MiB | 30.98 MiB/s
Receiving objects: 17% (293/1722), 32.32 MiB | 30.98 MiB/s
Receiving objects: 18% (310/1722), 32.32 MiB | 30.98 MiB/s
Receiving objects: 19% (328/1722), 32.32 MiB | 30.98 MiB/s
Receiving objects: 20% (345/1722), 32.32 MiB | 30.98 MiB/s
Receiving objects: 21% (362/1722), 32.32 MiB | 30.98 MiB/s
Receiving objects: 22% (379/1722), 32.32 MiB | 30.98 MiB/s
Receiving objects: 23% (397/1722), 32.32 MiB | 30.98 MiB/s
Receiving objects: 24% (414/1722), 32.32 MiB | 30.98 MiB/s
Receiving objects: 25% (431/1722), 32.32 MiB | 30.98 MiB/s
Receiving objects: 26% (448/1722), 32.32 MiB | 30.98 MiB/s
Receiving objects: 27% (465/1722), 32.32 MiB | 30.98 MiB/s
Receiving objects: 28% (483/1722), 32.32 MiB | 30.98 MiB/s
Receiving objects: 29% (500/1722), 32.32 MiB | 30.98 MiB/s
Receiving objects: 30% (517/1722), 32.32 MiB | 30.98 MiB/s
Receiving objects: 31% (534/1722), 32.32 MiB | 30.98 MiB/s
Receiving objects: 32% (552/1722), 48.31 MiB | 31.31 MiB/s
Receiving objects: 33% (569/1722), 48.31 MiB | 31.31 MiB/s
Receiving objects: 33% (574/1722), 64.21 MiB | 31.43 MiB/s
Receiving objects: 34% (586/1722), 64.21 MiB | 31.43 MiB/s
Receiving objects: 35% (603/1722), 80.16 MiB | 31.24 MiB/s
Receiving objects: 36% (620/1722), 80.16 MiB | 31.24 MiB/s
Receiving objects: 37% (638/1722), 80.16 MiB | 31.24 MiB/s
Receiving objects: 38% (655/1722), 80.16 MiB | 31.24 MiB/s
Receiving objects: 39% (672/1722), 80.16 MiB | 31.24 MiB/s
Receiving objects: 39% (677/1722), 96.09 MiB | 31.33 MiB/s
Receiving objects: 40% (689/1722), 96.09 MiB | 31.33 MiB/s
Receiving objects: 41% (707/1722), 96.09 MiB | 31.33 MiB/s
Receiving objects: 42% (724/1722), 96.09 MiB | 31.33 MiB/s
Receiving objects: 43% (741/1722), 96.09 MiB | 31.33 MiB/s
Receiving objects: 44% (758/1722), 96.09 MiB | 31.33 MiB/s
Receiving objects: 45% (775/1722), 96.09 MiB | 31.33 MiB/s
Receiving objects: 46% (793/1722), 96.09 MiB | 31.33 MiB/s
Receiving objects: 47% (810/1722), 96.09 MiB | 31.33 MiB/s
Receiving objects: 48% (827/1722), 96.09 MiB | 31.33 MiB/s
Receiving objects: 49% (844/1722), 96.09 MiB | 31.33 MiB/s
Receiving objects: 50% (861/1722), 96.09 MiB | 31.33 MiB/s
Receiving objects: 51% (879/1722), 96.09 MiB | 31.33 MiB/s
Receiving objects: 52% (896/1722), 96.09 MiB | 31.33 MiB/s
Receiving objects: 53% (913/1722), 112.01 MiB | 31.41 MiB/s
Receiving objects: 54% (930/1722), 112.01 MiB | 31.41 MiB/s
Receiving objects: 55% (948/1722), 112.01 MiB | 31.41 MiB/s
Receiving objects: 56% (965/1722), 112.01 MiB | 31.41 MiB/s
Receiving objects: 56% (969/1722), 127.98 MiB | 31.47 MiB/s
Receiving objects: 57% (982/1722), 127.98 MiB | 31.47 MiB/s
Receiving objects: 58% (999/1722), 127.98 MiB | 31.47 MiB/s
Receiving objects: 59% (1016/1722), 127.98 MiB | 31.47 MiB/s
Receiving objects: 60% (1034/1722), 143.92 MiB | 31.52 MiB/s
Receiving objects: 61% (1051/1722), 143.92 MiB | 31.52 MiB/s
Receiving objects: 61% (1057/1722), 159.80 MiB | 31.45 MiB/s
Receiving objects: 62% (1068/1722), 159.80 MiB | 31.45 MiB/s
Receiving objects: 63% (1085/1722), 159.80 MiB | 31.45 MiB/s
Receiving objects: 64% (1103/1722), 159.80 MiB | 31.45 MiB/s
Receiving objects: 65% (1120/1722), 159.80 MiB | 31.45 MiB/s
Receiving objects: 65% (1133/1722), 175.74 MiB | 31.71 MiB/s
Receiving objects: 66% (1137/1722), 175.74 MiB | 31.71 MiB/s
Receiving objects: 67% (1154/1722), 191.80 MiB | 31.72 MiB/s
Receiving objects: 68% (1171/1722), 191.80 MiB | 31.72 MiB/s
Receiving objects: 69% (1189/1722), 207.59 MiB | 31.70 MiB/s
Receiving objects: 69% (1204/1722), 207.59 MiB | 31.70 MiB/s
Receiving objects: 70% (1206/1722), 207.59 MiB | 31.70 MiB/s
Receiving objects: 71% (1223/1722), 223.67 MiB | 31.89 MiB/s
Receiving objects: 72% (1240/1722), 223.67 MiB | 31.89 MiB/s
Receiving objects: 73% (1258/1722), 223.67 MiB | 31.89 MiB/s
Receiving objects: 74% (1275/1722), 223.67 MiB | 31.89 MiB/s
Receiving objects: 75% (1292/1722), 223.67 MiB | 31.89 MiB/s
Receiving objects: 76% (1309/1722), 223.67 MiB | 31.89 MiB/s
Receiving objects: 77% (1326/1722), 239.66 MiB | 31.91 MiB/s
Receiving objects: 78% (1344/1722), 239.66 MiB | 31.91 MiB/s
Receiving objects: 79% (1361/1722), 239.66 MiB | 31.91 MiB/s
Receiving objects: 80% (1378/1722), 239.66 MiB | 31.91 MiB/s
Receiving objects: 81% (1395/1722), 239.66 MiB | 31.91 MiB/s
Receiving objects: 82% (1413/1722), 239.66 MiB | 31.91 MiB/s
Receiving objects: 83% (1430/1722), 239.66 MiB | 31.91 MiB/s
Receiving objects: 83% (1441/1722), 255.59 MiB | 31.91 MiB/s
Receiving objects: 84% (1447/1722), 255.59 MiB | 31.91 MiB/s
Receiving objects: 85% (1464/1722), 255.59 MiB | 31.91 MiB/s
Receiving objects: 86% (1481/1722), 255.59 MiB | 31.91 MiB/s
Receiving objects: 87% (1499/1722), 271.63 MiB | 31.94 MiB/s
Receiving objects: 88% (1516/1722), 271.63 MiB | 31.94 MiB/s
Receiving objects: 89% (1533/1722), 271.63 MiB | 31.94 MiB/s
Receiving objects: 90% (1550/1722), 271.63 MiB | 31.94 MiB/s
Receiving objects: 91% (1568/1722), 271.63 MiB | 31.94 MiB/s
Receiving objects: 92% (1585/1722), 271.63 MiB | 31.94 MiB/s
Receiving objects: 93% (1602/1722), 271.63 MiB | 31.94 MiB/s
Receiving objects: 94% (1619/1722), 271.63 MiB | 31.94 MiB/s
Receiving objects: 95% (1636/1722), 271.63 MiB | 31.94 MiB/s
Receiving objects: 95% (1650/1722), 277.07 MiB | 29.49 MiB/s
Receiving objects: 96% (1654/1722), 277.07 MiB | 29.49 MiB/s
remote: Total 1722 (delta 104), reused 131 (delta 63), pack-reused 1501 (from 2)
63.92 s
Receiving objects: 97% (1671/1722), 277.07 MiB | 29.49 MiB/s
Receiving objects: 98% (1688/1722), 277.07 MiB | 29.49 MiB/s
Receiving objects: 99% (1705/1722), 277.07 MiB | 29.49 MiB/s
Receiving objects: 100% (1722/1722), 277.07 MiB | 29.49 MiB/s
Receiving objects: 100% (1722/1722), 284.57 MiB | 30.65 MiB/s, done.
64.20 s
Resolving deltas: 0% (0/910)
Resolving deltas: 1% (10/910)
Resolving deltas: 2% (19/910)
Resolving deltas: 3% (28/910)
Resolving deltas: 4% (37/910)
Resolving deltas: 5% (46/910)
Resolving deltas: 6% (56/910)
Resolving deltas: 7% (65/910)
Resolving deltas: 8% (73/910)
Resolving deltas: 9% (82/910)
Resolving deltas: 10% (92/910)
Resolving deltas: 11% (103/910)
Resolving deltas: 12% (110/910)
Resolving deltas: 13% (120/910)
Resolving deltas: 14% (128/910)
Resolving deltas: 15% (137/910)
Resolving deltas: 16% (147/910)
Resolving deltas: 17% (156/910)
Resolving deltas: 18% (164/910)
Resolving deltas: 19% (174/910)
Resolving deltas: 20% (182/910)
Resolving deltas: 21% (192/910)
Resolving deltas: 22% (201/910)
Resolving deltas: 23% (210/910)
Resolving deltas: 24% (219/910)
Resolving deltas: 25% (228/910)
Resolving deltas: 26% (237/910)
Resolving deltas: 27% (246/910)
Resolving deltas: 28% (255/910)
Resolving deltas: 29% (264/910)
Resolving deltas: 30% (273/910)
Resolving deltas: 31% (283/910)
Resolving deltas: 32% (292/910)
Resolving deltas: 33% (302/910)
Resolving deltas: 34% (310/910)
Resolving deltas: 35% (319/910)
Resolving deltas: 36% (328/910)
Resolving deltas: 37% (337/910)
Resolving deltas: 38% (346/910)
Resolving deltas: 39% (355/910)
Resolving deltas: 40% (366/910)
Resolving deltas: 41% (375/910)
Resolving deltas: 42% (383/910)
Resolving deltas: 43% (392/910)
Resolving deltas: 44% (403/910)
Resolving deltas: 45% (410/910)
Resolving deltas: 46% (420/910)
Resolving deltas: 47% (428/910)
Resolving deltas: 48% (437/910)
Resolving deltas: 49% (446/910)
Resolving deltas: 50% (456/910)
Resolving deltas: 51% (465/910)
Resolving deltas: 52% (475/910)
Resolving deltas: 53% (483/910)
Resolving deltas: 54% (492/910)
Resolving deltas: 55% (501/910)
Resolving deltas: 56% (510/910)
Resolving deltas: 57% (519/910)
Resolving deltas: 58% (529/910)
Resolving deltas: 59% (537/910)
Resolving deltas: 60% (546/910)
Resolving deltas: 61% (556/910)
Resolving deltas: 62% (565/910)
Resolving deltas: 63% (574/910)
Resolving deltas: 64% (584/910)
Resolving deltas: 65% (592/910)
Resolving deltas: 66% (601/910)
Resolving deltas: 67% (611/910)
Resolving deltas: 68% (619/910)
Resolving deltas: 69% (628/910)
Resolving deltas: 70% (638/910)
Resolving deltas: 71% (648/910)
Resolving deltas: 72% (656/910)
Resolving deltas: 73% (666/910)
Resolving deltas: 74% (674/910)
Resolving deltas: 75% (683/910)
Resolving deltas: 76% (692/910)
Resolving deltas: 77% (701/910)
Resolving deltas: 78% (710/910)
Resolving deltas: 79% (719/910)
Resolving deltas: 80% (728/910)
Resolving deltas: 81% (738/910)
Resolving deltas: 82% (747/910)
Resolving deltas: 83% (756/910)
Resolving deltas: 84% (765/910)
Resolving deltas: 85% (774/910)
Resolving deltas: 86% (783/910)
Resolving deltas: 87% (792/910)
Resolving deltas: 88% (801/910)
Resolving deltas: 89% (810/910)
Resolving deltas: 90% (819/910)
Resolving deltas: 91% (829/910)
Resolving deltas: 92% (838/910)
Resolving deltas: 93% (847/910)
Resolving deltas: 94% (856/910)
Resolving deltas: 95% (865/910)
Resolving deltas: 96% (874/910)
Resolving deltas: 97% (883/910)
Resolving deltas: 98% (892/910)
Resolving deltas: 99% (901/910)
Resolving deltas: 100% (910/910)
Resolving deltas: 100% (910/910), done.
64.45 s
From https://github.com/symbolica-dev/symbolica-typst-plugin
64.45 s
* [new branch] codex/universe-readme -> codex/universe-readme
64.45 s
* [new branch] compress -> compress
64.45 s
* [new branch] main -> main
64.45 s
* [new branch] transitive-dependency-patches -> transitive-dependency-patches
64.45 s
* [new ref] refs/pull/3/head -> refs/pull/3/head
65.92 s
65.93 s
Downloading cached xgcc-15.3.0-libgcc from https://cache.nix-ci.com
65.93 s
Downloading cached busybox from https://cache.nix-ci.com
65.93 s
Downloading cached gcc-15.3.0-libgcc from https://cache.nix-ci.com
65.93 s
Downloading cached libunistring from https://cache.nix-ci.com
65.93 s
Downloading cached publicsuffix-list-0-unstable-2026-09 from https://cache.nix-ci.com
65.94 s
Downloaded cached xgcc-15.3.0-libgcc (193 KiB) in 11ms
65.94 s
Progress: 0 of 1 built, 1 of 65 downloaded from cache (4 downloading)
65.94 s
Downloaded cached gcc-15.3.0-libgcc (193 KiB) in 11ms
65.94 s
Progress: 0 of 1 built, 2 of 65 downloaded from cache (3 downloading)
65.94 s
Downloaded cached busybox (230 KiB) in 13ms
65.94 s
Progress: 0 of 1 built, 3 of 65 downloaded from cache (2 downloading)
65.95 s
Downloaded cached libunistring (2 MiB) in 20ms
65.95 s
Progress: 0 of 1 built, 4 of 65 downloaded from cache (1 downloading)
65.95 s
Downloading cached libidn2 from https://cache.nix-ci.com
65.95 s
Downloaded cached publicsuffix-list-0-unstable-2026-09 (330 KiB) in 20ms
65.95 s
Progress: 0 of 1 built, 5 of 65 downloaded from cache (1 downloading)
65.97 s
Downloaded cached libidn2 (359 KiB) in 15ms
65.97 s
Progress: 0 of 1 built, 6 of 65 downloaded from cache
65.97 s
Downloading cached glibc-2.42 from https://cache.nix-ci.com
66.12 s
Downloaded cached glibc-2.42 (33.4 MiB) in 153ms
66.12 s
Progress: 0 of 1 built, 7 of 65 downloaded from cache
66.12 s
Downloading cached acl from https://cache.nix-ci.com
66.12 s
Downloading cached aws-c-common from https://cache.nix-ci.com
66.12 s
Downloading cached bash from https://cache.nix-ci.com
66.12 s
Downloading cached brotli-1.2.0-lib from https://cache.nix-ci.com
66.12 s
Downloading cached bzip2 from https://cache.nix-ci.com
66.12 s
Downloading cached editline-1.17.1-unstable-2025-05 from https://cache.nix-ci.com
66.12 s
Downloading cached gcc-15.3.0-lib from https://cache.nix-ci.com
66.12 s
Downloading cached hwloc-2.14.0-lib from https://cache.nix-ci.com
66.12 s
Downloading cached keyutils-1.6.3-lib from https://cache.nix-ci.com
66.12 s
Downloading cached libcpuid from https://cache.nix-ci.com
66.12 s
Downloading cached libpsl from https://cache.nix-ci.com
66.12 s
Downloading cached libseccomp-2.6.1-lib from https://cache.nix-ci.com
66.12 s
Downloading cached libsodium-1.0.22-unstable-2026-08 from https://cache.nix-ci.com
66.12 s
Downloading cached libxml2 from https://cache.nix-ci.com
66.12 s
Downloading cached llhttp from https://cache.nix-ci.com
66.13 s
Downloading cached lowdown-3.0.1-lib from https://cache.nix-ci.com
66.14 s
Downloaded cached acl (134 KiB) in 20ms
66.14 s
Progress: 0 of 1 built, 8 of 65 downloaded from cache (15 downloading)
66.14 s
Downloading cached nghttp2-1.70.0-lib from https://cache.nix-ci.com
66.14 s
Downloaded cached hwloc-2.14.0-lib (458 KiB) in 21ms
66.14 s
Progress: 0 of 1 built, 9 of 65 downloaded from cache (15 downloading)
66.14 s
Downloading cached nghttp3 from https://cache.nix-ci.com
66.15 s
Downloaded cached bash (1.8 MiB) in 31ms
66.15 s
Progress: 0 of 1 built, 10 of 65 downloaded from cache (15 downloading)
66.15 s
Downloading cached openssl from https://cache.nix-ci.com
66.16 s
Downloaded cached keyutils-1.6.3-lib (41 KiB) in 37ms
66.16 s
Progress: 0 of 1 built, 11 of 65 downloaded from cache (15 downloading)
66.16 s
Downloading cached pcre2 from https://cache.nix-ci.com
66.17 s
Downloaded cached editline-1.17.1-unstable-2025-05 (58 KiB) in 47ms
66.17 s
Downloaded cached bzip2 (86 KiB) in 47ms
66.17 s
Progress: 0 of 1 built, 12 of 65 downloaded from cache (15 downloading)
66.17 s
Downloaded cached llhttp (89 KiB) in 47ms
66.17 s
Progress: 0 of 1 built, 13 of 65 downloaded from cache (15 downloading)
66.17 s
Progress: 0 of 1 built, 14 of 65 downloaded from cache (14 downloading)
66.17 s
Downloading cached xz from https://cache.nix-ci.com
66.17 s
Downloading cached zlib from https://cache.nix-ci.com
66.18 s
Downloaded cached libpsl (114 KiB) in 57ms
66.18 s
Progress: 0 of 1 built, 15 of 65 downloaded from cache (14 downloading)
66.18 s
Downloaded cached nghttp3 (228 KiB) in 36ms
66.18 s
Progress: 0 of 1 built, 16 of 65 downloaded from cache (13 downloading)
66.18 s
Downloaded cached libcpuid (326 KiB) in 58ms
66.18 s
Progress: 0 of 1 built, 17 of 65 downloaded from cache (12 downloading)
66.18 s
Downloaded cached nghttp2-1.70.0-lib (225 KiB) in 38ms
66.18 s
Progress: 0 of 1 built, 18 of 65 downloaded from cache (11 downloading)
66.18 s
Downloaded cached lowdown-3.0.1-lib (341 KiB) in 47ms
66.18 s
Progress: 0 of 1 built, 19 of 65 downloaded from cache (10 downloading)
66.18 s
Downloaded cached libseccomp-2.6.1-lib (189 KiB) in 58ms
66.18 s
Progress: 0 of 1 built, 20 of 65 downloaded from cache (9 downloading)
66.18 s
Downloaded cached brotli-1.2.0-lib (961 KiB) in 61ms
66.18 s
Progress: 0 of 1 built, 21 of 65 downloaded from cache (8 downloading)
66.18 s
Downloaded cached libsodium-1.0.22-unstable-2026-08 (669 KiB) in 61ms
66.18 s
Progress: 0 of 1 built, 22 of 65 downloaded from cache (7 downloading)
66.19 s
Downloaded cached aws-c-common (1.1 MiB) in 68ms
66.19 s
Progress: 0 of 1 built, 23 of 65 downloaded from cache (6 downloading)
66.19 s
Downloading cached aws-c-compression from https://cache.nix-ci.com
66.19 s
Downloading cached aws-c-sdkutils from https://cache.nix-ci.com
66.19 s
Downloading cached aws-checksums from https://cache.nix-ci.com
66.19 s
Downloaded cached libxml2 (1.4 MiB) in 70ms
66.19 s
Progress: 0 of 1 built, 24 of 65 downloaded from cache (8 downloading)
66.20 s
Downloaded cached zlib (129 KiB) in 36ms
66.20 s
Progress: 0 of 1 built, 25 of 65 downloaded from cache (7 downloading)
66.20 s
Downloading cached sqlite from https://cache.nix-ci.com
66.21 s
Downloaded cached xz (837 KiB) in 44ms
66.21 s
Progress: 0 of 1 built, 26 of 65 downloaded from cache (7 downloading)
66.21 s
Downloaded cached aws-c-compression (31 KiB) in 25ms
66.21 s
Progress: 0 of 1 built, 27 of 65 downloaded from cache (6 downloading)
66.22 s
Downloaded cached aws-checksums (86 KiB) in 30ms
66.22 s
Progress: 0 of 1 built, 28 of 65 downloaded from cache (5 downloading)
66.22 s
Downloaded cached aws-c-sdkutils (155 KiB) in 30ms
66.22 s
Progress: 0 of 1 built, 29 of 65 downloaded from cache (4 downloading)
66.22 s
Downloaded cached pcre2 (2 MiB) in 62ms
66.22 s
Progress: 0 of 1 built, 30 of 65 downloaded from cache (3 downloading)
66.23 s
Downloaded cached gcc-15.3.0-lib (9.8 MiB) in 106ms
66.23 s
Progress: 0 of 1 built, 31 of 65 downloaded from cache (2 downloading)
66.23 s
Downloading cached boehm-gc from https://cache.nix-ci.com
66.23 s
Downloading cached icu4c from https://cache.nix-ci.com
66.23 s
Downloading cached onetbb from https://cache.nix-ci.com
66.23 s
Downloading cached zstd from https://cache.nix-ci.com
66.26 s
Downloaded cached boehm-gc (312 KiB) in 33ms
66.26 s
Progress: 0 of 1 built, 32 of 65 downloaded from cache (5 downloading)
66.26 s
Downloaded cached onetbb (626 KiB) in 35ms
66.26 s
Progress: 0 of 1 built, 33 of 65 downloaded from cache (4 downloading)
66.26 s
Downloading cached libblake3 from https://cache.nix-ci.com
66.27 s
Downloaded cached zstd (1.1 MiB) in 47ms
66.27 s
Progress: 0 of 1 built, 34 of 65 downloaded from cache (4 downloading)
66.28 s
Downloaded cached openssl (8.9 MiB) in 126ms
66.28 s
Progress: 0 of 1 built, 35 of 65 downloaded from cache (3 downloading)
66.28 s
Downloading cached aws-c-cal from https://cache.nix-ci.com
66.28 s
Downloading cached krb5-1.22.2-lib from https://cache.nix-ci.com
66.28 s
Downloading cached libarchive-3.8.9-lib from https://cache.nix-ci.com
66.28 s
Downloading cached libssh2 from https://cache.nix-ci.com
66.28 s
Downloading cached ngtcp2 from https://cache.nix-ci.com
66.28 s
Downloading cached s2n-tls from https://cache.nix-ci.com
66.29 s
Downloaded cached libblake3 (117 KiB) in 23ms
66.29 s
Progress: 0 of 1 built, 36 of 65 downloaded from cache (8 downloading)
66.29 s
Downloaded cached sqlite (5.7 MiB) in 82ms
66.29 s
Progress: 0 of 1 built, 37 of 65 downloaded from cache (7 downloading)
66.31 s
Downloaded cached aws-c-cal (158 KiB) in 27ms
66.31 s
Progress: 0 of 1 built, 38 of 65 downloaded from cache (6 downloading)
66.31 s
Downloaded cached libssh2 (330 KiB) in 30ms
66.31 s
Progress: 0 of 1 built, 39 of 65 downloaded from cache (5 downloading)
66.31 s
Downloading cached libgit2-1.9.7-lib from https://cache.nix-ci.com
66.32 s
Downloaded cached ngtcp2 (515 KiB) in 39ms
66.32 s
Progress: 0 of 1 built, 40 of 65 downloaded from cache (5 downloading)
66.32 s
Downloaded cached s2n-tls (1.3 MiB) in 42ms
66.32 s
Progress: 0 of 1 built, 41 of 65 downloaded from cache (4 downloading)
66.32 s
Downloading cached aws-c-io from https://cache.nix-ci.com
66.32 s
Downloaded cached libarchive-3.8.9-lib (961 KiB) in 44ms
66.32 s
Progress: 0 of 1 built, 42 of 65 downloaded from cache (4 downloading)
66.34 s
Downloaded cached krb5-1.22.2-lib (2.7 MiB) in 63ms
66.34 s
Progress: 0 of 1 built, 43 of 65 downloaded from cache (3 downloading)
66.34 s
Downloading cached curl from https://cache.nix-ci.com
66.35 s
Downloaded cached aws-c-io (648 KiB) in 28ms
66.35 s
Progress: 0 of 1 built, 44 of 65 downloaded from cache (3 downloading)
66.35 s
Downloading cached aws-c-event-stream from https://cache.nix-ci.com
66.35 s
Downloading cached aws-c-http from https://cache.nix-ci.com
66.35 s
Downloaded cached libgit2-1.9.7-lib (1.6 MiB) in 44ms
66.35 s
Progress: 0 of 1 built, 45 of 65 downloaded from cache (4 downloading)
66.38 s
Downloaded cached aws-c-event-stream (176 KiB) in 24ms
66.38 s
Progress: 0 of 1 built, 46 of 65 downloaded from cache (3 downloading)
66.38 s
Downloaded cached curl (1.2 MiB) in 34ms
66.38 s
Progress: 0 of 1 built, 47 of 65 downloaded from cache (2 downloading)
66.38 s
Downloaded cached aws-c-http (641 KiB) in 27ms
66.38 s
Progress: 0 of 1 built, 48 of 65 downloaded from cache (1 downloading)
66.38 s
Downloading cached aws-c-auth from https://cache.nix-ci.com
66.38 s
Downloading cached aws-c-mqtt from https://cache.nix-ci.com
66.40 s
Downloaded cached aws-c-auth (387 KiB) in 23ms
66.40 s
Progress: 0 of 1 built, 49 of 65 downloaded from cache (2 downloading)
66.40 s
Downloading cached aws-c-s3 from https://cache.nix-ci.com
66.40 s
Downloaded cached aws-c-mqtt (557 KiB) in 26ms
66.41 s
Progress: 0 of 1 built, 50 of 65 downloaded from cache (2 downloading)
66.43 s
Downloaded cached aws-c-s3 (384 KiB) in 27ms
66.43 s
Progress: 0 of 1 built, 51 of 65 downloaded from cache (1 downloading)
66.43 s
Downloading cached aws-crt-cpp from https://cache.nix-ci.com
66.46 s
Downloaded cached aws-crt-cpp (979 KiB) in 26ms
66.46 s
Progress: 0 of 1 built, 52 of 65 downloaded from cache (1 downloading)
66.47 s
Downloaded cached icu4c (39.5 MiB) in 247ms
66.47 s
Progress: 0 of 1 built, 53 of 65 downloaded from cache
66.47 s
Downloading cached boost from https://cache.nix-ci.com
66.56 s
Downloaded cached boost (14.5 MiB) in 80ms
66.56 s
Progress: 0 of 1 built, 54 of 65 downloaded from cache
66.56 s
Downloading cached nix-util from https://cache.nix-ci.com
66.58 s
Downloaded cached nix-util (2.4 MiB) in 22ms
66.58 s
Progress: 0 of 1 built, 55 of 65 downloaded from cache
66.58 s
Downloading cached nix-nswrapper from https://cache.nix-ci.com
66.58 s
Downloading cached nix-store from https://cache.nix-ci.com
66.59 s
Downloaded cached nix-nswrapper (131 KiB) in 12ms
66.59 s
Progress: 0 of 1 built, 56 of 65 downloaded from cache (1 downloading)
66.61 s
Downloaded cached nix-store (5.8 MiB) in 33ms
66.61 s
Progress: 0 of 1 built, 57 of 65 downloaded from cache
66.61 s
Downloading cached nix-fetchers from https://cache.nix-ci.com
66.61 s
Downloading cached nix-main from https://cache.nix-ci.com
66.63 s
Downloaded cached nix-main (393 KiB) in 13ms
66.63 s
Progress: 0 of 1 built, 58 of 65 downloaded from cache (1 downloading)
66.63 s
Downloaded cached nix-fetchers (1.5 MiB) in 20ms
66.63 s
Progress: 0 of 1 built, 59 of 65 downloaded from cache
66.63 s
Downloading cached nix-expr from https://cache.nix-ci.com
66.66 s
Downloaded cached nix-expr (3.3 MiB) in 25ms
66.66 s
Progress: 0 of 1 built, 60 of 65 downloaded from cache
66.66 s
Downloading cached nix-flake from https://cache.nix-ci.com
66.68 s
Downloaded cached nix-flake (956 KiB) in 17ms
66.68 s
Progress: 0 of 1 built, 61 of 65 downloaded from cache
66.68 s
Downloading cached nix-cmd from https://cache.nix-ci.com
66.69 s
Downloaded cached nix-cmd (1 MiB) in 14ms
66.69 s
Progress: 0 of 1 built, 62 of 65 downloaded from cache
66.69 s
Downloading cached nix from https://cache.nix-ci.com
66.72 s
Downloaded cached nix (3.9 MiB) in 26ms
66.72 s
Progress: 0 of 1 built, 63 of 65 downloaded from cache
66.72 s
Downloading cached nix from https://cache.nix-ci.com
66.73 s
Downloaded cached nix (8848 B) in 11ms
66.73 s
Progress: 0 of 1 built, 64 of 65 downloaded from cache
66.73 s
Downloading cached nix-ci-check-gammaloop-nextest-clinnet from https://cache.nix-ci.com
66.73 s
Downloaded cached nix-ci-check-gammaloop-nextest-clinnet (1128 B) in 4ms
66.73 s
Progress: 0 of 1 built, 65 of 65 downloaded from cache
66.88 s
evaluating derivation 'gdo you want to allow configuration setting 'extra-substituters' to be set to 'https://cache.nix-ci.com ' (y/N)? do you want to permanently mark this value as untrusted (y/N)? warning: ignoring untrusted flake configuration setting 'extra-substituters'.
66.88 s
Pass '--accept-flake-config' to trust it
66.88 s
do you want to allow configuration setting 'extra-trusted-public-keys' to be set to 'nix-ci:g3xV5BDTLtIBZr/A00IU1x0EtKKlb7YLgBN2SgYgM6A= ' (y/N)? do you want to permanently mark this value as untrusted (y/N)? warning: ignoring untrusted flake configuration setting 'extra-trusted-public-keys'.
66.88 s
Pass '--accept-flake-config' to trust it
81.16 s
copying '/nix/store/cis1
evaluating derivation 'g
copying '/nix/store/cis1
evaluating derivation 'g
copying '/nix/store/cis1
evaluating derivation 'g
querying source on https
[1 /0 /1 copied (304.0 KiB
[1 /0 /1 copied (5.7 /201.4
[1 /0 /1 copied (9.4 /201.4
[1 /0 /1 copied (13.4 /201.
[1 /0 /1 copied (18.6 /201.
[1 /0 /1 copied (22.1 /201.
[1 /0 /1 copied (24.7 /201.
[1 /0 /1 copied (32.2 /201.
[1 /0 /1 copied (35.0 /201.
[1 /0 /1 copied (37.7 /201.
[1 /0 /1 copied (39.8 /201.
[1 /0 /1 copied (42.1 /201.
[1 /0 /1 copied (46.1 /201.
[1 /0 /1 copied (47.7 /201.
[1 /0 /1 copied (50.4 /201.
[1 /0 /1 copied (53.1 /201.
[1 /0 /1 copied (55.0 /201.
[1 /0 /1 copied (58.1 /201.
[1 /0 /1 copied (60.6 /201.
[1 /0 /1 copied (62.7 /201.
[1 /0 /1 copied (64.5 /201.
[1 /0 /1 copied (66.7 /201.
[1 /0 /1 copied (69.6 /201.
[1 /0 /1 copied (72.1 /201.
[1 /0 /1 copied (74.0 /201.
[1 /0 /1 copied (75.5 /201.
[1 /0 /1 copied (77.7 /201.
[1 /0 /1 copied (80.3 /201.
[1 /0 /1 copied (83.2 /201.
[1 /0 /1 copied (86.4 /201.
[1 /0 /1 copied (88.7 /201.
[1 /0 /1 copied (90.8 /201.
[1 /0 /1 copied (94.0 /201.
[1 /0 /1 copied (96.6 /201.
[1 /0 /1 copied (98.7 /201.
[1 /0 /1 copied (101.6 /201
[1 /0 /1 copied (104.0 /201
[1 /0 /1 copied (106.5 /201
[1 /0 /1 copied (108.5 /201
[1 /0 /1 copied (112.3 /201
[1 /0 /1 copied (114.7 /201
[1 /0 /1 copied (116.5 /201
[1 /0 /1 copied (118.1 /201
[1 /0 /1 copied (129.6 /201
[1 /0 /1 copied (133.4 /201
[1 /0 /1 copied (151.5 /201
[1 /0 /1 copied (158.1 /201
[1 /0 /1 copied (159.2 /201
[1 /0 /1 copied (160.9 /201
[1 /0 /1 copied (162.1 /201
[1 /0 /1 copied (163.5 /201
[1 /0 /1 copied (164.6 /201
[1 /0 /1 copied (165.8 /201
[1 /0 /1 copied (167.1 /201
[1 /0 /1 copied (168.2 /201
[1 /0 /1 copied (169.7 /201
[1 /0 /1 copied (170.7 /201
[1 /0 /1 copied (171.8 /201
[1 /0 /1 copied (172.9 /201
[1 /0 /1 copied (174.1 /201
[1 /0 /1 copied (175.1 /201
[1 /0 /1 copied (176.4 /201
[1 /0 /1 copied (177.5 /201
[1 /0 /1 copied (187.4 /201
[1 /0 /1 copied (189.0 /201
[1 /0 /1 copied (191.1 /201
[1 /0 /1 copied (193.0 /201
[1 /0 /1 copied (194.7 /201
[1 /0 /1 copied (201.4 MiB
[1 copied (201.4 MiB), 4
[0 /39 built, 15 /1 /124 co
[0 /40 built, 16 /11 /130 c
[0 /40 built, 16 /20 /130 c
[0 /39 built, 16 /25 /130 c
[0 /38 built, 16 /32 /130 c
[0 /37 built, 16 /40 /130 c
[0 /34 built, 16 /47 /130 c
[0 /30 built, 16 /57 /130 c
[0 /29 built, 15 /62 /130 c
[0 /25 built, 11 /70 /130 c
[0 /25 built, 11 /71 /130 c
[0 /24 built, 10 /72 /130 c
[1 /0 /24 built, 10 /72 /130
[2 /0 /24 built, 10 /72 /130crane-dummy-cargo-target.rs> structuredAttrs is enabled
81.16 s
[3 /0 /24 built, 8 /74 /130 crane-dummy-proc-macro-cargo-target.rs> structuredAttrs is enabled
81.19 s
crane-dummy-cargo-target.rs (post)> Uploading to the NixCI cache: /nix/store/h9idxv2cp1lvcmhzmgqyh438ad00r3gj-crane-dummy-cargo-target.rs
81.26 s
[3 /0 /23 built, 9 /74 /130 crane-dummy-cargo-target.rs (post)> warning: 'warn-short-path-literals' is deprecated, use 'lint-short-path-literals = ignore' instead
81.30 s
crane-dummy-cargo-target.rs (post)> copying 0 paths...
81.38 s
crane-dummy-cargo-target.rs (post)> warning: 'warn-short-path-literals' is deprecated, use 'lint-short-path-literals = ignore' instead
81.79 s
crane-dummy-cargo-target.rs (post)> copying 0 paths...
81.84 s
crane-dummy-proc-macro-cargo-target.rs (post)> Uploading to the NixCI cache: /nix/store/pqldjybaz45ml2lph0qcpw3vpa5j90n9-crane-dummy-proc-macro-cargo-target.rs
81.89 s
[2 /1 /24 built, 9 /74 /130 crane-dummy-proc-macro-cargo-target.rs (post)> warning: 'warn-short-path-literals' is deprecated, use 'lint-short-path-literals = ignore' instead
81.93 s
crane-dummy-proc-macro-cargo-target.rs (post)> copying 0 paths...
81.99 s
crane-dummy-proc-macro-cargo-target.rs (post)> warning: 'warn-short-path-literals' is deprecated, use 'lint-short-path-literals = ignore' instead
82.05 s
crane-dummy-proc-macro-cargo-target.rs (post)> copying 0 paths...
82.10 s
gammaloop-nextest-binaries-clinnet (post)> Uploading to the NixCI cache: /nix/store/r6d9ks0lpr631mrcy43137c895a0w5ns-gammaloop-nextest-binaries-clinnet
82.14 s
[1 /2 /23 built, 5 /78 /130 gammaloop-nextest-binaries-clinnet (post)> warning: 'warn-short-path-literals' is deprecated, use 'lint-short-path-literals = ignore' instead
82.18 s
gammaloop-nextest-binaries-clinnet (post)> copying 0 paths...
82.24 s
gammaloop-nextest-binaries-clinnet (post)> warning: 'warn-short-path-literals' is deprecated, use 'lint-short-path-literals = ignore' instead
83.22 s
gammaloop-nextest-binaries-clinnet (post)> copying 0 paths...
83.73 s
[3 /16 built, 15 /92 /130 c
[3 /16 built, 11 /103 /130
[3 /16 built, 10 /105 /130
[3 /16 built, 7 /113 /130 c
[3 /16 built, 6 /116 /130 c
[3 /16 built, 8 /117 /130 c
[3 /16 built, 7 /119 /130 c
[3 /15 built, 6 /120 /130 c
[1 /3 /14 built, 5 /121 /130builder.pl> Running phase: patchPhase
83.73 s
builder.pl> Running phase: updateAutotoolsGnuConfigScriptsPhase
83.74 s
builder.pl> Running phase: configurePhase
83.75 s
builder.pl> no configure script, doing nothing
83.75 s
builder.pl> Running phase: buildPhase
83.76 s
builder.pl> Running phase: checkPhase
83.77 s
builder.pl> Running phase: installPhase
83.77 s
builder.pl> no Makefile or custom installPhase, doing nothing
83.77 s
builder.pl> Running phase: fixupPhase
83.78 s
builder.pl> shrinking RPATHs of ELF executables and libraries in /nix/store/zzmspl8wdn2a3ancrz8dg3kci887nw6d-builder.pl
83.78 s
builder.pl> checking for references to /build/ in /nix/store/zzmspl8wdn2a3ancrz8dg3kci887nw6d-builder.pl...
83.79 s
builder.pl> patching script interpreter paths in /nix/store/zzmspl8wdn2a3ancrz8dg3kci887nw6d-builder.pl
83.83 s
builder.pl (post)> Uploading to the NixCI cache: /nix/store/zzmspl8wdn2a3ancrz8dg3kci887nw6d-builder.pl
83.89 s
builder.pl (post)> warning: 'warn-short-path-literals' is deprecated, use 'lint-short-path-literals = ignore' instead
83.93 s
builder.pl (post)> copying 0 paths...
84.00 s
builder.pl (post)> warning: 'warn-short-path-literals' is deprecated, use 'lint-short-path-literals = ignore' instead
84.19 s
builder.pl (post)> copying 0 paths...
84.81 s
[4 /14 built, 2 /124 /130 c
[4 /12 built, 2 /125 /130 c
[4 /12 built, 2 /127 /130 c
[1 /4 /11 built, 1 /128 /130typst> structuredAttrs is enabled
84.86 s
typst> created 10 symlinks in user environment
84.96 s
typst (post)> Uploading to the NixCI cache: /nix/store/5f1a3n27fy3y8pf6snxr2sbzwhk9brr2-typst-0.15.1-env
85.00 s
typst (post)> warning: 'warn-short-path-literals' is deprecated, use 'lint-short-path-literals = ignore' instead
85.03 s
typst (post)> copying 0 paths...
85.08 s
typst (post)> warning: 'warn-short-path-literals' is deprecated, use 'lint-short-path-literals = ignore' instead
85.29 s
typst (post)> copying 0 paths...
86.02 s
[5 /12 built, 1 /128 /130 c
[1 /5 /10 built, 1 /129 /130
[2 /5 /10 built, 1 /129 /130
[2 /5 /9 built, 130 copiedrust-stable-with-std (post)> Uploading to the NixCI cache: /nix/store/wg9kw4yhn1jn01mjs8cwx5mz69l1s64z-rust-stable-with-std-2026-09-03
86.06 s
rust-stable-with-std (post)> warning: 'warn-short-path-literals' is deprecated, use 'lint-short-path-literals = ignore' instead
86.09 s
rust-stable-with-std (post)> copying 0 paths...
86.13 s
rust-stable-with-std (post)> warning: 'warn-short-path-literals' is deprecated, use 'lint-short-path-literals = ignore' instead
86.17 s
rust-stable-with-std (post)> copying 0 paths...
86.33 s
[1 /6 /10 built, 130 copieclippy-stable-with-std (post)> Uploading to the NixCI cache: /nix/store/s9nslw8h7m9vh88zd2hilmjb298pfca4-clippy-stable-with-std-2026-09-03
86.37 s
clippy-stable-with-std (post)> warning: 'warn-short-path-literals' is deprecated, use 'lint-short-path-literals = ignore' instead
86.40 s
clippy-stable-with-std (post)> copying 0 paths...
86.44 s
clippy-stable-with-std (post)> warning: 'warn-short-path-literals' is deprecated, use 'lint-short-path-literals = ignore' instead
86.48 s
clippy-stable-with-std (post)> copying 0 paths...
86.56 s
[7 /10 built, 130 copied rust-stable-with-components> /nix/store/wg9kw4yhn1jn01mjs8cwx5mz69l1s64z-rust-stable-with-std-2026-09-03/bin:
86.56 s
[1 /7 /9 built, 130 copiedrust-stable-with-components> rust-gdbgui: Keeping existing link to /nix/store/s9nslw8h7m9vh88zd2hilmjb298pfca4-clippy-stable-with-std-2026-09-03/bin/rust-gdbgui
86.56 s
rust-stable-with-components> rustdoc: Keeping existing link to /nix/store/s9nslw8h7m9vh88zd2hilmjb298pfca4-clippy-stable-with-std-2026-09-03/bin/rustdoc
86.56 s
rust-stable-with-components> rust-lldb: Keeping existing link to /nix/store/s9nslw8h7m9vh88zd2hilmjb298pfca4-clippy-stable-with-std-2026-09-03/bin/rust-lldb
86.56 s
rust-stable-with-components> rustc: Keeping existing link to /nix/store/s9nslw8h7m9vh88zd2hilmjb298pfca4-clippy-stable-with-std-2026-09-03/bin/rustc
86.57 s
rust-stable-with-components> rust-gdb: Keeping existing link to /nix/store/s9nslw8h7m9vh88zd2hilmjb298pfca4-clippy-stable-with-std-2026-09-03/bin/rust-gdb
86.57 s
rust-stable-with-components> /nix/store/wg9kw4yhn1jn01mjs8cwx5mz69l1s64z-rust-stable-with-std-2026-09-03/lib:
86.57 s
rust-stable-with-components> librustc_driver-eaf3ed1d23ca5027.so: Keeping existing link to /nix/store/s9nslw8h7m9vh88zd2hilmjb298pfca4-clippy-stable-with-std-2026-09-03/lib/librustc_driver-eaf3ed1d23ca5027.so
87.12 s
rust-stable-with-components (post)> Uploading to the NixCI cache: /nix/store/c3bpv60f5wgp4pmgsifaykxk214h6463-rust-stable-with-components-2026-09-03
87.16 s
rust-stable-with-components (post)> warning: 'warn-short-path-literals' is deprecated, use 'lint-short-path-literals = ignore' instead
87.23 s
rust-stable-with-components (post)> copying 0 paths...
87.28 s
rust-stable-with-components (post)> warning: 'warn-short-path-literals' is deprecated, use 'lint-short-path-literals = ignore' instead
87.32 s
rust-stable-with-components (post)> copying 0 paths...
87.71 s
[8 /10 built, 130 copied
[1 /8 /9 built, 130 copiedgammaloop-nextest-clinnet> Nextest worker budget: 16
87.72 s
gammaloop-nextest-clinnet> Extracting 4 binaries (including 1 non-test binary), 1 build script output directory, and 1 linked path to /build/source
87.84 s
gammaloop-nextest-clinnet> Extracted 16 files to /build/source in 0.12s
87.86 s
gammaloop-nextest-clinnet> ------------
87.86 s
gammaloop-nextest-clinnet> Nextest run ID d2e81319-69f2-42fb-b275-6b948a787673 with nextest profile: ci_gammaloop
87.86 s
gammaloop-nextest-clinnet> Starting 38 tests across 3 binaries
188.71 s
gammaloop-nextest-clinnet> FAIL [ 100.777s] (32/38) clinnet::public_typst_behavior public_linnest_overlays_follow_the_unit
188.71 s
gammaloop-nextest-clinnet> stdout ---
188.71 s
gammaloop-nextest-clinnet>
188.71 s
gammaloop-nextest-clinnet> running 1 test
188.71 s
gammaloop-nextest-clinnet> test public_linnest_overlays_follow_the_unit has been running for over 60 seconds
188.71 s
gammaloop-nextest-clinnet> test public_linnest_overlays_follow_the_unit ... FAILED
188.71 s
gammaloop-nextest-clinnet>
188.71 s
gammaloop-nextest-clinnet> failures:
188.71 s
gammaloop-nextest-clinnet>
188.71 s
gammaloop-nextest-clinnet> failures:
188.71 s
gammaloop-nextest-clinnet> public_linnest_overlays_follow_the_unit
188.71 s
gammaloop-nextest-clinnet>
188.71 s
gammaloop-nextest-clinnet> test result: FAILED. 0 passed; 1 failed; 0 ignored; 0 measured; 17 filtered out; finished in 100.77s
188.71 s
gammaloop-nextest-clinnet>
188.71 s
gammaloop-nextest-clinnet> stderr ---
188.71 s
gammaloop-nextest-clinnet>
188.71 s
gammaloop-nextest-clinnet> thread 'public_linnest_overlays_follow_the_unit' (317) panicked at crates/clinnet/tests/public_typst_behavior.rs:81:55:
188.71 s
gammaloop-nextest-clinnet> called `Result::unwrap()` on an `Err` value: typst failed while compiling template /build/.tmp6idmUm/.clinnet/templates/linnest-public-behavior.svg
188.71 s
gammaloop-nextest-clinnet>
188.71 s
gammaloop-nextest-clinnet> Command executed:
188.71 s
gammaloop-nextest-clinnet> "typst" "c" "/build/.tmp6idmUm/.clinnet/templates/linnest-public-behavior.typ" "/build/.tmp6idmUm/.clinnet/templates/linnest-public-behavior.svg" "--root" "/build/.tmp6idmUm/.clinnet/templates"
188.71 s
gammaloop-nextest-clinnet>
188.71 s
gammaloop-nextest-clinnet> Typst stdout:
188.71 s
gammaloop-nextest-clinnet>
188.71 s
gammaloop-nextest-clinnet>
188.71 s
gammaloop-nextest-clinnet> Typst stderr:
188.71 s
gammaloop-nextest-clinnet>
188.71 s
gammaloop-nextest-clinnet>
188.71 s
gammaloop-nextest-clinnet> Location:
188.71 s
gammaloop-nextest-clinnet> crates/clinnet/src/lib.rs:741:13
188.71 s
gammaloop-nextest-clinnet> stack backtrace:
188.71 s
gammaloop-nextest-clinnet> 0: __rustc::rust_begin_unwind
188.71 s
gammaloop-nextest-clinnet> 1: core::panicking::panic_fmt
188.71 s
gammaloop-nextest-clinnet> 2: core::result::unwrap_failed
188.71 s
gammaloop-nextest-clinnet> 3: public_typst_behavior::render
188.71 s
gammaloop-nextest-clinnet> 4: <std::sync::once::Once>::call_once_force::<<std::sync::once_lock::OnceLock<alloc::string::String>>::initialize<<std::sync::once_lock::OnceLock<alloc::string::String>>::get_or_init<public_typst_behavior::linnest_public_svg::{closure#0}>::{closure#0}, !>::{closure#0}>::{closure#0}
188.71 s
gammaloop-nextest-clinnet> 5: <std::sys::sync::once::futex::Once>::call
188.71 s
gammaloop-nextest-clinnet> 6: <std::sync::once_lock::OnceLock<alloc::string::String>>::initialize::<<std::sync::once_lock::OnceLock<alloc::string::String>>::get_or_init<public_typst_behavior::linnest_public_svg::{closure#0}>::{closure#0}, !>
188.71 s
gammaloop-nextest-clinnet> 7: <public_typst_behavior::public_linnest_overlays_follow_the_unit::{closure#0} as core::ops::function::FnOnce<()>>::call_once
188.71 s
gammaloop-nextest-clinnet> note: Some details are omitted, run with `RUST_BACKTRACE=full` for a verbose backtrace.
188.71 s
gammaloop-nextest-clinnet>
227.19 s
gammaloop-nextest-clinnet> FAIL [ 139.312s] (33/38) clinnet::public_typst_behavior public_linnest_arrow_shafts_and_crossing_gaps
227.19 s
gammaloop-nextest-clinnet> stdout ---
227.19 s
gammaloop-nextest-clinnet>
227.19 s
gammaloop-nextest-clinnet> running 1 test
227.19 s
gammaloop-nextest-clinnet> test public_linnest_arrow_shafts_and_crossing_gaps has been running for over 60 seconds
227.19 s
gammaloop-nextest-clinnet> test public_linnest_arrow_shafts_and_crossing_gaps ... FAILED
227.19 s
gammaloop-nextest-clinnet>
227.19 s
gammaloop-nextest-clinnet> failures:
227.19 s
gammaloop-nextest-clinnet>
227.19 s
gammaloop-nextest-clinnet> failures:
227.19 s
gammaloop-nextest-clinnet> public_linnest_arrow_shafts_and_crossing_gaps
227.19 s
gammaloop-nextest-clinnet>
227.19 s
gammaloop-nextest-clinnet> test result: FAILED. 0 passed; 1 failed; 0 ignored; 0 measured; 17 filtered out; finished in 139.31s
227.19 s
gammaloop-nextest-clinnet>
227.19 s
gammaloop-nextest-clinnet> stderr ---
227.19 s
gammaloop-nextest-clinnet>
227.19 s
gammaloop-nextest-clinnet> thread 'public_linnest_arrow_shafts_and_crossing_gaps' (267) panicked at crates/clinnet/tests/public_typst_behavior.rs:81:55:
227.19 s
gammaloop-nextest-clinnet> called `Result::unwrap()` on an `Err` value: typst failed while compiling template /build/.tmpErcbJg/.clinnet/templates/linnest-public-behavior.svg
227.19 s
gammaloop-nextest-clinnet>
227.19 s
gammaloop-nextest-clinnet> Command executed:
227.19 s
gammaloop-nextest-clinnet> "typst" "c" "/build/.tmpErcbJg/.clinnet/templates/linnest-public-behavior.typ" "/build/.tmpErcbJg/.clinnet/templates/linnest-public-behavior.svg" "--root" "/build/.tmpErcbJg/.clinnet/templates"
227.19 s
gammaloop-nextest-clinnet>
227.19 s
gammaloop-nextest-clinnet> Typst stdout:
227.19 s
gammaloop-nextest-clinnet>
227.19 s
gammaloop-nextest-clinnet>
227.19 s
gammaloop-nextest-clinnet> Typst stderr:
227.19 s
gammaloop-nextest-clinnet>
227.19 s
gammaloop-nextest-clinnet>
227.19 s
gammaloop-nextest-clinnet> Location:
227.19 s
gammaloop-nextest-clinnet> crates/clinnet/src/lib.rs:741:13
227.19 s
gammaloop-nextest-clinnet> stack backtrace:
227.19 s
gammaloop-nextest-clinnet> 0: __rustc::rust_begin_unwind
227.19 s
gammaloop-nextest-clinnet> 1: core::panicking::panic_fmt
227.19 s
gammaloop-nextest-clinnet> 2: core::result::unwrap_failed
227.19 s
gammaloop-nextest-clinnet> 3: public_typst_behavior::render
227.19 s
gammaloop-nextest-clinnet> 4: <std::sync::once::Once>::call_once_force::<<std::sync::once_lock::OnceLock<alloc::string::String>>::initialize<<std::sync::once_lock::OnceLock<alloc::string::String>>::get_or_init<public_typst_behavior::linnest_public_svg::{closure#0}>::{closure#0}, !>::{closure#0}>::{closure#0}
227.19 s
gammaloop-nextest-clinnet> 5: <std::sys::sync::once::futex::Once>::call
227.19 s
gammaloop-nextest-clinnet> 6: <std::sync::once_lock::OnceLock<alloc::string::String>>::initialize::<<std::sync::once_lock::OnceLock<alloc::string::String>>::get_or_init<public_typst_behavior::linnest_public_svg::{closure#0}>::{closure#0}, !>
227.19 s
gammaloop-nextest-clinnet> 7: <public_typst_behavior::public_linnest_arrow_shafts_and_crossing_gaps::{closure#0} as core::ops::function::FnOnce<()>>::call_once
227.19 s
gammaloop-nextest-clinnet> note: Some details are omitted, run with `RUST_BACKTRACE=full` for a verbose backtrace.
227.19 s
gammaloop-nextest-clinnet>
247.87 s
gammaloop-nextest-clinnet> ------------
247.87 s
gammaloop-nextest-clinnet> Summary [ 160.014s] 38 tests run: 36 passed (5 slow ), 2 failed , 0 skipped
247.87 s
gammaloop-nextest-clinnet> FAIL [ 100.777s] (32/38) clinnet::public_typst_behavior public_linnest_overlays_follow_the_unit
247.87 s
gammaloop-nextest-clinnet> stdout ---
247.87 s
gammaloop-nextest-clinnet>
247.87 s
gammaloop-nextest-clinnet> running 1 test
247.87 s
gammaloop-nextest-clinnet> test public_linnest_overlays_follow_the_unit has been running for over 60 seconds
247.87 s
gammaloop-nextest-clinnet> test public_linnest_overlays_follow_the_unit ... FAILED
247.87 s
gammaloop-nextest-clinnet>
247.87 s
gammaloop-nextest-clinnet> failures:
247.87 s
gammaloop-nextest-clinnet>
247.87 s
gammaloop-nextest-clinnet> failures:
247.87 s
gammaloop-nextest-clinnet> public_linnest_overlays_follow_the_unit
247.87 s
gammaloop-nextest-clinnet>
247.87 s
gammaloop-nextest-clinnet> test result: FAILED. 0 passed; 1 failed; 0 ignored; 0 measured; 17 filtered out; finished in 100.77s
247.87 s
gammaloop-nextest-clinnet>
247.87 s
gammaloop-nextest-clinnet> stderr ---
247.87 s
gammaloop-nextest-clinnet>
247.87 s
gammaloop-nextest-clinnet> thread 'public_linnest_overlays_follow_the_unit' (317) panicked at crates/clinnet/tests/public_typst_behavior.rs:81:55:
247.87 s
gammaloop-nextest-clinnet> called `Result::unwrap()` on an `Err` value: typst failed while compiling template /build/.tmp6idmUm/.clinnet/templates/linnest-public-behavior.svg
247.87 s
gammaloop-nextest-clinnet>
247.87 s
gammaloop-nextest-clinnet> Command executed:
247.87 s
gammaloop-nextest-clinnet> "typst" "c" "/build/.tmp6idmUm/.clinnet/templates/linnest-public-behavior.typ" "/build/.tmp6idmUm/.clinnet/templates/linnest-public-behavior.svg" "--root" "/build/.tmp6idmUm/.clinnet/templates"
247.87 s
gammaloop-nextest-clinnet>
247.87 s
gammaloop-nextest-clinnet> Typst stdout:
247.87 s
gammaloop-nextest-clinnet>
247.87 s
gammaloop-nextest-clinnet>
247.87 s
gammaloop-nextest-clinnet> Typst stderr:
247.87 s
gammaloop-nextest-clinnet>
247.87 s
gammaloop-nextest-clinnet>
247.87 s
gammaloop-nextest-clinnet> Location:
247.87 s
gammaloop-nextest-clinnet> crates/clinnet/src/lib.rs:741:13
247.87 s
gammaloop-nextest-clinnet> stack backtrace:
247.87 s
gammaloop-nextest-clinnet> 0: __rustc::rust_begin_unwind
247.87 s
gammaloop-nextest-clinnet> 1: core::panicking::panic_fmt
247.87 s
gammaloop-nextest-clinnet> 2: core::result::unwrap_failed
247.87 s
gammaloop-nextest-clinnet> 3: public_typst_behavior::render
247.87 s
gammaloop-nextest-clinnet> 4: <std::sync::once::Once>::call_once_force::<<std::sync::once_lock::OnceLock<alloc::string::String>>::initialize<<std::sync::once_lock::OnceLock<alloc::string::String>>::get_or_init<public_typst_behavior::linnest_public_svg::{closure#0}>::{closure#0}, !>::{closure#0}>::{closure#0}
247.87 s
gammaloop-nextest-clinnet> 5: <std::sys::sync::once::futex::Once>::call
247.87 s
gammaloop-nextest-clinnet> 6: <std::sync::once_lock::OnceLock<alloc::string::String>>::initialize::<<std::sync::once_lock::OnceLock<alloc::string::String>>::get_or_init<public_typst_behavior::linnest_public_svg::{closure#0}>::{closure#0}, !>
247.87 s
gammaloop-nextest-clinnet> 7: <public_typst_behavior::public_linnest_overlays_follow_the_unit::{closure#0} as core::ops::function::FnOnce<()>>::call_once
247.87 s
gammaloop-nextest-clinnet> note: Some details are omitted, run with `RUST_BACKTRACE=full` for a verbose backtrace.
247.87 s
gammaloop-nextest-clinnet>
247.87 s
gammaloop-nextest-clinnet> FAIL [ 139.312s] (33/38) clinnet::public_typst_behavior public_linnest_arrow_shafts_and_crossing_gaps
247.87 s
gammaloop-nextest-clinnet> stdout ---
247.87 s
gammaloop-nextest-clinnet>
247.87 s
gammaloop-nextest-clinnet> running 1 test
247.87 s
gammaloop-nextest-clinnet> test public_linnest_arrow_shafts_and_crossing_gaps has been running for over 60 seconds
247.87 s
gammaloop-nextest-clinnet> test public_linnest_arrow_shafts_and_crossing_gaps ... FAILED
247.87 s
gammaloop-nextest-clinnet>
247.87 s
gammaloop-nextest-clinnet> failures:
247.87 s
gammaloop-nextest-clinnet>
247.87 s
gammaloop-nextest-clinnet> failures:
247.87 s
gammaloop-nextest-clinnet> public_linnest_arrow_shafts_and_crossing_gaps
247.87 s
gammaloop-nextest-clinnet>
247.87 s
gammaloop-nextest-clinnet> test result: FAILED. 0 passed; 1 failed; 0 ignored; 0 measured; 17 filtered out; finished in 139.31s
247.87 s
gammaloop-nextest-clinnet>
247.87 s
gammaloop-nextest-clinnet> stderr ---
247.87 s
gammaloop-nextest-clinnet>
247.87 s
gammaloop-nextest-clinnet> thread 'public_linnest_arrow_shafts_and_crossing_gaps' (267) panicked at crates/clinnet/tests/public_typst_behavior.rs:81:55:
247.87 s
gammaloop-nextest-clinnet> called `Result::unwrap()` on an `Err` value: typst failed while compiling template /build/.tmpErcbJg/.clinnet/templates/linnest-public-behavior.svg
247.87 s
gammaloop-nextest-clinnet>
247.87 s
gammaloop-nextest-clinnet> Command executed:
247.87 s
gammaloop-nextest-clinnet> "typst" "c" "/build/.tmpErcbJg/.clinnet/templates/linnest-public-behavior.typ" "/build/.tmpErcbJg/.clinnet/templates/linnest-public-behavior.svg" "--root" "/build/.tmpErcbJg/.clinnet/templates"
247.87 s
gammaloop-nextest-clinnet>
247.87 s
gammaloop-nextest-clinnet> Typst stdout:
247.87 s
gammaloop-nextest-clinnet>
247.87 s
gammaloop-nextest-clinnet>
247.87 s
gammaloop-nextest-clinnet> Typst stderr:
247.87 s
gammaloop-nextest-clinnet>
247.87 s
gammaloop-nextest-clinnet>
247.87 s
gammaloop-nextest-clinnet> Location:
247.87 s
gammaloop-nextest-clinnet> crates/clinnet/src/lib.rs:741:13
247.87 s
gammaloop-nextest-clinnet> stack backtrace:
247.87 s
gammaloop-nextest-clinnet> 0: __rustc::rust_begin_unwind
247.87 s
gammaloop-nextest-clinnet> 1: core::panicking::panic_fmt
247.87 s
gammaloop-nextest-clinnet> 2: core::result::unwrap_failed
247.87 s
gammaloop-nextest-clinnet> 3: public_typst_behavior::render
247.87 s
gammaloop-nextest-clinnet> 4: <std::sync::once::Once>::call_once_force::<<std::sync::once_lock::OnceLock<alloc::string::String>>::initialize<<std::sync::once_lock::OnceLock<alloc::string::String>>::get_or_init<public_typst_behavior::linnest_public_svg::{closure#0}>::{closure#0}, !>::{closure#0}>::{closure#0}
247.87 s
gammaloop-nextest-clinnet> 5: <std::sys::sync::once::futex::Once>::call
247.87 s
gammaloop-nextest-clinnet> 6: <std::sync::once_lock::OnceLock<alloc::string::String>>::initialize::<<std::sync::once_lock::OnceLock<alloc::string::String>>::get_or_init<public_typst_behavior::linnest_public_svg::{closure#0}>::{closure#0}, !>
247.87 s
gammaloop-nextest-clinnet> 7: <public_typst_behavior::public_linnest_arrow_shafts_and_crossing_gaps::{closure#0} as core::ops::function::FnOnce<()>>::call_once
247.87 s
gammaloop-nextest-clinnet> note: Some details are omitted, run with `RUST_BACKTRACE=full` for a verbose backtrace.
247.87 s
gammaloop-nextest-clinnet>
247.88 s
gammaloop-nextest-clinnet> error : test run failed
247.97 s
gammaloop-nextest-clinnet>
247.97 s
gammaloop-nextest-clinnet> ========== nextest test summary ==========
247.97 s
gammaloop-nextest-clinnet> report: target/nextest/ci_gammaloop/junit.xml
247.97 s
gammaloop-nextest-clinnet> tests: 38, failures: 2, errors: 0
247.97 s
gammaloop-nextest-clinnet>
247.97 s
gammaloop-nextest-clinnet> 1. clinnet::public_typst_behavior::public_linnest_overlays_follow_the_unit
247.97 s
gammaloop-nextest-clinnet> failure: test failure with exit code 101
247.97 s
gammaloop-nextest-clinnet> thread 'public_linnest_overlays_follow_the_unit' (317) panicked at crates/clinnet/tests/public_typst_behavior.rs:81:55:
247.97 s
gammaloop-nextest-clinnet> called `Result::unwrap()` on an `Err` value: typst failed while compiling template /build/.tmp6idmUm/.clinnet/templates/linnest-public-behavior.svg
247.97 s
gammaloop-nextest-clinnet>
247.97 s
gammaloop-nextest-clinnet> Command executed:
247.97 s
gammaloop-nextest-clinnet> "typst" "c" "/build/.tmp6idmUm/.clinnet/templates/linnest-public-behavior.typ" "/build/.tmp6idmUm/.clinnet/templates/linnest-public-behavior.svg" "--root" "/build/.tmp6idmUm/.clinnet/templates"
247.97 s
gammaloop-nextest-clinnet>
247.97 s
gammaloop-nextest-clinnet> Typst stdout:
247.97 s
gammaloop-nextest-clinnet>
247.97 s
gammaloop-nextest-clinnet>
247.97 s
gammaloop-nextest-clinnet> Typst stderr:
247.97 s
gammaloop-nextest-clinnet>
247.97 s
gammaloop-nextest-clinnet>
247.97 s
gammaloop-nextest-clinnet> Location:
247.97 s
gammaloop-nextest-clinnet> crates/clinnet/src/lib.rs:741:13
247.97 s
gammaloop-nextest-clinnet> stack backtrace:
247.97 s
gammaloop-nextest-clinnet> 0: __rustc::rust_begin_unwind
247.97 s
gammaloop-nextest-clinnet> 1: core::panicking::panic_fmt
247.97 s
gammaloop-nextest-clinnet> 2: core::result::unwrap_failed
247.97 s
gammaloop-nextest-clinnet> 3: public_typst_behavior::render
247.97 s
gammaloop-nextest-clinnet> 4: <std::sync::once::Once>::call_once_force::<<std::sync::once_lock::OnceLock<alloc::string::String>>::initialize<<std::sync::once_lock::OnceLock<alloc::string::String>>::get_or_init<public_typst_behavior::linnest_public_svg::{closure#0}>::{closure#0}, !>::{closure#0}>::{closure#0}
247.97 s
gammaloop-nextest-clinnet> 5: <std::sys::sync::once::futex::Once>::call
247.97 s
gammaloop-nextest-clinnet> 6: <std::sync::once_lock::OnceLock<alloc::string::String>>::initialize::<<std::sync::once_lock::OnceLock<alloc::string::String>>::get_or_init<public_typst_behavior::linnest_public_svg::{closure#0}>::{closure#0}, !>
247.97 s
gammaloop-nextest-clinnet> 7: <public_typst_behavior::public_linnest_overlays_follow_the_unit::{closure#0} as core::ops::function::FnOnce<()>>::call_once
247.97 s
gammaloop-nextest-clinnet> note: Some details are omitted, run with `RUST_BACKTRACE=full` for a verbose backtrace.
247.97 s
gammaloop-nextest-clinnet> system-out
247.97 s
gammaloop-nextest-clinnet> running 1 test
247.97 s
gammaloop-nextest-clinnet> test public_linnest_overlays_follow_the_unit has been running for over 60 seconds
247.97 s
gammaloop-nextest-clinnet> test public_linnest_overlays_follow_the_unit ... FAILED
247.97 s
gammaloop-nextest-clinnet>
247.97 s
gammaloop-nextest-clinnet> failures:
247.97 s
gammaloop-nextest-clinnet>
247.97 s
gammaloop-nextest-clinnet> failures:
247.97 s
gammaloop-nextest-clinnet> public_linnest_overlays_follow_the_unit
247.97 s
gammaloop-nextest-clinnet>
247.97 s
gammaloop-nextest-clinnet> test result: FAILED. 0 passed; 1 failed; 0 ignored; 0 measured; 17 filtered out; finished in 100.77s
247.97 s
gammaloop-nextest-clinnet> system-err
247.97 s
gammaloop-nextest-clinnet> thread 'public_linnest_overlays_follow_the_unit' (317) panicked at crates/clinnet/tests/public_typst_behavior.rs:81:55:
247.97 s
gammaloop-nextest-clinnet> called `Result::unwrap()` on an `Err` value: typst failed while compiling template /build/.tmp6idmUm/.clinnet/templates/linnest-public-behavior.svg
247.97 s
gammaloop-nextest-clinnet>
247.97 s
gammaloop-nextest-clinnet> Command executed:
247.97 s
gammaloop-nextest-clinnet> "typst" "c" "/build/.tmp6idmUm/.clinnet/templates/linnest-public-behavior.typ" "/build/.tmp6idmUm/.clinnet/templates/linnest-public-behavior.svg" "--root" "/build/.tmp6idmUm/.clinnet/templates"
247.97 s
gammaloop-nextest-clinnet>
247.97 s
gammaloop-nextest-clinnet> Typst stdout:
247.97 s
gammaloop-nextest-clinnet>
247.97 s
gammaloop-nextest-clinnet>
247.97 s
gammaloop-nextest-clinnet> Typst stderr:
247.97 s
gammaloop-nextest-clinnet>
247.97 s
gammaloop-nextest-clinnet>
247.97 s
gammaloop-nextest-clinnet> Location:
247.97 s
gammaloop-nextest-clinnet> crates/clinnet/src/lib.rs:741:13
247.97 s
gammaloop-nextest-clinnet> stack backtrace:
247.97 s
gammaloop-nextest-clinnet> 0: __rustc::rust_begin_unwind
247.97 s
gammaloop-nextest-clinnet> 1: core::panicking::panic_fmt
247.97 s
gammaloop-nextest-clinnet> 2: core::result::unwrap_failed
247.97 s
gammaloop-nextest-clinnet> 3: public_typst_behavior::render
247.97 s
gammaloop-nextest-clinnet> 4: <std::sync::once::Once>::call_once_force::<<std::sync::once_lock::OnceLock<alloc::string::String>>::initialize<<std::sync::once_lock::OnceLock<alloc::string::String>>::get_or_init<public_typst_behavior::linnest_public_svg::{closure#0}>::{closure#0}, !>::{closure#0}>::{closure#0}
247.97 s
gammaloop-nextest-clinnet> 5: <std::sys::sync::once::futex::Once>::call
247.97 s
gammaloop-nextest-clinnet> 6: <std::sync::once_lock::OnceLock<alloc::string::String>>::initialize::<<std::sync::once_lock::OnceLock<alloc::string::String>>::get_or_init<public_typst_behavior::linnest_public_svg::{closure#0}>::{closure#0}, !>
247.97 s
gammaloop-nextest-clinnet> 7: <public_typst_behavior::public_linnest_overlays_follow_the_unit::{closure#0} as core::ops::function::FnOnce<()>>::call_once
247.97 s
gammaloop-nextest-clinnet> note: Some details are omitted, run with `RUST_BACKTRACE=full` for a verbose backtrace.
247.97 s
gammaloop-nextest-clinnet>
247.97 s
gammaloop-nextest-clinnet> 2. clinnet::public_typst_behavior::public_linnest_arrow_shafts_and_crossing_gaps
247.97 s
gammaloop-nextest-clinnet> failure: test failure with exit code 101
247.97 s
gammaloop-nextest-clinnet> thread 'public_linnest_arrow_shafts_and_crossing_gaps' (267) panicked at crates/clinnet/tests/public_typst_behavior.rs:81:55:
247.97 s
gammaloop-nextest-clinnet> called `Result::unwrap()` on an `Err` value: typst failed while compiling template /build/.tmpErcbJg/.clinnet/templates/linnest-public-behavior.svg
247.97 s
gammaloop-nextest-clinnet>
247.97 s
gammaloop-nextest-clinnet> Command executed:
247.97 s
gammaloop-nextest-clinnet> "typst" "c" "/build/.tmpErcbJg/.clinnet/templates/linnest-public-behavior.typ" "/build/.tmpErcbJg/.clinnet/templates/linnest-public-behavior.svg" "--root" "/build/.tmpErcbJg/.clinnet/templates"
247.97 s
gammaloop-nextest-clinnet>
247.97 s
gammaloop-nextest-clinnet> Typst stdout:
247.97 s
gammaloop-nextest-clinnet>
247.97 s
gammaloop-nextest-clinnet>
247.97 s
gammaloop-nextest-clinnet> Typst stderr:
247.97 s
gammaloop-nextest-clinnet>
247.97 s
gammaloop-nextest-clinnet>
247.97 s
gammaloop-nextest-clinnet> Location:
247.97 s
gammaloop-nextest-clinnet> crates/clinnet/src/lib.rs:741:13
247.97 s
gammaloop-nextest-clinnet> stack backtrace:
247.97 s
gammaloop-nextest-clinnet> 0: __rustc::rust_begin_unwind
247.97 s
gammaloop-nextest-clinnet> 1: core::panicking::panic_fmt
247.97 s
gammaloop-nextest-clinnet> 2: core::result::unwrap_failed
247.97 s
gammaloop-nextest-clinnet> 3: public_typst_behavior::render
247.97 s
gammaloop-nextest-clinnet> 4: <std::sync::once::Once>::call_once_force::<<std::sync::once_lock::OnceLock<alloc::string::String>>::initialize<<std::sync::once_lock::OnceLock<alloc::string::String>>::get_or_init<public_typst_behavior::linnest_public_svg::{closure#0}>::{closure#0}, !>::{closure#0}>::{closure#0}
247.97 s
gammaloop-nextest-clinnet> 5: <std::sys::sync::once::futex::Once>::call
247.97 s
gammaloop-nextest-clinnet> 6: <std::sync::once_lock::OnceLock<alloc::string::String>>::initialize::<<std::sync::once_lock::OnceLock<alloc::string::String>>::get_or_init<public_typst_behavior::linnest_public_svg::{closure#0}>::{closure#0}, !>
247.97 s
gammaloop-nextest-clinnet> 7: <public_typst_behavior::public_linnest_arrow_shafts_and_crossing_gaps::{closure#0} as core::ops::function::FnOnce<()>>::call_once
247.97 s
gammaloop-nextest-clinnet> note: Some details are omitted, run with `RUST_BACKTRACE=full` for a verbose backtrace.
247.97 s
gammaloop-nextest-clinnet> system-out
247.97 s
gammaloop-nextest-clinnet> running 1 test
247.97 s
gammaloop-nextest-clinnet> test public_linnest_arrow_shafts_and_crossing_gaps has been running for over 60 seconds
247.97 s
gammaloop-nextest-clinnet> test public_linnest_arrow_shafts_and_crossing_gaps ... FAILED
247.97 s
gammaloop-nextest-clinnet>
247.97 s
gammaloop-nextest-clinnet> failures:
247.97 s
gammaloop-nextest-clinnet>
247.97 s
gammaloop-nextest-clinnet> failures:
247.97 s
gammaloop-nextest-clinnet> public_linnest_arrow_shafts_and_crossing_gaps
247.97 s
gammaloop-nextest-clinnet>
247.97 s
gammaloop-nextest-clinnet> test result: FAILED. 0 passed; 1 failed; 0 ignored; 0 measured; 17 filtered out; finished in 139.31s
247.97 s
gammaloop-nextest-clinnet> system-err
247.97 s
gammaloop-nextest-clinnet> thread 'public_linnest_arrow_shafts_and_crossing_gaps' (267) panicked at crates/clinnet/tests/public_typst_behavior.rs:81:55:
247.97 s
gammaloop-nextest-clinnet> called `Result::unwrap()` on an `Err` value: typst failed while compiling template /build/.tmpErcbJg/.clinnet/templates/linnest-public-behavior.svg
247.97 s
gammaloop-nextest-clinnet>
247.97 s
gammaloop-nextest-clinnet> Command executed:
247.97 s
gammaloop-nextest-clinnet> "typst" "c" "/build/.tmpErcbJg/.clinnet/templates/linnest-public-behavior.typ" "/build/.tmpErcbJg/.clinnet/templates/linnest-public-behavior.svg" "--root" "/build/.tmpErcbJg/.clinnet/templates"
247.97 s
gammaloop-nextest-clinnet>
247.97 s
gammaloop-nextest-clinnet> Typst stdout:
247.97 s
gammaloop-nextest-clinnet>
247.97 s
gammaloop-nextest-clinnet>
247.97 s
gammaloop-nextest-clinnet> Typst stderr:
247.97 s
gammaloop-nextest-clinnet>
247.97 s
gammaloop-nextest-clinnet>
247.97 s
gammaloop-nextest-clinnet> Location:
247.97 s
gammaloop-nextest-clinnet> crates/clinnet/src/lib.rs:741:13
247.97 s
gammaloop-nextest-clinnet> stack backtrace:
247.97 s
gammaloop-nextest-clinnet> 0: __rustc::rust_begin_unwind
247.97 s
gammaloop-nextest-clinnet> 1: core::panicking::panic_fmt
247.97 s
gammaloop-nextest-clinnet> 2: core::result::unwrap_failed
247.97 s
gammaloop-nextest-clinnet> 3: public_typst_behavior::render
247.97 s
gammaloop-nextest-clinnet> 4: <std::sync::once::Once>::call_once_force::<<std::sync::once_lock::OnceLock<alloc::string::String>>::initialize<<std::sync::once_lock::OnceLock<alloc::string::String>>::get_or_init<public_typst_behavior::linnest_public_svg::{closure#0}>::{closure#0}, !>::{closure#0}>::{closure#0}
247.97 s
gammaloop-nextest-clinnet> 5: <std::sys::sync::once::futex::Once>::call
247.97 s
gammaloop-nextest-clinnet> 6: <std::sync::once_lock::OnceLock<alloc::string::String>>::initialize::<<std::sync::once_lock::OnceLock<alloc::string::String>>::get_or_init<public_typst_behavior::linnest_public_svg::{closure#0}>::{closure#0}, !>
247.97 s
gammaloop-nextest-clinnet> 7: <public_typst_behavior::public_linnest_arrow_shafts_and_crossing_gaps::{closure#0} as core::ops::function::FnOnce<()>>::call_once
247.97 s
gammaloop-nextest-clinnet> note: Some details are omitted, run with `RUST_BACKTRACE=full` for a verbose backtrace.
247.97 s
gammaloop-nextest-clinnet> =========================================
248.12 s
[8 built (1 failed ), 130 error: Cannot build '/nix/store/4pqspwvh8pi9s2vg9g6mfsggpl9ynwzx-gammaloop-nextest-clinnet.drv '.
248.12 s
Reason: builder failed with exit code 100 .
248.12 s
Output paths:
248.12 s
/nix/store/v9zka7gxdrym1pq03r0i4w2q43fgdwcq-gammaloop-nextest-clinnet
248.12 s
Last 304 log lines:
248.12 s
> Nextest worker budget: 16
248.12 s
> Extracting 4 binaries (including 1 non-test binary), 1 build script output directory, and 1 linked path to /build/source
248.12 s
> Extracted 16 files to /build/source in 0.12s
248.12 s
> ------------
248.12 s
> Nextest run ID d2e81319-69f2-42fb-b275-6b948a787673 with nextest profile: ci_gammaloop
248.12 s
> Starting 38 tests across 3 binaries
248.12 s
> FAIL [ 100.777s] (32/38) clinnet::public_typst_behavior public_linnest_overlays_follow_the_unit
248.12 s
> stdout ---
248.12 s
>
248.12 s
> running 1 test
248.12 s
> test public_linnest_overlays_follow_the_unit has been running for over 60 seconds
248.12 s
> test public_linnest_overlays_follow_the_unit ... FAILED
248.12 s
>
248.12 s
> failures:
248.12 s
>
248.12 s
> failures:
248.12 s
> public_linnest_overlays_follow_the_unit
248.12 s
>
248.12 s
> test result: FAILED. 0 passed; 1 failed; 0 ignored; 0 measured; 17 filtered out; finished in 100.77s
248.12 s
>
248.12 s
> stderr ---
248.12 s
>
248.12 s
> thread 'public_linnest_overlays_follow_the_unit' (317) panicked at crates/clinnet/tests/public_typst_behavior.rs:81:55:
248.12 s
> called `Result::unwrap()` on an `Err` value: typst failed while compiling template /build/.tmp6idmUm/.clinnet/templates/linnest-public-behavior.svg
248.12 s
>
248.12 s
> Command executed:
248.12 s
> "typst" "c" "/build/.tmp6idmUm/.clinnet/templates/linnest-public-behavior.typ" "/build/.tmp6idmUm/.clinnet/templates/linnest-public-behavior.svg" "--root" "/build/.tmp6idmUm/.clinnet/templates"
248.12 s
>
248.12 s
> Typst stdout:
248.12 s
>
248.12 s
>
248.12 s
> Typst stderr:
248.12 s
>
248.12 s
>
248.12 s
> Location:
248.12 s
> crates/clinnet/src/lib.rs:741:13
248.12 s
> stack backtrace:
248.12 s
> 0: __rustc::rust_begin_unwind
248.12 s
> 1: core::panicking::panic_fmt
248.12 s
> 2: core::result::unwrap_failed
248.12 s
> 3: public_typst_behavior::render
248.12 s
> 4: <std::sync::once::Once>::call_once_force::<<std::sync::once_lock::OnceLock<alloc::string::String>>::initialize<<std::sync::once_lock::OnceLock<alloc::string::String>>::get_or_init<public_typst_behavior::linnest_public_svg::{closure#0}>::{closure#0}, !>::{closure#0}>::{closure#0}
248.12 s
> 5: <std::sys::sync::once::futex::Once>::call
248.12 s
> 6: <std::sync::once_lock::OnceLock<alloc::string::String>>::initialize::<<std::sync::once_lock::OnceLock<alloc::string::String>>::get_or_init<public_typst_behavior::linnest_public_svg::{closure#0}>::{closure#0}, !>
248.12 s
> 7: <public_typst_behavior::public_linnest_overlays_follow_the_unit::{closure#0} as core::ops::function::FnOnce<()>>::call_once
248.12 s
> note: Some details are omitted, run with `RUST_BACKTRACE=full` for a verbose backtrace.
248.12 s
>
248.12 s
> FAIL [ 139.312s] (33/38) clinnet::public_typst_behavior public_linnest_arrow_shafts_and_crossing_gaps
248.12 s
> stdout ---
248.12 s
>
248.12 s
> running 1 test
248.12 s
> test public_linnest_arrow_shafts_and_crossing_gaps has been running for over 60 seconds
248.12 s
> test public_linnest_arrow_shafts_and_crossing_gaps ... FAILED
248.12 s
>
248.12 s
> failures:
248.12 s
>
248.12 s
> failures:
248.12 s
> public_linnest_arrow_shafts_and_crossing_gaps
248.12 s
>
248.12 s
> test result: FAILED. 0 passed; 1 failed; 0 ignored; 0 measured; 17 filtered out; finished in 139.31s
248.12 s
>
248.12 s
> stderr ---
248.12 s
>
248.12 s
> thread 'public_linnest_arrow_shafts_and_crossing_gaps' (267) panicked at crates/clinnet/tests/public_typst_behavior.rs:81:55:
248.12 s
> called `Result::unwrap()` on an `Err` value: typst failed while compiling template /build/.tmpErcbJg/.clinnet/templates/linnest-public-behavior.svg
248.12 s
>
248.12 s
> Command executed:
248.12 s
> "typst" "c" "/build/.tmpErcbJg/.clinnet/templates/linnest-public-behavior.typ" "/build/.tmpErcbJg/.clinnet/templates/linnest-public-behavior.svg" "--root" "/build/.tmpErcbJg/.clinnet/templates"
248.12 s
>
248.12 s
> Typst stdout:
248.12 s
>
248.12 s
>
248.12 s
> Typst stderr:
248.12 s
>
248.12 s
>
248.12 s
> Location:
248.12 s
> crates/clinnet/src/lib.rs:741:13
248.12 s
> stack backtrace:
248.12 s
> 0: __rustc::rust_begin_unwind
248.12 s
> 1: core::panicking::panic_fmt
248.12 s
> 2: core::result::unwrap_failed
248.12 s
> 3: public_typst_behavior::render
248.12 s
> 4: <std::sync::once::Once>::call_once_force::<<std::sync::once_lock::OnceLock<alloc::string::String>>::initialize<<std::sync::once_lock::OnceLock<alloc::string::String>>::get_or_init<public_typst_behavior::linnest_public_svg::{closure#0}>::{closure#0}, !>::{closure#0}>::{closure#0}
248.12 s
> 5: <std::sys::sync::once::futex::Once>::call
248.12 s
> 6: <std::sync::once_lock::OnceLock<alloc::string::String>>::initialize::<<std::sync::once_lock::OnceLock<alloc::string::String>>::get_or_init<public_typst_behavior::linnest_public_svg::{closure#0}>::{closure#0}, !>
248.12 s
> 7: <public_typst_behavior::public_linnest_arrow_shafts_and_crossing_gaps::{closure#0} as core::ops::function::FnOnce<()>>::call_once
248.12 s
> note: Some details are omitted, run with `RUST_BACKTRACE=full` for a verbose backtrace.
248.12 s
>
248.12 s
> ------------
248.12 s
> Summary [ 160.014s] 38 tests run: 36 passed (5 slow ), 2 failed , 0 skipped
248.12 s
> FAIL [ 100.777s] (32/38) clinnet::public_typst_behavior public_linnest_overlays_follow_the_unit
248.12 s
> stdout ---
248.12 s
>
248.12 s
> running 1 test
248.12 s
> test public_linnest_overlays_follow_the_unit has been running for over 60 seconds
248.12 s
> test public_linnest_overlays_follow_the_unit ... FAILED
248.12 s
>
248.12 s
> failures:
248.12 s
>
248.12 s
> failures:
248.12 s
> public_linnest_overlays_follow_the_unit
248.12 s
>
248.12 s
> test result: FAILED. 0 passed; 1 failed; 0 ignored; 0 measured; 17 filtered out; finished in 100.77s
248.12 s
>
248.12 s
> stderr ---
248.12 s
>
248.12 s
> thread 'public_linnest_overlays_follow_the_unit' (317) panicked at crates/clinnet/tests/public_typst_behavior.rs:81:55:
248.12 s
> called `Result::unwrap()` on an `Err` value: typst failed while compiling template /build/.tmp6idmUm/.clinnet/templates/linnest-public-behavior.svg
248.12 s
>
248.12 s
> Command executed:
248.12 s
> "typst" "c" "/build/.tmp6idmUm/.clinnet/templates/linnest-public-behavior.typ" "/build/.tmp6idmUm/.clinnet/templates/linnest-public-behavior.svg" "--root" "/build/.tmp6idmUm/.clinnet/templates"
248.12 s
>
248.12 s
> Typst stdout:
248.12 s
>
248.12 s
>
248.12 s
> Typst stderr:
248.12 s
>
248.12 s
>
248.12 s
> Location:
248.12 s
> crates/clinnet/src/lib.rs:741:13
248.12 s
> stack backtrace:
248.12 s
> 0: __rustc::rust_begin_unwind
248.12 s
> 1: core::panicking::panic_fmt
248.12 s
> 2: core::result::unwrap_failed
248.12 s
> 3: public_typst_behavior::render
248.12 s
> 4: <std::sync::once::Once>::call_once_force::<<std::sync::once_lock::OnceLock<alloc::string::String>>::initialize<<std::sync::once_lock::OnceLock<alloc::string::String>>::get_or_init<public_typst_behavior::linnest_public_svg::{closure#0}>::{closure#0}, !>::{closure#0}>::{closure#0}
248.12 s
> 5: <std::sys::sync::once::futex::Once>::call
248.12 s
> 6: <std::sync::once_lock::OnceLock<alloc::string::String>>::initialize::<<std::sync::once_lock::OnceLock<alloc::string::String>>::get_or_init<public_typst_behavior::linnest_public_svg::{closure#0}>::{closure#0}, !>
248.12 s
> 7: <public_typst_behavior::public_linnest_overlays_follow_the_unit::{closure#0} as core::ops::function::FnOnce<()>>::call_once
248.12 s
> note: Some details are omitted, run with `RUST_BACKTRACE=full` for a verbose backtrace.
248.12 s
>
248.12 s
> FAIL [ 139.312s] (33/38) clinnet::public_typst_behavior public_linnest_arrow_shafts_and_crossing_gaps
248.12 s
> stdout ---
248.12 s
>
248.12 s
> running 1 test
248.12 s
> test public_linnest_arrow_shafts_and_crossing_gaps has been running for over 60 seconds
248.12 s
> test public_linnest_arrow_shafts_and_crossing_gaps ... FAILED
248.12 s
>
248.12 s
> failures:
248.12 s
>
248.12 s
> failures:
248.12 s
> public_linnest_arrow_shafts_and_crossing_gaps
248.12 s
>
248.12 s
> test result: FAILED. 0 passed; 1 failed; 0 ignored; 0 measured; 17 filtered out; finished in 139.31s
248.12 s
>
248.12 s
> stderr ---
248.12 s
>
248.12 s
> thread 'public_linnest_arrow_shafts_and_crossing_gaps' (267) panicked at crates/clinnet/tests/public_typst_behavior.rs:81:55:
248.12 s
> called `Result::unwrap()` on an `Err` value: typst failed while compiling template /build/.tmpErcbJg/.clinnet/templates/linnest-public-behavior.svg
248.12 s
>
248.12 s
> Command executed:
248.12 s
> "typst" "c" "/build/.tmpErcbJg/.clinnet/templates/linnest-public-behavior.typ" "/build/.tmpErcbJg/.clinnet/templates/linnest-public-behavior.svg" "--root" "/build/.tmpErcbJg/.clinnet/templates"
248.12 s
>
248.12 s
> Typst stdout:
248.12 s
>
248.12 s
>
248.12 s
> Typst stderr:
248.12 s
>
248.12 s
>
248.12 s
> Location:
248.12 s
> crates/clinnet/src/lib.rs:741:13
248.12 s
> stack backtrace:
248.12 s
> 0: __rustc::rust_begin_unwind
248.12 s
> 1: core::panicking::panic_fmt
248.12 s
> 2: core::result::unwrap_failed
248.12 s
> 3: public_typst_behavior::render
248.12 s
> 4: <std::sync::once::Once>::call_once_force::<<std::sync::once_lock::OnceLock<alloc::string::String>>::initialize<<std::sync::once_lock::OnceLock<alloc::string::String>>::get_or_init<public_typst_behavior::linnest_public_svg::{closure#0}>::{closure#0}, !>::{closure#0}>::{closure#0}
248.12 s
> 5: <std::sys::sync::once::futex::Once>::call
248.12 s
> 6: <std::sync::once_lock::OnceLock<alloc::string::String>>::initialize::<<std::sync::once_lock::OnceLock<alloc::string::String>>::get_or_init<public_typst_behavior::linnest_public_svg::{closure#0}>::{closure#0}, !>
248.12 s
> 7: <public_typst_behavior::public_linnest_arrow_shafts_and_crossing_gaps::{closure#0} as core::ops::function::FnOnce<()>>::call_once
248.12 s
> note: Some details are omitted, run with `RUST_BACKTRACE=full` for a verbose backtrace.
248.12 s
>
248.12 s
> error : test run failed
248.12 s
>
248.12 s
> ========== nextest test summary ==========
248.12 s
> report: target/nextest/ci_gammaloop/junit.xml
248.12 s
> tests: 38, failures: 2, errors: 0
248.12 s
>
248.12 s
> 1. clinnet::public_typst_behavior::public_linnest_overlays_follow_the_unit
248.12 s
> failure: test failure with exit code 101
248.12 s
> thread 'public_linnest_overlays_follow_the_unit' (317) panicked at crates/clinnet/tests/public_typst_behavior.rs:81:55:
248.12 s
> called `Result::unwrap()` on an `Err` value: typst failed while compiling template /build/.tmp6idmUm/.clinnet/templates/linnest-public-behavior.svg
248.12 s
>
248.12 s
> Command executed:
248.12 s
> "typst" "c" "/build/.tmp6idmUm/.clinnet/templates/linnest-public-behavior.typ" "/build/.tmp6idmUm/.clinnet/templates/linnest-public-behavior.svg" "--root" "/build/.tmp6idmUm/.clinnet/templates"
248.12 s
>
248.12 s
> Typst stdout:
248.12 s
>
248.12 s
>
248.12 s
> Typst stderr:
248.12 s
>
248.12 s
>
248.12 s
> Location:
248.12 s
> crates/clinnet/src/lib.rs:741:13
248.12 s
> stack backtrace:
248.12 s
> 0: __rustc::rust_begin_unwind
248.12 s
> 1: core::panicking::panic_fmt
248.12 s
> 2: core::result::unwrap_failed
248.12 s
> 3: public_typst_behavior::render
248.12 s
> 4: <std::sync::once::Once>::call_once_force::<<std::sync::once_lock::OnceLock<alloc::string::String>>::initialize<<std::sync::once_lock::OnceLock<alloc::string::String>>::get_or_init<public_typst_behavior::linnest_public_svg::{closure#0}>::{closure#0}, !>::{closure#0}>::{closure#0}
248.12 s
> 5: <std::sys::sync::once::futex::Once>::call
248.12 s
> 6: <std::sync::once_lock::OnceLock<alloc::string::String>>::initialize::<<std::sync::once_lock::OnceLock<alloc::string::String>>::get_or_init<public_typst_behavior::linnest_public_svg::{closure#0}>::{closure#0}, !>
248.12 s
> 7: <public_typst_behavior::public_linnest_overlays_follow_the_unit::{closure#0} as core::ops::function::FnOnce<()>>::call_once
248.12 s
> note: Some details are omitted, run with `RUST_BACKTRACE=full` for a verbose backtrace.
248.12 s
> system-out
248.12 s
> running 1 test
248.12 s
> test public_linnest_overlays_follow_the_unit has been running for over 60 seconds
248.12 s
> test public_linnest_overlays_follow_the_unit ... FAILED
248.12 s
>
248.12 s
> failures:
248.12 s
>
248.12 s
> failures:
248.12 s
> public_linnest_overlays_follow_the_unit
248.12 s
>
248.12 s
> test result: FAILED. 0 passed; 1 failed; 0 ignored; 0 measured; 17 filtered out; finished in 100.77s
248.12 s
> system-err
248.12 s
> thread 'public_linnest_overlays_follow_the_unit' (317) panicked at crates/clinnet/tests/public_typst_behavior.rs:81:55:
248.12 s
> called `Result::unwrap()` on an `Err` value: typst failed while compiling template /build/.tmp6idmUm/.clinnet/templates/linnest-public-behavior.svg
248.12 s
>
248.12 s
> Command executed:
248.12 s
> "typst" "c" "/build/.tmp6idmUm/.clinnet/templates/linnest-public-behavior.typ" "/build/.tmp6idmUm/.clinnet/templates/linnest-public-behavior.svg" "--root" "/build/.tmp6idmUm/.clinnet/templates"
248.12 s
>
248.12 s
> Typst stdout:
248.12 s
>
248.12 s
>
248.12 s
> Typst stderr:
248.12 s
>
248.12 s
>
248.12 s
> Location:
248.12 s
> crates/clinnet/src/lib.rs:741:13
248.12 s
> stack backtrace:
248.12 s
> 0: __rustc::rust_begin_unwind
248.12 s
> 1: core::panicking::panic_fmt
248.12 s
> 2: core::result::unwrap_failed
248.12 s
> 3: public_typst_behavior::render
248.12 s
> 4: <std::sync::once::Once>::call_once_force::<<std::sync::once_lock::OnceLock<alloc::string::String>>::initialize<<std::sync::once_lock::OnceLock<alloc::string::String>>::get_or_init<public_typst_behavior::linnest_public_svg::{closure#0}>::{closure#0}, !>::{closure#0}>::{closure#0}
248.12 s
> 5: <std::sys::sync::once::futex::Once>::call
248.12 s
> 6: <std::sync::once_lock::OnceLock<alloc::string::String>>::initialize::<<std::sync::once_lock::OnceLock<alloc::string::String>>::get_or_init<public_typst_behavior::linnest_public_svg::{closure#0}>::{closure#0}, !>
248.12 s
> 7: <public_typst_behavior::public_linnest_overlays_follow_the_unit::{closure#0} as core::ops::function::FnOnce<()>>::call_once
248.12 s
> note: Some details are omitted, run with `RUST_BACKTRACE=full` for a verbose backtrace.
248.12 s
>
248.12 s
> 2. clinnet::public_typst_behavior::public_linnest_arrow_shafts_and_crossing_gaps
248.12 s
> failure: test failure with exit code 101
248.12 s
> thread 'public_linnest_arrow_shafts_and_crossing_gaps' (267) panicked at crates/clinnet/tests/public_typst_behavior.rs:81:55:
248.12 s
> called `Result::unwrap()` on an `Err` value: typst failed while compiling template /build/.tmpErcbJg/.clinnet/templates/linnest-public-behavior.svg
248.12 s
>
248.12 s
> Command executed:
248.12 s
> "typst" "c" "/build/.tmpErcbJg/.clinnet/templates/linnest-public-behavior.typ" "/build/.tmpErcbJg/.clinnet/templates/linnest-public-behavior.svg" "--root" "/build/.tmpErcbJg/.clinnet/templates"
248.12 s
>
248.12 s
> Typst stdout:
248.12 s
>
248.12 s
>
248.12 s
> Typst stderr:
248.12 s
>
248.12 s
>
248.12 s
> Location:
248.12 s
> crates/clinnet/src/lib.rs:741:13
248.12 s
> stack backtrace:
248.12 s
> 0: __rustc::rust_begin_unwind
248.12 s
> 1: core::panicking::panic_fmt
248.12 s
> 2: core::result::unwrap_failed
248.12 s
> 3: public_typst_behavior::render
248.12 s
> 4: <std::sync::once::Once>::call_once_force::<<std::sync::once_lock::OnceLock<alloc::string::String>>::initialize<<std::sync::once_lock::OnceLock<alloc::string::String>>::get_or_init<public_typst_behavior::linnest_public_svg::{closure#0}>::{closure#0}, !>::{closure#0}>::{closure#0}
248.12 s
> 5: <std::sys::sync::once::futex::Once>::call
248.12 s
> 6: <std::sync::once_lock::OnceLock<alloc::string::String>>::initialize::<<std::sync::once_lock::OnceLock<alloc::string::String>>::get_or_init<public_typst_behavior::linnest_public_svg::{closure#0}>::{closure#0}, !>
248.12 s
> 7: <public_typst_behavior::public_linnest_arrow_shafts_and_crossing_gaps::{closure#0} as core::ops::function::FnOnce<()>>::call_once
248.12 s
> note: Some details are omitted, run with `RUST_BACKTRACE=full` for a verbose backtrace.
248.12 s
> system-out
248.12 s
> running 1 test
248.12 s
> test public_linnest_arrow_shafts_and_crossing_gaps has been running for over 60 seconds
248.12 s
> test public_linnest_arrow_shafts_and_crossing_gaps ... FAILED
248.12 s
>
248.12 s
> failures:
248.12 s
>
248.12 s
> failures:
248.12 s
> public_linnest_arrow_shafts_and_crossing_gaps
248.12 s
>
248.12 s
> test result: FAILED. 0 passed; 1 failed; 0 ignored; 0 measured; 17 filtered out; finished in 139.31s
248.12 s
> system-err
248.12 s
> thread 'public_linnest_arrow_shafts_and_crossing_gaps' (267) panicked at crates/clinnet/tests/public_typst_behavior.rs:81:55:
248.12 s
> called `Result::unwrap()` on an `Err` value: typst failed while compiling template /build/.tmpErcbJg/.clinnet/templates/linnest-public-behavior.svg
248.12 s
>
248.12 s
> Command executed:
248.12 s
> "typst" "c" "/build/.tmpErcbJg/.clinnet/templates/linnest-public-behavior.typ" "/build/.tmpErcbJg/.clinnet/templates/linnest-public-behavior.svg" "--root" "/build/.tmpErcbJg/.clinnet/templates"
248.12 s
>
248.12 s
> Typst stdout:
248.12 s
>
248.12 s
>
248.12 s
> Typst stderr:
248.12 s
>
248.12 s
>
248.12 s
> Location:
248.12 s
> crates/clinnet/src/lib.rs:741:13
248.12 s
> stack backtrace:
248.12 s
> 0: __rustc::rust_begin_unwind
248.12 s
> 1: core::panicking::panic_fmt
248.12 s
> 2: core::result::unwrap_failed
248.12 s
> 3: public_typst_behavior::render
248.12 s
> 4: <std::sync::once::Once>::call_once_force::<<std::sync::once_lock::OnceLock<alloc::string::String>>::initialize<<std::sync::once_lock::OnceLock<alloc::string::String>>::get_or_init<public_typst_behavior::linnest_public_svg::{closure#0}>::{closure#0}, !>::{closure#0}>::{closure#0}
248.12 s
> 5: <std::sys::sync::once::futex::Once>::call
248.12 s
> 6: <std::sync::once_lock::OnceLock<alloc::string::String>>::initialize::<<std::sync::once_lock::OnceLock<alloc::string::String>>::get_or_init<public_typst_behavior::linnest_public_svg::{closure#0}>::{closure#0}, !>
248.12 s
> 7: <public_typst_behavior::public_linnest_arrow_shafts_and_crossing_gaps::{closure#0} as core::ops::function::FnOnce<()>>::call_once
248.12 s
> note: Some details are omitted, run with `RUST_BACKTRACE=full` for a verbose backtrace.
248.12 s
> =========================================
248.12 s
For full logs, run:
248.12 s
nix log /nix/store/4pqspwvh8pi9s2vg9g6mfsggpl9ynwzx-gammaloop-nextest-clinnet.drv
248.42 s
Run failed.