0.81 s
$ /nix/store/9ypz3flqsrl5xl495mm8h645gadjsxi1-coreutils-9.11/bin/timeout --kill-after=15s 7200s /nix/store/23zk8sgzamrbmj1fday15szf7f2279s8-nix-2.34.7/bin/nix --extra-experimental-features nix-command --extra-experimental-features flakes --log-format internal-json build --no-link --print-out-paths git+https://github.com/alphal00p/gammaloop?ref=ir_safe_threshold_ct_rework&rev=0f3c75c08b143ceb3ca042d89635da65d3e874c6&shallow=1#checks.x86_64-linux.gammaloop-check --print-build-logs
0.84 s
error (ignored): SQLite database '/var/cache/nix-ci-worker/eval-cache-v6/494c24376b357b9e2a13d260e80e861810ab7e8f6ba34a2206cc787992343ef1.sqlite ' is busy
2.01 s
2.40 s
Downloading cached cargoHelperFunctionsHook from https://cache.nix-ci.com
2.40 s
Downloading cached configureCargoCommonVarsHook from https://cache.nix-ci.com
2.40 s
Downloading cached configureCargoVendoredDepsHook from https://cache.nix-ci.com
2.40 s
Downloading cached inheritCargoArtifactsHook from https://cache.nix-ci.com
2.40 s
Downloading cached installCargoArtifactsHook from https://cache.nix-ci.com
2.40 s
Downloading cached replaceCargoLockHook from https://cache.nix-ci.com
2.41 s
Downloading cached mailcap from https://cache.nix-ci.com
2.41 s
Downloading cached tzdata from https://cache.nix-ci.com
2.41 s
Downloading cached expand-response-params from https://cache.nix-ci.com
2.41 s
Downloading cached expand-response-params from https://cache.nix-ci.com
2.41 s
Downloading cached expat from https://cache.nix-ci.com
2.41 s
Downloading cached gdbm-1.26-lib from https://cache.nix-ci.com
2.41 s
Downloading cached gmp-with-cxx from https://cache.nix-ci.com
2.41 s
Downloading cached gnum4 from https://cache.nix-ci.com
2.41 s
Downloading cached linux-headers from https://cache.nix-ci.com
2.42 s
Downloading cached openssl from https://cache.nix-ci.com
2.48 s
Downloaded cached expand-response-params (16 KiB) in 73ms
2.48 s
Progress: 0 of 31 built, 1 of 57 downloaded from cache (15 downloading)
2.48 s
Downloading cached binutils-2.46-lib from https://cache.nix-ci.com
2.48 s
Downloaded cached mailcap (116 KiB) in 75ms
2.48 s
Progress: 0 of 31 built, 2 of 57 downloaded from cache (15 downloading)
2.48 s
Downloading cached cargo-stable-2026-07 from https://cache.nix-ci.com
2.49 s
Downloaded cached cargoHelperFunctionsHook (1016 B) in 90ms
2.49 s
Downloaded cached configureCargoCommonVarsHook (2728 B) in 91ms
2.49 s
Progress: 0 of 31 built, 3 of 57 downloaded from cache (15 downloading)
2.49 s
Downloading cached clippy-preview-stable-2026-07 from https://cache.nix-ci.com
2.49 s
Progress: 0 of 30 built, 4 of 57 downloaded from cache (15 downloading)
2.49 s
Downloaded cached configureCargoVendoredDepsHook (1632 B) in 92ms
2.49 s
Downloading cached glibc-2.42-67-bin from https://cache.nix-ci.com
2.49 s
Progress: 0 of 29 built, 5 of 57 downloaded from cache (15 downloading)
2.49 s
Downloading cached gmp from https://cache.nix-ci.com
2.49 s
Downloaded cached installCargoArtifactsHook (4624 B) in 91ms
2.49 s
Progress: 0 of 28 built, 6 of 57 downloaded from cache (15 downloading)
2.49 s
Downloaded cached replaceCargoLockHook (1032 B) in 89ms
2.49 s
Downloading cached libffi from https://cache.nix-ci.com
2.49 s
Progress: 0 of 27 built, 7 of 57 downloaded from cache (15 downloading)
2.49 s
Downloading cached llvm-tools-preview-stable-2026-07 from https://cache.nix-ci.com
2.49 s
Downloaded cached inheritCargoArtifactsHook (5944 B) in 91ms
2.49 s
Progress: 0 of 26 built, 8 of 57 downloaded from cache (15 downloading)
2.49 s
Downloading cached lndir from https://cache.nix-ci.com
2.49 s
Downloaded cached expat (312 KiB) in 85ms
2.49 s
Progress: 0 of 25 built, 9 of 57 downloaded from cache (15 downloading)
2.49 s
Downloading cached lz4-1.10.0-lib from https://cache.nix-ci.com
2.50 s
Downloaded cached expand-response-params (16 KiB) in 87ms
2.50 s
Progress: 0 of 25 built, 10 of 57 downloaded from cache (15 downloading)
2.50 s
Downloading cached mpdecimal from https://cache.nix-ci.com
2.51 s
Downloaded cached gdbm-1.26-lib (448 KiB) in 97ms
2.51 s
Progress: 0 of 25 built, 11 of 57 downloaded from cache (15 downloading)
2.51 s
Downloading cached ncurses from https://cache.nix-ci.com
2.51 s
Downloaded cached gmp-with-cxx (765 KiB) in 104ms
2.51 s
Progress: 0 of 25 built, 12 of 57 downloaded from cache (15 downloading)
2.51 s
Downloading cached pkg-config from https://cache.nix-ci.com
2.52 s
Downloaded cached gnum4 (1.1 MiB) in 108ms
2.52 s
Progress: 0 of 24 built, 13 of 57 downloaded from cache (15 downloading)
2.52 s
Downloading cached gmp-with-cxx-6.3.0-dev from https://cache.nix-ci.com
2.56 s
Downloaded cached lz4-1.10.0-lib (256 KiB) in 65ms
2.56 s
Progress: 0 of 23 built, 14 of 57 downloaded from cache (15 downloading)
2.56 s
Downloading cached mpfr from https://cache.nix-ci.com
2.56 s
Downloaded cached mpdecimal (220 KiB) in 67ms
2.56 s
Progress: 0 of 23 built, 15 of 57 downloaded from cache (15 downloading)
2.56 s
Downloading cached popt from https://cache.nix-ci.com
2.57 s
Downloaded cached openssl (8.9 MiB) in 155ms
2.57 s
Progress: 0 of 23 built, 16 of 57 downloaded from cache (15 downloading)
2.57 s
Downloading cached rust-std-stable-2026-07 from https://cache.nix-ci.com
2.57 s
Downloaded cached pkg-config (673 KiB) in 59ms
2.57 s
Progress: 0 of 22 built, 17 of 57 downloaded from cache (15 downloading)
2.57 s
Downloading cached openssl-3.6.3-bin from https://cache.nix-ci.com
2.58 s
Downloaded cached gmp-with-cxx-6.3.0-dev (211 KiB) in 57ms
2.58 s
Progress: 0 of 22 built, 18 of 57 downloaded from cache (15 downloading)
2.58 s
Downloading cached pkg-config-wrapper from https://cache.nix-ci.com
2.59 s
Downloaded cached lndir (23 KiB) in 91ms
2.59 s
Progress: 0 of 21 built, 19 of 57 downloaded from cache (15 downloading)
2.59 s
Downloading cached rustc-stable-2026-07 from https://cache.nix-ci.com
2.59 s
Downloaded cached tzdata (2 MiB) in 179ms
2.59 s
Progress: 0 of 20 built, 20 of 57 downloaded from cache (15 downloading)
2.59 s
Downloading cached sqlite from https://cache.nix-ci.com
2.59 s
Downloaded cached libffi (72 KiB) in 95ms
2.59 s
Progress: 0 of 20 built, 21 of 57 downloaded from cache (15 downloading)
2.59 s
Downloaded cached binutils-2.46-lib (2.9 MiB) in 107ms
2.59 s
Downloading cached util-linux-minimal-2.42.2-lib from https://cache.nix-ci.com
2.59 s
Progress: 0 of 20 built, 22 of 57 downloaded from cache (15 downloading)
2.59 s
Downloading cached xxhash from https://cache.nix-ci.com
2.61 s
Downloaded cached gmp (722 KiB) in 116ms
2.61 s
Progress: 0 of 20 built, 23 of 57 downloaded from cache (15 downloading)
2.61 s
Downloading cached binutils from https://cache.nix-ci.com
2.62 s
Downloaded cached mpfr (803 KiB) in 59ms
2.62 s
Progress: 0 of 20 built, 24 of 57 downloaded from cache (15 downloading)
2.62 s
Downloading cached isl from https://cache.nix-ci.com
2.63 s
Downloaded cached popt (161 KiB) in 65ms
2.63 s
Progress: 0 of 19 built, 25 of 57 downloaded from cache (15 downloading)
2.63 s
Downloading cached libmpc from https://cache.nix-ci.com
2.63 s
Downloaded cached pkg-config-wrapper (11 KiB) in 55ms
2.63 s
Progress: 0 of 19 built, 26 of 57 downloaded from cache (15 downloading)
2.63 s
Downloading cached mpfr from https://cache.nix-ci.com
2.63 s
Downloaded cached openssl-3.6.3-bin (1.3 MiB) in 57ms
2.63 s
Progress: 0 of 18 built, 27 of 57 downloaded from cache (15 downloading)
2.63 s
Downloading cached mpfr-4.2.2-dev from https://cache.nix-ci.com
2.63 s
Downloaded cached glibc-2.42-67-bin (2.8 MiB) in 139ms
2.63 s
Progress: 0 of 18 built, 28 of 57 downloaded from cache (15 downloading)
2.63 s
Downloading cached openssl-3.6.3-dev from https://cache.nix-ci.com
2.66 s
Downloaded cached xxhash (413 KiB) in 67ms
2.66 s
Progress: 0 of 18 built, 29 of 57 downloaded from cache (15 downloading)
2.66 s
Downloading cached zstd from https://cache.nix-ci.com
2.67 s
Downloaded cached linux-headers (7.1 MiB) in 256ms
2.67 s
Progress: 0 of 18 built, 30 of 57 downloaded from cache (15 downloading)
2.67 s
Downloading cached glibc-2.42-67-dev from https://cache.nix-ci.com
2.68 s
Downloaded cached sqlite (5.7 MiB) in 94ms
2.68 s
Progress: 0 of 18 built, 31 of 57 downloaded from cache (15 downloading)
2.69 s
Downloaded cached util-linux-minimal-2.42.2-lib (2 MiB) in 96ms
2.69 s
Progress: 0 of 18 built, 32 of 57 downloaded from cache (14 downloading)
2.73 s
Downloaded cached mpfr-4.2.2-dev (64 KiB) in 95ms
2.73 s
Progress: 0 of 18 built, 33 of 57 downloaded from cache (13 downloading)
2.73 s
Downloaded cached libmpc (301 KiB) in 98ms
2.73 s
Progress: 0 of 17 built, 34 of 57 downloaded from cache (12 downloading)
2.74 s
Downloaded cached mpfr (803 KiB) in 109ms
2.74 s
Progress: 0 of 16 built, 35 of 57 downloaded from cache (11 downloading)
2.74 s
Downloaded cached zstd (1.1 MiB) in 83ms
2.74 s
Downloading cached libmpc from https://cache.nix-ci.com
2.74 s
Progress: 0 of 16 built, 36 of 57 downloaded from cache (11 downloading)
2.74 s
Downloading cached rsync from https://cache.nix-ci.com
2.74 s
Downloading cached zstd-1.5.7-bin from https://cache.nix-ci.com
2.74 s
Downloaded cached isl (2.5 MiB) in 122ms
2.74 s
Progress: 0 of 16 built, 37 of 57 downloaded from cache (12 downloading)
2.75 s
Downloaded cached openssl-3.6.3-dev (1.9 MiB) in 119ms
2.75 s
Progress: 0 of 16 built, 38 of 57 downloaded from cache (11 downloading)
2.76 s
Downloaded cached ncurses (3.7 MiB) in 249ms
2.76 s
Progress: 0 of 15 built, 39 of 57 downloaded from cache (10 downloading)
2.76 s
Downloading cached readline from https://cache.nix-ci.com
2.79 s
Downloaded cached glibc-2.42-67-dev (2.3 MiB) in 121ms
2.79 s
Progress: 0 of 15 built, 40 of 57 downloaded from cache (10 downloading)
2.80 s
Downloaded cached libmpc (301 KiB) in 61ms
2.80 s
Downloaded cached zstd-1.5.7-bin (380 KiB) in 61ms
2.80 s
Progress: 0 of 15 built, 41 of 57 downloaded from cache (9 downloading)
2.80 s
Progress: 0 of 15 built, 42 of 57 downloaded from cache (8 downloading)
2.80 s
Downloading cached gcc from https://cache.nix-ci.com
2.80 s
Downloading cached zstd-1.5.7-dev from https://cache.nix-ci.com
2.81 s
Downloaded cached rsync (710 KiB) in 66ms
2.81 s
Progress: 0 of 15 built, 43 of 57 downloaded from cache (9 downloading)
2.82 s
Downloaded cached readline (494 KiB) in 64ms
2.82 s
Progress: 0 of 14 built, 44 of 57 downloaded from cache (8 downloading)
2.82 s
Downloading cached python3 from https://cache.nix-ci.com
2.86 s
Downloaded cached zstd-1.5.7-dev (219 KiB) in 58ms
2.86 s
Progress: 0 of 14 built, 45 of 57 downloaded from cache (8 downloading)
3.00 s
Downloaded cached binutils (32.6 MiB) in 386ms
3.00 s
Progress: 0 of 13 built, 46 of 57 downloaded from cache (7 downloading)
3.00 s
Downloading cached binutils-wrapper from https://cache.nix-ci.com
3.10 s
Downloaded cached binutils-wrapper (55 KiB) in 100ms
3.10 s
Progress: 0 of 13 built, 47 of 57 downloaded from cache (7 downloading)
3.11 s
Downloaded cached clippy-preview-stable-2026-07 (22.9 MiB) in 615ms
3.11 s
Progress: 0 of 13 built, 48 of 57 downloaded from cache (6 downloading)
3.63 s
Downloaded cached cargo-stable-2026-07 (41.1 MiB) in 1.1s
3.63 s
Progress: 0 of 12 built, 49 of 57 downloaded from cache (5 downloading)
4.88 s
Downloaded cached python3 (127 MiB) in 2.0s
4.88 s
Progress: 0 of 11 built, 50 of 57 downloaded from cache (4 downloading)
5.30 s
Downloaded cached rust-std-stable-2026-07 (161.4 MiB) in 2.7s
5.30 s
Progress: 0 of 10 built, 51 of 57 downloaded from cache (3 downloading)
5.75 s
Downloaded cached gcc (264.1 MiB) in 2.9s
5.75 s
Progress: 0 of 9 built, 52 of 57 downloaded from cache (2 downloading)
5.75 s
Downloading cached gcc-wrapper from https://cache.nix-ci.com
5.79 s
Downloaded cached gcc-wrapper (69 KiB) in 40ms
5.79 s
Progress: 0 of 9 built, 53 of 57 downloaded from cache (2 downloading)
5.79 s
Downloading cached stdenv-linux from https://cache.nix-ci.com
5.84 s
Downloaded cached stdenv-linux (60 KiB) in 44ms
5.87 s
Progress: 0 of 8 built, 54 of 57 downloaded from cache (2 downloading)
6.03 s
Downloaded cached llvm-tools-preview-stable-2026-07 (201.8 MiB) in 3.5s
6.03 s
Progress: 0 of 7 built, 55 of 57 downloaded from cache (1 downloading)
7.92 s
Downloaded cached rustc-stable-2026-07 (395.4 MiB) in 5.3s
7.92 s
Progress: 0 of 6 built, 56 of 57 downloaded from cache
7.92 s
Downloading cached rustfmt-preview-stable-2026-07 from https://cache.nix-ci.com
7.97 s
Building /nix/store/0278k537z0dbnrpx1zavbqcn0h9lxpnr-clippy-stable-with-std-2026-07-09.drv
8.00 s
Building /nix/store/hb2gbp84is9q8ij9m36pw4n1c0ngrpd6-rust-stable-with-std-2026-07-09.drv
8.03 s
Downloaded cached rustfmt-preview-stable-2026-07 (8.7 MiB) in 107ms
8.03 s
Progress: 0 of 5 built (2 building), 57 of 57 downloaded from cache
8.33 s
[rust-stable-with-std-2026-07:post-build] Uploading to the NixCI cache: /nix/store/imnwv6nazijihjlgf2h3l1qm63m7l9wk-rust-stable-with-std-2026-07-09
8.37 s
[rust-stable-with-std-2026-07:post-build] warning: 'warn-short-path-literals' is deprecated, use 'lint-short-path-literals = ignore' instead
8.41 s
[rust-stable-with-std-2026-07:post-build] copying 0 paths...
8.47 s
[rust-stable-with-std-2026-07:post-build] warning: 'warn-short-path-literals' is deprecated, use 'lint-short-path-literals = ignore' instead
8.52 s
[rust-stable-with-std-2026-07:post-build] copying 0 paths...
8.53 s
Uploaded rust-stable-with-std-2026-07 in 216ms
8.53 s
Progress: 1 of 5 built (1 building), 57 of 57 downloaded from cache
8.53 s
Built rust-stable-with-std-2026-07 in 529ms
8.71 s
[clippy-stable-with-std-2026-07:post-build] Uploading to the NixCI cache: /nix/store/r4bjy93lvnfma1awpi480n2mz3af0adx-clippy-stable-with-std-2026-07-09
8.75 s
[clippy-stable-with-std-2026-07:post-build] warning: 'warn-short-path-literals' is deprecated, use 'lint-short-path-literals = ignore' instead
8.78 s
[clippy-stable-with-std-2026-07:post-build] copying 0 paths...
8.84 s
[clippy-stable-with-std-2026-07:post-build] warning: 'warn-short-path-literals' is deprecated, use 'lint-short-path-literals = ignore' instead
8.88 s
[clippy-stable-with-std-2026-07:post-build] copying 0 paths...
8.89 s
Uploaded clippy-stable-with-std-2026-07 in 199ms
8.89 s
Progress: 2 of 5 built, 57 of 57 downloaded from cache
8.89 s
Built clippy-stable-with-std-2026-07 in 926ms
8.92 s
Building /nix/store/qgjs9pnh25i6xlw7f78s5yqb5p0mama9-rust-stable-with-components-2026-07-09.drv
8.98 s
[rust-stable-with-components-2026-07] /nix/store/imnwv6nazijihjlgf2h3l1qm63m7l9wk-rust-stable-with-std-2026-07-09/bin:
8.98 s
[rust-stable-with-components-2026-07] rustc: Keeping existing link to /nix/store/r4bjy93lvnfma1awpi480n2mz3af0adx-clippy-stable-with-std-2026-07-09/bin/rustc
8.98 s
[rust-stable-with-components-2026-07] rust-gdbgui: Keeping existing link to /nix/store/r4bjy93lvnfma1awpi480n2mz3af0adx-clippy-stable-with-std-2026-07-09/bin/rust-gdbgui
8.98 s
[rust-stable-with-components-2026-07] rust-lldb: Keeping existing link to /nix/store/r4bjy93lvnfma1awpi480n2mz3af0adx-clippy-stable-with-std-2026-07-09/bin/rust-lldb
8.98 s
[rust-stable-with-components-2026-07] rustdoc: Keeping existing link to /nix/store/r4bjy93lvnfma1awpi480n2mz3af0adx-clippy-stable-with-std-2026-07-09/bin/rustdoc
8.98 s
[rust-stable-with-components-2026-07] rust-gdb: Keeping existing link to /nix/store/r4bjy93lvnfma1awpi480n2mz3af0adx-clippy-stable-with-std-2026-07-09/bin/rust-gdb
8.98 s
[rust-stable-with-components-2026-07] /nix/store/imnwv6nazijihjlgf2h3l1qm63m7l9wk-rust-stable-with-std-2026-07-09/lib:
8.98 s
[rust-stable-with-components-2026-07] librustc_driver-a39fc8bf9e61dbb9.so: Keeping existing link to /nix/store/r4bjy93lvnfma1awpi480n2mz3af0adx-clippy-stable-with-std-2026-07-09/lib/librustc_driver-a39fc8bf9e61dbb9.so
9.50 s
[rust-stable-with-components-2026-07:post-build] Uploading to the NixCI cache: /nix/store/9pb4ikjdw4gp766ayxl6gg3b7hqm6ds4-rust-stable-with-components-2026-07-09
9.54 s
[rust-stable-with-components-2026-07:post-build] warning: 'warn-short-path-literals' is deprecated, use 'lint-short-path-literals = ignore' instead
9.58 s
[rust-stable-with-components-2026-07:post-build] copying 0 paths...
9.64 s
[rust-stable-with-components-2026-07:post-build] warning: 'warn-short-path-literals' is deprecated, use 'lint-short-path-literals = ignore' instead
9.67 s
[rust-stable-with-components-2026-07:post-build] copying 0 paths...
9.69 s
Uploaded rust-stable-with-components-2026-07 in 207ms
9.69 s
Progress: 3 of 5 built, 57 of 57 downloaded from cache
9.69 s
Built rust-stable-with-components-2026-07 in 764ms
9.82 s
Building /nix/store/ldwqpkbpc8crkk3daxd316w8rfdkfkxa-gammaloop-workspace-check-0.1.0.drv
9.89 s
[gammaloop-workspace-check] Phase: unpackPhase
9.90 s
[gammaloop-workspace-check] unpacking source archive /nix/store/iwyqqfzvbxqmc3v1spmyg70hrg3fxgmy-source
10.03 s
[gammaloop-workspace-check] source root is source
10.06 s
[gammaloop-workspace-check] Phase: patchPhase
10.06 s
[gammaloop-workspace-check] Executing configureCargoCommonVars
10.07 s
[gammaloop-workspace-check] decompressing cargo artifacts from /nix/store/3rr2bdgfb9psnb82qgblc5h3v86p0vb1-gammaloop-workspace-deps-deps-0.1.0/target.tar.zst to target
11.33 s
[gammaloop-workspace-check] Phase: updateAutotoolsGnuConfigScriptsPhase
12.50 s
[gammaloop-workspace-check] Phase: configurePhase
12.50 s
[gammaloop-workspace-check] will append /build/source/.cargo-home/config.toml with contents of /nix/store/yhvbfm4fzwpxbf22ypggjx69dpf2hlmh-vendor-cargo-deps/config.toml
12.50 s
[gammaloop-workspace-check] default configurePhase, nothing to do
12.50 s
[gammaloop-workspace-check] Phase: buildPhase
12.50 s
[gammaloop-workspace-check] +++ command cargo --version
12.50 s
[gammaloop-workspace-check] cargo 1.97.0 (c980f4866 2026-06-30)
12.50 s
[gammaloop-workspace-check] +++ command cargo check --profile ci-optim --locked --workspace --features gammaloop-tracing-filter/clap,gammaloop-tracing-filter/symbolica,idenso/bincode,idenso/reference-cases,linnet/bincode,linnet/drawing,linnet/serde,linnet/symbolica,spenso-macros/shadowing,spenso/shadowing,symbolica/tracing_max_level_info --all-targets
12.50 s
[gammaloop-workspace-check] Checking cfg-if v1.0.4
12.50 s
[gammaloop-workspace-check] Checking memchr v2.8.0
12.50 s
[gammaloop-workspace-check] Checking once_cell v1.21.4
12.50 s
[gammaloop-workspace-check] Checking either v1.15.0
12.50 s
[gammaloop-workspace-check] Checking serde_core v1.0.228
12.50 s
[gammaloop-workspace-check] Checking libc v0.2.186
12.50 s
[gammaloop-workspace-check] Checking libm v0.2.16
12.50 s
[gammaloop-workspace-check] Checking itoa v1.0.18
12.50 s
[gammaloop-workspace-check] Checking log v0.4.29
12.50 s
[gammaloop-workspace-check] Checking crossbeam-utils v0.8.21
12.50 s
[gammaloop-workspace-check] Checking equivalent v1.0.2
12.50 s
[gammaloop-workspace-check] Checking zerocopy v0.8.48
12.50 s
[gammaloop-workspace-check] Checking regex-syntax v0.8.10
12.50 s
[gammaloop-workspace-check] Checking zmij v1.0.21
12.50 s
[gammaloop-workspace-check] Checking lazy_static v1.5.0
12.50 s
[gammaloop-workspace-check] Checking bytemuck v1.25.0
12.50 s
[gammaloop-workspace-check] Compiling target-lexicon v0.13.5
12.50 s
[gammaloop-workspace-check] Checking powerfmt v0.2.0
12.50 s
[gammaloop-workspace-check] Checking arrayvec v0.7.6
12.51 s
[gammaloop-workspace-check] Checking time-core v0.1.8
12.51 s
[gammaloop-workspace-check] Checking itertools v0.14.0
12.54 s
[gammaloop-workspace-check] Checking num_threads v0.1.7
12.55 s
[gammaloop-workspace-check] Checking pin-project-lite v0.2.17
12.59 s
[gammaloop-workspace-check] Checking deranged v0.5.8
12.59 s
[gammaloop-workspace-check] Checking num-conv v0.2.1
12.60 s
[gammaloop-workspace-check] Checking tracing-core v0.1.36
12.61 s
[gammaloop-workspace-check] Checking safe_arch v0.7.4
12.61 s
[gammaloop-workspace-check] Checking allocator-api2 v0.2.21
12.66 s
[gammaloop-workspace-check] Checking foldhash v0.2.0
12.69 s
[gammaloop-workspace-check] Checking const-random v0.1.18
12.72 s
[gammaloop-workspace-check] Checking unty v0.0.4
12.74 s
[gammaloop-workspace-check] Checking nu-ansi-term v0.50.3
12.77 s
[gammaloop-workspace-check] Checking winnow v1.0.2
12.78 s
[gammaloop-workspace-check] Checking static_assertions v1.1.0
12.81 s
[gammaloop-workspace-check] Checking crossbeam-epoch v0.9.18
12.82 s
[gammaloop-workspace-check] Checking aho-corasick v1.1.4
12.82 s
[gammaloop-workspace-check] Checking safe_arch v1.0.0
12.90 s
[gammaloop-workspace-check] Checking tracing-log v0.2.0
12.91 s
[gammaloop-workspace-check] Checking hashbrown v0.16.1
12.91 s
[gammaloop-workspace-check] Checking wide v0.7.33
12.96 s
[gammaloop-workspace-check] Checking tracing v0.1.44
12.99 s
[gammaloop-workspace-check] Checking sharded-slab v0.1.7
12.99 s
[gammaloop-workspace-check] Checking crossbeam-deque v0.8.6
13.07 s
[gammaloop-workspace-check] Checking thread_local v1.1.9
13.13 s
[gammaloop-workspace-check] Checking rayon-core v1.13.0
13.16 s
[gammaloop-workspace-check] Checking az v1.3.0
13.18 s
[gammaloop-workspace-check] Checking toml_writer v1.1.1+spec-1.1.0
13.31 s
[gammaloop-workspace-check] Checking indenter v0.3.4
13.32 s
[gammaloop-workspace-check] Checking wide v1.3.0
13.34 s
[gammaloop-workspace-check] Compiling phf_shared v0.11.3
13.35 s
[gammaloop-workspace-check] Checking anyhow v1.0.102
13.44 s
[gammaloop-workspace-check] Checking num-traits v0.2.19
13.46 s
[gammaloop-workspace-check] Checking rayon v1.12.0
13.50 s
[gammaloop-workspace-check] Checking dyn-clone v1.0.20
13.54 s
[gammaloop-workspace-check] Checking rawpointer v0.2.1
13.56 s
[gammaloop-workspace-check] Checking utf8parse v0.2.2
13.57 s
[gammaloop-workspace-check] Checking alloc-no-stdlib v2.0.4
13.58 s
[gammaloop-workspace-check] Checking matrixmultiply v0.3.10
13.61 s
[gammaloop-workspace-check] Checking anstyle-parse v1.0.0
13.62 s
[gammaloop-workspace-check] Checking alloc-stdlib v0.2.2
13.67 s
[gammaloop-workspace-check] Checking colorchoice v1.0.5
13.71 s
[gammaloop-workspace-check] Checking colored v3.1.1
13.72 s
[gammaloop-workspace-check] Checking is_terminal_polyfill v1.70.2
13.73 s
[gammaloop-workspace-check] Checking toml_parser v1.1.2+spec-1.1.0
13.73 s
[gammaloop-workspace-check] Checking anstyle-query v1.1.5
13.75 s
[gammaloop-workspace-check] Checking anstyle v1.0.14
13.77 s
[gammaloop-workspace-check] Compiling phf_generator v0.11.3
13.79 s
[gammaloop-workspace-check] Checking eyre v0.6.12
13.85 s
[gammaloop-workspace-check] Checking getrandom v0.3.4
13.85 s
[gammaloop-workspace-check] Compiling pyo3-build-config v0.28.3
13.86 s
[gammaloop-workspace-check] Checking time v0.3.47
13.87 s
[gammaloop-workspace-check] Checking gmp-mpfr-sys v1.7.1
13.88 s
[gammaloop-workspace-check] Checking anstream v1.0.0
13.92 s
[gammaloop-workspace-check] Checking regex-automata v0.4.14
13.94 s
[gammaloop-workspace-check] Checking unicode-width v0.2.2
13.95 s
[gammaloop-workspace-check] Checking bitflags v1.3.2
13.97 s
[gammaloop-workspace-check] Compiling phf_codegen v0.11.3
13.98 s
[gammaloop-workspace-check] Checking rand_core v0.9.5
13.98 s
[gammaloop-workspace-check] Checking region v3.0.2
14.02 s
[gammaloop-workspace-check] Checking approx v0.5.1
14.04 s
[gammaloop-workspace-check] Checking num-integer v0.1.46
14.05 s
[gammaloop-workspace-check] Checking hugepage-rs v0.1.1
14.08 s
[gammaloop-workspace-check] Checking wasmtime-jit-icache-coherence v34.0.2
14.08 s
[gammaloop-workspace-check] Checking serde v1.0.228
14.10 s
[gammaloop-workspace-check] Checking serde_json v1.0.149
14.11 s
[gammaloop-workspace-check] Checking bitflags v2.11.1
14.11 s
[gammaloop-workspace-check] Checking serde_spanned v1.1.1
14.12 s
[gammaloop-workspace-check] Checking toml_datetime v1.1.1+spec-1.1.0
14.12 s
[gammaloop-workspace-check] Checking brotli-decompressor v5.0.0
14.13 s
[gammaloop-workspace-check] Checking inventory v0.3.24
14.14 s
[gammaloop-workspace-check] Checking spec_math v0.1.6
14.17 s
[gammaloop-workspace-check] Checking thiserror v2.0.18
14.18 s
[gammaloop-workspace-check] Compiling getopts v0.2.24
14.19 s
[gammaloop-workspace-check] Checking libloading v0.9.0
14.21 s
[gammaloop-workspace-check] Checking self_cell v1.2.2
14.22 s
[gammaloop-workspace-check] Checking byteorder v1.5.0
14.25 s
[gammaloop-workspace-check] Checking tinyjson v2.5.1
14.27 s
[gammaloop-workspace-check] Checking bytes v1.11.1
14.28 s
[gammaloop-workspace-check] Checking toml v1.1.2+spec-1.1.0
14.30 s
[gammaloop-workspace-check] Checking append-only-vec v0.1.8
14.37 s
[gammaloop-workspace-check] Checking linux-raw-sys v0.12.1
14.38 s
[gammaloop-workspace-check] Compiling unicode_names2_generator v1.3.0
14.40 s
[gammaloop-workspace-check] Compiling unic-char-range v0.9.0
14.48 s
[gammaloop-workspace-check] Checking smallvec v1.15.1
14.48 s
[gammaloop-workspace-check] Checking num-complex v0.4.6
14.51 s
[gammaloop-workspace-check] Checking bincode v2.0.1
14.61 s
[gammaloop-workspace-check] Checking tracing-serde v0.2.0
14.63 s
[gammaloop-workspace-check] Checking smartstring v1.0.1
14.75 s
[gammaloop-workspace-check] Compiling unic-common v0.9.0
14.78 s
[gammaloop-workspace-check] Checking rustix v1.1.4
14.80 s
[gammaloop-workspace-check] Checking simba v0.9.1
14.80 s
[gammaloop-workspace-check] Compiling unic-char-property v0.9.0
14.84 s
[gammaloop-workspace-check] Compiling unic-ucd-version v0.9.0
14.86 s
[gammaloop-workspace-check] Checking brotli v8.0.2
14.88 s
[gammaloop-workspace-check] Compiling is-macro v0.3.7
14.91 s
[gammaloop-workspace-check] Compiling rustpython-parser-vendored v0.4.0
14.96 s
[gammaloop-workspace-check] Checking iana-time-zone v0.1.65
15.04 s
[gammaloop-workspace-check] Compiling rustpython-parser v0.4.0
15.09 s
[gammaloop-workspace-check] Checking chrono v0.4.44
15.24 s
[gammaloop-workspace-check] Compiling phf v0.11.3
15.25 s
[gammaloop-workspace-check] Checking rustc-hash v2.1.2
15.39 s
[gammaloop-workspace-check] Compiling unic-ucd-ident v0.9.0
15.39 s
[gammaloop-workspace-check] Compiling unic-emoji-char v0.9.0
15.42 s
[gammaloop-workspace-check] Checking ndarray v0.17.2
15.43 s
[gammaloop-workspace-check] Compiling lalrpop-util v0.20.2
15.47 s
[gammaloop-workspace-check] Compiling rustc-hash v1.1.0
15.51 s
[gammaloop-workspace-check] Checking rug v1.30.0
15.55 s
[gammaloop-workspace-check] Compiling symbolica v2.2.0 (https://github.com/symbolica-dev/symbolica?branch=dev#0441bd7a)
15.64 s
[gammaloop-workspace-check] Checking unicode-segmentation v1.13.2
15.72 s
[gammaloop-workspace-check] Checking scopeguard v1.2.0
15.76 s
[gammaloop-workspace-check] Checking parking_lot_core v0.9.12
15.80 s
[gammaloop-workspace-check] Checking lock_api v0.4.14
15.94 s
[gammaloop-workspace-check] Checking ppv-lite86 v0.2.21
15.99 s
[gammaloop-workspace-check] Checking ahash v0.8.12
16.03 s
[gammaloop-workspace-check] Checking hashbrown v0.17.0
16.20 s
[gammaloop-workspace-check] Checking unicode-ident v1.0.24
16.29 s
[gammaloop-workspace-check] Checking parking_lot v0.12.5
16.36 s
[gammaloop-workspace-check] Checking errno v0.3.14
16.41 s
[gammaloop-workspace-check] Checking rand_chacha v0.9.0
16.45 s
[gammaloop-workspace-check] Checking getrandom v0.2.17
16.50 s
[gammaloop-workspace-check] Checking clap_lex v1.1.0
16.57 s
[gammaloop-workspace-check] Checking strsim v0.11.1
16.64 s
[gammaloop-workspace-check] Checking unicase v2.9.0
16.66 s
[gammaloop-workspace-check] Checking rand v0.9.4
16.70 s
[gammaloop-workspace-check] Checking signal-hook-registry v1.4.8
16.74 s
[gammaloop-workspace-check] Checking vte v0.14.1
16.78 s
[gammaloop-workspace-check] Checking indexmap v2.14.0
16.80 s
[gammaloop-workspace-check] Checking same-file v1.0.6
16.85 s
[gammaloop-workspace-check] Checking mio v1.2.0
16.91 s
[gammaloop-workspace-check] Checking minimal-lexical v0.2.1
16.94 s
[gammaloop-workspace-check] Checking walkdir v2.5.0
16.97 s
[gammaloop-workspace-check] Checking signal-hook v0.3.18
16.98 s
[gammaloop-workspace-check] Checking matchers v0.2.0
17.10 s
[gammaloop-workspace-check] Checking tracing-subscriber v0.3.23
17.12 s
[gammaloop-workspace-check] Checking regex v1.12.3
17.21 s
[gammaloop-workspace-check] Checking nom v7.1.3
17.22 s
[gammaloop-workspace-check] Checking derive_more v2.1.1
17.29 s
[gammaloop-workspace-check] Checking num-bigint v0.4.6
17.33 s
[gammaloop-workspace-check] Checking terminal_size v0.4.4
17.38 s
[gammaloop-workspace-check] Checking signal-hook-mio v0.2.5
17.48 s
[gammaloop-workspace-check] Checking symjit v2.21.0
17.48 s
[gammaloop-workspace-check] Checking clap_builder v4.6.0
17.52 s
[gammaloop-workspace-check] Checking console v0.16.3
17.57 s
[gammaloop-workspace-check] Checking winnow v0.7.15
17.64 s
[gammaloop-workspace-check] Checking linux-raw-sys v0.4.15
18.03 s
[gammaloop-workspace-check] Checking rustix v0.38.44
18.29 s
[gammaloop-workspace-check] Checking rand_core v0.6.4
18.48 s
[gammaloop-workspace-check] Checking half v2.7.1
18.82 s
[gammaloop-workspace-check] Checking getrandom v0.4.2
19.00 s
[gammaloop-workspace-check] Compiling unicode_names2 v1.3.0
19.06 s
[gammaloop-workspace-check] Checking fnv v1.0.7
19.13 s
[gammaloop-workspace-check] Checking ciborium-io v0.2.2
19.14 s
[gammaloop-workspace-check] Checking fastrand v2.4.1
19.18 s
[gammaloop-workspace-check] Checking plotters-backend v0.3.7
19.24 s
[gammaloop-workspace-check] Checking ciborium-ll v0.2.2
19.33 s
[gammaloop-workspace-check] Checking crossterm v0.28.1
19.34 s
[gammaloop-workspace-check] Checking tempfile v3.27.0
19.44 s
[gammaloop-workspace-check] Checking ansitok v0.3.0
19.48 s
[gammaloop-workspace-check] Checking plotters-svg v0.3.7
19.50 s
[gammaloop-workspace-check] Checking env_filter v1.0.1
19.53 s
[gammaloop-workspace-check] Checking toml_datetime v0.6.11
19.68 s
[gammaloop-workspace-check] Checking serde_spanned v0.6.9
19.72 s
[gammaloop-workspace-check] Checking itertools v0.10.5
19.75 s
[gammaloop-workspace-check] Checking cast v0.3.0
19.78 s
[gammaloop-workspace-check] Checking jiff v0.2.24
19.80 s
[gammaloop-workspace-check] Checking toml_write v0.1.2
19.82 s
[gammaloop-workspace-check] Checking plotters v0.3.7
19.86 s
[gammaloop-workspace-check] Checking ciborium v0.2.2
19.95 s
[gammaloop-workspace-check] Checking ansi-str v0.9.0
19.96 s
[gammaloop-workspace-check] Checking rand_chacha v0.3.1
20.10 s
[gammaloop-workspace-check] Checking toml_edit v0.22.27
20.24 s
[gammaloop-workspace-check] Checking typeid v1.0.3
20.31 s
[gammaloop-workspace-check] Checking similar v2.7.0
20.54 s
[gammaloop-workspace-check] Checking tinytemplate v1.2.1
20.55 s
[gammaloop-workspace-check] Checking is-terminal v0.4.17
20.57 s
[gammaloop-workspace-check] Checking xprec v0.2.2
20.60 s
[gammaloop-workspace-check] Checking tap v1.0.1
20.66 s
[gammaloop-workspace-check] Checking clap v4.6.1
20.70 s
[gammaloop-workspace-check] Checking bytecount v0.6.9
20.73 s
[gammaloop-workspace-check] Checking anes v0.1.6
20.76 s
[gammaloop-workspace-check] Checking oorandom v11.1.5
20.82 s
[gammaloop-workspace-check] Checking papergrid v0.17.0
20.84 s
[gammaloop-workspace-check] Checking wyz v0.5.1
20.86 s
[gammaloop-workspace-check] Checking ron v0.12.1
20.91 s
[gammaloop-workspace-check] Checking rand v0.8.6
20.91 s
[gammaloop-workspace-check] Checking testing_table v0.3.0
20.98 s
[gammaloop-workspace-check] Checking toml_edit v0.25.11+spec-1.1.0
21.06 s
[gammaloop-workspace-check] Checking uncased v0.9.10
21.10 s
[gammaloop-workspace-check] Checking radium v0.7.0
21.11 s
[gammaloop-workspace-check] Checking funty v2.0.0
21.17 s
[gammaloop-workspace-check] Checking ucd-trie v0.1.7
21.34 s
[gammaloop-workspace-check] Checking approx v0.4.0
21.36 s
[gammaloop-workspace-check] Checking criterion-plot v0.5.0
21.40 s
[gammaloop-workspace-check] Checking pest v2.8.6
21.46 s
[gammaloop-workspace-check] Checking cgmath v0.18.0
21.58 s
[gammaloop-workspace-check] Checking num-rational v0.4.2
21.60 s
[gammaloop-workspace-check] Checking num-iter v0.1.45
21.70 s
[gammaloop-workspace-check] Checking ref-ops v0.2.5
21.71 s
[gammaloop-workspace-check] Checking bitvec v1.0.1
21.82 s
[gammaloop-workspace-check] Checking criterion v0.5.1
21.86 s
[gammaloop-workspace-check] Checking rand_xoshiro v0.6.0
22.03 s
[gammaloop-workspace-check] Checking num v0.4.3
22.13 s
[gammaloop-workspace-check] Checking features v0.10.0
22.18 s
[gammaloop-workspace-check] Checking tabled v0.20.0
22.23 s
[gammaloop-workspace-check] Checking constcat v0.5.1
22.26 s
[gammaloop-workspace-check] Checking gat-lending-iterator v0.1.8
22.26 s
[gammaloop-workspace-check] Checking toml v0.8.23
22.37 s
[gammaloop-workspace-check] Checking colored v2.2.0
22.43 s
[gammaloop-workspace-check] Checking arrayref v0.3.9
22.48 s
[gammaloop-workspace-check] Checking cpufeatures v0.3.0
22.51 s
[gammaloop-workspace-check] Checking constant_time_eq v0.4.2
22.55 s
[gammaloop-workspace-check] Checking base64 v0.22.1
22.59 s
[gammaloop-workspace-check] Compiling pyo3-ffi v0.28.3
22.64 s
[gammaloop-workspace-check] Compiling pyo3-macros-backend v0.28.3
22.65 s
[gammaloop-workspace-check] Compiling pyo3 v0.28.3
22.65 s
[gammaloop-workspace-check] Compiling numpy v0.28.0
22.78 s
[gammaloop-workspace-check] Checking figment v0.10.19
22.80 s
[gammaloop-workspace-check] Checking insta v1.47.2
22.89 s
[gammaloop-workspace-check] Checking blake3 v1.8.5
23.12 s
[gammaloop-workspace-check] Checking joinery v2.1.0
23.19 s
[gammaloop-workspace-check] Checking dot-parser v0.5.1
23.22 s
[gammaloop-workspace-check] Checking siphasher v1.0.2
23.28 s
[gammaloop-workspace-check] Checking titlecase v2.2.1
23.46 s
[gammaloop-workspace-check] Checking subprocess v0.2.15
23.50 s
[gammaloop-workspace-check] Checking rust_lisp v0.18.0
23.51 s
[gammaloop-workspace-check] Checking phf_shared v0.13.1
23.61 s
[gammaloop-workspace-check] Compiling vakint v0.1.2 (/build/source/crates/vakint)
23.74 s
[gammaloop-workspace-check] Checking version-compare v0.2.1
23.75 s
[gammaloop-workspace-check] Checking phf v0.13.1
23.80 s
[gammaloop-workspace-check] Checking env_logger v0.11.10
23.82 s
[gammaloop-workspace-check] Checking typenum v1.20.0
23.86 s
[gammaloop-workspace-check] Checking xpct v0.5.1
23.89 s
[gammaloop-workspace-check] Checking ryu v1.0.23
23.91 s
[gammaloop-workspace-check] Checking castaway v0.2.4
23.92 s
[gammaloop-workspace-check] Checking toml_datetime v0.7.5+spec-1.1.0
23.97 s
[gammaloop-workspace-check] Checking strum v0.27.2
24.03 s
[gammaloop-workspace-check] Checking unicode-truncate v2.0.1
24.04 s
[gammaloop-workspace-check] Checking string-template-plus v0.4.3
24.04 s
[gammaloop-workspace-check] Checking compact_str v0.9.0
24.04 s
[gammaloop-workspace-check] Checking kasuari v0.4.12
24.05 s
[gammaloop-workspace-check] Checking lru v0.16.4
24.07 s
[gammaloop-workspace-check] Checking vte v0.15.0
24.16 s
[gammaloop-workspace-check] Checking toml v0.9.12+spec-1.1.0
24.20 s
[gammaloop-workspace-check] Checking portable-atomic v1.13.1
24.25 s
[gammaloop-workspace-check] Checking unit-prefix v0.5.2
24.26 s
[gammaloop-workspace-check] Checking rand_distr v0.4.3
24.31 s
[gammaloop-workspace-check] Checking vt100 v0.16.2
24.32 s
[gammaloop-workspace-check] Checking simba v0.6.0
24.37 s
[gammaloop-workspace-check] Checking line-clipping v0.3.7
24.40 s
[gammaloop-workspace-check] Checking gimli v0.32.3
24.44 s
[gammaloop-workspace-check] Checking adler2 v2.0.1
24.46 s
[gammaloop-workspace-check] Checking thiserror v1.0.69
24.53 s
[gammaloop-workspace-check] Checking derive_builder v0.11.2
24.56 s
[gammaloop-workspace-check] Checking object v0.37.3
24.59 s
[gammaloop-workspace-check] Checking crossterm v0.29.0
24.61 s
[gammaloop-workspace-check] Checking miniz_oxide v0.8.9
24.63 s
[gammaloop-workspace-check] Checking ratatui-core v0.1.0
24.65 s
[gammaloop-workspace-check] Checking owo-colors v4.3.0
24.73 s
[gammaloop-workspace-check] Checking tracing-error v0.2.1
24.76 s
[gammaloop-workspace-check] Checking serde-big-array v0.5.1
24.85 s
[gammaloop-workspace-check] Checking amd v0.2.2
24.90 s
[gammaloop-workspace-check] Checking itertools v0.11.0
24.90 s
[gammaloop-workspace-check] Compiling gammaloop-tracing-filter-macros v0.1.0 (/build/source/crates/gammaloop-tracing-filter-macros)
24.93 s
[gammaloop-workspace-check] Checking indicatif v0.18.4
24.95 s
[gammaloop-workspace-check] Checking option-ext v0.2.0
25.02 s
[gammaloop-workspace-check] Checking rustc-demangle v0.1.27
25.07 s
[gammaloop-workspace-check] Checking dirs-sys v0.5.0
25.20 s
[gammaloop-workspace-check] Checking ref-cast v1.0.25
25.26 s
[gammaloop-workspace-check] Checking nix v0.31.2
25.30 s
[gammaloop-workspace-check] Checking integer-sqrt v0.1.5
25.32 s
[gammaloop-workspace-check] Checking brotli-decompressor v4.0.3
25.38 s
[gammaloop-workspace-check] Checking crossbeam-channel v0.5.15
25.45 s
[gammaloop-workspace-check] Compiling rustpython-parser-core v0.4.0
25.45 s
[gammaloop-workspace-check] Checking itertools v0.12.1
25.47 s
[gammaloop-workspace-check] Compiling gammalooprs v0.3.4 (/build/source/crates/gammalooprs)
25.57 s
[gammaloop-workspace-check] Checking symlink v0.1.0
25.63 s
[gammaloop-workspace-check] Compiling rustpython-ast v0.4.0
25.64 s
[gammaloop-workspace-check] Checking color-spantrace v0.3.0
25.66 s
[gammaloop-workspace-check] Checking unsafe-libyaml v0.2.11
25.76 s
[gammaloop-workspace-check] Checking tracing-indicatif v0.3.14
25.77 s
[gammaloop-workspace-check] Checking include_dir v0.7.4
25.89 s
[gammaloop-workspace-check] Checking ratatui-widgets v0.3.0
25.89 s
[gammaloop-workspace-check] Checking ratatui-crossterm v0.1.0
25.93 s
[gammaloop-workspace-check] Checking pathfinding v4.15.0
25.94 s
[gammaloop-workspace-check] Checking tracing-appender v0.2.5
25.97 s
[gammaloop-workspace-check] Checking schemars v1.2.1
26.00 s
[gammaloop-workspace-check] Checking ctrlc v3.5.2
26.06 s
[gammaloop-workspace-check] Checking slotmap v1.1.1
26.14 s
[gammaloop-workspace-check] Checking dirs v6.0.0
26.18 s
[gammaloop-workspace-check] Checking generic-array v0.14.7
26.20 s
[gammaloop-workspace-check] Checking json5 v0.4.1
26.32 s
[gammaloop-workspace-check] Checking brotli v7.0.0
26.33 s
[gammaloop-workspace-check] Checking clarabel v0.11.1
26.57 s
[gammaloop-workspace-check] Checking typed-index-collections v3.5.0
26.61 s
[gammaloop-workspace-check] Checking serde_yaml v0.9.34+deprecated
26.63 s
[gammaloop-workspace-check] Checking vectorize v0.2.0
26.72 s
[gammaloop-workspace-check] Checking ringbuffer v0.16.0
26.75 s
[gammaloop-workspace-check] Checking base62 v2.2.4
26.88 s
[gammaloop-workspace-check] Checking cpufeatures v0.2.17
26.95 s
[gammaloop-workspace-check] Checking clap_complete v4.6.3
26.97 s
[gammaloop-workspace-check] Checking crypto-common v0.1.7
26.98 s
[gammaloop-workspace-check] Checking block-buffer v0.10.4
26.99 s
[gammaloop-workspace-check] Checking fd-lock v4.0.4
27.00 s
[gammaloop-workspace-check] Checking strip-ansi-escapes v0.2.1
27.08 s
[gammaloop-workspace-check] Compiling gammaloop-api v0.1.0 (/build/source/crates/gammaloop-api)
27.09 s
[gammaloop-workspace-check] Checking itertools v0.13.0
27.11 s
[gammaloop-workspace-check] Checking digest v0.10.7
27.13 s
[gammaloop-workspace-check] Compiling test-log-core v0.2.20
27.18 s
[gammaloop-workspace-check] Checking ratatui-macros v0.7.0
27.22 s
[gammaloop-workspace-check] Checking strum v0.26.3
27.25 s
[gammaloop-workspace-check] Checking ratatui v0.30.0
27.30 s
[gammaloop-workspace-check] Compiling rustc_version v0.4.1
27.37 s
[gammaloop-workspace-check] Checking sysinfo v0.33.1
27.39 s
[gammaloop-workspace-check] Checking clap_complete_nushell v4.6.0
27.40 s
[gammaloop-workspace-check] Checking addr2line v0.25.1
27.43 s
[gammaloop-workspace-check] Checking sha2 v0.10.9
27.55 s
[gammaloop-workspace-check] Checking shlex v1.3.0
27.69 s
[gammaloop-workspace-check] Checking bincode v1.3.3
27.75 s
[gammaloop-workspace-check] Checking rust-embed-utils v8.11.0
27.76 s
[gammaloop-workspace-check] Checking futures-core v0.3.32
27.86 s
[gammaloop-workspace-check] Checking rust-embed v8.11.0
27.92 s
[gammaloop-workspace-check] Compiling gungraun-runner v0.18.2
27.95 s
[gammaloop-workspace-check] Checking slab v0.4.12
27.96 s
[gammaloop-workspace-check] Checking futures-task v0.3.32
28.14 s
[gammaloop-workspace-check] Checking sdd v3.0.10
28.15 s
[gammaloop-workspace-check] Compiling gammaloop-integration-tests v0.1.0 (/build/source/tests)
28.18 s
[gammaloop-workspace-check] Checking futures-util v0.3.32
28.25 s
[gammaloop-workspace-check] Checking which v8.0.2
28.41 s
[gammaloop-workspace-check] Compiling gungraun-macros v0.8.0
28.43 s
[gammaloop-workspace-check] Checking scc v2.4.0
28.48 s
[gammaloop-workspace-check] Compiling numerica v2.2.0 (https://github.com/symbolica-dev/symbolica?branch=dev#0441bd7a)
28.59 s
[gammaloop-workspace-check] Checking backtrace v0.3.76
28.69 s
[gammaloop-workspace-check] Checking reedline v0.42.0
29.32 s
[gammaloop-workspace-check] Checking nalgebra v0.29.0
29.46 s
[gammaloop-workspace-check] Checking color-eyre v0.6.5
30.05 s
[gammaloop-workspace-check] Compiling test-log-macros v0.2.20
30.17 s
[gammaloop-workspace-check] Checking proc-macro2 v1.0.106
30.20 s
[gammaloop-workspace-check] Checking maplit v1.0.2
30.21 s
[gammaloop-workspace-check] Checking base64 v0.21.7
30.26 s
[gammaloop-workspace-check] Compiling iai-callgrind-runner v0.14.2
30.27 s
[gammaloop-workspace-check] Checking wait-timeout v0.2.1
30.40 s
[gammaloop-workspace-check] Compiling iai-callgrind v0.14.2
30.52 s
[gammaloop-workspace-check] Checking ron v0.8.1
30.63 s
[gammaloop-workspace-check] Checking quick-error v1.2.3
30.70 s
[gammaloop-workspace-check] Checking quote v1.0.45
30.71 s
[gammaloop-workspace-check] Checking bit-vec v0.8.0
30.74 s
[gammaloop-workspace-check] Checking futures-executor v0.3.32
30.84 s
[gammaloop-workspace-check] Checking rusty-fork v0.3.1
30.90 s
[gammaloop-workspace-check] Checking serial_test v3.4.0
30.91 s
[gammaloop-workspace-check] Compiling iai-callgrind-macros v0.5.1
30.94 s
[gammaloop-workspace-check] Checking syn v2.0.117
30.97 s
[gammaloop-workspace-check] Checking bit-set v0.8.0
31.06 s
[gammaloop-workspace-check] Checking rand_xorshift v0.4.0
31.07 s
[gammaloop-workspace-check] Checking console v0.15.11
31.14 s
[gammaloop-workspace-check] Checking unarray v0.1.4
31.15 s
[gammaloop-workspace-check] Checking pathdiff v0.2.3
31.22 s
[gammaloop-workspace-check] Checking proptest v1.11.0
31.48 s
[gammaloop-workspace-check] Checking kurbo v0.11.3
31.67 s
[gammaloop-workspace-check] Checking similar-asserts v1.7.0
31.94 s
[gammaloop-workspace-check] Checking clinnet v0.1.8 (/build/source/crates/clinnet)
33.75 s
[gammaloop-workspace-check] Checking test-log v0.2.20
34.09 s
[gammaloop-workspace-check] Compiling graphica v2.1.0 (https://github.com/symbolica-dev/symbolica?branch=dev#0441bd7a)
37.55 s
[gammaloop-workspace-check] Checking statrs v0.16.1
39.67 s
[gammaloop-workspace-check] Checking momtrop v0.3.0
40.47 s
[gammaloop-workspace-check] Checking gungraun v0.18.2
47.71 s
[gammaloop-workspace-check] Compiling pyo3-macros v0.28.3
48.03 s
[gammaloop-workspace-check] Compiling pyo3-stub-gen-derive v0.17.2
58.61 s
[gammaloop-workspace-check] Checking pyo3-stub-gen v0.17.2
71.31 s
[gammaloop-workspace-check] Checking symbolica-utils v0.1.0 (/build/source/crates/symbolica-utils)
71.32 s
[gammaloop-workspace-check] Checking spenso-macros v0.3.2 (/build/source/crates/spenso-macros)
391.49 s
[gammaloop-workspace-check] Compiling gammaloop-workspace-hack v0.1.0 (/build/source/crates/gammaloop-workspace-hack)
391.89 s
[gammaloop-workspace-check] Checking linnet v0.17.0 (/build/source/crates/linnet)
396.93 s
[gammaloop-workspace-check] Checking spenso v0.6.0 (/build/source/crates/spenso)
397.34 s
[gammaloop-workspace-check] Checking linnet-py v0.1.0 (/build/source/crates/linnet-py)
397.34 s
[gammaloop-workspace-check] Checking linnest v0.1.0 (/build/source/crates/linnest)
405.18 s
[gammaloop-workspace-check] Checking idenso v0.3.0 (/build/source/crates/idenso)
405.19 s
[gammaloop-workspace-check] Checking gammaloop-tracing-filter v0.1.0 (/build/source/crates/gammaloop-tracing-filter)
407.86 s
[gammaloop-workspace-check] Checking spenso-hep-lib v0.1.7 (/build/source/crates/spenso-hep-lib)
408.13 s
[gammaloop-workspace-check] Checking spynso3 v0.1.2 (/build/source/crates/spynso3)
438.03 s
[gammaloop-workspace-check] error[E0063] : missing field `center_group` in initializer of `ThresholdCountertermVariantMetadata`
438.05 s
[gammaloop-workspace-check] --> crates/gammaloop-api/src/commands/display.rs:2060:28
438.05 s
[gammaloop-workspace-check] |
438.05 s
[gammaloop-workspace-check] 2060 | variants: vec![ThresholdCountertermVariantMetadata {
438.05 s
[gammaloop-workspace-check] | ^^^^^^^^^^^^^^^^^^^^^^^^^^^^^^^^^^^ missing `center_group`
438.05 s
[gammaloop-workspace-check]
438.05 s
[gammaloop-workspace-check] error[E0063] : missing field `center_group` in initializer of `ThresholdCountertermVariantMetadata`
438.05 s
[gammaloop-workspace-check] --> crates/gammaloop-api/src/commands/display.rs:2092:28
438.05 s
[gammaloop-workspace-check] |
438.05 s
[gammaloop-workspace-check] 2092 | variants: vec![ThresholdCountertermVariantMetadata {
438.05 s
[gammaloop-workspace-check] | ^^^^^^^^^^^^^^^^^^^^^^^^^^^^^^^^^^^ missing `center_group`
438.05 s
[gammaloop-workspace-check]
442.60 s
[gammaloop-workspace-check] For more information about this error, try `rustc --explain E0063`.
442.66 s
[gammaloop-workspace-check] error : could not compile `gammaloop-api` (lib test) due to 2 previous errors
442.66 s
[gammaloop-workspace-check] warning : build failed, waiting for other jobs to finish...
444.51 s
Progress: 3 of 4 built (1 failed), 57 of 57 downloaded from cache
444.53 s
Failed to build gammaloop-workspace-check after 7m14s
444.53 s
Cannot build ' /nix/store/ldwqpkbpc8crkk3daxd316w8rfdkfkxa-gammaloop-workspace-check-0.1.0.drv '.
444.53 s
Reason: builder failed with exit code 101 .
444.53 s
Output paths:
444.53 s
/nix/store/qcmhkayx3bybxvx8sy0fzz764cidv5n2-gammaloop-workspace-check-0.1.0
444.53 s
Last 428 log lines:
444.53 s
> Running phase: unpackPhase
444.53 s
> unpacking source archive /nix/store/iwyqqfzvbxqmc3v1spmyg70hrg3fxgmy-source
444.53 s
> source root is source
444.53 s
> Running phase: patchPhase
444.53 s
> Executing configureCargoCommonVars
444.53 s
> decompressing cargo artifacts from /nix/store/3rr2bdgfb9psnb82qgblc5h3v86p0vb1-gammaloop-workspace-deps-deps-0.1.0/target.tar.zst to target
444.53 s
> Running phase: updateAutotoolsGnuConfigScriptsPhase
444.53 s
> Running phase: configurePhase
444.53 s
> will append /build/source/.cargo-home/config.toml with contents of /nix/store/yhvbfm4fzwpxbf22ypggjx69dpf2hlmh-vendor-cargo-deps/config.toml
444.53 s
> default configurePhase, nothing to do
444.53 s
> Running phase: buildPhase
444.53 s
> +++ command cargo --version
444.53 s
> cargo 1.97.0 (c980f4866 2026-06-30)
444.53 s
> +++ command cargo check --profile ci-optim --locked --workspace --features gammaloop-tracing-filter/clap,gammaloop-tracing-filter/symbolica,idenso/bincode,idenso/reference-cases,linnet/bincode,linnet/drawing,linnet/serde,linnet/symbolica,spenso-macros/shadowing,spenso/shadowing,symbolica/tracing_max_level_info --all-targets
444.53 s
> Checking cfg-if v1.0.4
444.53 s
> Checking memchr v2.8.0
444.53 s
> Checking once_cell v1.21.4
444.53 s
> Checking either v1.15.0
444.53 s
> Checking serde_core v1.0.228
444.53 s
> Checking libc v0.2.186
444.53 s
> Checking libm v0.2.16
444.53 s
> Checking itoa v1.0.18
444.53 s
> Checking log v0.4.29
444.53 s
> Checking crossbeam-utils v0.8.21
444.53 s
> Checking equivalent v1.0.2
444.53 s
> Checking zerocopy v0.8.48
444.53 s
> Checking regex-syntax v0.8.10
444.53 s
> Checking zmij v1.0.21
444.53 s
> Checking lazy_static v1.5.0
444.53 s
> Checking bytemuck v1.25.0
444.53 s
> Compiling target-lexicon v0.13.5
444.53 s
> Checking powerfmt v0.2.0
444.53 s
> Checking arrayvec v0.7.6
444.53 s
> Checking time-core v0.1.8
444.53 s
> Checking itertools v0.14.0
444.53 s
> Checking num_threads v0.1.7
444.53 s
> Checking pin-project-lite v0.2.17
444.53 s
> Checking deranged v0.5.8
444.53 s
> Checking num-conv v0.2.1
444.53 s
> Checking tracing-core v0.1.36
444.53 s
> Checking safe_arch v0.7.4
444.53 s
> Checking allocator-api2 v0.2.21
444.53 s
> Checking foldhash v0.2.0
444.53 s
> Checking const-random v0.1.18
444.53 s
> Checking unty v0.0.4
444.53 s
> Checking nu-ansi-term v0.50.3
444.53 s
> Checking winnow v1.0.2
444.53 s
> Checking static_assertions v1.1.0
444.53 s
> Checking crossbeam-epoch v0.9.18
444.53 s
> Checking aho-corasick v1.1.4
444.53 s
> Checking safe_arch v1.0.0
444.53 s
> Checking tracing-log v0.2.0
444.53 s
> Checking hashbrown v0.16.1
444.53 s
> Checking wide v0.7.33
444.53 s
> Checking tracing v0.1.44
444.53 s
> Checking sharded-slab v0.1.7
444.53 s
> Checking crossbeam-deque v0.8.6
444.53 s
> Checking thread_local v1.1.9
444.53 s
> Checking rayon-core v1.13.0
444.53 s
> Checking az v1.3.0
444.53 s
> Checking toml_writer v1.1.1+spec-1.1.0
444.53 s
> Checking indenter v0.3.4
444.53 s
> Checking wide v1.3.0
444.53 s
> Compiling phf_shared v0.11.3
444.53 s
> Checking anyhow v1.0.102
444.53 s
> Checking num-traits v0.2.19
444.53 s
> Checking rayon v1.12.0
444.53 s
> Checking dyn-clone v1.0.20
444.53 s
> Checking rawpointer v0.2.1
444.53 s
> Checking utf8parse v0.2.2
444.53 s
> Checking alloc-no-stdlib v2.0.4
444.53 s
> Checking matrixmultiply v0.3.10
444.53 s
> Checking anstyle-parse v1.0.0
444.53 s
> Checking alloc-stdlib v0.2.2
444.53 s
> Checking colorchoice v1.0.5
444.53 s
> Checking colored v3.1.1
444.53 s
> Checking is_terminal_polyfill v1.70.2
444.53 s
> Checking toml_parser v1.1.2+spec-1.1.0
444.53 s
> Checking anstyle-query v1.1.5
444.53 s
> Checking anstyle v1.0.14
444.53 s
> Compiling phf_generator v0.11.3
444.53 s
> Checking eyre v0.6.12
444.53 s
> Checking getrandom v0.3.4
444.53 s
> Compiling pyo3-build-config v0.28.3
444.53 s
> Checking time v0.3.47
444.53 s
> Checking gmp-mpfr-sys v1.7.1
444.53 s
> Checking anstream v1.0.0
444.53 s
> Checking regex-automata v0.4.14
444.53 s
> Checking unicode-width v0.2.2
444.53 s
> Checking bitflags v1.3.2
444.53 s
> Compiling phf_codegen v0.11.3
444.53 s
> Checking rand_core v0.9.5
444.53 s
> Checking region v3.0.2
444.53 s
> Checking approx v0.5.1
444.53 s
> Checking num-integer v0.1.46
444.53 s
> Checking hugepage-rs v0.1.1
444.53 s
> Checking wasmtime-jit-icache-coherence v34.0.2
444.53 s
> Checking serde v1.0.228
444.53 s
> Checking serde_json v1.0.149
444.53 s
> Checking bitflags v2.11.1
444.53 s
> Checking serde_spanned v1.1.1
444.53 s
> Checking toml_datetime v1.1.1+spec-1.1.0
444.53 s
> Checking brotli-decompressor v5.0.0
444.53 s
> Checking inventory v0.3.24
444.53 s
> Checking spec_math v0.1.6
444.53 s
> Checking thiserror v2.0.18
444.53 s
> Compiling getopts v0.2.24
444.53 s
> Checking libloading v0.9.0
444.53 s
> Checking self_cell v1.2.2
444.53 s
> Checking byteorder v1.5.0
444.53 s
> Checking tinyjson v2.5.1
444.53 s
> Checking bytes v1.11.1
444.53 s
> Checking toml v1.1.2+spec-1.1.0
444.53 s
> Checking append-only-vec v0.1.8
444.53 s
> Checking linux-raw-sys v0.12.1
444.53 s
> Compiling unicode_names2_generator v1.3.0
444.53 s
> Compiling unic-char-range v0.9.0
444.53 s
> Checking smallvec v1.15.1
444.53 s
> Checking num-complex v0.4.6
444.53 s
> Checking bincode v2.0.1
444.53 s
> Checking tracing-serde v0.2.0
444.53 s
> Checking smartstring v1.0.1
444.53 s
> Compiling unic-common v0.9.0
444.53 s
> Checking rustix v1.1.4
444.53 s
> Checking simba v0.9.1
444.53 s
> Compiling unic-char-property v0.9.0
444.53 s
> Compiling unic-ucd-version v0.9.0
444.53 s
> Checking brotli v8.0.2
444.53 s
> Compiling is-macro v0.3.7
444.53 s
> Compiling rustpython-parser-vendored v0.4.0
444.53 s
> Checking iana-time-zone v0.1.65
444.53 s
> Compiling rustpython-parser v0.4.0
444.53 s
> Checking chrono v0.4.44
444.53 s
> Compiling phf v0.11.3
444.53 s
> Checking rustc-hash v2.1.2
444.53 s
> Compiling unic-ucd-ident v0.9.0
444.53 s
> Compiling unic-emoji-char v0.9.0
444.53 s
> Checking ndarray v0.17.2
444.53 s
> Compiling lalrpop-util v0.20.2
444.53 s
> Compiling rustc-hash v1.1.0
444.53 s
> Checking rug v1.30.0
444.53 s
> Compiling symbolica v2.2.0 (https://github.com/symbolica-dev/symbolica?branch=dev#0441bd7a)
444.53 s
> Checking unicode-segmentation v1.13.2
444.53 s
> Checking scopeguard v1.2.0
444.53 s
> Checking parking_lot_core v0.9.12
444.53 s
> Checking lock_api v0.4.14
444.53 s
> Checking ppv-lite86 v0.2.21
444.53 s
> Checking ahash v0.8.12
444.53 s
> Checking hashbrown v0.17.0
444.53 s
> Checking unicode-ident v1.0.24
444.53 s
> Checking parking_lot v0.12.5
444.53 s
> Checking errno v0.3.14
444.53 s
> Checking rand_chacha v0.9.0
444.53 s
> Checking getrandom v0.2.17
444.53 s
> Checking clap_lex v1.1.0
444.53 s
> Checking strsim v0.11.1
444.53 s
> Checking unicase v2.9.0
444.53 s
> Checking rand v0.9.4
444.53 s
> Checking signal-hook-registry v1.4.8
444.53 s
> Checking vte v0.14.1
444.53 s
> Checking indexmap v2.14.0
444.53 s
> Checking same-file v1.0.6
444.53 s
> Checking mio v1.2.0
444.53 s
> Checking minimal-lexical v0.2.1
444.53 s
> Checking walkdir v2.5.0
444.53 s
> Checking signal-hook v0.3.18
444.53 s
> Checking matchers v0.2.0
444.53 s
> Checking tracing-subscriber v0.3.23
444.53 s
> Checking regex v1.12.3
444.53 s
> Checking nom v7.1.3
444.53 s
> Checking derive_more v2.1.1
444.53 s
> Checking num-bigint v0.4.6
444.53 s
> Checking terminal_size v0.4.4
444.53 s
> Checking signal-hook-mio v0.2.5
444.53 s
> Checking symjit v2.21.0
444.53 s
> Checking clap_builder v4.6.0
444.53 s
> Checking console v0.16.3
444.53 s
> Checking winnow v0.7.15
444.53 s
> Checking linux-raw-sys v0.4.15
444.53 s
> Checking rustix v0.38.44
444.53 s
> Checking rand_core v0.6.4
444.53 s
> Checking half v2.7.1
444.53 s
> Checking getrandom v0.4.2
444.53 s
> Compiling unicode_names2 v1.3.0
444.53 s
> Checking fnv v1.0.7
444.53 s
> Checking ciborium-io v0.2.2
444.53 s
> Checking fastrand v2.4.1
444.53 s
> Checking plotters-backend v0.3.7
444.53 s
> Checking ciborium-ll v0.2.2
444.53 s
> Checking crossterm v0.28.1
444.53 s
> Checking tempfile v3.27.0
444.53 s
> Checking ansitok v0.3.0
444.53 s
> Checking plotters-svg v0.3.7
444.53 s
> Checking env_filter v1.0.1
444.53 s
> Checking toml_datetime v0.6.11
444.53 s
> Checking serde_spanned v0.6.9
444.53 s
> Checking itertools v0.10.5
444.53 s
> Checking cast v0.3.0
444.53 s
> Checking jiff v0.2.24
444.53 s
> Checking toml_write v0.1.2
444.53 s
> Checking plotters v0.3.7
444.53 s
> Checking ciborium v0.2.2
444.53 s
> Checking ansi-str v0.9.0
444.53 s
> Checking rand_chacha v0.3.1
444.53 s
> Checking toml_edit v0.22.27
444.53 s
> Checking typeid v1.0.3
444.53 s
> Checking similar v2.7.0
444.53 s
> Checking tinytemplate v1.2.1
444.53 s
> Checking is-terminal v0.4.17
444.53 s
> Checking xprec v0.2.2
444.53 s
> Checking tap v1.0.1
444.53 s
> Checking clap v4.6.1
444.53 s
> Checking bytecount v0.6.9
444.53 s
> Checking anes v0.1.6
444.53 s
> Checking oorandom v11.1.5
444.53 s
> Checking papergrid v0.17.0
444.53 s
> Checking wyz v0.5.1
444.53 s
> Checking ron v0.12.1
444.53 s
> Checking rand v0.8.6
444.53 s
> Checking testing_table v0.3.0
444.53 s
> Checking toml_edit v0.25.11+spec-1.1.0
444.53 s
> Checking uncased v0.9.10
444.53 s
> Checking radium v0.7.0
444.53 s
> Checking funty v2.0.0
444.53 s
> Checking ucd-trie v0.1.7
444.53 s
> Checking approx v0.4.0
444.53 s
> Checking criterion-plot v0.5.0
444.53 s
> Checking pest v2.8.6
444.53 s
> Checking cgmath v0.18.0
444.53 s
> Checking num-rational v0.4.2
444.53 s
> Checking num-iter v0.1.45
444.53 s
> Checking ref-ops v0.2.5
444.53 s
> Checking bitvec v1.0.1
444.53 s
> Checking criterion v0.5.1
444.53 s
> Checking rand_xoshiro v0.6.0
444.53 s
> Checking num v0.4.3
444.53 s
> Checking features v0.10.0
444.53 s
> Checking tabled v0.20.0
444.53 s
> Checking constcat v0.5.1
444.53 s
> Checking gat-lending-iterator v0.1.8
444.53 s
> Checking toml v0.8.23
444.53 s
> Checking colored v2.2.0
444.53 s
> Checking arrayref v0.3.9
444.53 s
> Checking cpufeatures v0.3.0
444.53 s
> Checking constant_time_eq v0.4.2
444.53 s
> Checking base64 v0.22.1
444.53 s
> Compiling pyo3-ffi v0.28.3
444.53 s
> Compiling pyo3-macros-backend v0.28.3
444.53 s
> Compiling pyo3 v0.28.3
444.53 s
> Compiling numpy v0.28.0
444.53 s
> Checking figment v0.10.19
444.53 s
> Checking insta v1.47.2
444.53 s
> Checking blake3 v1.8.5
444.53 s
> Checking joinery v2.1.0
444.53 s
> Checking dot-parser v0.5.1
444.53 s
> Checking siphasher v1.0.2
444.53 s
> Checking titlecase v2.2.1
444.53 s
> Checking subprocess v0.2.15
444.53 s
> Checking rust_lisp v0.18.0
444.53 s
> Checking phf_shared v0.13.1
444.53 s
> Compiling vakint v0.1.2 (/build/source/crates/vakint)
444.53 s
> Checking version-compare v0.2.1
444.53 s
> Checking phf v0.13.1
444.53 s
> Checking env_logger v0.11.10
444.53 s
> Checking typenum v1.20.0
444.53 s
> Checking xpct v0.5.1
444.53 s
> Checking ryu v1.0.23
444.53 s
> Checking castaway v0.2.4
444.53 s
> Checking toml_datetime v0.7.5+spec-1.1.0
444.53 s
> Checking strum v0.27.2
444.53 s
> Checking unicode-truncate v2.0.1
444.53 s
> Checking string-template-plus v0.4.3
444.53 s
> Checking compact_str v0.9.0
444.53 s
> Checking kasuari v0.4.12
444.53 s
> Checking lru v0.16.4
444.53 s
> Checking vte v0.15.0
444.53 s
> Checking toml v0.9.12+spec-1.1.0
444.53 s
> Checking portable-atomic v1.13.1
444.53 s
> Checking unit-prefix v0.5.2
444.53 s
> Checking rand_distr v0.4.3
444.53 s
> Checking vt100 v0.16.2
444.53 s
> Checking simba v0.6.0
444.53 s
> Checking line-clipping v0.3.7
444.53 s
> Checking gimli v0.32.3
444.53 s
> Checking adler2 v2.0.1
444.53 s
> Checking thiserror v1.0.69
444.53 s
> Checking derive_builder v0.11.2
444.53 s
> Checking object v0.37.3
444.53 s
> Checking crossterm v0.29.0
444.53 s
> Checking miniz_oxide v0.8.9
444.53 s
> Checking ratatui-core v0.1.0
444.53 s
> Checking owo-colors v4.3.0
444.53 s
> Checking tracing-error v0.2.1
444.53 s
> Checking serde-big-array v0.5.1
444.53 s
> Checking amd v0.2.2
444.53 s
> Checking itertools v0.11.0
444.53 s
> Compiling gammaloop-tracing-filter-macros v0.1.0 (/build/source/crates/gammaloop-tracing-filter-macros)
444.53 s
> Checking indicatif v0.18.4
444.53 s
> Checking option-ext v0.2.0
444.53 s
> Checking rustc-demangle v0.1.27
444.53 s
> Checking dirs-sys v0.5.0
444.53 s
> Checking ref-cast v1.0.25
444.53 s
> Checking nix v0.31.2
444.53 s
> Checking integer-sqrt v0.1.5
444.53 s
> Checking brotli-decompressor v4.0.3
444.53 s
> Checking crossbeam-channel v0.5.15
444.53 s
> Compiling rustpython-parser-core v0.4.0
444.53 s
> Checking itertools v0.12.1
444.53 s
> Compiling gammalooprs v0.3.4 (/build/source/crates/gammalooprs)
444.53 s
> Checking symlink v0.1.0
444.53 s
> Compiling rustpython-ast v0.4.0
444.53 s
> Checking color-spantrace v0.3.0
444.53 s
> Checking unsafe-libyaml v0.2.11
444.53 s
> Checking tracing-indicatif v0.3.14
444.53 s
> Checking include_dir v0.7.4
444.53 s
> Checking ratatui-widgets v0.3.0
444.53 s
> Checking ratatui-crossterm v0.1.0
444.53 s
> Checking pathfinding v4.15.0
444.53 s
> Checking tracing-appender v0.2.5
444.53 s
> Checking schemars v1.2.1
444.53 s
> Checking ctrlc v3.5.2
444.53 s
> Checking slotmap v1.1.1
444.53 s
> Checking dirs v6.0.0
444.53 s
> Checking generic-array v0.14.7
444.53 s
> Checking json5 v0.4.1
444.53 s
> Checking brotli v7.0.0
444.53 s
> Checking clarabel v0.11.1
444.53 s
> Checking typed-index-collections v3.5.0
444.53 s
> Checking serde_yaml v0.9.34+deprecated
444.53 s
> Checking vectorize v0.2.0
444.53 s
> Checking ringbuffer v0.16.0
444.53 s
> Checking base62 v2.2.4
444.53 s
> Checking cpufeatures v0.2.17
444.53 s
> Checking clap_complete v4.6.3
444.53 s
> Checking crypto-common v0.1.7
444.53 s
> Checking block-buffer v0.10.4
444.53 s
> Checking fd-lock v4.0.4
444.53 s
> Checking strip-ansi-escapes v0.2.1
444.53 s
> Compiling gammaloop-api v0.1.0 (/build/source/crates/gammaloop-api)
444.53 s
> Checking itertools v0.13.0
444.53 s
> Checking digest v0.10.7
444.53 s
> Compiling test-log-core v0.2.20
444.53 s
> Checking ratatui-macros v0.7.0
444.53 s
> Checking strum v0.26.3
444.53 s
> Checking ratatui v0.30.0
444.53 s
> Compiling rustc_version v0.4.1
444.53 s
> Checking sysinfo v0.33.1
444.53 s
> Checking clap_complete_nushell v4.6.0
444.53 s
> Checking addr2line v0.25.1
444.53 s
> Checking sha2 v0.10.9
444.53 s
> Checking shlex v1.3.0
444.53 s
> Checking bincode v1.3.3
444.53 s
> Checking rust-embed-utils v8.11.0
444.53 s
> Checking futures-core v0.3.32
444.53 s
> Checking rust-embed v8.11.0
444.53 s
> Compiling gungraun-runner v0.18.2
444.53 s
> Checking slab v0.4.12
444.53 s
> Checking futures-task v0.3.32
444.53 s
> Checking sdd v3.0.10
444.53 s
> Compiling gammaloop-integration-tests v0.1.0 (/build/source/tests)
444.53 s
> Checking futures-util v0.3.32
444.53 s
> Checking which v8.0.2
444.53 s
> Compiling gungraun-macros v0.8.0
444.53 s
> Checking scc v2.4.0
444.53 s
> Compiling numerica v2.2.0 (https://github.com/symbolica-dev/symbolica?branch=dev#0441bd7a)
444.53 s
> Checking backtrace v0.3.76
444.53 s
> Checking reedline v0.42.0
444.53 s
> Checking nalgebra v0.29.0
444.53 s
> Checking color-eyre v0.6.5
444.53 s
> Compiling test-log-macros v0.2.20
444.53 s
> Checking proc-macro2 v1.0.106
444.53 s
> Checking maplit v1.0.2
444.53 s
> Checking base64 v0.21.7
444.53 s
> Compiling iai-callgrind-runner v0.14.2
444.53 s
> Checking wait-timeout v0.2.1
444.53 s
> Compiling iai-callgrind v0.14.2
444.53 s
> Checking ron v0.8.1
444.53 s
> Checking quick-error v1.2.3
444.53 s
> Checking quote v1.0.45
444.53 s
> Checking bit-vec v0.8.0
444.53 s
> Checking futures-executor v0.3.32
444.53 s
> Checking rusty-fork v0.3.1
444.53 s
> Checking serial_test v3.4.0
444.53 s
> Compiling iai-callgrind-macros v0.5.1
444.53 s
> Checking syn v2.0.117
444.53 s
> Checking bit-set v0.8.0
444.53 s
> Checking rand_xorshift v0.4.0
444.53 s
> Checking console v0.15.11
444.53 s
> Checking unarray v0.1.4
444.53 s
> Checking pathdiff v0.2.3
444.53 s
> Checking proptest v1.11.0
444.53 s
> Checking kurbo v0.11.3
444.53 s
> Checking similar-asserts v1.7.0
444.53 s
> Checking clinnet v0.1.8 (/build/source/crates/clinnet)
444.53 s
> Checking test-log v0.2.20
444.53 s
> Compiling graphica v2.1.0 (https://github.com/symbolica-dev/symbolica?branch=dev#0441bd7a)
444.53 s
> Checking statrs v0.16.1
444.53 s
> Checking momtrop v0.3.0
444.53 s
> Checking gungraun v0.18.2
444.53 s
> Compiling pyo3-macros v0.28.3
444.53 s
> Compiling pyo3-stub-gen-derive v0.17.2
444.53 s
> Checking pyo3-stub-gen v0.17.2
444.53 s
> Checking symbolica-utils v0.1.0 (/build/source/crates/symbolica-utils)
444.53 s
> Checking spenso-macros v0.3.2 (/build/source/crates/spenso-macros)
444.53 s
> Compiling gammaloop-workspace-hack v0.1.0 (/build/source/crates/gammaloop-workspace-hack)
444.53 s
> Checking linnet v0.17.0 (/build/source/crates/linnet)
444.53 s
> Checking spenso v0.6.0 (/build/source/crates/spenso)
444.53 s
> Checking linnet-py v0.1.0 (/build/source/crates/linnet-py)
444.53 s
> Checking linnest v0.1.0 (/build/source/crates/linnest)
444.53 s
> Checking idenso v0.3.0 (/build/source/crates/idenso)
444.53 s
> Checking gammaloop-tracing-filter v0.1.0 (/build/source/crates/gammaloop-tracing-filter)
444.53 s
> Checking spenso-hep-lib v0.1.7 (/build/source/crates/spenso-hep-lib)
444.53 s
> Checking spynso3 v0.1.2 (/build/source/crates/spynso3)
444.53 s
> error[E0063] : missing field `center_group` in initializer of `ThresholdCountertermVariantMetadata`
444.53 s
> --> crates/gammaloop-api/src/commands/display.rs:2060:28
444.53 s
> |
444.53 s
> 2060 | variants: vec![ThresholdCountertermVariantMetadata {
444.53 s
> | ^^^^^^^^^^^^^^^^^^^^^^^^^^^^^^^^^^^ missing `center_group`
444.53 s
>
444.53 s
> error[E0063] : missing field `center_group` in initializer of `ThresholdCountertermVariantMetadata`
444.53 s
> --> crates/gammaloop-api/src/commands/display.rs:2092:28
444.53 s
> |
444.53 s
> 2092 | variants: vec![ThresholdCountertermVariantMetadata {
444.53 s
> | ^^^^^^^^^^^^^^^^^^^^^^^^^^^^^^^^^^^ missing `center_group`
444.53 s
>
444.53 s
> For more information about this error, try `rustc --explain E0063`.
444.53 s
> error : could not compile `gammaloop-api` (lib test) due to 2 previous errors
444.53 s
> warning : build failed, waiting for other jobs to finish...
444.53 s
For full logs, run:
444.53 s
nix log /nix/store/ldwqpkbpc8crkk3daxd316w8rfdkfkxa-gammaloop-workspace-check-0.1.0.drv
444.55 s
Build failed.