1. 0.63 s $ /nix/store/9ypz3flqsrl5xl495mm8h645gadjsxi1-coreutils-9.11/bin/timeout --kill-after=15s 7200s /nix/store/23zk8sgzamrbmj1fday15szf7f2279s8-nix-2.34.7/bin/nix --extra-experimental-features nix-command --extra-experimental-features flakes --log-format internal-json build --no-link --print-out-paths git+https://github.com/alphal00p/gammaloop?ref=ir_safe_threshold_ct_rework&rev=0f3c75c08b143ceb3ca042d89635da65d3e874c6&shallow=1#checks.x86_64-linux.gammaloop-check --print-build-logs
  2. 1.44 s error (ignored): SQLite database '/var/cache/nix-ci-worker/eval-cache-v6/494c24376b357b9e2a13d260e80e861810ab7e8f6ba34a2206cc787992343ef1.sqlite' is busy
  3. 2.53 s
  4. 3.17 s Building /nix/store/ldwqpkbpc8crkk3daxd316w8rfdkfkxa-gammaloop-workspace-check-0.1.0.drv
  5. 3.36 s [gammaloop-workspace-check] Phase: unpackPhase
  6. 3.38 s [gammaloop-workspace-check] unpacking source archive /nix/store/iwyqqfzvbxqmc3v1spmyg70hrg3fxgmy-source
  7. 3.52 s [gammaloop-workspace-check] source root is source
  8. 3.55 s [gammaloop-workspace-check] Phase: patchPhase
  9. 3.56 s [gammaloop-workspace-check] Executing configureCargoCommonVars
  10. 3.56 s [gammaloop-workspace-check] decompressing cargo artifacts from /nix/store/3rr2bdgfb9psnb82qgblc5h3v86p0vb1-gammaloop-workspace-deps-deps-0.1.0/target.tar.zst to target
  11. 6.47 s [gammaloop-workspace-check] Phase: updateAutotoolsGnuConfigScriptsPhase
  12. 6.54 s [gammaloop-workspace-check] Phase: configurePhase
  13. 6.55 s [gammaloop-workspace-check] will append /build/source/.cargo-home/config.toml with contents of /nix/store/yhvbfm4fzwpxbf22ypggjx69dpf2hlmh-vendor-cargo-deps/config.toml
  14. 6.57 s [gammaloop-workspace-check] default configurePhase, nothing to do
  15. 6.57 s [gammaloop-workspace-check] Phase: buildPhase
  16. 6.59 s [gammaloop-workspace-check] +++ command cargo --version
  17. 6.59 s [gammaloop-workspace-check] cargo 1.97.0 (c980f4866 2026-06-30)
  18. 6.66 s [gammaloop-workspace-check] +++ command cargo check --profile ci-optim --locked --workspace --features gammaloop-tracing-filter/clap,gammaloop-tracing-filter/symbolica,idenso/bincode,idenso/reference-cases,linnet/bincode,linnet/drawing,linnet/serde,linnet/symbolica,spenso-macros/shadowing,spenso/shadowing,symbolica/tracing_max_level_info --all-targets
  19. 7.48 s [gammaloop-workspace-check] Checking cfg-if v1.0.4
  20. 7.48 s [gammaloop-workspace-check] Checking memchr v2.8.0
  21. 7.48 s [gammaloop-workspace-check] Checking once_cell v1.21.4
  22. 7.50 s [gammaloop-workspace-check] Checking either v1.15.0
  23. 7.50 s [gammaloop-workspace-check] Checking serde_core v1.0.228
  24. 7.51 s [gammaloop-workspace-check] Checking libc v0.2.186
  25. 7.51 s [gammaloop-workspace-check] Checking libm v0.2.16
  26. 7.51 s [gammaloop-workspace-check] Checking itoa v1.0.18
  27. 7.53 s [gammaloop-workspace-check] Checking log v0.4.29
  28. 7.53 s [gammaloop-workspace-check] Checking crossbeam-utils v0.8.21
  29. 7.53 s [gammaloop-workspace-check] Checking zerocopy v0.8.48
  30. 7.53 s [gammaloop-workspace-check] Checking equivalent v1.0.2
  31. 7.56 s [gammaloop-workspace-check] Checking regex-syntax v0.8.10
  32. 7.56 s [gammaloop-workspace-check] Checking zmij v1.0.21
  33. 7.56 s [gammaloop-workspace-check] Checking lazy_static v1.5.0
  34. 7.56 s [gammaloop-workspace-check] Checking bytemuck v1.25.0
  35. 7.56 s [gammaloop-workspace-check] Compiling target-lexicon v0.13.5
  36. 7.63 s [gammaloop-workspace-check] Checking powerfmt v0.2.0
  37. 7.64 s [gammaloop-workspace-check] Checking arrayvec v0.7.6
  38. 7.70 s [gammaloop-workspace-check] Checking itertools v0.14.0
  39. 7.77 s [gammaloop-workspace-check] Checking num-conv v0.2.1
  40. 7.81 s [gammaloop-workspace-check] Checking num_threads v0.1.7
  41. 7.83 s [gammaloop-workspace-check] Checking pin-project-lite v0.2.17
  42. 7.88 s [gammaloop-workspace-check] Checking deranged v0.5.8
  43. 7.90 s [gammaloop-workspace-check] Checking time-core v0.1.8
  44. 7.93 s [gammaloop-workspace-check] Checking safe_arch v0.7.4
  45. 7.95 s [gammaloop-workspace-check] Checking tracing-core v0.1.36
  46. 7.99 s [gammaloop-workspace-check] Checking foldhash v0.2.0
  47. 7.99 s [gammaloop-workspace-check] Checking allocator-api2 v0.2.21
  48. 8.02 s [gammaloop-workspace-check] Checking aho-corasick v1.1.4
  49. 8.10 s [gammaloop-workspace-check] Checking const-random v0.1.18
  50. 8.16 s [gammaloop-workspace-check] Checking crossbeam-epoch v0.9.18
  51. 8.18 s [gammaloop-workspace-check] Checking winnow v1.0.2
  52. 8.20 s [gammaloop-workspace-check] Checking nu-ansi-term v0.50.3
  53. 8.22 s [gammaloop-workspace-check] Checking static_assertions v1.1.0
  54. 8.28 s [gammaloop-workspace-check] Checking unty v0.0.4
  55. 8.38 s [gammaloop-workspace-check] Checking safe_arch v1.0.0
  56. 8.41 s [gammaloop-workspace-check] Checking crossbeam-deque v0.8.6
  57. 8.57 s [gammaloop-workspace-check] Checking sharded-slab v0.1.7
  58. 8.62 s [gammaloop-workspace-check] Checking wide v0.7.33
  59. 8.66 s [gammaloop-workspace-check] Checking hashbrown v0.16.1
  60. 8.78 s [gammaloop-workspace-check] Checking rayon-core v1.13.0
  61. 8.80 s [gammaloop-workspace-check] Checking tracing v0.1.44
  62. 8.81 s [gammaloop-workspace-check] Checking tracing-log v0.2.0
  63. 8.95 s [gammaloop-workspace-check] Checking thread_local v1.1.9
  64. 8.96 s [gammaloop-workspace-check] Checking toml_writer v1.1.1+spec-1.1.0
  65. 8.97 s [gammaloop-workspace-check] Checking num-traits v0.2.19
  66. 9.04 s [gammaloop-workspace-check] Checking indenter v0.3.4
  67. 9.07 s [gammaloop-workspace-check] Checking az v1.3.0
  68. 9.09 s [gammaloop-workspace-check] Checking rayon v1.12.0
  69. 9.09 s [gammaloop-workspace-check] Checking wide v1.3.0
  70. 9.20 s [gammaloop-workspace-check] Compiling phf_shared v0.11.3
  71. 9.43 s [gammaloop-workspace-check] Checking anyhow v1.0.102
  72. 9.62 s [gammaloop-workspace-check] Checking alloc-no-stdlib v2.0.4
  73. 9.65 s [gammaloop-workspace-check] Checking dyn-clone v1.0.20
  74. 9.74 s [gammaloop-workspace-check] Checking rawpointer v0.2.1
  75. 9.80 s [gammaloop-workspace-check] Checking utf8parse v0.2.2
  76. 9.81 s [gammaloop-workspace-check] Checking alloc-stdlib v0.2.2
  77. 9.83 s [gammaloop-workspace-check] Checking matrixmultiply v0.3.10
  78. 9.84 s [gammaloop-workspace-check] Checking getrandom v0.3.4
  79. 9.87 s [gammaloop-workspace-check] Checking time v0.3.47
  80. 9.90 s [gammaloop-workspace-check] Checking gmp-mpfr-sys v1.7.1
  81. 9.98 s [gammaloop-workspace-check] Checking anstyle-parse v1.0.0
  82. 10.09 s [gammaloop-workspace-check] Checking anstyle v1.0.14
  83. 10.10 s [gammaloop-workspace-check] Checking approx v0.5.1
  84. 10.13 s [gammaloop-workspace-check] Checking num-integer v0.1.46
  85. 10.14 s [gammaloop-workspace-check] Checking rand_core v0.9.5
  86. 10.21 s [gammaloop-workspace-check] Checking colorchoice v1.0.5
  87. 10.27 s [gammaloop-workspace-check] Checking anstyle-query v1.1.5
  88. 10.27 s [gammaloop-workspace-check] Checking colored v3.1.1
  89. 10.27 s [gammaloop-workspace-check] Checking regex-automata v0.4.14
  90. 10.28 s [gammaloop-workspace-check] Checking is_terminal_polyfill v1.70.2
  91. 10.31 s [gammaloop-workspace-check] Compiling phf_generator v0.11.3
  92. 10.31 s [gammaloop-workspace-check] Checking eyre v0.6.12
  93. 10.33 s [gammaloop-workspace-check] Checking unicode-width v0.2.2
  94. 10.35 s [gammaloop-workspace-check] Checking bitflags v1.3.2
  95. 10.35 s [gammaloop-workspace-check] Checking toml_parser v1.1.2+spec-1.1.0
  96. 10.37 s [gammaloop-workspace-check] Checking anstream v1.0.0
  97. 10.39 s [gammaloop-workspace-check] Checking region v3.0.2
  98. 10.49 s [gammaloop-workspace-check] Checking brotli-decompressor v5.0.0
  99. 10.50 s [gammaloop-workspace-check] Compiling pyo3-build-config v0.28.3
  100. 10.51 s [gammaloop-workspace-check] Checking wasmtime-jit-icache-coherence v34.0.2
  101. 10.56 s [gammaloop-workspace-check] Checking hugepage-rs v0.1.1
  102. 10.63 s [gammaloop-workspace-check] Checking inventory v0.3.24
  103. 10.67 s [gammaloop-workspace-check] Compiling phf_codegen v0.11.3
  104. 10.80 s [gammaloop-workspace-check] Checking spec_math v0.1.6
  105. 10.82 s [gammaloop-workspace-check] Checking thiserror v2.0.18
  106. 10.85 s [gammaloop-workspace-check] Compiling getopts v0.2.24
  107. 10.92 s [gammaloop-workspace-check] Checking libloading v0.9.0
  108. 10.95 s [gammaloop-workspace-check] Checking byteorder v1.5.0
  109. 10.97 s [gammaloop-workspace-check] Checking append-only-vec v0.1.8
  110. 11.07 s [gammaloop-workspace-check] Checking bytes v1.11.1
  111. 11.08 s [gammaloop-workspace-check] Checking tinyjson v2.5.1
  112. 11.13 s [gammaloop-workspace-check] Checking self_cell v1.2.2
  113. 11.14 s [gammaloop-workspace-check] Compiling unic-char-range v0.9.0
  114. 11.20 s [gammaloop-workspace-check] Compiling unicode_names2_generator v1.3.0
  115. 11.21 s [gammaloop-workspace-check] Compiling unic-common v0.9.0
  116. 11.23 s [gammaloop-workspace-check] Checking linux-raw-sys v0.12.1
  117. 11.28 s [gammaloop-workspace-check] Compiling unic-ucd-version v0.9.0
  118. 11.30 s [gammaloop-workspace-check] Compiling unic-char-property v0.9.0
  119. 11.35 s [gammaloop-workspace-check] Compiling is-macro v0.3.7
  120. 11.38 s [gammaloop-workspace-check] Checking serde v1.0.228
  121. 11.39 s [gammaloop-workspace-check] Checking serde_json v1.0.149
  122. 11.41 s [gammaloop-workspace-check] Checking bitflags v2.11.1
  123. 11.56 s [gammaloop-workspace-check] Checking serde_spanned v1.1.1
  124. 11.58 s [gammaloop-workspace-check] Checking toml_datetime v1.1.1+spec-1.1.0
  125. 11.79 s [gammaloop-workspace-check] Checking rustix v1.1.4
  126. 11.80 s [gammaloop-workspace-check] Compiling rustpython-parser-vendored v0.4.0
  127. 11.92 s [gammaloop-workspace-check] Checking toml v1.1.2+spec-1.1.0
  128. 11.98 s [gammaloop-workspace-check] Checking brotli v8.0.2
  129. 12.02 s [gammaloop-workspace-check] Checking iana-time-zone v0.1.65
  130. 12.12 s [gammaloop-workspace-check] Compiling rustpython-parser v0.4.0
  131. 12.36 s [gammaloop-workspace-check] Compiling phf v0.11.3
  132. 12.43 s [gammaloop-workspace-check] Checking smallvec v1.15.1
  133. 12.70 s [gammaloop-workspace-check] Checking num-complex v0.4.6
  134. 12.72 s [gammaloop-workspace-check] Checking bincode v2.0.1
  135. 12.90 s [gammaloop-workspace-check] Checking tracing-serde v0.2.0
  136. 13.01 s [gammaloop-workspace-check] Checking smartstring v1.0.1
  137. 13.06 s [gammaloop-workspace-check] Checking chrono v0.4.44
  138. 13.08 s [gammaloop-workspace-check] Checking rustc-hash v2.1.2
  139. 13.11 s [gammaloop-workspace-check] Compiling unic-emoji-char v0.9.0
  140. 13.21 s [gammaloop-workspace-check] Compiling unic-ucd-ident v0.9.0
  141. 13.23 s [gammaloop-workspace-check] Compiling lalrpop-util v0.20.2
  142. 13.32 s [gammaloop-workspace-check] Compiling rustc-hash v1.1.0
  143. 13.40 s [gammaloop-workspace-check] Checking rug v1.30.0
  144. 13.40 s [gammaloop-workspace-check] Checking unicode-segmentation v1.13.2
  145. 13.41 s [gammaloop-workspace-check] Compiling symbolica v2.2.0 (https://github.com/symbolica-dev/symbolica?branch=dev#0441bd7a)
  146. 13.45 s [gammaloop-workspace-check] Checking scopeguard v1.2.0
  147. 13.48 s [gammaloop-workspace-check] Checking parking_lot_core v0.9.12
  148. 13.53 s [gammaloop-workspace-check] Checking lock_api v0.4.14
  149. 13.63 s [gammaloop-workspace-check] Checking simba v0.9.1
  150. 13.69 s [gammaloop-workspace-check] Checking ndarray v0.17.2
  151. 13.79 s [gammaloop-workspace-check] Checking hashbrown v0.17.0
  152. 13.92 s [gammaloop-workspace-check] Checking unicode-ident v1.0.24
  153. 14.01 s [gammaloop-workspace-check] Checking parking_lot v0.12.5
  154. 14.10 s [gammaloop-workspace-check] Checking getrandom v0.2.17
  155. 14.32 s [gammaloop-workspace-check] Checking errno v0.3.14
  156. 14.34 s [gammaloop-workspace-check] Checking unicase v2.9.0
  157. 14.40 s [gammaloop-workspace-check] Checking clap_lex v1.1.0
  158. 14.47 s [gammaloop-workspace-check] Checking strsim v0.11.1
  159. 14.49 s [gammaloop-workspace-check] Checking signal-hook-registry v1.4.8
  160. 14.64 s [gammaloop-workspace-check] Checking vte v0.14.1
  161. 14.64 s [gammaloop-workspace-check] Checking same-file v1.0.6
  162. 14.71 s [gammaloop-workspace-check] Checking ppv-lite86 v0.2.21
  163. 14.80 s [gammaloop-workspace-check] Checking ahash v0.8.12
  164. 14.85 s [gammaloop-workspace-check] Checking walkdir v2.5.0
  165. 14.88 s [gammaloop-workspace-check] Checking signal-hook v0.3.18
  166. 15.00 s [gammaloop-workspace-check] Checking mio v1.2.0
  167. 15.01 s [gammaloop-workspace-check] Checking terminal_size v0.4.4
  168. 15.04 s [gammaloop-workspace-check] Checking indexmap v2.14.0
  169. 15.14 s [gammaloop-workspace-check] Checking minimal-lexical v0.2.1
  170. 15.23 s [gammaloop-workspace-check] Checking clap_builder v4.6.0
  171. 15.26 s [gammaloop-workspace-check] Checking derive_more v2.1.1
  172. 15.33 s [gammaloop-workspace-check] Checking num-bigint v0.4.6
  173. 15.39 s [gammaloop-workspace-check] Checking console v0.16.3
  174. 15.49 s [gammaloop-workspace-check] Checking nom v7.1.3
  175. 15.57 s [gammaloop-workspace-check] Checking rand_chacha v0.9.0
  176. 15.85 s [gammaloop-workspace-check] Checking winnow v0.7.15
  177. 15.90 s [gammaloop-workspace-check] Checking rand v0.9.4
  178. 16.18 s [gammaloop-workspace-check] Checking matchers v0.2.0
  179. 16.23 s [gammaloop-workspace-check] Checking regex v1.12.3
  180. 16.27 s [gammaloop-workspace-check] Checking tracing-subscriber v0.3.23
  181. 16.57 s [gammaloop-workspace-check] Checking signal-hook-mio v0.2.5
  182. 16.66 s [gammaloop-workspace-check] Checking symjit v2.21.0
  183. 16.68 s [gammaloop-workspace-check] Checking linux-raw-sys v0.4.15
  184. 16.80 s [gammaloop-workspace-check] Checking half v2.7.1
  185. 17.14 s [gammaloop-workspace-check] Checking rustix v0.38.44
  186. 17.26 s [gammaloop-workspace-check] Checking rand_core v0.6.4
  187. 17.30 s [gammaloop-workspace-check] Checking getrandom v0.4.2
  188. 17.48 s [gammaloop-workspace-check] Checking fnv v1.0.7
  189. 17.49 s [gammaloop-workspace-check] Checking ciborium-io v0.2.2
  190. 17.54 s [gammaloop-workspace-check] Checking plotters-backend v0.3.7
  191. 17.54 s [gammaloop-workspace-check] Checking fastrand v2.4.1
  192. 17.76 s [gammaloop-workspace-check] Checking tempfile v3.27.0
  193. 17.84 s [gammaloop-workspace-check] Checking plotters-svg v0.3.7
  194. 17.88 s [gammaloop-workspace-check] Checking ciborium-ll v0.2.2
  195. 17.95 s [gammaloop-workspace-check] Checking env_filter v1.0.1
  196. 17.97 s [gammaloop-workspace-check] Checking serde_spanned v0.6.9
  197. 18.00 s [gammaloop-workspace-check] Compiling unicode_names2 v1.3.0
  198. 18.11 s [gammaloop-workspace-check] Checking toml_datetime v0.6.11
  199. 18.13 s [gammaloop-workspace-check] Checking itertools v0.10.5
  200. 18.14 s [gammaloop-workspace-check] Checking ansitok v0.3.0
  201. 18.16 s [gammaloop-workspace-check] Checking jiff v0.2.24
  202. 18.17 s [gammaloop-workspace-check] Checking toml_write v0.1.2
  203. 18.26 s [gammaloop-workspace-check] Checking cast v0.3.0
  204. 18.44 s [gammaloop-workspace-check] Checking ciborium v0.2.2
  205. 18.45 s [gammaloop-workspace-check] Checking plotters v0.3.7
  206. 18.50 s [gammaloop-workspace-check] Checking toml_edit v0.22.27
  207. 18.58 s [gammaloop-workspace-check] Checking clap v4.6.1
  208. 18.59 s [gammaloop-workspace-check] Checking ansi-str v0.9.0
  209. 18.61 s [gammaloop-workspace-check] Checking crossterm v0.28.1
  210. 18.66 s [gammaloop-workspace-check] Checking rand_chacha v0.3.1
  211. 18.91 s [gammaloop-workspace-check] Checking similar v2.7.0
  212. 18.95 s [gammaloop-workspace-check] Checking typeid v1.0.3
  213. 19.02 s [gammaloop-workspace-check] Checking tinytemplate v1.2.1
  214. 19.06 s [gammaloop-workspace-check] Checking is-terminal v0.4.17
  215. 19.12 s [gammaloop-workspace-check] Checking bytecount v0.6.9
  216. 19.20 s [gammaloop-workspace-check] Checking oorandom v11.1.5
  217. 19.31 s [gammaloop-workspace-check] Checking anes v0.1.6
  218. 19.45 s [gammaloop-workspace-check] Checking tap v1.0.1
  219. 19.52 s [gammaloop-workspace-check] Checking wyz v0.5.1
  220. 19.55 s [gammaloop-workspace-check] Checking papergrid v0.17.0
  221. 19.77 s [gammaloop-workspace-check] Checking ron v0.12.1
  222. 19.80 s [gammaloop-workspace-check] Checking rand v0.8.6
  223. 19.81 s [gammaloop-workspace-check] Checking testing_table v0.3.0
  224. 19.93 s [gammaloop-workspace-check] Checking toml_edit v0.25.11+spec-1.1.0
  225. 20.09 s [gammaloop-workspace-check] Checking criterion-plot v0.5.0
  226. 20.12 s [gammaloop-workspace-check] Checking xprec v0.2.2
  227. 20.22 s [gammaloop-workspace-check] Checking uncased v0.9.10
  228. 20.31 s [gammaloop-workspace-check] Checking radium v0.7.0
  229. 20.36 s [gammaloop-workspace-check] Checking funty v2.0.0
  230. 20.37 s [gammaloop-workspace-check] Checking ucd-trie v0.1.7
  231. 20.49 s [gammaloop-workspace-check] Checking pest v2.8.6
  232. 20.51 s [gammaloop-workspace-check] Checking criterion v0.5.1
  233. 20.59 s [gammaloop-workspace-check] Checking approx v0.4.0
  234. 20.65 s [gammaloop-workspace-check] Checking num-rational v0.4.2
  235. 20.73 s [gammaloop-workspace-check] Checking cgmath v0.18.0
  236. 21.03 s [gammaloop-workspace-check] Checking bitvec v1.0.1
  237. 21.10 s [gammaloop-workspace-check] Checking num-iter v0.1.45
  238. 21.15 s [gammaloop-workspace-check] Checking toml v0.8.23
  239. 21.17 s [gammaloop-workspace-check] Checking ref-ops v0.2.5
  240. 21.21 s [gammaloop-workspace-check] Checking rand_xoshiro v0.6.0
  241. 21.22 s [gammaloop-workspace-check] Checking num v0.4.3
  242. 21.27 s [gammaloop-workspace-check] Checking features v0.10.0
  243. 21.28 s [gammaloop-workspace-check] Checking constcat v0.5.1
  244. 21.30 s [gammaloop-workspace-check] Compiling pyo3-ffi v0.28.3
  245. 21.31 s [gammaloop-workspace-check] Compiling pyo3-macros-backend v0.28.3
  246. 21.33 s [gammaloop-workspace-check] Compiling pyo3 v0.28.3
  247. 21.33 s [gammaloop-workspace-check] Compiling numpy v0.28.0
  248. 21.51 s [gammaloop-workspace-check] Checking tabled v0.20.0
  249. 21.67 s [gammaloop-workspace-check] Checking insta v1.47.2
  250. 21.69 s [gammaloop-workspace-check] Checking gat-lending-iterator v0.1.8
  251. 21.84 s [gammaloop-workspace-check] Checking colored v2.2.0
  252. 21.84 s [gammaloop-workspace-check] Checking constant_time_eq v0.4.2
  253. 21.87 s [gammaloop-workspace-check] Checking figment v0.10.19
  254. 21.92 s [gammaloop-workspace-check] Checking cpufeatures v0.3.0
  255. 21.96 s [gammaloop-workspace-check] Checking arrayref v0.3.9
  256. 22.01 s [gammaloop-workspace-check] Checking blake3 v1.8.5
  257. 22.22 s [gammaloop-workspace-check] Checking base64 v0.22.1
  258. 22.25 s [gammaloop-workspace-check] Checking dot-parser v0.5.1
  259. 22.36 s [gammaloop-workspace-check] Checking siphasher v1.0.2
  260. 22.44 s [gammaloop-workspace-check] Checking joinery v2.1.0
  261. 22.47 s [gammaloop-workspace-check] Checking subprocess v0.2.15
  262. 22.50 s [gammaloop-workspace-check] Checking phf_shared v0.13.1
  263. 22.62 s [gammaloop-workspace-check] Checking titlecase v2.2.1
  264. 22.63 s [gammaloop-workspace-check] Checking rust_lisp v0.18.0
  265. 22.66 s [gammaloop-workspace-check] Compiling vakint v0.1.2 (/build/source/crates/vakint)
  266. 22.71 s [gammaloop-workspace-check] Checking phf v0.13.1
  267. 22.81 s [gammaloop-workspace-check] Checking version-compare v0.2.1
  268. 22.83 s [gammaloop-workspace-check] Checking typenum v1.20.0
  269. 22.97 s [gammaloop-workspace-check] Checking xpct v0.5.1
  270. 23.00 s [gammaloop-workspace-check] Checking ryu v1.0.23
  271. 23.04 s [gammaloop-workspace-check] Checking castaway v0.2.4
  272. 23.09 s [gammaloop-workspace-check] Checking toml_datetime v0.7.5+spec-1.1.0
  273. 23.10 s [gammaloop-workspace-check] Checking strum v0.27.2
  274. 23.17 s [gammaloop-workspace-check] Checking compact_str v0.9.0
  275. 23.18 s [gammaloop-workspace-check] Checking unicode-truncate v2.0.1
  276. 23.27 s [gammaloop-workspace-check] Checking kasuari v0.4.12
  277. 23.37 s [gammaloop-workspace-check] Checking string-template-plus v0.4.3
  278. 23.42 s [gammaloop-workspace-check] Checking toml v0.9.12+spec-1.1.0
  279. 23.53 s [gammaloop-workspace-check] Checking lru v0.16.4
  280. 23.64 s [gammaloop-workspace-check] Checking vte v0.15.0
  281. 23.74 s [gammaloop-workspace-check] Checking portable-atomic v1.13.1
  282. 23.84 s [gammaloop-workspace-check] Checking ratatui-core v0.1.0
  283. 23.86 s [gammaloop-workspace-check] Checking vt100 v0.16.2
  284. 24.14 s [gammaloop-workspace-check] Checking unit-prefix v0.5.2
  285. 24.25 s [gammaloop-workspace-check] Checking rand_distr v0.4.3
  286. 24.27 s [gammaloop-workspace-check] Checking simba v0.6.0
  287. 24.35 s [gammaloop-workspace-check] Checking line-clipping v0.3.7
  288. 24.37 s [gammaloop-workspace-check] Checking gimli v0.32.3
  289. 24.54 s [gammaloop-workspace-check] Checking adler2 v2.0.1
  290. 24.60 s [gammaloop-workspace-check] Checking thiserror v1.0.69
  291. 24.65 s [gammaloop-workspace-check] Checking miniz_oxide v0.8.9
  292. 24.69 s [gammaloop-workspace-check] Checking derive_builder v0.11.2
  293. 24.76 s [gammaloop-workspace-check] Checking crossterm v0.29.0
  294. 24.85 s [gammaloop-workspace-check] Checking owo-colors v4.3.0
  295. 24.86 s [gammaloop-workspace-check] Checking object v0.37.3
  296. 24.96 s [gammaloop-workspace-check] Checking tracing-error v0.2.1
  297. 24.99 s [gammaloop-workspace-check] Checking indicatif v0.18.4
  298. 25.11 s [gammaloop-workspace-check] Checking serde-big-array v0.5.1
  299. 25.13 s [gammaloop-workspace-check] Checking amd v0.2.2
  300. 25.20 s [gammaloop-workspace-check] Checking itertools v0.11.0
  301. 25.28 s [gammaloop-workspace-check] Compiling gammaloop-tracing-filter-macros v0.1.0 (/build/source/crates/gammaloop-tracing-filter-macros)
  302. 25.42 s [gammaloop-workspace-check] Checking env_logger v0.11.10
  303. 25.46 s [gammaloop-workspace-check] Checking option-ext v0.2.0
  304. 25.51 s [gammaloop-workspace-check] Checking rustc-demangle v0.1.27
  305. 25.54 s [gammaloop-workspace-check] Checking dirs-sys v0.5.0
  306. 25.65 s [gammaloop-workspace-check] Checking ref-cast v1.0.25
  307. 25.68 s [gammaloop-workspace-check] Checking nix v0.31.2
  308. 25.72 s [gammaloop-workspace-check] Checking color-spantrace v0.3.0
  309. 25.74 s [gammaloop-workspace-check] Checking integer-sqrt v0.1.5
  310. 25.75 s [gammaloop-workspace-check] Checking ratatui-widgets v0.3.0
  311. 25.77 s [gammaloop-workspace-check] Checking ratatui-crossterm v0.1.0
  312. 25.80 s [gammaloop-workspace-check] Checking brotli-decompressor v4.0.3
  313. 25.82 s [gammaloop-workspace-check] Checking crossbeam-channel v0.5.15
  314. 25.93 s [gammaloop-workspace-check] Checking itertools v0.12.1
  315. 26.01 s [gammaloop-workspace-check] Compiling gammalooprs v0.3.4 (/build/source/crates/gammalooprs)
  316. 26.03 s [gammaloop-workspace-check] Checking symlink v0.1.0
  317. 26.04 s [gammaloop-workspace-check] Checking unsafe-libyaml v0.2.11
  318. 26.10 s [gammaloop-workspace-check] Checking include_dir v0.7.4
  319. 26.12 s [gammaloop-workspace-check] Checking pathfinding v4.15.0
  320. 26.20 s [gammaloop-workspace-check] Compiling rustpython-parser-core v0.4.0
  321. 26.24 s [gammaloop-workspace-check] Checking tracing-indicatif v0.3.14
  322. 26.33 s [gammaloop-workspace-check] Checking schemars v1.2.1
  323. 26.49 s [gammaloop-workspace-check] Compiling rustpython-ast v0.4.0
  324. 26.64 s [gammaloop-workspace-check] Checking tracing-appender v0.2.5
  325. 26.76 s [gammaloop-workspace-check] Checking slotmap v1.1.1
  326. 26.95 s [gammaloop-workspace-check] Checking ctrlc v3.5.2
  327. 27.00 s [gammaloop-workspace-check] Checking brotli v7.0.0
  328. 27.06 s [gammaloop-workspace-check] Checking dirs v6.0.0
  329. 27.08 s [gammaloop-workspace-check] Checking generic-array v0.14.7
  330. 27.10 s [gammaloop-workspace-check] Checking json5 v0.4.1
  331. 27.18 s [gammaloop-workspace-check] Checking typed-index-collections v3.5.0
  332. 27.29 s [gammaloop-workspace-check] Checking clarabel v0.11.1
  333. 27.34 s [gammaloop-workspace-check] Checking serde_yaml v0.9.34+deprecated
  334. 27.49 s [gammaloop-workspace-check] Checking addr2line v0.25.1
  335. 27.60 s [gammaloop-workspace-check] Checking vectorize v0.2.0
  336. 27.62 s [gammaloop-workspace-check] Checking base62 v2.2.4
  337. 27.65 s [gammaloop-workspace-check] Checking ringbuffer v0.16.0
  338. 27.66 s [gammaloop-workspace-check] Checking cpufeatures v0.2.17
  339. 27.68 s [gammaloop-workspace-check] Checking clap_complete v4.6.3
  340. 27.71 s [gammaloop-workspace-check] Checking fd-lock v4.0.4
  341. 27.80 s [gammaloop-workspace-check] Checking strip-ansi-escapes v0.2.1
  342. 27.81 s [gammaloop-workspace-check] Compiling gammaloop-api v0.1.0 (/build/source/crates/gammaloop-api)
  343. 27.83 s [gammaloop-workspace-check] Checking itertools v0.13.0
  344. 27.86 s [gammaloop-workspace-check] Compiling test-log-core v0.2.20
  345. 27.88 s [gammaloop-workspace-check] Checking strum v0.26.3
  346. 27.98 s [gammaloop-workspace-check] Checking block-buffer v0.10.4
  347. 28.01 s [gammaloop-workspace-check] Checking crypto-common v0.1.7
  348. 28.03 s [gammaloop-workspace-check] Compiling rustc_version v0.4.1
  349. 28.07 s [gammaloop-workspace-check] Checking clap_complete_nushell v4.6.0
  350. 28.10 s [gammaloop-workspace-check] Checking sysinfo v0.33.1
  351. 28.13 s [gammaloop-workspace-check] Checking digest v0.10.7
  352. 28.14 s [gammaloop-workspace-check] Checking ratatui-macros v0.7.0
  353. 28.21 s [gammaloop-workspace-check] Checking shlex v1.3.0
  354. 28.22 s [gammaloop-workspace-check] Checking ratatui v0.30.0
  355. 28.32 s [gammaloop-workspace-check] Checking sha2 v0.10.9
  356. 28.35 s [gammaloop-workspace-check] Checking bincode v1.3.3
  357. 28.43 s [gammaloop-workspace-check] Checking futures-core v0.3.32
  358. 28.46 s [gammaloop-workspace-check] Checking futures-task v0.3.32
  359. 28.57 s [gammaloop-workspace-check] Checking slab v0.4.12
  360. 28.61 s [gammaloop-workspace-check] Compiling gungraun-runner v0.18.2
  361. 28.66 s [gammaloop-workspace-check] Checking sdd v3.0.10
  362. 28.81 s [gammaloop-workspace-check] Checking rust-embed-utils v8.11.0
  363. 28.83 s [gammaloop-workspace-check] Checking backtrace v0.3.76
  364. 28.85 s [gammaloop-workspace-check] Checking futures-util v0.3.32
  365. 28.90 s [gammaloop-workspace-check] Checking scc v2.4.0
  366. 28.92 s [gammaloop-workspace-check] Checking rust-embed v8.11.0
  367. 29.00 s [gammaloop-workspace-check] Compiling gungraun-macros v0.8.0
  368. 29.00 s [gammaloop-workspace-check] Compiling gammaloop-integration-tests v0.1.0 (/build/source/tests)
  369. 29.03 s [gammaloop-workspace-check] Checking which v8.0.2
  370. 29.24 s [gammaloop-workspace-check] Checking reedline v0.42.0
  371. 29.26 s [gammaloop-workspace-check] Checking color-eyre v0.6.5
  372. 29.30 s [gammaloop-workspace-check] Checking proc-macro2 v1.0.106
  373. 29.63 s [gammaloop-workspace-check] Checking maplit v1.0.2
  374. 29.70 s [gammaloop-workspace-check] Checking base64 v0.21.7
  375. 29.74 s [gammaloop-workspace-check] Checking quote v1.0.45
  376. 29.95 s [gammaloop-workspace-check] Checking nalgebra v0.29.0
  377. 29.97 s [gammaloop-workspace-check] Compiling iai-callgrind-runner v0.14.2
  378. 29.99 s [gammaloop-workspace-check] Checking wait-timeout v0.2.1
  379. 30.04 s [gammaloop-workspace-check] Checking ron v0.8.1
  380. 30.10 s [gammaloop-workspace-check] Compiling numerica v2.2.0 (https://github.com/symbolica-dev/symbolica?branch=dev#0441bd7a)
  381. 30.12 s [gammaloop-workspace-check] Checking quick-error v1.2.3
  382. 30.21 s [gammaloop-workspace-check] Checking bit-vec v0.8.0
  383. 30.32 s [gammaloop-workspace-check] Compiling iai-callgrind v0.14.2
  384. 30.35 s [gammaloop-workspace-check] Checking bit-set v0.8.0
  385. 30.36 s [gammaloop-workspace-check] Checking futures-executor v0.3.32
  386. 30.50 s [gammaloop-workspace-check] Checking rusty-fork v0.3.1
  387. 30.50 s [gammaloop-workspace-check] Checking serial_test v3.4.0
  388. 30.57 s [gammaloop-workspace-check] Compiling test-log-macros v0.2.20
  389. 30.59 s [gammaloop-workspace-check] Checking syn v2.0.117
  390. 30.63 s [gammaloop-workspace-check] Compiling iai-callgrind-macros v0.5.1
  391. 30.64 s [gammaloop-workspace-check] Checking rand_xorshift v0.4.0
  392. 30.65 s [gammaloop-workspace-check] Checking console v0.15.11
  393. 30.76 s [gammaloop-workspace-check] Checking pathdiff v0.2.3
  394. 30.81 s [gammaloop-workspace-check] Checking unarray v0.1.4
  395. 30.89 s [gammaloop-workspace-check] Checking proptest v1.11.0
  396. 31.15 s [gammaloop-workspace-check] Checking similar-asserts v1.7.0
  397. 31.16 s [gammaloop-workspace-check] Checking kurbo v0.11.3
  398. 31.24 s [gammaloop-workspace-check] Checking clinnet v0.1.8 (/build/source/crates/clinnet)
  399. 32.92 s [gammaloop-workspace-check] Checking test-log v0.2.20
  400. 34.63 s [gammaloop-workspace-check] Compiling graphica v2.1.0 (https://github.com/symbolica-dev/symbolica?branch=dev#0441bd7a)
  401. 35.12 s [gammaloop-workspace-check] Checking statrs v0.16.1
  402. 35.74 s [gammaloop-workspace-check] Checking gungraun v0.18.2
  403. 35.86 s [gammaloop-workspace-check] Checking momtrop v0.3.0
  404. 38.34 s [gammaloop-workspace-check] Compiling pyo3-stub-gen-derive v0.17.2
  405. 38.61 s [gammaloop-workspace-check] Compiling pyo3-macros v0.28.3
  406. 44.36 s [gammaloop-workspace-check] Checking pyo3-stub-gen v0.17.2
  407. 52.93 s [gammaloop-workspace-check] Checking symbolica-utils v0.1.0 (/build/source/crates/symbolica-utils)
  408. 52.94 s [gammaloop-workspace-check] Checking spenso-macros v0.3.2 (/build/source/crates/spenso-macros)
  409. 304.89 s [gammaloop-workspace-check] Compiling gammaloop-workspace-hack v0.1.0 (/build/source/crates/gammaloop-workspace-hack)
  410. 305.06 s [gammaloop-workspace-check] Checking linnet v0.17.0 (/build/source/crates/linnet)
  411. 307.89 s [gammaloop-workspace-check] Checking spenso v0.6.0 (/build/source/crates/spenso)
  412. 308.17 s [gammaloop-workspace-check] Checking linnet-py v0.1.0 (/build/source/crates/linnet-py)
  413. 308.17 s [gammaloop-workspace-check] Checking linnest v0.1.0 (/build/source/crates/linnest)
  414. 314.01 s [gammaloop-workspace-check] Checking idenso v0.3.0 (/build/source/crates/idenso)
  415. 314.02 s [gammaloop-workspace-check] Checking gammaloop-tracing-filter v0.1.0 (/build/source/crates/gammaloop-tracing-filter)
  416. 315.60 s [gammaloop-workspace-check] Checking spenso-hep-lib v0.1.7 (/build/source/crates/spenso-hep-lib)
  417. 315.73 s [gammaloop-workspace-check] Checking spynso3 v0.1.2 (/build/source/crates/spynso3)
  418. 336.23 s [gammaloop-workspace-check] error[E0063]: missing field `center_group` in initializer of `ThresholdCountertermVariantMetadata`
  419. 336.23 s [gammaloop-workspace-check] --> crates/gammaloop-api/src/commands/display.rs:2060:28
  420. 336.23 s [gammaloop-workspace-check] |
  421. 336.23 s [gammaloop-workspace-check] 2060 | variants: vec![ThresholdCountertermVariantMetadata {
  422. 336.23 s [gammaloop-workspace-check] | ^^^^^^^^^^^^^^^^^^^^^^^^^^^^^^^^^^^ missing `center_group`
  423. 336.23 s [gammaloop-workspace-check]
  424. 336.23 s [gammaloop-workspace-check] error[E0063]: missing field `center_group` in initializer of `ThresholdCountertermVariantMetadata`
  425. 336.23 s [gammaloop-workspace-check] --> crates/gammaloop-api/src/commands/display.rs:2092:28
  426. 336.23 s [gammaloop-workspace-check] |
  427. 336.23 s [gammaloop-workspace-check] 2092 | variants: vec![ThresholdCountertermVariantMetadata {
  428. 336.23 s [gammaloop-workspace-check] | ^^^^^^^^^^^^^^^^^^^^^^^^^^^^^^^^^^^ missing `center_group`
  429. 336.23 s [gammaloop-workspace-check]
  430. 338.88 s [gammaloop-workspace-check] For more information about this error, try `rustc --explain E0063`.
  431. 338.92 s [gammaloop-workspace-check] error: could not compile `gammaloop-api` (lib test) due to 2 previous errors
  432. 338.92 s [gammaloop-workspace-check] warning: build failed, waiting for other jobs to finish...
  433. 339.49 s Progress: 0 of 1 built (1 failed)
  434. 339.49 s Failed to build gammaloop-workspace-check after 5m36s
  435. 339.50 s Cannot build '/nix/store/ldwqpkbpc8crkk3daxd316w8rfdkfkxa-gammaloop-workspace-check-0.1.0.drv'.
  436. 339.50 s Reason: builder failed with exit code 101.
  437. 339.50 s Output paths:
  438. 339.50 s /nix/store/qcmhkayx3bybxvx8sy0fzz764cidv5n2-gammaloop-workspace-check-0.1.0
  439. 339.50 s Last 428 log lines:
  440. 339.50 s > Running phase: unpackPhase
  441. 339.50 s > unpacking source archive /nix/store/iwyqqfzvbxqmc3v1spmyg70hrg3fxgmy-source
  442. 339.50 s > source root is source
  443. 339.50 s > Running phase: patchPhase
  444. 339.50 s > Executing configureCargoCommonVars
  445. 339.50 s > decompressing cargo artifacts from /nix/store/3rr2bdgfb9psnb82qgblc5h3v86p0vb1-gammaloop-workspace-deps-deps-0.1.0/target.tar.zst to target
  446. 339.50 s > Running phase: updateAutotoolsGnuConfigScriptsPhase
  447. 339.50 s > Running phase: configurePhase
  448. 339.50 s > will append /build/source/.cargo-home/config.toml with contents of /nix/store/yhvbfm4fzwpxbf22ypggjx69dpf2hlmh-vendor-cargo-deps/config.toml
  449. 339.50 s > default configurePhase, nothing to do
  450. 339.50 s > Running phase: buildPhase
  451. 339.50 s > +++ command cargo --version
  452. 339.50 s > cargo 1.97.0 (c980f4866 2026-06-30)
  453. 339.50 s > +++ command cargo check --profile ci-optim --locked --workspace --features gammaloop-tracing-filter/clap,gammaloop-tracing-filter/symbolica,idenso/bincode,idenso/reference-cases,linnet/bincode,linnet/drawing,linnet/serde,linnet/symbolica,spenso-macros/shadowing,spenso/shadowing,symbolica/tracing_max_level_info --all-targets
  454. 339.50 s > Checking cfg-if v1.0.4
  455. 339.50 s > Checking memchr v2.8.0
  456. 339.50 s > Checking once_cell v1.21.4
  457. 339.50 s > Checking either v1.15.0
  458. 339.50 s > Checking serde_core v1.0.228
  459. 339.50 s > Checking libc v0.2.186
  460. 339.50 s > Checking libm v0.2.16
  461. 339.50 s > Checking itoa v1.0.18
  462. 339.50 s > Checking log v0.4.29
  463. 339.50 s > Checking crossbeam-utils v0.8.21
  464. 339.50 s > Checking zerocopy v0.8.48
  465. 339.50 s > Checking equivalent v1.0.2
  466. 339.50 s > Checking regex-syntax v0.8.10
  467. 339.50 s > Checking zmij v1.0.21
  468. 339.50 s > Checking lazy_static v1.5.0
  469. 339.50 s > Checking bytemuck v1.25.0
  470. 339.50 s > Compiling target-lexicon v0.13.5
  471. 339.50 s > Checking powerfmt v0.2.0
  472. 339.50 s > Checking arrayvec v0.7.6
  473. 339.50 s > Checking itertools v0.14.0
  474. 339.50 s > Checking num-conv v0.2.1
  475. 339.50 s > Checking num_threads v0.1.7
  476. 339.50 s > Checking pin-project-lite v0.2.17
  477. 339.50 s > Checking deranged v0.5.8
  478. 339.50 s > Checking time-core v0.1.8
  479. 339.50 s > Checking safe_arch v0.7.4
  480. 339.50 s > Checking tracing-core v0.1.36
  481. 339.50 s > Checking foldhash v0.2.0
  482. 339.50 s > Checking allocator-api2 v0.2.21
  483. 339.50 s > Checking aho-corasick v1.1.4
  484. 339.50 s > Checking const-random v0.1.18
  485. 339.50 s > Checking crossbeam-epoch v0.9.18
  486. 339.50 s > Checking winnow v1.0.2
  487. 339.50 s > Checking nu-ansi-term v0.50.3
  488. 339.50 s > Checking static_assertions v1.1.0
  489. 339.50 s > Checking unty v0.0.4
  490. 339.50 s > Checking safe_arch v1.0.0
  491. 339.50 s > Checking crossbeam-deque v0.8.6
  492. 339.50 s > Checking sharded-slab v0.1.7
  493. 339.50 s > Checking wide v0.7.33
  494. 339.50 s > Checking hashbrown v0.16.1
  495. 339.50 s > Checking rayon-core v1.13.0
  496. 339.50 s > Checking tracing v0.1.44
  497. 339.50 s > Checking tracing-log v0.2.0
  498. 339.50 s > Checking thread_local v1.1.9
  499. 339.50 s > Checking toml_writer v1.1.1+spec-1.1.0
  500. 339.50 s > Checking num-traits v0.2.19
  501. 339.50 s > Checking indenter v0.3.4
  502. 339.50 s > Checking az v1.3.0
  503. 339.50 s > Checking rayon v1.12.0
  504. 339.50 s > Checking wide v1.3.0
  505. 339.50 s > Compiling phf_shared v0.11.3
  506. 339.50 s > Checking anyhow v1.0.102
  507. 339.50 s > Checking alloc-no-stdlib v2.0.4
  508. 339.50 s > Checking dyn-clone v1.0.20
  509. 339.50 s > Checking rawpointer v0.2.1
  510. 339.50 s > Checking utf8parse v0.2.2
  511. 339.50 s > Checking alloc-stdlib v0.2.2
  512. 339.50 s > Checking matrixmultiply v0.3.10
  513. 339.50 s > Checking getrandom v0.3.4
  514. 339.50 s > Checking time v0.3.47
  515. 339.50 s > Checking gmp-mpfr-sys v1.7.1
  516. 339.50 s > Checking anstyle-parse v1.0.0
  517. 339.50 s > Checking anstyle v1.0.14
  518. 339.50 s > Checking approx v0.5.1
  519. 339.50 s > Checking num-integer v0.1.46
  520. 339.50 s > Checking rand_core v0.9.5
  521. 339.50 s > Checking colorchoice v1.0.5
  522. 339.50 s > Checking anstyle-query v1.1.5
  523. 339.50 s > Checking colored v3.1.1
  524. 339.50 s > Checking regex-automata v0.4.14
  525. 339.50 s > Checking is_terminal_polyfill v1.70.2
  526. 339.50 s > Compiling phf_generator v0.11.3
  527. 339.50 s > Checking eyre v0.6.12
  528. 339.50 s > Checking unicode-width v0.2.2
  529. 339.50 s > Checking bitflags v1.3.2
  530. 339.50 s > Checking toml_parser v1.1.2+spec-1.1.0
  531. 339.50 s > Checking anstream v1.0.0
  532. 339.50 s > Checking region v3.0.2
  533. 339.50 s > Checking brotli-decompressor v5.0.0
  534. 339.50 s > Compiling pyo3-build-config v0.28.3
  535. 339.50 s > Checking wasmtime-jit-icache-coherence v34.0.2
  536. 339.50 s > Checking hugepage-rs v0.1.1
  537. 339.50 s > Checking inventory v0.3.24
  538. 339.50 s > Compiling phf_codegen v0.11.3
  539. 339.50 s > Checking spec_math v0.1.6
  540. 339.50 s > Checking thiserror v2.0.18
  541. 339.50 s > Compiling getopts v0.2.24
  542. 339.50 s > Checking libloading v0.9.0
  543. 339.50 s > Checking byteorder v1.5.0
  544. 339.50 s > Checking append-only-vec v0.1.8
  545. 339.50 s > Checking bytes v1.11.1
  546. 339.50 s > Checking tinyjson v2.5.1
  547. 339.50 s > Checking self_cell v1.2.2
  548. 339.50 s > Compiling unic-char-range v0.9.0
  549. 339.50 s > Compiling unicode_names2_generator v1.3.0
  550. 339.50 s > Compiling unic-common v0.9.0
  551. 339.50 s > Checking linux-raw-sys v0.12.1
  552. 339.50 s > Compiling unic-ucd-version v0.9.0
  553. 339.50 s > Compiling unic-char-property v0.9.0
  554. 339.50 s > Compiling is-macro v0.3.7
  555. 339.50 s > Checking serde v1.0.228
  556. 339.50 s > Checking serde_json v1.0.149
  557. 339.50 s > Checking bitflags v2.11.1
  558. 339.50 s > Checking serde_spanned v1.1.1
  559. 339.50 s > Checking toml_datetime v1.1.1+spec-1.1.0
  560. 339.50 s > Checking rustix v1.1.4
  561. 339.50 s > Compiling rustpython-parser-vendored v0.4.0
  562. 339.50 s > Checking toml v1.1.2+spec-1.1.0
  563. 339.50 s > Checking brotli v8.0.2
  564. 339.50 s > Checking iana-time-zone v0.1.65
  565. 339.50 s > Compiling rustpython-parser v0.4.0
  566. 339.50 s > Compiling phf v0.11.3
  567. 339.50 s > Checking smallvec v1.15.1
  568. 339.50 s > Checking num-complex v0.4.6
  569. 339.50 s > Checking bincode v2.0.1
  570. 339.50 s > Checking tracing-serde v0.2.0
  571. 339.50 s > Checking smartstring v1.0.1
  572. 339.50 s > Checking chrono v0.4.44
  573. 339.50 s > Checking rustc-hash v2.1.2
  574. 339.50 s > Compiling unic-emoji-char v0.9.0
  575. 339.50 s > Compiling unic-ucd-ident v0.9.0
  576. 339.50 s > Compiling lalrpop-util v0.20.2
  577. 339.50 s > Compiling rustc-hash v1.1.0
  578. 339.50 s > Checking rug v1.30.0
  579. 339.50 s > Checking unicode-segmentation v1.13.2
  580. 339.50 s > Compiling symbolica v2.2.0 (https://github.com/symbolica-dev/symbolica?branch=dev#0441bd7a)
  581. 339.50 s > Checking scopeguard v1.2.0
  582. 339.50 s > Checking parking_lot_core v0.9.12
  583. 339.50 s > Checking lock_api v0.4.14
  584. 339.50 s > Checking simba v0.9.1
  585. 339.50 s > Checking ndarray v0.17.2
  586. 339.50 s > Checking hashbrown v0.17.0
  587. 339.50 s > Checking unicode-ident v1.0.24
  588. 339.50 s > Checking parking_lot v0.12.5
  589. 339.50 s > Checking getrandom v0.2.17
  590. 339.50 s > Checking errno v0.3.14
  591. 339.50 s > Checking unicase v2.9.0
  592. 339.50 s > Checking clap_lex v1.1.0
  593. 339.50 s > Checking strsim v0.11.1
  594. 339.50 s > Checking signal-hook-registry v1.4.8
  595. 339.50 s > Checking vte v0.14.1
  596. 339.50 s > Checking same-file v1.0.6
  597. 339.50 s > Checking ppv-lite86 v0.2.21
  598. 339.50 s > Checking ahash v0.8.12
  599. 339.50 s > Checking walkdir v2.5.0
  600. 339.50 s > Checking signal-hook v0.3.18
  601. 339.50 s > Checking mio v1.2.0
  602. 339.50 s > Checking terminal_size v0.4.4
  603. 339.50 s > Checking indexmap v2.14.0
  604. 339.50 s > Checking minimal-lexical v0.2.1
  605. 339.50 s > Checking clap_builder v4.6.0
  606. 339.50 s > Checking derive_more v2.1.1
  607. 339.50 s > Checking num-bigint v0.4.6
  608. 339.50 s > Checking console v0.16.3
  609. 339.50 s > Checking nom v7.1.3
  610. 339.50 s > Checking rand_chacha v0.9.0
  611. 339.50 s > Checking winnow v0.7.15
  612. 339.50 s > Checking rand v0.9.4
  613. 339.50 s > Checking matchers v0.2.0
  614. 339.50 s > Checking regex v1.12.3
  615. 339.50 s > Checking tracing-subscriber v0.3.23
  616. 339.50 s > Checking signal-hook-mio v0.2.5
  617. 339.50 s > Checking symjit v2.21.0
  618. 339.50 s > Checking linux-raw-sys v0.4.15
  619. 339.50 s > Checking half v2.7.1
  620. 339.50 s > Checking rustix v0.38.44
  621. 339.50 s > Checking rand_core v0.6.4
  622. 339.50 s > Checking getrandom v0.4.2
  623. 339.50 s > Checking fnv v1.0.7
  624. 339.50 s > Checking ciborium-io v0.2.2
  625. 339.50 s > Checking plotters-backend v0.3.7
  626. 339.50 s > Checking fastrand v2.4.1
  627. 339.50 s > Checking tempfile v3.27.0
  628. 339.50 s > Checking plotters-svg v0.3.7
  629. 339.50 s > Checking ciborium-ll v0.2.2
  630. 339.50 s > Checking env_filter v1.0.1
  631. 339.50 s > Checking serde_spanned v0.6.9
  632. 339.50 s > Compiling unicode_names2 v1.3.0
  633. 339.50 s > Checking toml_datetime v0.6.11
  634. 339.50 s > Checking itertools v0.10.5
  635. 339.50 s > Checking ansitok v0.3.0
  636. 339.50 s > Checking jiff v0.2.24
  637. 339.50 s > Checking toml_write v0.1.2
  638. 339.50 s > Checking cast v0.3.0
  639. 339.50 s > Checking ciborium v0.2.2
  640. 339.50 s > Checking plotters v0.3.7
  641. 339.50 s > Checking toml_edit v0.22.27
  642. 339.50 s > Checking clap v4.6.1
  643. 339.50 s > Checking ansi-str v0.9.0
  644. 339.50 s > Checking crossterm v0.28.1
  645. 339.50 s > Checking rand_chacha v0.3.1
  646. 339.50 s > Checking similar v2.7.0
  647. 339.50 s > Checking typeid v1.0.3
  648. 339.50 s > Checking tinytemplate v1.2.1
  649. 339.50 s > Checking is-terminal v0.4.17
  650. 339.50 s > Checking bytecount v0.6.9
  651. 339.50 s > Checking oorandom v11.1.5
  652. 339.50 s > Checking anes v0.1.6
  653. 339.50 s > Checking tap v1.0.1
  654. 339.50 s > Checking wyz v0.5.1
  655. 339.50 s > Checking papergrid v0.17.0
  656. 339.50 s > Checking ron v0.12.1
  657. 339.50 s > Checking rand v0.8.6
  658. 339.50 s > Checking testing_table v0.3.0
  659. 339.50 s > Checking toml_edit v0.25.11+spec-1.1.0
  660. 339.50 s > Checking criterion-plot v0.5.0
  661. 339.50 s > Checking xprec v0.2.2
  662. 339.50 s > Checking uncased v0.9.10
  663. 339.50 s > Checking radium v0.7.0
  664. 339.50 s > Checking funty v2.0.0
  665. 339.50 s > Checking ucd-trie v0.1.7
  666. 339.50 s > Checking pest v2.8.6
  667. 339.50 s > Checking criterion v0.5.1
  668. 339.50 s > Checking approx v0.4.0
  669. 339.50 s > Checking num-rational v0.4.2
  670. 339.50 s > Checking cgmath v0.18.0
  671. 339.50 s > Checking bitvec v1.0.1
  672. 339.50 s > Checking num-iter v0.1.45
  673. 339.50 s > Checking toml v0.8.23
  674. 339.50 s > Checking ref-ops v0.2.5
  675. 339.50 s > Checking rand_xoshiro v0.6.0
  676. 339.50 s > Checking num v0.4.3
  677. 339.50 s > Checking features v0.10.0
  678. 339.50 s > Checking constcat v0.5.1
  679. 339.50 s > Compiling pyo3-ffi v0.28.3
  680. 339.50 s > Compiling pyo3-macros-backend v0.28.3
  681. 339.50 s > Compiling pyo3 v0.28.3
  682. 339.50 s > Compiling numpy v0.28.0
  683. 339.50 s > Checking tabled v0.20.0
  684. 339.50 s > Checking insta v1.47.2
  685. 339.50 s > Checking gat-lending-iterator v0.1.8
  686. 339.50 s > Checking colored v2.2.0
  687. 339.50 s > Checking constant_time_eq v0.4.2
  688. 339.50 s > Checking figment v0.10.19
  689. 339.50 s > Checking cpufeatures v0.3.0
  690. 339.50 s > Checking arrayref v0.3.9
  691. 339.50 s > Checking blake3 v1.8.5
  692. 339.50 s > Checking base64 v0.22.1
  693. 339.50 s > Checking dot-parser v0.5.1
  694. 339.50 s > Checking siphasher v1.0.2
  695. 339.50 s > Checking joinery v2.1.0
  696. 339.50 s > Checking subprocess v0.2.15
  697. 339.50 s > Checking phf_shared v0.13.1
  698. 339.50 s > Checking titlecase v2.2.1
  699. 339.50 s > Checking rust_lisp v0.18.0
  700. 339.50 s > Compiling vakint v0.1.2 (/build/source/crates/vakint)
  701. 339.50 s > Checking phf v0.13.1
  702. 339.50 s > Checking version-compare v0.2.1
  703. 339.50 s > Checking typenum v1.20.0
  704. 339.50 s > Checking xpct v0.5.1
  705. 339.50 s > Checking ryu v1.0.23
  706. 339.50 s > Checking castaway v0.2.4
  707. 339.50 s > Checking toml_datetime v0.7.5+spec-1.1.0
  708. 339.50 s > Checking strum v0.27.2
  709. 339.50 s > Checking compact_str v0.9.0
  710. 339.50 s > Checking unicode-truncate v2.0.1
  711. 339.50 s > Checking kasuari v0.4.12
  712. 339.50 s > Checking string-template-plus v0.4.3
  713. 339.50 s > Checking toml v0.9.12+spec-1.1.0
  714. 339.50 s > Checking lru v0.16.4
  715. 339.50 s > Checking vte v0.15.0
  716. 339.50 s > Checking portable-atomic v1.13.1
  717. 339.50 s > Checking ratatui-core v0.1.0
  718. 339.50 s > Checking vt100 v0.16.2
  719. 339.50 s > Checking unit-prefix v0.5.2
  720. 339.50 s > Checking rand_distr v0.4.3
  721. 339.50 s > Checking simba v0.6.0
  722. 339.50 s > Checking line-clipping v0.3.7
  723. 339.50 s > Checking gimli v0.32.3
  724. 339.50 s > Checking adler2 v2.0.1
  725. 339.50 s > Checking thiserror v1.0.69
  726. 339.50 s > Checking miniz_oxide v0.8.9
  727. 339.50 s > Checking derive_builder v0.11.2
  728. 339.50 s > Checking crossterm v0.29.0
  729. 339.50 s > Checking owo-colors v4.3.0
  730. 339.50 s > Checking object v0.37.3
  731. 339.50 s > Checking tracing-error v0.2.1
  732. 339.50 s > Checking indicatif v0.18.4
  733. 339.50 s > Checking serde-big-array v0.5.1
  734. 339.50 s > Checking amd v0.2.2
  735. 339.50 s > Checking itertools v0.11.0
  736. 339.50 s > Compiling gammaloop-tracing-filter-macros v0.1.0 (/build/source/crates/gammaloop-tracing-filter-macros)
  737. 339.50 s > Checking env_logger v0.11.10
  738. 339.50 s > Checking option-ext v0.2.0
  739. 339.50 s > Checking rustc-demangle v0.1.27
  740. 339.50 s > Checking dirs-sys v0.5.0
  741. 339.50 s > Checking ref-cast v1.0.25
  742. 339.50 s > Checking nix v0.31.2
  743. 339.50 s > Checking color-spantrace v0.3.0
  744. 339.50 s > Checking integer-sqrt v0.1.5
  745. 339.50 s > Checking ratatui-widgets v0.3.0
  746. 339.50 s > Checking ratatui-crossterm v0.1.0
  747. 339.50 s > Checking brotli-decompressor v4.0.3
  748. 339.50 s > Checking crossbeam-channel v0.5.15
  749. 339.50 s > Checking itertools v0.12.1
  750. 339.50 s > Compiling gammalooprs v0.3.4 (/build/source/crates/gammalooprs)
  751. 339.50 s > Checking symlink v0.1.0
  752. 339.50 s > Checking unsafe-libyaml v0.2.11
  753. 339.50 s > Checking include_dir v0.7.4
  754. 339.50 s > Checking pathfinding v4.15.0
  755. 339.50 s > Compiling rustpython-parser-core v0.4.0
  756. 339.50 s > Checking tracing-indicatif v0.3.14
  757. 339.50 s > Checking schemars v1.2.1
  758. 339.50 s > Compiling rustpython-ast v0.4.0
  759. 339.50 s > Checking tracing-appender v0.2.5
  760. 339.50 s > Checking slotmap v1.1.1
  761. 339.50 s > Checking ctrlc v3.5.2
  762. 339.50 s > Checking brotli v7.0.0
  763. 339.50 s > Checking dirs v6.0.0
  764. 339.50 s > Checking generic-array v0.14.7
  765. 339.50 s > Checking json5 v0.4.1
  766. 339.50 s > Checking typed-index-collections v3.5.0
  767. 339.50 s > Checking clarabel v0.11.1
  768. 339.50 s > Checking serde_yaml v0.9.34+deprecated
  769. 339.50 s > Checking addr2line v0.25.1
  770. 339.50 s > Checking vectorize v0.2.0
  771. 339.50 s > Checking base62 v2.2.4
  772. 339.50 s > Checking ringbuffer v0.16.0
  773. 339.50 s > Checking cpufeatures v0.2.17
  774. 339.50 s > Checking clap_complete v4.6.3
  775. 339.50 s > Checking fd-lock v4.0.4
  776. 339.50 s > Checking strip-ansi-escapes v0.2.1
  777. 339.50 s > Compiling gammaloop-api v0.1.0 (/build/source/crates/gammaloop-api)
  778. 339.50 s > Checking itertools v0.13.0
  779. 339.50 s > Compiling test-log-core v0.2.20
  780. 339.50 s > Checking strum v0.26.3
  781. 339.50 s > Checking block-buffer v0.10.4
  782. 339.50 s > Checking crypto-common v0.1.7
  783. 339.50 s > Compiling rustc_version v0.4.1
  784. 339.50 s > Checking clap_complete_nushell v4.6.0
  785. 339.50 s > Checking sysinfo v0.33.1
  786. 339.50 s > Checking digest v0.10.7
  787. 339.50 s > Checking ratatui-macros v0.7.0
  788. 339.50 s > Checking shlex v1.3.0
  789. 339.50 s > Checking ratatui v0.30.0
  790. 339.50 s > Checking sha2 v0.10.9
  791. 339.50 s > Checking bincode v1.3.3
  792. 339.50 s > Checking futures-core v0.3.32
  793. 339.50 s > Checking futures-task v0.3.32
  794. 339.50 s > Checking slab v0.4.12
  795. 339.50 s > Compiling gungraun-runner v0.18.2
  796. 339.50 s > Checking sdd v3.0.10
  797. 339.50 s > Checking rust-embed-utils v8.11.0
  798. 339.50 s > Checking backtrace v0.3.76
  799. 339.50 s > Checking futures-util v0.3.32
  800. 339.50 s > Checking scc v2.4.0
  801. 339.50 s > Checking rust-embed v8.11.0
  802. 339.50 s > Compiling gungraun-macros v0.8.0
  803. 339.50 s > Compiling gammaloop-integration-tests v0.1.0 (/build/source/tests)
  804. 339.50 s > Checking which v8.0.2
  805. 339.50 s > Checking reedline v0.42.0
  806. 339.50 s > Checking color-eyre v0.6.5
  807. 339.50 s > Checking proc-macro2 v1.0.106
  808. 339.50 s > Checking maplit v1.0.2
  809. 339.50 s > Checking base64 v0.21.7
  810. 339.50 s > Checking quote v1.0.45
  811. 339.50 s > Checking nalgebra v0.29.0
  812. 339.50 s > Compiling iai-callgrind-runner v0.14.2
  813. 339.50 s > Checking wait-timeout v0.2.1
  814. 339.50 s > Checking ron v0.8.1
  815. 339.50 s > Compiling numerica v2.2.0 (https://github.com/symbolica-dev/symbolica?branch=dev#0441bd7a)
  816. 339.50 s > Checking quick-error v1.2.3
  817. 339.50 s > Checking bit-vec v0.8.0
  818. 339.50 s > Compiling iai-callgrind v0.14.2
  819. 339.50 s > Checking bit-set v0.8.0
  820. 339.50 s > Checking futures-executor v0.3.32
  821. 339.50 s > Checking rusty-fork v0.3.1
  822. 339.50 s > Checking serial_test v3.4.0
  823. 339.50 s > Compiling test-log-macros v0.2.20
  824. 339.50 s > Checking syn v2.0.117
  825. 339.50 s > Compiling iai-callgrind-macros v0.5.1
  826. 339.50 s > Checking rand_xorshift v0.4.0
  827. 339.50 s > Checking console v0.15.11
  828. 339.50 s > Checking pathdiff v0.2.3
  829. 339.50 s > Checking unarray v0.1.4
  830. 339.50 s > Checking proptest v1.11.0
  831. 339.50 s > Checking similar-asserts v1.7.0
  832. 339.50 s > Checking kurbo v0.11.3
  833. 339.50 s > Checking clinnet v0.1.8 (/build/source/crates/clinnet)
  834. 339.50 s > Checking test-log v0.2.20
  835. 339.50 s > Compiling graphica v2.1.0 (https://github.com/symbolica-dev/symbolica?branch=dev#0441bd7a)
  836. 339.50 s > Checking statrs v0.16.1
  837. 339.50 s > Checking gungraun v0.18.2
  838. 339.50 s > Checking momtrop v0.3.0
  839. 339.50 s > Compiling pyo3-stub-gen-derive v0.17.2
  840. 339.50 s > Compiling pyo3-macros v0.28.3
  841. 339.50 s > Checking pyo3-stub-gen v0.17.2
  842. 339.50 s > Checking symbolica-utils v0.1.0 (/build/source/crates/symbolica-utils)
  843. 339.50 s > Checking spenso-macros v0.3.2 (/build/source/crates/spenso-macros)
  844. 339.50 s > Compiling gammaloop-workspace-hack v0.1.0 (/build/source/crates/gammaloop-workspace-hack)
  845. 339.50 s > Checking linnet v0.17.0 (/build/source/crates/linnet)
  846. 339.50 s > Checking spenso v0.6.0 (/build/source/crates/spenso)
  847. 339.50 s > Checking linnet-py v0.1.0 (/build/source/crates/linnet-py)
  848. 339.50 s > Checking linnest v0.1.0 (/build/source/crates/linnest)
  849. 339.50 s > Checking idenso v0.3.0 (/build/source/crates/idenso)
  850. 339.50 s > Checking gammaloop-tracing-filter v0.1.0 (/build/source/crates/gammaloop-tracing-filter)
  851. 339.50 s > Checking spenso-hep-lib v0.1.7 (/build/source/crates/spenso-hep-lib)
  852. 339.50 s > Checking spynso3 v0.1.2 (/build/source/crates/spynso3)
  853. 339.50 s > error[E0063]: missing field `center_group` in initializer of `ThresholdCountertermVariantMetadata`
  854. 339.50 s > --> crates/gammaloop-api/src/commands/display.rs:2060:28
  855. 339.50 s > |
  856. 339.50 s > 2060 | variants: vec![ThresholdCountertermVariantMetadata {
  857. 339.50 s > | ^^^^^^^^^^^^^^^^^^^^^^^^^^^^^^^^^^^ missing `center_group`
  858. 339.50 s >
  859. 339.50 s > error[E0063]: missing field `center_group` in initializer of `ThresholdCountertermVariantMetadata`
  860. 339.50 s > --> crates/gammaloop-api/src/commands/display.rs:2092:28
  861. 339.50 s > |
  862. 339.50 s > 2092 | variants: vec![ThresholdCountertermVariantMetadata {
  863. 339.50 s > | ^^^^^^^^^^^^^^^^^^^^^^^^^^^^^^^^^^^ missing `center_group`
  864. 339.50 s >
  865. 339.50 s > For more information about this error, try `rustc --explain E0063`.
  866. 339.50 s > error: could not compile `gammaloop-api` (lib test) due to 2 previous errors
  867. 339.50 s > warning: build failed, waiting for other jobs to finish...
  868. 339.50 s For full logs, run:
  869. 339.50 s nix log /nix/store/ldwqpkbpc8crkk3daxd316w8rfdkfkxa-gammaloop-workspace-check-0.1.0.drv
  870. 339.53 s Build failed.