1. 0.00 s $ /nix/store/61685rbaxmpigwi3z23i33sv3jyfl70q-coreutils-9.11/bin/timeout --kill-after=15s 7200s /nix/store/wknkybkzrc16r11vk5vrykh4wmw7a353-nix-2.34.8/bin/nix --extra-experimental-features nix-command --extra-experimental-features flakes flake clone git+https://github.com/alphal00p/gammaloop --dest /tmp/nix-ci-worker/stable-pwd/repo/
  2. 0.10 s Cloning into '/tmp/nix-ci-worker/stable-pwd/repo'...
  3. 0.79 s remote: Enumerating objects: 110731, done.
  4. 0.91 s remote: Counting objects: 0% (1/14180) remote: Counting objects: 1% (142/14180) remote: Counting objects: 2% (284/14180) remote: Counting objects: 3% (426/14180) remote: Counting objects: 4% (568/14180) remote: Counting objects: 5% (709/14180) remote: Counting objects: 6% (851/14180) remote: Counting objects: 7% (993/14180) remote: Counting objects: 8% (1135/14180) remote: Counting objects: 9% (1277/14180) remote: Counting objects: 10% (1418/14180) remote: Counting objects: 11% (1560/14180) remote: Counting objects: 12% (1702/14180) remote: Counting objects: 13% (1844/14180) remote: Counting objects: 14% (1986/14180) remote: Counting objects: 15% (2127/14180) remote: Counting objects: 16% (2269/14180) remote: Counting objects: 17% (2411/14180) remote: Counting objects: 18% (2553/14180) remote: Counting objects: 19% (2695/14180) remote: Counting objects: 20% (2836/14180) remote: Counting objects: 21% (2978/14180) remote: Counting objects: 22% (3120/14180) remote: Counting objects: 23% (3262/14180) remote: Counting objects: 24% (3404/14180) remote: Counting objects: 25% (3545/14180) remote: Counting objects: 26% (3687/14180) remote: Counting objects: 27% (3829/14180) remote: Counting objects: 28% (3971/14180) remote: Counting objects: 29% (4113/14180) remote: Counting objects: 30% (4254/14180) remote: Counting objects: 31% (4396/14180) remote: Counting objects: 32% (4538/14180) remote: Counting objects: 33% (4680/14180) remote: Counting objects: 34% (4822/14180) remote: Counting objects: 35% (4963/14180) remote: Counting objects: 36% (5105/14180) remote: Counting objects: 37% (5247/14180) remote: Counting objects: 38% (5389/14180) remote: Counting objects: 39% (5531/14180) remote: Counting objects: 40% (5672/14180) remote: Counting objects: 41% (5814/14180) remote: Counting objects: 42% (5956/14180) remote: Counting objects: 43% (6098/14180) remote: Counting objects: 44% (6240/14180) remote: Counting objects: 45% (6381/14180) remote: Counting objects: 46% (6523/14180) remote: Counting objects: 47% (6665/14180) remote: Counting objects: 48% (6807/14180) remote: Counting objects: 49% (6949/14180) remote: Counting objects: 50% (7090/14180) remote: Counting objects: 51% (7232/14180) remote: Counting objects: 52% (7374/14180) remote: Counting objects: 53% (7516/14180) remote: Counting objects: 54% (7658/14180) remote: Counting objects: 55% (7799/14180) remote: Counting objects: 56% (7941/14180) remote: Counting objects: 57% (8083/14180) remote: Counting objects: 58% (8225/14180) remote: Counting objects: 59% (8367/14180) remote: Counting objects: 60% (8508/14180) remote: Counting objects: 61% (8650/14180) remote: Counting objects: 62% (8792/14180) remote: Counting objects: 63% (8934/14180) remote: Counting objects: 64% (9076/14180) remote: Counting objects: 65% (9217/14180) remote: Counting objects: 66% (9359/14180) remote: Counting objects: 67% (9501/14180) remote: Counting objects: 68% (9643/14180) remote: Counting objects: 69% (9785/14180) remote: Counting objects: 70% (9926/14180) remote: Counting objects: 71% (10068/14180) remote: Counting objects: 72% (10210/14180) remote: Counting objects: 73% (10352/14180) remote: Counting objects: 74% (10494/14180) remote: Counting objects: 75% (10635/14180) remote: Counting objects: 76% (10777/14180) remote: Counting objects: 77% (10919/14180) remote: Counting objects: 78% (11061/14180) remote: Counting objects: 79% (11203/14180) remote: Counting objects: 80% (11344/14180) remote: Counting objects: 81% (11486/14180) remote: Counting objects: 82% (11628/14180) remote: Counting objects: 83% (11770/14180) remote: Counting objects: 84% (11912/14180) remote: Counting objects: 85% (12053/14180) remote: Counting objects: 86% (12195/14180) remote: Counting objects: 87% (12337/14180) remote: Counting objects: 88% (12479/14180) remote: Counting objects: 89% (12621/14180) remote: Counting objects: 90% (12762/14180) remote: Counting objects: 91% (12904/14180) remote: Counting objects: 92% (13046/14180) remote: Counting objects: 93% (13188/14180) remote: Counting objects: 94% (13330/14180) remote: Counting objects: 95% (13471/14180) remote: Counting objects: 96% (13613/14180) remote: Counting objects: 97% (13755/14180) remote: Counting objects: 98% (13897/14180) remote: Counting objects: 99% (14039/14180) remote: Counting objects: 100% (14180/14180) remote: Counting objects: 100% (14180/14180), done.
  5. 5.69 s remote: Compressing objects: 0% (1/2882) remote: Compressing objects: 1% (29/2882) remote: Compressing objects: 2% (58/2882) remote: Compressing objects: 3% (87/2882) remote: Compressing objects: 4% (116/2882) remote: Compressing objects: 5% (145/2882) remote: Compressing objects: 6% (173/2882) remote: Compressing objects: 7% (202/2882) remote: Compressing objects: 8% (231/2882) remote: Compressing objects: 9% (260/2882) remote: Compressing objects: 10% (289/2882) remote: Compressing objects: 11% (318/2882) remote: Compressing objects: 11% (342/2882) remote: Compressing objects: 12% (346/2882) remote: Compressing objects: 13% (375/2882) remote: Compressing objects: 13% (379/2882) remote: Compressing objects: 14% (404/2882) remote: Compressing objects: 15% (433/2882) remote: Compressing objects: 16% (462/2882) remote: Compressing objects: 17% (490/2882) remote: Compressing objects: 17% (493/2882) remote: Compressing objects: 18% (519/2882) remote: Compressing objects: 19% (548/2882) remote: Compressing objects: 20% (577/2882) remote: Compressing objects: 21% (606/2882) remote: Compressing objects: 22% (635/2882) remote: Compressing objects: 23% (663/2882) remote: Compressing objects: 23% (667/2882) remote: Compressing objects: 24% (692/2882) remote: Compressing objects: 25% (721/2882) remote: Compressing objects: 26% (750/2882) remote: Compressing objects: 27% (779/2882) remote: Compressing objects: 28% (807/2882) remote: Compressing objects: 29% (836/2882) remote: Compressing objects: 30% (865/2882) remote: Compressing objects: 31% (894/2882) remote: Compressing objects: 32% (923/2882) remote: Compressing objects: 33% (952/2882) remote: Compressing objects: 34% (980/2882) remote: Compressing objects: 35% (1009/2882) remote: Compressing objects: 36% (1038/2882) remote: Compressing objects: 37% (1067/2882) remote: Compressing objects: 38% (1096/2882) remote: Compressing objects: 39% (1124/2882) remote: Compressing objects: 40% (1153/2882) remote: Compressing objects: 41% (1182/2882) remote: Compressing objects: 42% (1211/2882) remote: Compressing objects: 43% (1240/2882) remote: Compressing objects: 44% (1269/2882) remote: Compressing objects: 45% (1297/2882) remote: Compressing objects: 46% (1326/2882) remote: Compressing objects: 47% (1355/2882) remote: Compressing objects: 48% (1384/2882) remote: Compressing objects: 49% (1413/2882) remote: Compressing objects: 50% (1441/2882) remote: Compressing objects: 51% (1470/2882) remote: Compressing objects: 52% (1499/2882) remote: Compressing objects: 53% (1528/2882) remote: Compressing objects: 54% (1557/2882) remote: Compressing objects: 55% (1586/2882) remote: Compressing objects: 56% (1614/2882) remote: Compressing objects: 57% (1643/2882) remote: Compressing objects: 58% (1672/2882) remote: Compressing objects: 59% (1701/2882) remote: Compressing objects: 60% (1730/2882) remote: Compressing objects: 61% (1759/2882) remote: Compressing objects: 62% (1787/2882) remote: Compressing objects: 63% (1816/2882) remote: Compressing objects: 64% (1845/2882) remote: Compressing objects: 65% (1874/2882) remote: Compressing objects: 66% (1903/2882) remote: Compressing objects: 67% (1931/2882) remote: Compressing objects: 68% (1960/2882) remote: Compressing objects: 69% (1989/2882) remote: Compressing objects: 70% (2018/2882) remote: Compressing objects: 71% (2047/2882) remote: Compressing objects: 72% (2076/2882) remote: Compressing objects: 73% (2104/2882) remote: Compressing objects: 74% (2133/2882) remote: Compressing objects: 75% (2162/2882) remote: Compressing objects: 76% (2191/2882) remote: Compressing objects: 77% (2220/2882) remote: Compressing objects: 78% (2248/2882) remote: Compressing objects: 79% (2277/2882) remote: Compressing objects: 80% (2306/2882) remote: Compressing objects: 81% (2335/2882) remote: Compressing objects: 82% (2364/2882) remote: Compressing objects: 83% (2393/2882) remote: Compressing objects: 84% (2421/2882) remote: Compressing objects: 85% (2450/2882) remote: Compressing objects: 86% (2479/2882) remote: Compressing objects: 87% (2508/2882) remote: Compressing objects: 88% (2537/2882) remote: Compressing objects: 89% (2565/2882) remote: Compressing objects: 90% (2594/2882) remote: Compressing objects: 91% (2623/2882) remote: Compressing objects: 92% (2652/2882) remote: Compressing objects: 93% (2681/2882) remote: Compressing objects: 94% (2710/2882) remote: Compressing objects: 95% (2738/2882) remote: Compressing objects: 96% (2767/2882) remote: Compressing objects: 97% (2796/2882) remote: Compressing objects: 98% (2825/2882) remote: Compressing objects: 99% (2854/2882) remote: Compressing objects: 100% (2882/2882) remote: Compressing objects: 100% (2882/2882), done.
  6. 15.99 s Receiving objects: 0% (1/110731) Receiving objects: 1% (1108/110731) Receiving objects: 2% (2215/110731) Receiving objects: 3% (3322/110731), 13.08 MiB | 26.14 MiB/s Receiving objects: 4% (4430/110731), 13.08 MiB | 26.14 MiB/s Receiving objects: 5% (5537/110731), 13.08 MiB | 26.14 MiB/s Receiving objects: 6% (6644/110731), 13.08 MiB | 26.14 MiB/s Receiving objects: 7% (7752/110731), 13.08 MiB | 26.14 MiB/s Receiving objects: 8% (8859/110731), 13.08 MiB | 26.14 MiB/s Receiving objects: 9% (9966/110731), 13.08 MiB | 26.14 MiB/s Receiving objects: 9% (10040/110731), 29.00 MiB | 28.99 MiB/s Receiving objects: 10% (11074/110731), 29.00 MiB | 28.99 MiB/s Receiving objects: 11% (12181/110731), 29.00 MiB | 28.99 MiB/s Receiving objects: 12% (13288/110731), 29.00 MiB | 28.99 MiB/s Receiving objects: 13% (14396/110731), 29.00 MiB | 28.99 MiB/s Receiving objects: 14% (15503/110731), 29.00 MiB | 28.99 MiB/s Receiving objects: 15% (16610/110731), 29.00 MiB | 28.99 MiB/s Receiving objects: 16% (17717/110731), 29.00 MiB | 28.99 MiB/s Receiving objects: 17% (18825/110731), 29.00 MiB | 28.99 MiB/s Receiving objects: 18% (19932/110731), 29.00 MiB | 28.99 MiB/s Receiving objects: 19% (21039/110731), 29.00 MiB | 28.99 MiB/s Receiving objects: 20% (22147/110731), 29.00 MiB | 28.99 MiB/s Receiving objects: 21% (23254/110731), 29.00 MiB | 28.99 MiB/s Receiving objects: 22% (24361/110731), 29.00 MiB | 28.99 MiB/s Receiving objects: 23% (25469/110731), 29.00 MiB | 28.99 MiB/s Receiving objects: 24% (26576/110731), 29.00 MiB | 28.99 MiB/s Receiving objects: 25% (27683/110731), 29.00 MiB | 28.99 MiB/s Receiving objects: 26% (28791/110731), 45.79 MiB | 30.52 MiB/s Receiving objects: 27% (29898/110731), 45.79 MiB | 30.52 MiB/s Receiving objects: 28% (31005/110731), 45.79 MiB | 30.52 MiB/s Receiving objects: 29% (32112/110731), 45.79 MiB | 30.52 MiB/s Receiving objects: 30% (33220/110731), 45.79 MiB | 30.52 MiB/s Receiving objects: 31% (34327/110731), 45.79 MiB | 30.52 MiB/s Receiving objects: 32% (35434/110731), 45.79 MiB | 30.52 MiB/s Receiving objects: 33% (36542/110731), 45.79 MiB | 30.52 MiB/s Receiving objects: 34% (37649/110731), 45.79 MiB | 30.52 MiB/s Receiving objects: 35% (38756/110731), 45.79 MiB | 30.52 MiB/s Receiving objects: 36% (39864/110731), 45.79 MiB | 30.52 MiB/s Receiving objects: 37% (40971/110731), 45.79 MiB | 30.52 MiB/s Receiving objects: 38% (42078/110731), 45.79 MiB | 30.52 MiB/s Receiving objects: 39% (43186/110731), 45.79 MiB | 30.52 MiB/s Receiving objects: 39% (43641/110731), 45.79 MiB | 30.52 MiB/s Receiving objects: 40% (44293/110731), 64.62 MiB | 32.30 MiB/s Receiving objects: 41% (45400/110731), 64.62 MiB | 32.30 MiB/s Receiving objects: 42% (46508/110731), 64.62 MiB | 32.30 MiB/s Receiving objects: 43% (47615/110731), 64.62 MiB | 32.30 MiB/s Receiving objects: 44% (48722/110731), 64.62 MiB | 32.30 MiB/s Receiving objects: 45% (49829/110731), 64.62 MiB | 32.30 MiB/s Receiving objects: 46% (50937/110731), 64.62 MiB | 32.30 MiB/s Receiving objects: 47% (52044/110731), 64.62 MiB | 32.30 MiB/s Receiving objects: 48% (53151/110731), 81.04 MiB | 32.14 MiB/s Receiving objects: 49% (54259/110731), 81.04 MiB | 32.14 MiB/s Receiving objects: 50% (55366/110731), 81.04 MiB | 32.14 MiB/s Receiving objects: 51% (56473/110731), 81.04 MiB | 32.14 MiB/s Receiving objects: 52% (57581/110731), 81.04 MiB | 32.14 MiB/s Receiving objects: 52% (57824/110731), 81.04 MiB | 32.14 MiB/s Receiving objects: 53% (58688/110731), 98.60 MiB | 32.64 MiB/s Receiving objects: 54% (59795/110731), 98.60 MiB | 32.64 MiB/s Receiving objects: 55% (60903/110731), 98.60 MiB | 32.64 MiB/s Receiving objects: 56% (62010/110731), 98.60 MiB | 32.64 MiB/s Receiving objects: 57% (63117/110731), 98.60 MiB | 32.64 MiB/s Receiving objects: 58% (64224/110731), 114.98 MiB | 32.65 MiB/s Receiving objects: 59% (65332/110731), 114.98 MiB | 32.65 MiB/s Receiving objects: 60% (66439/110731), 114.98 MiB | 32.65 MiB/s Receiving objects: 60% (66568/110731), 114.98 MiB | 32.65 MiB/s Receiving objects: 61% (67546/110731), 131.44 MiB | 32.69 MiB/s Receiving objects: 61% (68435/110731), 165.18 MiB | 33.63 MiB/s Receiving objects: 62% (68654/110731), 165.18 MiB | 33.63 MiB/s Receiving objects: 63% (69761/110731), 165.18 MiB | 33.63 MiB/s Receiving objects: 64% (70868/110731), 165.18 MiB | 33.63 MiB/s Receiving objects: 65% (71976/110731), 165.18 MiB | 33.63 MiB/s Receiving objects: 66% (73083/110731), 165.18 MiB | 33.63 MiB/s Receiving objects: 67% (74190/110731), 165.18 MiB | 33.63 MiB/s Receiving objects: 68% (75298/110731), 165.18 MiB | 33.63 MiB/s Receiving objects: 69% (76405/110731), 182.68 MiB | 33.98 MiB/s Receiving objects: 70% (77512/110731), 182.68 MiB | 33.98 MiB/s Receiving objects: 71% (78620/110731), 182.68 MiB | 33.98 MiB/s Receiving objects: 72% (79727/110731), 182.68 MiB | 33.98 MiB/s Receiving objects: 73% (80834/110731), 182.68 MiB | 33.98 MiB/s Receiving objects: 74% (81941/110731), 182.68 MiB | 33.98 MiB/s Receiving objects: 75% (83049/110731), 182.68 MiB | 33.98 MiB/s Receiving objects: 76% (84156/110731), 182.68 MiB | 33.98 MiB/s Receiving objects: 77% (85263/110731), 182.68 MiB | 33.98 MiB/s Receiving objects: 78% (86371/110731), 182.68 MiB | 33.98 MiB/s Receiving objects: 78% (86483/110731), 182.68 MiB | 33.98 MiB/s Receiving objects: 79% (87478/110731), 199.50 MiB | 33.99 MiB/s Receiving objects: 80% (88585/110731), 199.50 MiB | 33.99 MiB/s Receiving objects: 81% (89693/110731), 199.50 MiB | 33.99 MiB/s Receiving objects: 81% (90106/110731), 215.54 MiB | 33.33 MiB/s Receiving objects: 82% (90800/110731), 250.40 MiB | 33.67 MiB/s Receiving objects: 83% (91907/110731), 250.40 MiB | 33.67 MiB/s Receiving objects: 83% (92638/110731), 250.40 MiB | 33.67 MiB/s Receiving objects: 84% (93015/110731), 250.40 MiB | 33.67 MiB/s Receiving objects: 85% (94122/110731), 266.40 MiB | 33.60 MiB/s Receiving objects: 86% (95229/110731), 266.40 MiB | 33.60 MiB/s Receiving objects: 87% (96336/110731), 283.46 MiB | 33.72 MiB/s Receiving objects: 88% (97444/110731), 283.46 MiB | 33.72 MiB/s Receiving objects: 89% (98551/110731), 283.46 MiB | 33.72 MiB/s Receiving objects: 90% (99658/110731), 283.46 MiB | 33.72 MiB/s Receiving objects: 91% (100766/110731), 283.46 MiB | 33.72 MiB/s Receiving objects: 91% (101823/110731), 283.46 MiB | 33.72 MiB/s Receiving objects: 92% (101873/110731), 283.46 MiB | 33.72 MiB/s Receiving objects: 93% (102980/110731), 300.94 MiB | 33.80 MiB/s Receiving objects: 94% (104088/110731), 300.94 MiB | 33.80 MiB/s Receiving objects: 95% (105195/110731), 300.94 MiB | 33.80 MiB/s Receiving objects: 96% (106302/110731), 300.94 MiB | 33.80 MiB/s Receiving objects: 97% (107410/110731), 300.94 MiB | 33.80 MiB/s Receiving objects: 98% (108517/110731), 300.94 MiB | 33.80 MiB/s Receiving objects: 98% (109393/110731), 312.37 MiB | 31.78 MiB/s Receiving objects: 99% (109624/110731), 321.40 MiB | 29.90 MiB/s remote: Total 110731 (delta 11886), reused 11585 (delta 10898), pack-reused 96551 (from 2)
  7. 15.99 s Receiving objects: 100% (110731/110731), 321.40 MiB | 29.90 MiB/s Receiving objects: 100% (110731/110731), 325.00 MiB | 31.54 MiB/s, done.
  8. 18.02 s Resolving deltas: 0% (0/72602) Resolving deltas: 1% (727/72602) Resolving deltas: 2% (1453/72602) Resolving deltas: 3% (2179/72602) Resolving deltas: 4% (2905/72602) Resolving deltas: 5% (3633/72602) Resolving deltas: 6% (4357/72602) Resolving deltas: 7% (5083/72602) Resolving deltas: 8% (5810/72602) Resolving deltas: 9% (6535/72602) Resolving deltas: 10% (7261/72602) Resolving deltas: 11% (7987/72602) Resolving deltas: 12% (8713/72602) Resolving deltas: 13% (9442/72602) Resolving deltas: 14% (10165/72602) Resolving deltas: 15% (10891/72602) Resolving deltas: 16% (11617/72602) Resolving deltas: 17% (12343/72602) Resolving deltas: 18% (13069/72602) Resolving deltas: 19% (13795/72602) Resolving deltas: 20% (14521/72602) Resolving deltas: 21% (15247/72602) Resolving deltas: 22% (15973/72602) Resolving deltas: 23% (16699/72602) Resolving deltas: 24% (17425/72602) Resolving deltas: 25% (18151/72602) Resolving deltas: 26% (18877/72602) Resolving deltas: 27% (19603/72602) Resolving deltas: 28% (20329/72602) Resolving deltas: 29% (21055/72602) Resolving deltas: 30% (21781/72602) Resolving deltas: 31% (22507/72602) Resolving deltas: 32% (23233/72602) Resolving deltas: 33% (23959/72602) Resolving deltas: 34% (24685/72602) Resolving deltas: 35% (25411/72602) Resolving deltas: 36% (26137/72602) Resolving deltas: 36% (26178/72602) Resolving deltas: 37% (26863/72602) Resolving deltas: 38% (27589/72602) Resolving deltas: 39% (28317/72602) Resolving deltas: 40% (29041/72602) Resolving deltas: 41% (29767/72602) Resolving deltas: 42% (30493/72602) Resolving deltas: 43% (31219/72602) Resolving deltas: 44% (31945/72602) Resolving deltas: 45% (32671/72602) Resolving deltas: 46% (33397/72602) Resolving deltas: 47% (34123/72602) Resolving deltas: 48% (34849/72602) Resolving deltas: 49% (35575/72602) Resolving deltas: 50% (36302/72602) Resolving deltas: 51% (37029/72602) Resolving deltas: 52% (37755/72602) Resolving deltas: 53% (38480/72602) Resolving deltas: 54% (39208/72602) Resolving deltas: 55% (39932/72602) Resolving deltas: 56% (40658/72602) Resolving deltas: 57% (41384/72602) Resolving deltas: 58% (42110/72602) Resolving deltas: 59% (42836/72602) Resolving deltas: 60% (43562/72602) Resolving deltas: 61% (44290/72602) Resolving deltas: 62% (45015/72602) Resolving deltas: 63% (45740/72602) Resolving deltas: 64% (46466/72602) Resolving deltas: 65% (47192/72602) Resolving deltas: 66% (47918/72602) Resolving deltas: 67% (48645/72602) Resolving deltas: 68% (49370/72602) Resolving deltas: 69% (50096/72602) Resolving deltas: 70% (50822/72602) Resolving deltas: 71% (51548/72602) Resolving deltas: 72% (52275/72602) Resolving deltas: 73% (53000/72602) Resolving deltas: 74% (53726/72602) Resolving deltas: 75% (54452/72602) Resolving deltas: 76% (55178/72602) Resolving deltas: 77% (55905/72602) Resolving deltas: 78% (56630/72602) Resolving deltas: 79% (57356/72602) Resolving deltas: 80% (58082/72602) Resolving deltas: 81% (58810/72602) Resolving deltas: 82% (59534/72602) Resolving deltas: 83% (60260/72602) Resolving deltas: 84% (60986/72602) Resolving deltas: 85% (61712/72602) Resolving deltas: 86% (62438/72602) Resolving deltas: 87% (63164/72602) Resolving deltas: 88% (63891/72602) Resolving deltas: 89% (64617/72602) Resolving deltas: 90% (65342/72602) Resolving deltas: 91% (66068/72602) Resolving deltas: 92% (66794/72602) Resolving deltas: 93% (67520/72602) Resolving deltas: 94% (68246/72602) Resolving deltas: 95% (68972/72602) Resolving deltas: 96% (69698/72602) Resolving deltas: 97% (70424/72602) Resolving deltas: 98% (71150/72602) Resolving deltas: 99% (71877/72602) Resolving deltas: 99% (72470/72602) Resolving deltas: 100% (72602/72602) Resolving deltas: 100% (72602/72602), done.
  9. 18.67 s Fetching commit 07b1d150507fa30cd2cd44f18a21e3387ba5063b for linnest-endpoints-momentum-layouts ...
  10. 18.67 s $ /nix/store/5vpcfsdx1lcnlb2y4k7xyc74shp5qwbh-git-2.54.0/bin/git fetch origin 07b1d150507fa30cd2cd44f18a21e3387ba5063b
  11. 19.14 s From https://github.com/alphal00p/gammaloop
  12. 19.14 s * branch 07b1d150507fa30cd2cd44f18a21e3387ba5063b -> FETCH_HEAD
  13. 19.16 s $ /nix/store/61685rbaxmpigwi3z23i33sv3jyfl70q-coreutils-9.11/bin/timeout --kill-after=15s 7200s /nix/store/5vpcfsdx1lcnlb2y4k7xyc74shp5qwbh-git-2.54.0/bin/git -c advice.detachedHead=false checkout 07b1d150507fa30cd2cd44f18a21e3387ba5063b
  14. 19.48 s HEAD is now at 07b1d1505 extend linnest edge endpoints, momentum display, and partial layouts
  15. 19.49 s $ /nix/store/61685rbaxmpigwi3z23i33sv3jyfl70q-coreutils-9.11/bin/timeout --kill-after=15s 7200s /nix/store/wknkybkzrc16r11vk5vrykh4wmw7a353-nix-2.34.8/bin/nix --extra-experimental-features nix-command --extra-experimental-features flakes --log-format internal-json run .#packages.x86_64-linux.nix-ci-check-gammaloop-nextest-docs --print-build-logs
  16. 19.62 s warning: ignoring untrusted flake configuration setting 'extra-substituters'.
  17. 19.62 s Pass '--accept-flake-config' to trust it
  18. 19.62 s warning: ignoring untrusted flake configuration setting 'extra-trusted-public-keys'.
  19. 19.62 s Pass '--accept-flake-config' to trust it
  20. 19.62 s
  21. 19.86 s evaluating derivation 'gdo you want to allow configuration setting 'extra-substituters' to be set to 'https://cache.nix-ci.com' (y/N)? do you want to permanently mark this value as untrusted (y/N)? warning: ignoring untrusted flake configuration setting 'extra-substituters'.
  22. 19.86 s Pass '--accept-flake-config' to trust it
  23. 19.86 s do you want to allow configuration setting 'extra-trusted-public-keys' to be set to 'nix-ci:g3xV5BDTLtIBZr/A00IU1x0EtKKlb7YLgBN2SgYgM6A=' (y/N)? do you want to permanently mark this value as untrusted (y/N)? warning: ignoring untrusted flake configuration setting 'extra-trusted-public-keys'.
  24. 19.86 s Pass '--accept-flake-config' to trust it
  25. 27.86 s copying '/nix/store/gisz evaluating derivation 'g copying '/nix/store/gisz evaluating derivation 'g copying '/nix/store/gisz evaluating derivation 'g copying '/nix/store/gisz evaluating derivation 'g copying '/nix/store/gisz evaluating derivation 'g copying '/nix/store/gisz evaluating derivation 'g copying '/nix/store/gisz evaluating derivation 'g copying '/nix/store/gisz evaluating derivation 'g copying '/nix/store/gisz evaluating derivation 'g [0/1 built] [1/0/1 built] building ggammaloop-nextest-docs> Extracting 2 binaries to /build/source
  26. 27.93 s gammaloop-nextest-docs> Extracted 5 files to /build/source in 0.07s
  27. 27.94 s gammaloop-nextest-docs> ------------
  28. 27.94 s gammaloop-nextest-docs> Nextest run ID 22f7fa96-17cc-4ca5-819d-31cfd55be410 with nextest profile: ci_gammaloop
  29. 27.94 s gammaloop-nextest-docs> Starting 129 tests across 2 binaries
  30. 28.18 s gammaloop-nextest-docs> FAIL [ 0.239s] ( 63/129) alphal00p-docs-builder tests::checked_in_registry_is_valid
  31. 28.18 s gammaloop-nextest-docs> stdout ---
  32. 28.18 s gammaloop-nextest-docs>
  33. 28.18 s gammaloop-nextest-docs> running 1 test
  34. 28.18 s gammaloop-nextest-docs> test tests::checked_in_registry_is_valid ... FAILED
  35. 28.18 s gammaloop-nextest-docs>
  36. 28.18 s gammaloop-nextest-docs> failures:
  37. 28.18 s gammaloop-nextest-docs>
  38. 28.18 s gammaloop-nextest-docs> failures:
  39. 28.18 s gammaloop-nextest-docs> tests::checked_in_registry_is_valid
  40. 28.18 s gammaloop-nextest-docs>
  41. 28.18 s gammaloop-nextest-docs> test result: FAILED. 0 passed; 1 failed; 0 ignored; 0 measured; 128 filtered out; finished in 0.23s
  42. 28.18 s gammaloop-nextest-docs>
  43. 28.19 s gammaloop-nextest-docs> stderr ---
  44. 28.19 s gammaloop-nextest-docs>
  45. 28.19 s gammaloop-nextest-docs> thread 'tests::checked_in_registry_is_valid' (200) panicked at crates/alphal00p-docs-builder/src/lib.rs:12178:50:
  46. 28.19 s gammaloop-nextest-docs> called `Result::unwrap()` on an `Err` value: developer note nix-crane-cache-reuse verified scope nix/rust-workspace.nix changed (expected 66f700580ce13b9eaee90fe0111639e46968c531, found 0a568cb5712045aee37d96bfb2f91d3d32b7e9b9); owner review or an explicit no-impact attestation is required
  47. 28.19 s gammaloop-nextest-docs>
  48. 28.19 s gammaloop-nextest-docs> Location:
  49. 28.19 s gammaloop-nextest-docs> crates/alphal00p-docs-builder/src/lib.rs:992:29
  50. 28.19 s gammaloop-nextest-docs> stack backtrace:
  51. 28.19 s gammaloop-nextest-docs> 0: __rustc::rust_begin_unwind
  52. 28.19 s gammaloop-nextest-docs> 1: core::panicking::panic_fmt
  53. 28.19 s gammaloop-nextest-docs> 2: core::result::unwrap_failed
  54. 28.19 s gammaloop-nextest-docs> 3: alphal00p_docs_builder::tests::checked_in_registry_is_valid
  55. 28.19 s gammaloop-nextest-docs> 4: <alphal00p_docs_builder::tests::checked_in_registry_is_valid::{closure#0} as core::ops::function::FnOnce<()>>::call_once
  56. 28.19 s gammaloop-nextest-docs> note: Some details are omitted, run with `RUST_BACKTRACE=full` for a verbose backtrace.
  57. 28.19 s gammaloop-nextest-docs>
  58. 28.23 s gammaloop-nextest-docs> FAIL [ 0.289s] ( 68/129) alphal00p-docs-builder provenance_tests::each_build_captures_one_revision_before_rendering
  59. 28.23 s gammaloop-nextest-docs> stdout ---
  60. 28.23 s gammaloop-nextest-docs>
  61. 28.23 s gammaloop-nextest-docs> running 1 test
  62. 28.23 s gammaloop-nextest-docs>
  63. 28.23 s gammaloop-nextest-docs> running 1 test
  64. 28.23 s gammaloop-nextest-docs> test provenance_tests::each_build_captures_one_revision_before_rendering ... FAILED
  65. 28.23 s gammaloop-nextest-docs>
  66. 28.23 s gammaloop-nextest-docs> failures:
  67. 28.23 s gammaloop-nextest-docs>
  68. 28.23 s gammaloop-nextest-docs> failures:
  69. 28.23 s gammaloop-nextest-docs> provenance_tests::each_build_captures_one_revision_before_rendering
  70. 28.23 s gammaloop-nextest-docs>
  71. 28.23 s gammaloop-nextest-docs> test result: FAILED. 0 passed; 1 failed; 0 ignored; 0 measured; 128 filtered out; finished in 0.27s
  72. 28.23 s gammaloop-nextest-docs>
  73. 28.23 s gammaloop-nextest-docs> test provenance_tests::each_build_captures_one_revision_before_rendering ... FAILED
  74. 28.23 s gammaloop-nextest-docs>
  75. 28.23 s gammaloop-nextest-docs> failures:
  76. 28.23 s gammaloop-nextest-docs>
  77. 28.23 s gammaloop-nextest-docs> failures:
  78. 28.23 s gammaloop-nextest-docs> provenance_tests::each_build_captures_one_revision_before_rendering
  79. 28.23 s gammaloop-nextest-docs>
  80. 28.23 s gammaloop-nextest-docs> test result: FAILED. 0 passed; 1 failed; 0 ignored; 0 measured; 128 filtered out; finished in 0.28s
  81. 28.23 s gammaloop-nextest-docs>
  82. 28.23 s gammaloop-nextest-docs> stderr ---
  83. 28.23 s gammaloop-nextest-docs>
  84. 28.23 s gammaloop-nextest-docs> thread 'provenance_tests::each_build_captures_one_revision_before_rendering' (209) panicked at crates/alphal00p-docs-builder/src/provenance_tests.rs:297:14:
  85. 28.23 s gammaloop-nextest-docs> called `Result::unwrap()` on an `Err` value: developer note nix-crane-cache-reuse verified scope nix/rust-workspace.nix changed (expected 66f700580ce13b9eaee90fe0111639e46968c531, found 0a568cb5712045aee37d96bfb2f91d3d32b7e9b9); owner review or an explicit no-impact attestation is required
  86. 28.23 s gammaloop-nextest-docs>
  87. 28.23 s gammaloop-nextest-docs> Location:
  88. 28.23 s gammaloop-nextest-docs> crates/alphal00p-docs-builder/src/lib.rs:992:29
  89. 28.23 s gammaloop-nextest-docs> stack backtrace:
  90. 28.23 s gammaloop-nextest-docs> 0: __rustc::rust_begin_unwind
  91. 28.23 s gammaloop-nextest-docs> 1: core::panicking::panic_fmt
  92. 28.23 s gammaloop-nextest-docs> 2: core::result::unwrap_failed
  93. 28.23 s gammaloop-nextest-docs> 3: alphal00p_docs_builder::provenance_tests::each_build_captures_one_revision_before_rendering
  94. 28.23 s gammaloop-nextest-docs> 4: <alphal00p_docs_builder::provenance_tests::each_build_captures_one_revision_before_rendering::{closure#0} as core::ops::function::FnOnce<()>>::call_once
  95. 28.23 s gammaloop-nextest-docs> note: Some details are omitted, run with `RUST_BACKTRACE=full` for a verbose backtrace.
  96. 28.23 s gammaloop-nextest-docs>
  97. 28.23 s gammaloop-nextest-docs> thread 'provenance_tests::each_build_captures_one_revision_before_rendering' (163) panicked at crates/alphal00p-docs-builder/src/provenance_tests.rs:274:9:
  98. 28.23 s gammaloop-nextest-docs> assertion failed: command.status().unwrap().success()
  99. 28.23 s gammaloop-nextest-docs> stack backtrace:
  100. 28.23 s gammaloop-nextest-docs> 0: __rustc::rust_begin_unwind
  101. 28.23 s gammaloop-nextest-docs> 1: core::panicking::panic_fmt
  102. 28.23 s gammaloop-nextest-docs> 2: core::panicking::panic
  103. 28.23 s gammaloop-nextest-docs> 3: alphal00p_docs_builder::provenance_tests::each_build_captures_one_revision_before_rendering
  104. 28.23 s gammaloop-nextest-docs> 4: <alphal00p_docs_builder::provenance_tests::each_build_captures_one_revision_before_rendering::{closure#0} as core::ops::function::FnOnce<()>>::call_once
  105. 28.23 s gammaloop-nextest-docs> note: Some details are omitted, run with `RUST_BACKTRACE=full` for a verbose backtrace.
  106. 28.23 s gammaloop-nextest-docs>
  107. 28.25 s gammaloop-nextest-docs> FAIL [ 0.271s] ( 71/129) alphal00p-docs-builder tests::developer_scope_ranges_ignore_unrelated_edits_and_warn_only_while_watching
  108. 28.25 s gammaloop-nextest-docs> stdout ---
  109. 28.25 s gammaloop-nextest-docs>
  110. 28.25 s gammaloop-nextest-docs> running 1 test
  111. 28.25 s gammaloop-nextest-docs> test tests::developer_scope_ranges_ignore_unrelated_edits_and_warn_only_while_watching ... FAILED
  112. 28.25 s gammaloop-nextest-docs>
  113. 28.25 s gammaloop-nextest-docs> failures:
  114. 28.25 s gammaloop-nextest-docs>
  115. 28.25 s gammaloop-nextest-docs> failures:
  116. 28.25 s gammaloop-nextest-docs> tests::developer_scope_ranges_ignore_unrelated_edits_and_warn_only_while_watching
  117. 28.25 s gammaloop-nextest-docs>
  118. 28.25 s gammaloop-nextest-docs> test result: FAILED. 0 passed; 1 failed; 0 ignored; 0 measured; 128 filtered out; finished in 0.26s
  119. 28.25 s gammaloop-nextest-docs>
  120. 28.25 s gammaloop-nextest-docs> stderr ---
  121. 28.25 s gammaloop-nextest-docs>
  122. 28.25 s gammaloop-nextest-docs> thread 'tests::developer_scope_ranges_ignore_unrelated_edits_and_warn_only_while_watching' (286) panicked at crates/alphal00p-docs-builder/src/lib.rs:12263:29:
  123. 28.25 s gammaloop-nextest-docs> called `Result::unwrap()` on an `Err` value: developer note nix-crane-cache-reuse verified scope nix/rust-workspace.nix changed (expected 66f700580ce13b9eaee90fe0111639e46968c531, found 0a568cb5712045aee37d96bfb2f91d3d32b7e9b9); owner review or an explicit no-impact attestation is required
  124. 28.25 s gammaloop-nextest-docs>
  125. 28.25 s gammaloop-nextest-docs> Location:
  126. 28.25 s gammaloop-nextest-docs> crates/alphal00p-docs-builder/src/lib.rs:992:29
  127. 28.25 s gammaloop-nextest-docs> stack backtrace:
  128. 28.25 s gammaloop-nextest-docs> 0: __rustc::rust_begin_unwind
  129. 28.25 s gammaloop-nextest-docs> 1: core::panicking::panic_fmt
  130. 28.25 s gammaloop-nextest-docs> 2: core::result::unwrap_failed
  131. 28.25 s gammaloop-nextest-docs> 3: alphal00p_docs_builder::tests::developer_scope_ranges_ignore_unrelated_edits_and_warn_only_while_watching
  132. 28.25 s gammaloop-nextest-docs> 4: <alphal00p_docs_builder::tests::developer_scope_ranges_ignore_unrelated_edits_and_warn_only_while_watching::{closure#0} as core::ops::function::FnOnce<()>>::call_once
  133. 28.25 s gammaloop-nextest-docs> note: Some details are omitted, run with `RUST_BACKTRACE=full` for a verbose backtrace.
  134. 28.25 s gammaloop-nextest-docs>
  135. 28.28 s gammaloop-nextest-docs> FAIL [ 0.288s] ( 79/129) alphal00p-docs-builder tests::every_product_requires_a_task_chooser_and_each_supported_interface
  136. 28.28 s gammaloop-nextest-docs> stdout ---
  137. 28.28 s gammaloop-nextest-docs>
  138. 28.28 s gammaloop-nextest-docs> running 1 test
  139. 28.28 s gammaloop-nextest-docs> test tests::every_product_requires_a_task_chooser_and_each_supported_interface ... FAILED
  140. 28.28 s gammaloop-nextest-docs>
  141. 28.28 s gammaloop-nextest-docs> failures:
  142. 28.28 s gammaloop-nextest-docs>
  143. 28.28 s gammaloop-nextest-docs> failures:
  144. 28.28 s gammaloop-nextest-docs> tests::every_product_requires_a_task_chooser_and_each_supported_interface
  145. 28.28 s gammaloop-nextest-docs>
  146. 28.28 s gammaloop-nextest-docs> test result: FAILED. 0 passed; 1 failed; 0 ignored; 0 measured; 128 filtered out; finished in 0.28s
  147. 28.28 s gammaloop-nextest-docs>
  148. 28.28 s gammaloop-nextest-docs> stderr ---
  149. 28.28 s gammaloop-nextest-docs>
  150. 28.28 s gammaloop-nextest-docs> thread 'tests::every_product_requires_a_task_chooser_and_each_supported_interface' (315) panicked at crates/alphal00p-docs-builder/src/lib.rs:12192:9:
  151. 28.28 s gammaloop-nextest-docs> assertion failed: format!("{error:#}").contains("has no quickstart page")
  152. 28.28 s gammaloop-nextest-docs> stack backtrace:
  153. 28.28 s gammaloop-nextest-docs> 0: __rustc::rust_begin_unwind
  154. 28.28 s gammaloop-nextest-docs> 1: core::panicking::panic_fmt
  155. 28.28 s gammaloop-nextest-docs> 2: core::panicking::panic
  156. 28.28 s gammaloop-nextest-docs> 3: alphal00p_docs_builder::tests::every_product_requires_a_task_chooser_and_each_supported_interface
  157. 28.28 s gammaloop-nextest-docs> 4: <alphal00p_docs_builder::tests::every_product_requires_a_task_chooser_and_each_supported_interface::{closure#0} as core::ops::function::FnOnce<()>>::call_once
  158. 28.28 s gammaloop-nextest-docs> note: Some details are omitted, run with `RUST_BACKTRACE=full` for a verbose backtrace.
  159. 28.28 s gammaloop-nextest-docs>
  160. 28.32 s gammaloop-nextest-docs> FAIL [ 0.271s] ( 95/129) alphal00p-docs-builder tests::pdf_manual_chapter_order_must_match_the_page_registry
  161. 28.32 s gammaloop-nextest-docs> stdout ---
  162. 28.32 s gammaloop-nextest-docs>
  163. 28.32 s gammaloop-nextest-docs> running 1 test
  164. 28.32 s gammaloop-nextest-docs> test tests::pdf_manual_chapter_order_must_match_the_page_registry ... FAILED
  165. 28.32 s gammaloop-nextest-docs>
  166. 28.32 s gammaloop-nextest-docs> failures:
  167. 28.32 s gammaloop-nextest-docs>
  168. 28.32 s gammaloop-nextest-docs> failures:
  169. 28.32 s gammaloop-nextest-docs> tests::pdf_manual_chapter_order_must_match_the_page_registry
  170. 28.32 s gammaloop-nextest-docs>
  171. 28.32 s gammaloop-nextest-docs> test result: FAILED. 0 passed; 1 failed; 0 ignored; 0 measured; 128 filtered out; finished in 0.26s
  172. 28.32 s gammaloop-nextest-docs>
  173. 28.32 s gammaloop-nextest-docs> stderr ---
  174. 28.32 s gammaloop-nextest-docs>
  175. 28.32 s gammaloop-nextest-docs> thread 'tests::pdf_manual_chapter_order_must_match_the_page_registry' (408) panicked at crates/alphal00p-docs-builder/src/lib.rs:12243:9:
  176. 28.32 s gammaloop-nextest-docs> assertion failed: format!("{error:#}").contains("PDF manual chapter order differs")
  177. 28.32 s gammaloop-nextest-docs> stack backtrace:
  178. 28.32 s gammaloop-nextest-docs> 0: __rustc::rust_begin_unwind
  179. 28.32 s gammaloop-nextest-docs> 1: core::panicking::panic_fmt
  180. 28.32 s gammaloop-nextest-docs> 2: core::panicking::panic
  181. 28.32 s gammaloop-nextest-docs> 3: alphal00p_docs_builder::tests::pdf_manual_chapter_order_must_match_the_page_registry
  182. 28.32 s gammaloop-nextest-docs> 4: <alphal00p_docs_builder::tests::pdf_manual_chapter_order_must_match_the_page_registry::{closure#0} as core::ops::function::FnOnce<()>>::call_once
  183. 28.32 s gammaloop-nextest-docs> note: Some details are omitted, run with `RUST_BACKTRACE=full` for a verbose backtrace.
  184. 28.32 s gammaloop-nextest-docs>
  185. 51.97 s gammaloop-nextest-docs> ------------
  186. 51.97 s gammaloop-nextest-docs> Summary [ 24.033s] 129 tests run: 124 passed, 5 failed, 0 skipped
  187. 51.97 s gammaloop-nextest-docs> FAIL [ 0.239s] ( 63/129) alphal00p-docs-builder tests::checked_in_registry_is_valid
  188. 51.97 s gammaloop-nextest-docs> stdout ---
  189. 51.97 s gammaloop-nextest-docs>
  190. 51.97 s gammaloop-nextest-docs> running 1 test
  191. 51.97 s gammaloop-nextest-docs> test tests::checked_in_registry_is_valid ... FAILED
  192. 51.97 s gammaloop-nextest-docs>
  193. 51.97 s gammaloop-nextest-docs> failures:
  194. 51.97 s gammaloop-nextest-docs>
  195. 51.97 s gammaloop-nextest-docs> failures:
  196. 51.97 s gammaloop-nextest-docs> tests::checked_in_registry_is_valid
  197. 51.97 s gammaloop-nextest-docs>
  198. 51.97 s gammaloop-nextest-docs> test result: FAILED. 0 passed; 1 failed; 0 ignored; 0 measured; 128 filtered out; finished in 0.23s
  199. 51.97 s gammaloop-nextest-docs>
  200. 51.97 s gammaloop-nextest-docs> stderr ---
  201. 51.97 s gammaloop-nextest-docs>
  202. 51.97 s gammaloop-nextest-docs> thread 'tests::checked_in_registry_is_valid' (200) panicked at crates/alphal00p-docs-builder/src/lib.rs:12178:50:
  203. 51.97 s gammaloop-nextest-docs> called `Result::unwrap()` on an `Err` value: developer note nix-crane-cache-reuse verified scope nix/rust-workspace.nix changed (expected 66f700580ce13b9eaee90fe0111639e46968c531, found 0a568cb5712045aee37d96bfb2f91d3d32b7e9b9); owner review or an explicit no-impact attestation is required
  204. 51.97 s gammaloop-nextest-docs>
  205. 51.97 s gammaloop-nextest-docs> Location:
  206. 51.97 s gammaloop-nextest-docs> crates/alphal00p-docs-builder/src/lib.rs:992:29
  207. 51.97 s gammaloop-nextest-docs> stack backtrace:
  208. 51.97 s gammaloop-nextest-docs> 0: __rustc::rust_begin_unwind
  209. 51.97 s gammaloop-nextest-docs> 1: core::panicking::panic_fmt
  210. 51.97 s gammaloop-nextest-docs> 2: core::result::unwrap_failed
  211. 51.97 s gammaloop-nextest-docs> 3: alphal00p_docs_builder::tests::checked_in_registry_is_valid
  212. 51.97 s gammaloop-nextest-docs> 4: <alphal00p_docs_builder::tests::checked_in_registry_is_valid::{closure#0} as core::ops::function::FnOnce<()>>::call_once
  213. 51.97 s gammaloop-nextest-docs> note: Some details are omitted, run with `RUST_BACKTRACE=full` for a verbose backtrace.
  214. 51.97 s gammaloop-nextest-docs>
  215. 51.97 s gammaloop-nextest-docs> FAIL [ 0.289s] ( 68/129) alphal00p-docs-builder provenance_tests::each_build_captures_one_revision_before_rendering
  216. 51.97 s gammaloop-nextest-docs> stdout ---
  217. 51.97 s gammaloop-nextest-docs>
  218. 51.97 s gammaloop-nextest-docs> running 1 test
  219. 51.97 s gammaloop-nextest-docs>
  220. 51.97 s gammaloop-nextest-docs> running 1 test
  221. 51.97 s gammaloop-nextest-docs> test provenance_tests::each_build_captures_one_revision_before_rendering ... FAILED
  222. 51.97 s gammaloop-nextest-docs>
  223. 51.97 s gammaloop-nextest-docs> failures:
  224. 51.97 s gammaloop-nextest-docs>
  225. 51.97 s gammaloop-nextest-docs> failures:
  226. 51.97 s gammaloop-nextest-docs> provenance_tests::each_build_captures_one_revision_before_rendering
  227. 51.98 s gammaloop-nextest-docs>
  228. 51.98 s gammaloop-nextest-docs> test result: FAILED. 0 passed; 1 failed; 0 ignored; 0 measured; 128 filtered out; finished in 0.27s
  229. 51.98 s gammaloop-nextest-docs>
  230. 51.98 s gammaloop-nextest-docs> test provenance_tests::each_build_captures_one_revision_before_rendering ... FAILED
  231. 51.98 s gammaloop-nextest-docs>
  232. 51.98 s gammaloop-nextest-docs> failures:
  233. 51.98 s gammaloop-nextest-docs>
  234. 51.98 s gammaloop-nextest-docs> failures:
  235. 51.98 s gammaloop-nextest-docs> provenance_tests::each_build_captures_one_revision_before_rendering
  236. 51.98 s gammaloop-nextest-docs>
  237. 51.98 s gammaloop-nextest-docs> test result: FAILED. 0 passed; 1 failed; 0 ignored; 0 measured; 128 filtered out; finished in 0.28s
  238. 51.98 s gammaloop-nextest-docs>
  239. 51.98 s gammaloop-nextest-docs> stderr ---
  240. 51.98 s gammaloop-nextest-docs>
  241. 51.98 s gammaloop-nextest-docs> thread 'provenance_tests::each_build_captures_one_revision_before_rendering' (209) panicked at crates/alphal00p-docs-builder/src/provenance_tests.rs:297:14:
  242. 51.98 s gammaloop-nextest-docs> called `Result::unwrap()` on an `Err` value: developer note nix-crane-cache-reuse verified scope nix/rust-workspace.nix changed (expected 66f700580ce13b9eaee90fe0111639e46968c531, found 0a568cb5712045aee37d96bfb2f91d3d32b7e9b9); owner review or an explicit no-impact attestation is required
  243. 51.98 s gammaloop-nextest-docs>
  244. 51.98 s gammaloop-nextest-docs> Location:
  245. 51.98 s gammaloop-nextest-docs> crates/alphal00p-docs-builder/src/lib.rs:992:29
  246. 51.98 s gammaloop-nextest-docs> stack backtrace:
  247. 51.98 s gammaloop-nextest-docs> 0: __rustc::rust_begin_unwind
  248. 51.98 s gammaloop-nextest-docs> 1: core::panicking::panic_fmt
  249. 51.98 s gammaloop-nextest-docs> 2: core::result::unwrap_failed
  250. 51.98 s gammaloop-nextest-docs> 3: alphal00p_docs_builder::provenance_tests::each_build_captures_one_revision_before_rendering
  251. 51.98 s gammaloop-nextest-docs> 4: <alphal00p_docs_builder::provenance_tests::each_build_captures_one_revision_before_rendering::{closure#0} as core::ops::function::FnOnce<()>>::call_once
  252. 51.98 s gammaloop-nextest-docs> note: Some details are omitted, run with `RUST_BACKTRACE=full` for a verbose backtrace.
  253. 51.98 s gammaloop-nextest-docs>
  254. 51.98 s gammaloop-nextest-docs> thread 'provenance_tests::each_build_captures_one_revision_before_rendering' (163) panicked at crates/alphal00p-docs-builder/src/provenance_tests.rs:274:9:
  255. 51.98 s gammaloop-nextest-docs> assertion failed: command.status().unwrap().success()
  256. 51.98 s gammaloop-nextest-docs> stack backtrace:
  257. 51.98 s gammaloop-nextest-docs> 0: __rustc::rust_begin_unwind
  258. 51.98 s gammaloop-nextest-docs> 1: core::panicking::panic_fmt
  259. 51.98 s gammaloop-nextest-docs> 2: core::panicking::panic
  260. 51.98 s gammaloop-nextest-docs> 3: alphal00p_docs_builder::provenance_tests::each_build_captures_one_revision_before_rendering
  261. 51.98 s gammaloop-nextest-docs> 4: <alphal00p_docs_builder::provenance_tests::each_build_captures_one_revision_before_rendering::{closure#0} as core::ops::function::FnOnce<()>>::call_once
  262. 51.98 s gammaloop-nextest-docs> note: Some details are omitted, run with `RUST_BACKTRACE=full` for a verbose backtrace.
  263. 51.98 s gammaloop-nextest-docs>
  264. 51.98 s gammaloop-nextest-docs> FAIL [ 0.271s] ( 71/129) alphal00p-docs-builder tests::developer_scope_ranges_ignore_unrelated_edits_and_warn_only_while_watching
  265. 51.98 s gammaloop-nextest-docs> stdout ---
  266. 51.98 s gammaloop-nextest-docs>
  267. 51.98 s gammaloop-nextest-docs> running 1 test
  268. 51.98 s gammaloop-nextest-docs> test tests::developer_scope_ranges_ignore_unrelated_edits_and_warn_only_while_watching ... FAILED
  269. 51.98 s gammaloop-nextest-docs>
  270. 51.98 s gammaloop-nextest-docs> failures:
  271. 51.98 s gammaloop-nextest-docs>
  272. 51.98 s gammaloop-nextest-docs> failures:
  273. 51.98 s gammaloop-nextest-docs> tests::developer_scope_ranges_ignore_unrelated_edits_and_warn_only_while_watching
  274. 51.98 s gammaloop-nextest-docs>
  275. 51.98 s gammaloop-nextest-docs> test result: FAILED. 0 passed; 1 failed; 0 ignored; 0 measured; 128 filtered out; finished in 0.26s
  276. 51.98 s gammaloop-nextest-docs>
  277. 51.98 s gammaloop-nextest-docs> stderr ---
  278. 51.98 s gammaloop-nextest-docs>
  279. 51.98 s gammaloop-nextest-docs> thread 'tests::developer_scope_ranges_ignore_unrelated_edits_and_warn_only_while_watching' (286) panicked at crates/alphal00p-docs-builder/src/lib.rs:12263:29:
  280. 51.98 s gammaloop-nextest-docs> called `Result::unwrap()` on an `Err` value: developer note nix-crane-cache-reuse verified scope nix/rust-workspace.nix changed (expected 66f700580ce13b9eaee90fe0111639e46968c531, found 0a568cb5712045aee37d96bfb2f91d3d32b7e9b9); owner review or an explicit no-impact attestation is required
  281. 51.98 s gammaloop-nextest-docs>
  282. 51.98 s gammaloop-nextest-docs> Location:
  283. 51.98 s gammaloop-nextest-docs> crates/alphal00p-docs-builder/src/lib.rs:992:29
  284. 51.98 s gammaloop-nextest-docs> stack backtrace:
  285. 51.98 s gammaloop-nextest-docs> 0: __rustc::rust_begin_unwind
  286. 51.98 s gammaloop-nextest-docs> 1: core::panicking::panic_fmt
  287. 51.98 s gammaloop-nextest-docs> 2: core::result::unwrap_failed
  288. 51.98 s gammaloop-nextest-docs> 3: alphal00p_docs_builder::tests::developer_scope_ranges_ignore_unrelated_edits_and_warn_only_while_watching
  289. 51.98 s gammaloop-nextest-docs> 4: <alphal00p_docs_builder::tests::developer_scope_ranges_ignore_unrelated_edits_and_warn_only_while_watching::{closure#0} as core::ops::function::FnOnce<()>>::call_once
  290. 51.98 s gammaloop-nextest-docs> note: Some details are omitted, run with `RUST_BACKTRACE=full` for a verbose backtrace.
  291. 51.98 s gammaloop-nextest-docs>
  292. 51.98 s gammaloop-nextest-docs> FAIL [ 0.288s] ( 79/129) alphal00p-docs-builder tests::every_product_requires_a_task_chooser_and_each_supported_interface
  293. 51.98 s gammaloop-nextest-docs> stdout ---
  294. 51.98 s gammaloop-nextest-docs>
  295. 51.98 s gammaloop-nextest-docs> running 1 test
  296. 51.98 s gammaloop-nextest-docs> test tests::every_product_requires_a_task_chooser_and_each_supported_interface ... FAILED
  297. 51.98 s gammaloop-nextest-docs>
  298. 51.98 s gammaloop-nextest-docs> failures:
  299. 51.98 s gammaloop-nextest-docs>
  300. 51.98 s gammaloop-nextest-docs> failures:
  301. 51.98 s gammaloop-nextest-docs> tests::every_product_requires_a_task_chooser_and_each_supported_interface
  302. 51.98 s gammaloop-nextest-docs>
  303. 51.98 s gammaloop-nextest-docs> test result: FAILED. 0 passed; 1 failed; 0 ignored; 0 measured; 128 filtered out; finished in 0.28s
  304. 51.98 s gammaloop-nextest-docs>
  305. 51.98 s gammaloop-nextest-docs> stderr ---
  306. 51.98 s gammaloop-nextest-docs>
  307. 51.98 s gammaloop-nextest-docs> thread 'tests::every_product_requires_a_task_chooser_and_each_supported_interface' (315) panicked at crates/alphal00p-docs-builder/src/lib.rs:12192:9:
  308. 51.98 s gammaloop-nextest-docs> assertion failed: format!("{error:#}").contains("has no quickstart page")
  309. 51.98 s gammaloop-nextest-docs> stack backtrace:
  310. 51.98 s gammaloop-nextest-docs> 0: __rustc::rust_begin_unwind
  311. 51.98 s gammaloop-nextest-docs> 1: core::panicking::panic_fmt
  312. 51.98 s gammaloop-nextest-docs> 2: core::panicking::panic
  313. 51.98 s gammaloop-nextest-docs> 3: alphal00p_docs_builder::tests::every_product_requires_a_task_chooser_and_each_supported_interface
  314. 51.98 s gammaloop-nextest-docs> 4: <alphal00p_docs_builder::tests::every_product_requires_a_task_chooser_and_each_supported_interface::{closure#0} as core::ops::function::FnOnce<()>>::call_once
  315. 51.98 s gammaloop-nextest-docs> note: Some details are omitted, run with `RUST_BACKTRACE=full` for a verbose backtrace.
  316. 51.98 s gammaloop-nextest-docs>
  317. 51.98 s gammaloop-nextest-docs> FAIL [ 0.271s] ( 95/129) alphal00p-docs-builder tests::pdf_manual_chapter_order_must_match_the_page_registry
  318. 51.98 s gammaloop-nextest-docs> stdout ---
  319. 51.98 s gammaloop-nextest-docs>
  320. 51.98 s gammaloop-nextest-docs> running 1 test
  321. 51.98 s gammaloop-nextest-docs> test tests::pdf_manual_chapter_order_must_match_the_page_registry ... FAILED
  322. 51.98 s gammaloop-nextest-docs>
  323. 51.98 s gammaloop-nextest-docs> failures:
  324. 51.98 s gammaloop-nextest-docs>
  325. 51.98 s gammaloop-nextest-docs> failures:
  326. 51.98 s gammaloop-nextest-docs> tests::pdf_manual_chapter_order_must_match_the_page_registry
  327. 51.98 s gammaloop-nextest-docs>
  328. 51.98 s gammaloop-nextest-docs> test result: FAILED. 0 passed; 1 failed; 0 ignored; 0 measured; 128 filtered out; finished in 0.26s
  329. 51.98 s gammaloop-nextest-docs>
  330. 51.98 s gammaloop-nextest-docs> stderr ---
  331. 51.98 s gammaloop-nextest-docs>
  332. 51.98 s gammaloop-nextest-docs> thread 'tests::pdf_manual_chapter_order_must_match_the_page_registry' (408) panicked at crates/alphal00p-docs-builder/src/lib.rs:12243:9:
  333. 51.98 s gammaloop-nextest-docs> assertion failed: format!("{error:#}").contains("PDF manual chapter order differs")
  334. 51.98 s gammaloop-nextest-docs> stack backtrace:
  335. 51.98 s gammaloop-nextest-docs> 0: __rustc::rust_begin_unwind
  336. 51.98 s gammaloop-nextest-docs> 1: core::panicking::panic_fmt
  337. 51.98 s gammaloop-nextest-docs> 2: core::panicking::panic
  338. 51.98 s gammaloop-nextest-docs> 3: alphal00p_docs_builder::tests::pdf_manual_chapter_order_must_match_the_page_registry
  339. 51.98 s gammaloop-nextest-docs> 4: <alphal00p_docs_builder::tests::pdf_manual_chapter_order_must_match_the_page_registry::{closure#0} as core::ops::function::FnOnce<()>>::call_once
  340. 51.98 s gammaloop-nextest-docs> note: Some details are omitted, run with `RUST_BACKTRACE=full` for a verbose backtrace.
  341. 51.98 s gammaloop-nextest-docs>
  342. 51.98 s gammaloop-nextest-docs> error: test run failed
  343. 52.02 s gammaloop-nextest-docs>
  344. 52.02 s gammaloop-nextest-docs> ========== nextest test summary ==========
  345. 52.02 s gammaloop-nextest-docs> report: target/nextest/ci_gammaloop/junit.xml
  346. 52.02 s gammaloop-nextest-docs> tests: 129, failures: 5, errors: 0
  347. 52.02 s gammaloop-nextest-docs>
  348. 52.02 s gammaloop-nextest-docs> 1. alphal00p-docs-builder::tests::checked_in_registry_is_valid
  349. 52.02 s gammaloop-nextest-docs> failure: test failure with exit code 101
  350. 52.02 s gammaloop-nextest-docs> thread 'tests::checked_in_registry_is_valid' (200) panicked at crates/alphal00p-docs-builder/src/lib.rs:12178:50:
  351. 52.02 s gammaloop-nextest-docs> called `Result::unwrap()` on an `Err` value: developer note nix-crane-cache-reuse verified scope nix/rust-workspace.nix changed (expected 66f700580ce13b9eaee90fe0111639e46968c531, found 0a568cb5712045aee37d96bfb2f91d3d32b7e9b9); owner review or an explicit no-impact attestation is required
  352. 52.02 s gammaloop-nextest-docs>
  353. 52.02 s gammaloop-nextest-docs> Location:
  354. 52.02 s gammaloop-nextest-docs> crates/alphal00p-docs-builder/src/lib.rs:992:29
  355. 52.02 s gammaloop-nextest-docs> stack backtrace:
  356. 52.02 s gammaloop-nextest-docs> 0: __rustc::rust_begin_unwind
  357. 52.02 s gammaloop-nextest-docs> 1: core::panicking::panic_fmt
  358. 52.02 s gammaloop-nextest-docs> 2: core::result::unwrap_failed
  359. 52.02 s gammaloop-nextest-docs> 3: alphal00p_docs_builder::tests::checked_in_registry_is_valid
  360. 52.02 s gammaloop-nextest-docs> 4: <alphal00p_docs_builder::tests::checked_in_registry_is_valid::{closure#0} as core::ops::function::FnOnce<()>>::call_once
  361. 52.02 s gammaloop-nextest-docs> note: Some details are omitted, run with `RUST_BACKTRACE=full` for a verbose backtrace.
  362. 52.02 s gammaloop-nextest-docs> system-out
  363. 52.02 s gammaloop-nextest-docs> running 1 test
  364. 52.02 s gammaloop-nextest-docs> test tests::checked_in_registry_is_valid ... FAILED
  365. 52.02 s gammaloop-nextest-docs>
  366. 52.02 s gammaloop-nextest-docs> failures:
  367. 52.02 s gammaloop-nextest-docs>
  368. 52.02 s gammaloop-nextest-docs> failures:
  369. 52.02 s gammaloop-nextest-docs> tests::checked_in_registry_is_valid
  370. 52.02 s gammaloop-nextest-docs>
  371. 52.02 s gammaloop-nextest-docs> test result: FAILED. 0 passed; 1 failed; 0 ignored; 0 measured; 128 filtered out; finished in 0.23s
  372. 52.02 s gammaloop-nextest-docs> system-err
  373. 52.02 s gammaloop-nextest-docs> thread 'tests::checked_in_registry_is_valid' (200) panicked at crates/alphal00p-docs-builder/src/lib.rs:12178:50:
  374. 52.02 s gammaloop-nextest-docs> called `Result::unwrap()` on an `Err` value: developer note nix-crane-cache-reuse verified scope nix/rust-workspace.nix changed (expected 66f700580ce13b9eaee90fe0111639e46968c531, found 0a568cb5712045aee37d96bfb2f91d3d32b7e9b9); owner review or an explicit no-impact attestation is required
  375. 52.02 s gammaloop-nextest-docs>
  376. 52.02 s gammaloop-nextest-docs> Location:
  377. 52.02 s gammaloop-nextest-docs> crates/alphal00p-docs-builder/src/lib.rs:992:29
  378. 52.02 s gammaloop-nextest-docs> stack backtrace:
  379. 52.02 s gammaloop-nextest-docs> 0: __rustc::rust_begin_unwind
  380. 52.02 s gammaloop-nextest-docs> 1: core::panicking::panic_fmt
  381. 52.02 s gammaloop-nextest-docs> 2: core::result::unwrap_failed
  382. 52.02 s gammaloop-nextest-docs> 3: alphal00p_docs_builder::tests::checked_in_registry_is_valid
  383. 52.02 s gammaloop-nextest-docs> 4: <alphal00p_docs_builder::tests::checked_in_registry_is_valid::{closure#0} as core::ops::function::FnOnce<()>>::call_once
  384. 52.02 s gammaloop-nextest-docs> note: Some details are omitted, run with `RUST_BACKTRACE=full` for a verbose backtrace.
  385. 52.02 s gammaloop-nextest-docs>
  386. 52.02 s gammaloop-nextest-docs> 2. alphal00p-docs-builder::provenance_tests::each_build_captures_one_revision_before_rendering
  387. 52.02 s gammaloop-nextest-docs> failure: test failure with exit code 101
  388. 52.02 s gammaloop-nextest-docs> thread 'provenance_tests::each_build_captures_one_revision_before_rendering' (163) panicked at crates/alphal00p-docs-builder/src/provenance_tests.rs:274:9:
  389. 52.02 s gammaloop-nextest-docs> assertion failed: command.status().unwrap().success()
  390. 52.02 s gammaloop-nextest-docs> stack backtrace:
  391. 52.02 s gammaloop-nextest-docs> 0: __rustc::rust_begin_unwind
  392. 52.02 s gammaloop-nextest-docs> 1: core::panicking::panic_fmt
  393. 52.02 s gammaloop-nextest-docs> 2: core::panicking::panic
  394. 52.02 s gammaloop-nextest-docs> 3: alphal00p_docs_builder::provenance_tests::each_build_captures_one_revision_before_rendering
  395. 52.03 s gammaloop-nextest-docs> 4: <alphal00p_docs_builder::provenance_tests::each_build_captures_one_revision_before_rendering::{closure#0} as core::ops::function::FnOnce<()>>::call_once
  396. 52.03 s gammaloop-nextest-docs> note: Some details are omitted, run with `RUST_BACKTRACE=full` for a verbose backtrace.
  397. 52.03 s gammaloop-nextest-docs> system-out
  398. 52.03 s gammaloop-nextest-docs> running 1 test
  399. 52.03 s gammaloop-nextest-docs>
  400. 52.03 s gammaloop-nextest-docs> running 1 test
  401. 52.03 s gammaloop-nextest-docs> test provenance_tests::each_build_captures_one_revision_before_rendering ... FAILED
  402. 52.03 s gammaloop-nextest-docs>
  403. 52.03 s gammaloop-nextest-docs> failures:
  404. 52.03 s gammaloop-nextest-docs>
  405. 52.03 s gammaloop-nextest-docs> failures:
  406. 52.03 s gammaloop-nextest-docs> provenance_tests::each_build_captures_one_revision_before_rendering
  407. 52.03 s gammaloop-nextest-docs>
  408. 52.03 s gammaloop-nextest-docs> test result: FAILED. 0 passed; 1 failed; 0 ignored; 0 measured; 128 filtered out; finished in 0.27s
  409. 52.03 s gammaloop-nextest-docs>
  410. 52.03 s gammaloop-nextest-docs> test provenance_tests::each_build_captures_one_revision_before_rendering ... FAILED
  411. 52.03 s gammaloop-nextest-docs>
  412. 52.03 s gammaloop-nextest-docs> failures:
  413. 52.03 s gammaloop-nextest-docs>
  414. 52.03 s gammaloop-nextest-docs> failures:
  415. 52.03 s gammaloop-nextest-docs> provenance_tests::each_build_captures_one_revision_before_rendering
  416. 52.03 s gammaloop-nextest-docs>
  417. 52.03 s gammaloop-nextest-docs> test result: FAILED. 0 passed; 1 failed; 0 ignored; 0 measured; 128 filtered out; finished in 0.28s
  418. 52.03 s gammaloop-nextest-docs> system-err
  419. 52.03 s gammaloop-nextest-docs> thread 'provenance_tests::each_build_captures_one_revision_before_rendering' (209) panicked at crates/alphal00p-docs-builder/src/provenance_tests.rs:297:14:
  420. 52.03 s gammaloop-nextest-docs> called `Result::unwrap()` on an `Err` value: developer note nix-crane-cache-reuse verified scope nix/rust-workspace.nix changed (expected 66f700580ce13b9eaee90fe0111639e46968c531, found 0a568cb5712045aee37d96bfb2f91d3d32b7e9b9); owner review or an explicit no-impact attestation is required
  421. 52.03 s gammaloop-nextest-docs>
  422. 52.03 s gammaloop-nextest-docs> Location:
  423. 52.03 s gammaloop-nextest-docs> crates/alphal00p-docs-builder/src/lib.rs:992:29
  424. 52.03 s gammaloop-nextest-docs> stack backtrace:
  425. 52.03 s gammaloop-nextest-docs> 0: __rustc::rust_begin_unwind
  426. 52.03 s gammaloop-nextest-docs> 1: core::panicking::panic_fmt
  427. 52.03 s gammaloop-nextest-docs> 2: core::result::unwrap_failed
  428. 52.03 s gammaloop-nextest-docs> 3: alphal00p_docs_builder::provenance_tests::each_build_captures_one_revision_before_rendering
  429. 52.03 s gammaloop-nextest-docs> 4: <alphal00p_docs_builder::provenance_tests::each_build_captures_one_revision_before_rendering::{closure#0} as core::ops::function::FnOnce<()>>::call_once
  430. 52.03 s gammaloop-nextest-docs> note: Some details are omitted, run with `RUST_BACKTRACE=full` for a verbose backtrace.
  431. 52.03 s gammaloop-nextest-docs>
  432. 52.03 s gammaloop-nextest-docs> thread 'provenance_tests::each_build_captures_one_revision_before_rendering' (163) panicked at crates/alphal00p-docs-builder/src/provenance_tests.rs:274:9:
  433. 52.03 s gammaloop-nextest-docs> assertion failed: command.status().unwrap().success()
  434. 52.03 s gammaloop-nextest-docs> stack backtrace:
  435. 52.03 s gammaloop-nextest-docs> 0: __rustc::rust_begin_unwind
  436. 52.03 s gammaloop-nextest-docs> 1: core::panicking::panic_fmt
  437. 52.03 s gammaloop-nextest-docs> 2: core::panicking::panic
  438. 52.03 s gammaloop-nextest-docs> 3: alphal00p_docs_builder::provenance_tests::each_build_captures_one_revision_before_rendering
  439. 52.03 s gammaloop-nextest-docs> 4: <alphal00p_docs_builder::provenance_tests::each_build_captures_one_revision_before_rendering::{closure#0} as core::ops::function::FnOnce<()>>::call_once
  440. 52.03 s gammaloop-nextest-docs> note: Some details are omitted, run with `RUST_BACKTRACE=full` for a verbose backtrace.
  441. 52.03 s gammaloop-nextest-docs>
  442. 52.03 s gammaloop-nextest-docs> 3. alphal00p-docs-builder::tests::developer_scope_ranges_ignore_unrelated_edits_and_warn_only_while_watching
  443. 52.03 s gammaloop-nextest-docs> failure: test failure with exit code 101
  444. 52.03 s gammaloop-nextest-docs> thread 'tests::developer_scope_ranges_ignore_unrelated_edits_and_warn_only_while_watching' (286) panicked at crates/alphal00p-docs-builder/src/lib.rs:12263:29:
  445. 52.03 s gammaloop-nextest-docs> called `Result::unwrap()` on an `Err` value: developer note nix-crane-cache-reuse verified scope nix/rust-workspace.nix changed (expected 66f700580ce13b9eaee90fe0111639e46968c531, found 0a568cb5712045aee37d96bfb2f91d3d32b7e9b9); owner review or an explicit no-impact attestation is required
  446. 52.03 s gammaloop-nextest-docs>
  447. 52.03 s gammaloop-nextest-docs> Location:
  448. 52.03 s gammaloop-nextest-docs> crates/alphal00p-docs-builder/src/lib.rs:992:29
  449. 52.03 s gammaloop-nextest-docs> stack backtrace:
  450. 52.03 s gammaloop-nextest-docs> 0: __rustc::rust_begin_unwind
  451. 52.03 s gammaloop-nextest-docs> 1: core::panicking::panic_fmt
  452. 52.03 s gammaloop-nextest-docs> 2: core::result::unwrap_failed
  453. 52.03 s gammaloop-nextest-docs> 3: alphal00p_docs_builder::tests::developer_scope_ranges_ignore_unrelated_edits_and_warn_only_while_watching
  454. 52.03 s gammaloop-nextest-docs> 4: <alphal00p_docs_builder::tests::developer_scope_ranges_ignore_unrelated_edits_and_warn_only_while_watching::{closure#0} as core::ops::function::FnOnce<()>>::call_once
  455. 52.03 s gammaloop-nextest-docs> note: Some details are omitted, run with `RUST_BACKTRACE=full` for a verbose backtrace.
  456. 52.03 s gammaloop-nextest-docs> system-out
  457. 52.03 s gammaloop-nextest-docs> running 1 test
  458. 52.03 s gammaloop-nextest-docs> test tests::developer_scope_ranges_ignore_unrelated_edits_and_warn_only_while_watching ... FAILED
  459. 52.03 s gammaloop-nextest-docs>
  460. 52.03 s gammaloop-nextest-docs> failures:
  461. 52.03 s gammaloop-nextest-docs>
  462. 52.03 s gammaloop-nextest-docs> failures:
  463. 52.03 s gammaloop-nextest-docs> tests::developer_scope_ranges_ignore_unrelated_edits_and_warn_only_while_watching
  464. 52.03 s gammaloop-nextest-docs>
  465. 52.03 s gammaloop-nextest-docs> test result: FAILED. 0 passed; 1 failed; 0 ignored; 0 measured; 128 filtered out; finished in 0.26s
  466. 52.03 s gammaloop-nextest-docs> system-err
  467. 52.03 s gammaloop-nextest-docs> thread 'tests::developer_scope_ranges_ignore_unrelated_edits_and_warn_only_while_watching' (286) panicked at crates/alphal00p-docs-builder/src/lib.rs:12263:29:
  468. 52.03 s gammaloop-nextest-docs> called `Result::unwrap()` on an `Err` value: developer note nix-crane-cache-reuse verified scope nix/rust-workspace.nix changed (expected 66f700580ce13b9eaee90fe0111639e46968c531, found 0a568cb5712045aee37d96bfb2f91d3d32b7e9b9); owner review or an explicit no-impact attestation is required
  469. 52.03 s gammaloop-nextest-docs>
  470. 52.03 s gammaloop-nextest-docs> Location:
  471. 52.03 s gammaloop-nextest-docs> crates/alphal00p-docs-builder/src/lib.rs:992:29
  472. 52.03 s gammaloop-nextest-docs> stack backtrace:
  473. 52.03 s gammaloop-nextest-docs> 0: __rustc::rust_begin_unwind
  474. 52.03 s gammaloop-nextest-docs> 1: core::panicking::panic_fmt
  475. 52.03 s gammaloop-nextest-docs> 2: core::result::unwrap_failed
  476. 52.03 s gammaloop-nextest-docs> 3: alphal00p_docs_builder::tests::developer_scope_ranges_ignore_unrelated_edits_and_warn_only_while_watching
  477. 52.03 s gammaloop-nextest-docs> 4: <alphal00p_docs_builder::tests::developer_scope_ranges_ignore_unrelated_edits_and_warn_only_while_watching::{closure#0} as core::ops::function::FnOnce<()>>::call_once
  478. 52.03 s gammaloop-nextest-docs> note: Some details are omitted, run with `RUST_BACKTRACE=full` for a verbose backtrace.
  479. 52.03 s gammaloop-nextest-docs>
  480. 52.03 s gammaloop-nextest-docs> 4. alphal00p-docs-builder::tests::every_product_requires_a_task_chooser_and_each_supported_interface
  481. 52.03 s gammaloop-nextest-docs> failure: test failure with exit code 101
  482. 52.03 s gammaloop-nextest-docs> thread 'tests::every_product_requires_a_task_chooser_and_each_supported_interface' (315) panicked at crates/alphal00p-docs-builder/src/lib.rs:12192:9:
  483. 52.03 s gammaloop-nextest-docs> assertion failed: format!("{error:#}").contains("has no quickstart page")
  484. 52.03 s gammaloop-nextest-docs> stack backtrace:
  485. 52.03 s gammaloop-nextest-docs> 0: __rustc::rust_begin_unwind
  486. 52.03 s gammaloop-nextest-docs> 1: core::panicking::panic_fmt
  487. 52.03 s gammaloop-nextest-docs> 2: core::panicking::panic
  488. 52.03 s gammaloop-nextest-docs> 3: alphal00p_docs_builder::tests::every_product_requires_a_task_chooser_and_each_supported_interface
  489. 52.03 s gammaloop-nextest-docs> 4: <alphal00p_docs_builder::tests::every_product_requires_a_task_chooser_and_each_supported_interface::{closure#0} as core::ops::function::FnOnce<()>>::call_once
  490. 52.03 s gammaloop-nextest-docs> note: Some details are omitted, run with `RUST_BACKTRACE=full` for a verbose backtrace.
  491. 52.03 s gammaloop-nextest-docs> system-out
  492. 52.03 s gammaloop-nextest-docs> running 1 test
  493. 52.03 s gammaloop-nextest-docs> test tests::every_product_requires_a_task_chooser_and_each_supported_interface ... FAILED
  494. 52.03 s gammaloop-nextest-docs>
  495. 52.03 s gammaloop-nextest-docs> failures:
  496. 52.03 s gammaloop-nextest-docs>
  497. 52.03 s gammaloop-nextest-docs> failures:
  498. 52.03 s gammaloop-nextest-docs> tests::every_product_requires_a_task_chooser_and_each_supported_interface
  499. 52.03 s gammaloop-nextest-docs>
  500. 52.03 s gammaloop-nextest-docs> test result: FAILED. 0 passed; 1 failed; 0 ignored; 0 measured; 128 filtered out; finished in 0.28s
  501. 52.03 s gammaloop-nextest-docs> system-err
  502. 52.03 s gammaloop-nextest-docs> thread 'tests::every_product_requires_a_task_chooser_and_each_supported_interface' (315) panicked at crates/alphal00p-docs-builder/src/lib.rs:12192:9:
  503. 52.03 s gammaloop-nextest-docs> assertion failed: format!("{error:#}").contains("has no quickstart page")
  504. 52.03 s gammaloop-nextest-docs> stack backtrace:
  505. 52.03 s gammaloop-nextest-docs> 0: __rustc::rust_begin_unwind
  506. 52.03 s gammaloop-nextest-docs> 1: core::panicking::panic_fmt
  507. 52.03 s gammaloop-nextest-docs> 2: core::panicking::panic
  508. 52.03 s gammaloop-nextest-docs> 3: alphal00p_docs_builder::tests::every_product_requires_a_task_chooser_and_each_supported_interface
  509. 52.03 s gammaloop-nextest-docs> 4: <alphal00p_docs_builder::tests::every_product_requires_a_task_chooser_and_each_supported_interface::{closure#0} as core::ops::function::FnOnce<()>>::call_once
  510. 52.03 s gammaloop-nextest-docs> note: Some details are omitted, run with `RUST_BACKTRACE=full` for a verbose backtrace.
  511. 52.03 s gammaloop-nextest-docs>
  512. 52.03 s gammaloop-nextest-docs> 5. alphal00p-docs-builder::tests::pdf_manual_chapter_order_must_match_the_page_registry
  513. 52.03 s gammaloop-nextest-docs> failure: test failure with exit code 101
  514. 52.03 s gammaloop-nextest-docs> thread 'tests::pdf_manual_chapter_order_must_match_the_page_registry' (408) panicked at crates/alphal00p-docs-builder/src/lib.rs:12243:9:
  515. 52.03 s gammaloop-nextest-docs> assertion failed: format!("{error:#}").contains("PDF manual chapter order differs")
  516. 52.03 s gammaloop-nextest-docs> stack backtrace:
  517. 52.03 s gammaloop-nextest-docs> 0: __rustc::rust_begin_unwind
  518. 52.03 s gammaloop-nextest-docs> 1: core::panicking::panic_fmt
  519. 52.03 s gammaloop-nextest-docs> 2: core::panicking::panic
  520. 52.03 s gammaloop-nextest-docs> 3: alphal00p_docs_builder::tests::pdf_manual_chapter_order_must_match_the_page_registry
  521. 52.03 s gammaloop-nextest-docs> 4: <alphal00p_docs_builder::tests::pdf_manual_chapter_order_must_match_the_page_registry::{closure#0} as core::ops::function::FnOnce<()>>::call_once
  522. 52.03 s gammaloop-nextest-docs> note: Some details are omitted, run with `RUST_BACKTRACE=full` for a verbose backtrace.
  523. 52.03 s gammaloop-nextest-docs> system-out
  524. 52.03 s gammaloop-nextest-docs> running 1 test
  525. 52.03 s gammaloop-nextest-docs> test tests::pdf_manual_chapter_order_must_match_the_page_registry ... FAILED
  526. 52.03 s gammaloop-nextest-docs>
  527. 52.03 s gammaloop-nextest-docs> failures:
  528. 52.03 s gammaloop-nextest-docs>
  529. 52.03 s gammaloop-nextest-docs> failures:
  530. 52.03 s gammaloop-nextest-docs> tests::pdf_manual_chapter_order_must_match_the_page_registry
  531. 52.03 s gammaloop-nextest-docs>
  532. 52.03 s gammaloop-nextest-docs> test result: FAILED. 0 passed; 1 failed; 0 ignored; 0 measured; 128 filtered out; finished in 0.26s
  533. 52.03 s gammaloop-nextest-docs> system-err
  534. 52.03 s gammaloop-nextest-docs> thread 'tests::pdf_manual_chapter_order_must_match_the_page_registry' (408) panicked at crates/alphal00p-docs-builder/src/lib.rs:12243:9:
  535. 52.03 s gammaloop-nextest-docs> assertion failed: format!("{error:#}").contains("PDF manual chapter order differs")
  536. 52.03 s gammaloop-nextest-docs> stack backtrace:
  537. 52.03 s gammaloop-nextest-docs> 0: __rustc::rust_begin_unwind
  538. 52.03 s gammaloop-nextest-docs> 1: core::panicking::panic_fmt
  539. 52.03 s gammaloop-nextest-docs> 2: core::panicking::panic
  540. 52.03 s gammaloop-nextest-docs> 3: alphal00p_docs_builder::tests::pdf_manual_chapter_order_must_match_the_page_registry
  541. 52.03 s gammaloop-nextest-docs> 4: <alphal00p_docs_builder::tests::pdf_manual_chapter_order_must_match_the_page_registry::{closure#0} as core::ops::function::FnOnce<()>>::call_once
  542. 52.03 s gammaloop-nextest-docs> note: Some details are omitted, run with `RUST_BACKTRACE=full` for a verbose backtrace.
  543. 52.03 s gammaloop-nextest-docs> =========================================
  544. 52.05 s gammaloop-nextest-docs> Extracting 2 binaries to /build/source
  545. 52.10 s gammaloop-nextest-docs> Extracted 5 files to /build/source in 0.05s
  546. 52.11 s gammaloop-nextest-docs> ------------
  547. 52.11 s gammaloop-nextest-docs> Nextest run ID 42c79af4-4823-488a-b614-fc71eda6536d with nextest profile: ci_gammaloop
  548. 52.11 s gammaloop-nextest-docs> Starting 22 tests across 2 binaries
  549. 52.14 s gammaloop-nextest-docs> ------------
  550. 52.14 s gammaloop-nextest-docs> Summary [ 0.030s] 22 tests run: 22 passed, 0 skipped
  551. 52.18 s gammaloop-nextest-docs>
  552. 52.18 s gammaloop-nextest-docs> ========== nextest test summary ==========
  553. 52.18 s gammaloop-nextest-docs> report: target/nextest/ci_gammaloop/junit.xml
  554. 52.18 s gammaloop-nextest-docs> tests: 22, failures: 0, errors: 0
  555. 52.18 s gammaloop-nextest-docs> No failing testcases found.
  556. 52.18 s gammaloop-nextest-docs> =========================================
  557. 52.20 s gammaloop-nextest-docs> Extracting 3 binaries (including 2 non-test binaries), 1 build script output directory, and 2 linked paths to /build/source
  558. 52.56 s gammaloop-nextest-docs> Extracted 22 files to /build/source in 0.36s
  559. 52.57 s gammaloop-nextest-docs> ------------
  560. 52.57 s gammaloop-nextest-docs> Nextest run ID 4a461ab7-b12b-4e88-843a-29bc7f3ed4df with nextest profile: ci_gammaloop
  561. 52.57 s gammaloop-nextest-docs> Starting 89 tests across 1 binary
  562. 52.63 s gammaloop-nextest-docs> ------------
  563. 52.63 s gammaloop-nextest-docs> Summary [ 0.058s] 89 tests run: 89 passed, 0 skipped
  564. 52.66 s gammaloop-nextest-docs>
  565. 52.66 s gammaloop-nextest-docs> ========== nextest test summary ==========
  566. 52.66 s gammaloop-nextest-docs> report: target/nextest/ci_gammaloop/junit.xml
  567. 52.66 s gammaloop-nextest-docs> tests: 89, failures: 0, errors: 0
  568. 52.66 s gammaloop-nextest-docs> No failing testcases found.
  569. 52.66 s gammaloop-nextest-docs> =========================================
  570. 52.68 s gammaloop-nextest-docs> Extracting 2 binaries to /build/source
  571. 52.73 s gammaloop-nextest-docs> Extracted 5 files to /build/source in 0.05s
  572. 52.74 s gammaloop-nextest-docs> ------------
  573. 52.74 s gammaloop-nextest-docs> Nextest run ID 5855c3fe-5f1f-4c40-96d1-a6572b51532f with nextest profile: ci_gammaloop
  574. 52.74 s gammaloop-nextest-docs> Starting 10 tests across 2 binaries
  575. 66.67 s gammaloop-nextest-docs> ------------
  576. 66.67 s gammaloop-nextest-docs> Summary [ 13.928s] 10 tests run: 10 passed, 0 skipped
  577. 66.70 s gammaloop-nextest-docs>
  578. 66.70 s gammaloop-nextest-docs> ========== nextest test summary ==========
  579. 66.70 s gammaloop-nextest-docs> report: target/nextest/ci_gammaloop/junit.xml
  580. 66.70 s gammaloop-nextest-docs> tests: 10, failures: 0, errors: 0
  581. 66.70 s gammaloop-nextest-docs> No failing testcases found.
  582. 66.70 s gammaloop-nextest-docs> =========================================
  583. 66.71 s gammaloop-nextest-docs> Extracting 1 binary to /build/source
  584. 66.75 s gammaloop-nextest-docs> Extracted 4 files to /build/source in 0.04s
  585. 66.75 s gammaloop-nextest-docs> ------------
  586. 66.75 s gammaloop-nextest-docs> Nextest run ID fe9ae595-cc28-4766-93ae-626af9da8dba with nextest profile: ci_gammaloop
  587. 66.75 s gammaloop-nextest-docs> Starting 0 tests across 1 binary
  588. 66.75 s gammaloop-nextest-docs> ------------
  589. 66.75 s gammaloop-nextest-docs> Summary [ 0.000s] 0 tests run: 0 passed, 0 skipped
  590. 66.78 s gammaloop-nextest-docs>
  591. 66.78 s gammaloop-nextest-docs> ========== nextest test summary ==========
  592. 66.78 s gammaloop-nextest-docs> report: target/nextest/ci_gammaloop/junit.xml
  593. 66.78 s gammaloop-nextest-docs> tests: 0, failures: 0, errors: 0
  594. 66.78 s gammaloop-nextest-docs> No failing testcases found.
  595. 66.78 s gammaloop-nextest-docs> =========================================
  596. 66.80 s gammaloop-nextest-docs> Extracting 1 binary to /build/source
  597. 66.84 s gammaloop-nextest-docs> Extracted 4 files to /build/source in 0.04s
  598. 66.84 s gammaloop-nextest-docs> ------------
  599. 66.84 s gammaloop-nextest-docs> Nextest run ID d3eda8cc-d9e5-4408-ad1c-69ffda22ae09 with nextest profile: ci_gammaloop
  600. 66.84 s gammaloop-nextest-docs> Starting 5 tests across 1 binary
  601. 66.85 s gammaloop-nextest-docs> ------------
  602. 66.85 s gammaloop-nextest-docs> Summary [ 0.005s] 5 tests run: 5 passed, 0 skipped
  603. 66.88 s gammaloop-nextest-docs>
  604. 66.88 s gammaloop-nextest-docs> ========== nextest test summary ==========
  605. 66.88 s gammaloop-nextest-docs> report: target/nextest/ci_gammaloop/junit.xml
  606. 66.88 s gammaloop-nextest-docs> tests: 5, failures: 0, errors: 0
  607. 66.88 s gammaloop-nextest-docs> No failing testcases found.
  608. 66.88 s gammaloop-nextest-docs> =========================================
  609. 67.10 s error: Cannot build '/nix/store/vj8wdqhcdhpl16s0z9h5y6gmk5iqkmvb-gammaloop-nextest-docs.drv'.
  610. 67.10 s Reason: builder failed with exit code 100.
  611. 67.10 s Output paths:
  612. 67.10 s /nix/store/ydqcrz3r95y4diyz90dlyicd9s8v4bln-gammaloop-nextest-docs
  613. 67.10 s Last 584 log lines:
  614. 67.10 s > Extracting 2 binaries to /build/source
  615. 67.10 s > Extracted 5 files to /build/source in 0.07s
  616. 67.10 s > ------------
  617. 67.10 s > Nextest run ID 22f7fa96-17cc-4ca5-819d-31cfd55be410 with nextest profile: ci_gammaloop
  618. 67.10 s > Starting 129 tests across 2 binaries
  619. 67.10 s > FAIL [ 0.239s] ( 63/129) alphal00p-docs-builder tests::checked_in_registry_is_valid
  620. 67.10 s > stdout ---
  621. 67.10 s >
  622. 67.10 s > running 1 test
  623. 67.10 s > test tests::checked_in_registry_is_valid ... FAILED
  624. 67.10 s >
  625. 67.10 s > failures:
  626. 67.10 s >
  627. 67.10 s > failures:
  628. 67.10 s > tests::checked_in_registry_is_valid
  629. 67.10 s >
  630. 67.10 s > test result: FAILED. 0 passed; 1 failed; 0 ignored; 0 measured; 128 filtered out; finished in 0.23s
  631. 67.10 s >
  632. 67.10 s > stderr ---
  633. 67.10 s >
  634. 67.10 s > thread 'tests::checked_in_registry_is_valid' (200) panicked at crates/alphal00p-docs-builder/src/lib.rs:12178:50:
  635. 67.10 s > called `Result::unwrap()` on an `Err` value: developer note nix-crane-cache-reuse verified scope nix/rust-workspace.nix changed (expected 66f700580ce13b9eaee90fe0111639e46968c531, found 0a568cb5712045aee37d96bfb2f91d3d32b7e9b9); owner review or an explicit no-impact attestation is required
  636. 67.10 s >
  637. 67.10 s > Location:
  638. 67.10 s > crates/alphal00p-docs-builder/src/lib.rs:992:29
  639. 67.10 s > stack backtrace:
  640. 67.10 s > 0: __rustc::rust_begin_unwind
  641. 67.10 s > 1: core::panicking::panic_fmt
  642. 67.10 s > 2: core::result::unwrap_failed
  643. 67.10 s > 3: alphal00p_docs_builder::tests::checked_in_registry_is_valid
  644. 67.10 s > 4: <alphal00p_docs_builder::tests::checked_in_registry_is_valid::{closure#0} as core::ops::function::FnOnce<()>>::call_once
  645. 67.10 s > note: Some details are omitted, run with `RUST_BACKTRACE=full` for a verbose backtrace.
  646. 67.10 s >
  647. 67.10 s > FAIL [ 0.289s] ( 68/129) alphal00p-docs-builder provenance_tests::each_build_captures_one_revision_before_rendering
  648. 67.10 s > stdout ---
  649. 67.10 s >
  650. 67.10 s > running 1 test
  651. 67.10 s >
  652. 67.10 s > running 1 test
  653. 67.10 s > test provenance_tests::each_build_captures_one_revision_before_rendering ... FAILED
  654. 67.10 s >
  655. 67.10 s > failures:
  656. 67.10 s >
  657. 67.10 s > failures:
  658. 67.10 s > provenance_tests::each_build_captures_one_revision_before_rendering
  659. 67.10 s >
  660. 67.10 s > test result: FAILED. 0 passed; 1 failed; 0 ignored; 0 measured; 128 filtered out; finished in 0.27s
  661. 67.10 s >
  662. 67.10 s > test provenance_tests::each_build_captures_one_revision_before_rendering ... FAILED
  663. 67.10 s >
  664. 67.10 s > failures:
  665. 67.10 s >
  666. 67.10 s > failures:
  667. 67.10 s > provenance_tests::each_build_captures_one_revision_before_rendering
  668. 67.10 s >
  669. 67.10 s > test result: FAILED. 0 passed; 1 failed; 0 ignored; 0 measured; 128 filtered out; finished in 0.28s
  670. 67.10 s >
  671. 67.10 s > stderr ---
  672. 67.10 s >
  673. 67.10 s > thread 'provenance_tests::each_build_captures_one_revision_before_rendering' (209) panicked at crates/alphal00p-docs-builder/src/provenance_tests.rs:297:14:
  674. 67.10 s > called `Result::unwrap()` on an `Err` value: developer note nix-crane-cache-reuse verified scope nix/rust-workspace.nix changed (expected 66f700580ce13b9eaee90fe0111639e46968c531, found 0a568cb5712045aee37d96bfb2f91d3d32b7e9b9); owner review or an explicit no-impact attestation is required
  675. 67.10 s >
  676. 67.10 s > Location:
  677. 67.10 s > crates/alphal00p-docs-builder/src/lib.rs:992:29
  678. 67.10 s > stack backtrace:
  679. 67.10 s > 0: __rustc::rust_begin_unwind
  680. 67.10 s > 1: core::panicking::panic_fmt
  681. 67.10 s > 2: core::result::unwrap_failed
  682. 67.10 s > 3: alphal00p_docs_builder::provenance_tests::each_build_captures_one_revision_before_rendering
  683. 67.10 s > 4: <alphal00p_docs_builder::provenance_tests::each_build_captures_one_revision_before_rendering::{closure#0} as core::ops::function::FnOnce<()>>::call_once
  684. 67.10 s > note: Some details are omitted, run with `RUST_BACKTRACE=full` for a verbose backtrace.
  685. 67.10 s >
  686. 67.10 s > thread 'provenance_tests::each_build_captures_one_revision_before_rendering' (163) panicked at crates/alphal00p-docs-builder/src/provenance_tests.rs:274:9:
  687. 67.10 s > assertion failed: command.status().unwrap().success()
  688. 67.10 s > stack backtrace:
  689. 67.10 s > 0: __rustc::rust_begin_unwind
  690. 67.10 s > 1: core::panicking::panic_fmt
  691. 67.10 s > 2: core::panicking::panic
  692. 67.10 s > 3: alphal00p_docs_builder::provenance_tests::each_build_captures_one_revision_before_rendering
  693. 67.10 s > 4: <alphal00p_docs_builder::provenance_tests::each_build_captures_one_revision_before_rendering::{closure#0} as core::ops::function::FnOnce<()>>::call_once
  694. 67.10 s > note: Some details are omitted, run with `RUST_BACKTRACE=full` for a verbose backtrace.
  695. 67.10 s >
  696. 67.10 s > FAIL [ 0.271s] ( 71/129) alphal00p-docs-builder tests::developer_scope_ranges_ignore_unrelated_edits_and_warn_only_while_watching
  697. 67.10 s > stdout ---
  698. 67.10 s >
  699. 67.10 s > running 1 test
  700. 67.10 s > test tests::developer_scope_ranges_ignore_unrelated_edits_and_warn_only_while_watching ... FAILED
  701. 67.10 s >
  702. 67.10 s > failures:
  703. 67.10 s >
  704. 67.10 s > failures:
  705. 67.10 s > tests::developer_scope_ranges_ignore_unrelated_edits_and_warn_only_while_watching
  706. 67.10 s >
  707. 67.10 s > test result: FAILED. 0 passed; 1 failed; 0 ignored; 0 measured; 128 filtered out; finished in 0.26s
  708. 67.10 s >
  709. 67.10 s > stderr ---
  710. 67.10 s >
  711. 67.10 s > thread 'tests::developer_scope_ranges_ignore_unrelated_edits_and_warn_only_while_watching' (286) panicked at crates/alphal00p-docs-builder/src/lib.rs:12263:29:
  712. 67.10 s > called `Result::unwrap()` on an `Err` value: developer note nix-crane-cache-reuse verified scope nix/rust-workspace.nix changed (expected 66f700580ce13b9eaee90fe0111639e46968c531, found 0a568cb5712045aee37d96bfb2f91d3d32b7e9b9); owner review or an explicit no-impact attestation is required
  713. 67.10 s >
  714. 67.10 s > Location:
  715. 67.10 s > crates/alphal00p-docs-builder/src/lib.rs:992:29
  716. 67.10 s > stack backtrace:
  717. 67.10 s > 0: __rustc::rust_begin_unwind
  718. 67.10 s > 1: core::panicking::panic_fmt
  719. 67.10 s > 2: core::result::unwrap_failed
  720. 67.10 s > 3: alphal00p_docs_builder::tests::developer_scope_ranges_ignore_unrelated_edits_and_warn_only_while_watching
  721. 67.10 s > 4: <alphal00p_docs_builder::tests::developer_scope_ranges_ignore_unrelated_edits_and_warn_only_while_watching::{closure#0} as core::ops::function::FnOnce<()>>::call_once
  722. 67.10 s > note: Some details are omitted, run with `RUST_BACKTRACE=full` for a verbose backtrace.
  723. 67.10 s >
  724. 67.10 s > FAIL [ 0.288s] ( 79/129) alphal00p-docs-builder tests::every_product_requires_a_task_chooser_and_each_supported_interface
  725. 67.10 s > stdout ---
  726. 67.10 s >
  727. 67.10 s > running 1 test
  728. 67.10 s > test tests::every_product_requires_a_task_chooser_and_each_supported_interface ... FAILED
  729. 67.10 s >
  730. 67.10 s > failures:
  731. 67.10 s >
  732. 67.10 s > failures:
  733. 67.10 s > tests::every_product_requires_a_task_chooser_and_each_supported_interface
  734. 67.10 s >
  735. 67.10 s > test result: FAILED. 0 passed; 1 failed; 0 ignored; 0 measured; 128 filtered out; finished in 0.28s
  736. 67.10 s >
  737. 67.10 s > stderr ---
  738. 67.10 s >
  739. 67.10 s > thread 'tests::every_product_requires_a_task_chooser_and_each_supported_interface' (315) panicked at crates/alphal00p-docs-builder/src/lib.rs:12192:9:
  740. 67.10 s > assertion failed: format!("{error:#}").contains("has no quickstart page")
  741. 67.10 s > stack backtrace:
  742. 67.10 s > 0: __rustc::rust_begin_unwind
  743. 67.10 s > 1: core::panicking::panic_fmt
  744. 67.10 s > 2: core::panicking::panic
  745. 67.10 s > 3: alphal00p_docs_builder::tests::every_product_requires_a_task_chooser_and_each_supported_interface
  746. 67.10 s > 4: <alphal00p_docs_builder::tests::every_product_requires_a_task_chooser_and_each_supported_interface::{closure#0} as core::ops::function::FnOnce<()>>::call_once
  747. 67.10 s > note: Some details are omitted, run with `RUST_BACKTRACE=full` for a verbose backtrace.
  748. 67.10 s >
  749. 67.10 s > FAIL [ 0.271s] ( 95/129) alphal00p-docs-builder tests::pdf_manual_chapter_order_must_match_the_page_registry
  750. 67.10 s > stdout ---
  751. 67.10 s >
  752. 67.10 s > running 1 test
  753. 67.10 s > test tests::pdf_manual_chapter_order_must_match_the_page_registry ... FAILED
  754. 67.10 s >
  755. 67.10 s > failures:
  756. 67.10 s >
  757. 67.10 s > failures:
  758. 67.10 s > tests::pdf_manual_chapter_order_must_match_the_page_registry
  759. 67.10 s >
  760. 67.10 s > test result: FAILED. 0 passed; 1 failed; 0 ignored; 0 measured; 128 filtered out; finished in 0.26s
  761. 67.10 s >
  762. 67.10 s > stderr ---
  763. 67.10 s >
  764. 67.10 s > thread 'tests::pdf_manual_chapter_order_must_match_the_page_registry' (408) panicked at crates/alphal00p-docs-builder/src/lib.rs:12243:9:
  765. 67.10 s > assertion failed: format!("{error:#}").contains("PDF manual chapter order differs")
  766. 67.10 s > stack backtrace:
  767. 67.10 s > 0: __rustc::rust_begin_unwind
  768. 67.10 s > 1: core::panicking::panic_fmt
  769. 67.10 s > 2: core::panicking::panic
  770. 67.10 s > 3: alphal00p_docs_builder::tests::pdf_manual_chapter_order_must_match_the_page_registry
  771. 67.10 s > 4: <alphal00p_docs_builder::tests::pdf_manual_chapter_order_must_match_the_page_registry::{closure#0} as core::ops::function::FnOnce<()>>::call_once
  772. 67.10 s > note: Some details are omitted, run with `RUST_BACKTRACE=full` for a verbose backtrace.
  773. 67.10 s >
  774. 67.10 s > ------------
  775. 67.10 s > Summary [ 24.033s] 129 tests run: 124 passed, 5 failed, 0 skipped
  776. 67.10 s > FAIL [ 0.239s] ( 63/129) alphal00p-docs-builder tests::checked_in_registry_is_valid
  777. 67.10 s > stdout ---
  778. 67.10 s >
  779. 67.10 s > running 1 test
  780. 67.10 s > test tests::checked_in_registry_is_valid ... FAILED
  781. 67.10 s >
  782. 67.10 s > failures:
  783. 67.10 s >
  784. 67.10 s > failures:
  785. 67.10 s > tests::checked_in_registry_is_valid
  786. 67.10 s >
  787. 67.10 s > test result: FAILED. 0 passed; 1 failed; 0 ignored; 0 measured; 128 filtered out; finished in 0.23s
  788. 67.10 s >
  789. 67.10 s > stderr ---
  790. 67.10 s >
  791. 67.10 s > thread 'tests::checked_in_registry_is_valid' (200) panicked at crates/alphal00p-docs-builder/src/lib.rs:12178:50:
  792. 67.10 s > called `Result::unwrap()` on an `Err` value: developer note nix-crane-cache-reuse verified scope nix/rust-workspace.nix changed (expected 66f700580ce13b9eaee90fe0111639e46968c531, found 0a568cb5712045aee37d96bfb2f91d3d32b7e9b9); owner review or an explicit no-impact attestation is required
  793. 67.10 s >
  794. 67.10 s > Location:
  795. 67.10 s > crates/alphal00p-docs-builder/src/lib.rs:992:29
  796. 67.10 s > stack backtrace:
  797. 67.10 s > 0: __rustc::rust_begin_unwind
  798. 67.10 s > 1: core::panicking::panic_fmt
  799. 67.10 s > 2: core::result::unwrap_failed
  800. 67.10 s > 3: alphal00p_docs_builder::tests::checked_in_registry_is_valid
  801. 67.10 s > 4: <alphal00p_docs_builder::tests::checked_in_registry_is_valid::{closure#0} as core::ops::function::FnOnce<()>>::call_once
  802. 67.10 s > note: Some details are omitted, run with `RUST_BACKTRACE=full` for a verbose backtrace.
  803. 67.10 s >
  804. 67.10 s > FAIL [ 0.289s] ( 68/129) alphal00p-docs-builder provenance_tests::each_build_captures_one_revision_before_rendering
  805. 67.10 s > stdout ---
  806. 67.10 s >
  807. 67.10 s > running 1 test
  808. 67.10 s >
  809. 67.10 s > running 1 test
  810. 67.10 s > test provenance_tests::each_build_captures_one_revision_before_rendering ... FAILED
  811. 67.10 s >
  812. 67.10 s > failures:
  813. 67.10 s >
  814. 67.10 s > failures:
  815. 67.10 s > provenance_tests::each_build_captures_one_revision_before_rendering
  816. 67.10 s >
  817. 67.10 s > test result: FAILED. 0 passed; 1 failed; 0 ignored; 0 measured; 128 filtered out; finished in 0.27s
  818. 67.10 s >
  819. 67.10 s > test provenance_tests::each_build_captures_one_revision_before_rendering ... FAILED
  820. 67.10 s >
  821. 67.10 s > failures:
  822. 67.10 s >
  823. 67.10 s > failures:
  824. 67.10 s > provenance_tests::each_build_captures_one_revision_before_rendering
  825. 67.10 s >
  826. 67.10 s > test result: FAILED. 0 passed; 1 failed; 0 ignored; 0 measured; 128 filtered out; finished in 0.28s
  827. 67.10 s >
  828. 67.10 s > stderr ---
  829. 67.10 s >
  830. 67.10 s > thread 'provenance_tests::each_build_captures_one_revision_before_rendering' (209) panicked at crates/alphal00p-docs-builder/src/provenance_tests.rs:297:14:
  831. 67.10 s > called `Result::unwrap()` on an `Err` value: developer note nix-crane-cache-reuse verified scope nix/rust-workspace.nix changed (expected 66f700580ce13b9eaee90fe0111639e46968c531, found 0a568cb5712045aee37d96bfb2f91d3d32b7e9b9); owner review or an explicit no-impact attestation is required
  832. 67.10 s >
  833. 67.10 s > Location:
  834. 67.10 s > crates/alphal00p-docs-builder/src/lib.rs:992:29
  835. 67.10 s > stack backtrace:
  836. 67.10 s > 0: __rustc::rust_begin_unwind
  837. 67.10 s > 1: core::panicking::panic_fmt
  838. 67.10 s > 2: core::result::unwrap_failed
  839. 67.10 s > 3: alphal00p_docs_builder::provenance_tests::each_build_captures_one_revision_before_rendering
  840. 67.10 s > 4: <alphal00p_docs_builder::provenance_tests::each_build_captures_one_revision_before_rendering::{closure#0} as core::ops::function::FnOnce<()>>::call_once
  841. 67.10 s > note: Some details are omitted, run with `RUST_BACKTRACE=full` for a verbose backtrace.
  842. 67.10 s >
  843. 67.10 s > thread 'provenance_tests::each_build_captures_one_revision_before_rendering' (163) panicked at crates/alphal00p-docs-builder/src/provenance_tests.rs:274:9:
  844. 67.10 s > assertion failed: command.status().unwrap().success()
  845. 67.10 s > stack backtrace:
  846. 67.10 s > 0: __rustc::rust_begin_unwind
  847. 67.10 s > 1: core::panicking::panic_fmt
  848. 67.10 s > 2: core::panicking::panic
  849. 67.10 s > 3: alphal00p_docs_builder::provenance_tests::each_build_captures_one_revision_before_rendering
  850. 67.10 s > 4: <alphal00p_docs_builder::provenance_tests::each_build_captures_one_revision_before_rendering::{closure#0} as core::ops::function::FnOnce<()>>::call_once
  851. 67.10 s > note: Some details are omitted, run with `RUST_BACKTRACE=full` for a verbose backtrace.
  852. 67.10 s >
  853. 67.10 s > FAIL [ 0.271s] ( 71/129) alphal00p-docs-builder tests::developer_scope_ranges_ignore_unrelated_edits_and_warn_only_while_watching
  854. 67.10 s > stdout ---
  855. 67.10 s >
  856. 67.10 s > running 1 test
  857. 67.10 s > test tests::developer_scope_ranges_ignore_unrelated_edits_and_warn_only_while_watching ... FAILED
  858. 67.10 s >
  859. 67.10 s > failures:
  860. 67.10 s >
  861. 67.10 s > failures:
  862. 67.10 s > tests::developer_scope_ranges_ignore_unrelated_edits_and_warn_only_while_watching
  863. 67.10 s >
  864. 67.10 s > test result: FAILED. 0 passed; 1 failed; 0 ignored; 0 measured; 128 filtered out; finished in 0.26s
  865. 67.10 s >
  866. 67.10 s > stderr ---
  867. 67.10 s >
  868. 67.10 s > thread 'tests::developer_scope_ranges_ignore_unrelated_edits_and_warn_only_while_watching' (286) panicked at crates/alphal00p-docs-builder/src/lib.rs:12263:29:
  869. 67.10 s > called `Result::unwrap()` on an `Err` value: developer note nix-crane-cache-reuse verified scope nix/rust-workspace.nix changed (expected 66f700580ce13b9eaee90fe0111639e46968c531, found 0a568cb5712045aee37d96bfb2f91d3d32b7e9b9); owner review or an explicit no-impact attestation is required
  870. 67.10 s >
  871. 67.10 s > Location:
  872. 67.10 s > crates/alphal00p-docs-builder/src/lib.rs:992:29
  873. 67.10 s > stack backtrace:
  874. 67.10 s > 0: __rustc::rust_begin_unwind
  875. 67.10 s > 1: core::panicking::panic_fmt
  876. 67.10 s > 2: core::result::unwrap_failed
  877. 67.10 s > 3: alphal00p_docs_builder::tests::developer_scope_ranges_ignore_unrelated_edits_and_warn_only_while_watching
  878. 67.10 s > 4: <alphal00p_docs_builder::tests::developer_scope_ranges_ignore_unrelated_edits_and_warn_only_while_watching::{closure#0} as core::ops::function::FnOnce<()>>::call_once
  879. 67.10 s > note: Some details are omitted, run with `RUST_BACKTRACE=full` for a verbose backtrace.
  880. 67.10 s >
  881. 67.10 s > FAIL [ 0.288s] ( 79/129) alphal00p-docs-builder tests::every_product_requires_a_task_chooser_and_each_supported_interface
  882. 67.10 s > stdout ---
  883. 67.10 s >
  884. 67.10 s > running 1 test
  885. 67.10 s > test tests::every_product_requires_a_task_chooser_and_each_supported_interface ... FAILED
  886. 67.10 s >
  887. 67.10 s > failures:
  888. 67.10 s >
  889. 67.10 s > failures:
  890. 67.10 s > tests::every_product_requires_a_task_chooser_and_each_supported_interface
  891. 67.10 s >
  892. 67.10 s > test result: FAILED. 0 passed; 1 failed; 0 ignored; 0 measured; 128 filtered out; finished in 0.28s
  893. 67.10 s >
  894. 67.10 s > stderr ---
  895. 67.10 s >
  896. 67.10 s > thread 'tests::every_product_requires_a_task_chooser_and_each_supported_interface' (315) panicked at crates/alphal00p-docs-builder/src/lib.rs:12192:9:
  897. 67.10 s > assertion failed: format!("{error:#}").contains("has no quickstart page")
  898. 67.10 s > stack backtrace:
  899. 67.10 s > 0: __rustc::rust_begin_unwind
  900. 67.10 s > 1: core::panicking::panic_fmt
  901. 67.10 s > 2: core::panicking::panic
  902. 67.10 s > 3: alphal00p_docs_builder::tests::every_product_requires_a_task_chooser_and_each_supported_interface
  903. 67.10 s > 4: <alphal00p_docs_builder::tests::every_product_requires_a_task_chooser_and_each_supported_interface::{closure#0} as core::ops::function::FnOnce<()>>::call_once
  904. 67.10 s > note: Some details are omitted, run with `RUST_BACKTRACE=full` for a verbose backtrace.
  905. 67.10 s >
  906. 67.10 s > FAIL [ 0.271s] ( 95/129) alphal00p-docs-builder tests::pdf_manual_chapter_order_must_match_the_page_registry
  907. 67.10 s > stdout ---
  908. 67.10 s >
  909. 67.10 s > running 1 test
  910. 67.10 s > test tests::pdf_manual_chapter_order_must_match_the_page_registry ... FAILED
  911. 67.10 s >
  912. 67.10 s > failures:
  913. 67.10 s >
  914. 67.10 s > failures:
  915. 67.10 s > tests::pdf_manual_chapter_order_must_match_the_page_registry
  916. 67.10 s >
  917. 67.10 s > test result: FAILED. 0 passed; 1 failed; 0 ignored; 0 measured; 128 filtered out; finished in 0.26s
  918. 67.10 s >
  919. 67.10 s > stderr ---
  920. 67.10 s >
  921. 67.10 s > thread 'tests::pdf_manual_chapter_order_must_match_the_page_registry' (408) panicked at crates/alphal00p-docs-builder/src/lib.rs:12243:9:
  922. 67.10 s > assertion failed: format!("{error:#}").contains("PDF manual chapter order differs")
  923. 67.10 s > stack backtrace:
  924. 67.10 s > 0: __rustc::rust_begin_unwind
  925. 67.10 s > 1: core::panicking::panic_fmt
  926. 67.10 s > 2: core::panicking::panic
  927. 67.10 s > 3: alphal00p_docs_builder::tests::pdf_manual_chapter_order_must_match_the_page_registry
  928. 67.10 s > 4: <alphal00p_docs_builder::tests::pdf_manual_chapter_order_must_match_the_page_registry::{closure#0} as core::ops::function::FnOnce<()>>::call_once
  929. 67.10 s > note: Some details are omitted, run with `RUST_BACKTRACE=full` for a verbose backtrace.
  930. 67.10 s >
  931. 67.10 s > error: test run failed
  932. 67.10 s >
  933. 67.10 s > ========== nextest test summary ==========
  934. 67.10 s > report: target/nextest/ci_gammaloop/junit.xml
  935. 67.10 s > tests: 129, failures: 5, errors: 0
  936. 67.10 s >
  937. 67.10 s > 1. alphal00p-docs-builder::tests::checked_in_registry_is_valid
  938. 67.10 s > failure: test failure with exit code 101
  939. 67.10 s > thread 'tests::checked_in_registry_is_valid' (200) panicked at crates/alphal00p-docs-builder/src/lib.rs:12178:50:
  940. 67.10 s > called `Result::unwrap()` on an `Err` value: developer note nix-crane-cache-reuse verified scope nix/rust-workspace.nix changed (expected 66f700580ce13b9eaee90fe0111639e46968c531, found 0a568cb5712045aee37d96bfb2f91d3d32b7e9b9); owner review or an explicit no-impact attestation is required
  941. 67.10 s >
  942. 67.10 s > Location:
  943. 67.10 s > crates/alphal00p-docs-builder/src/lib.rs:992:29
  944. 67.10 s > stack backtrace:
  945. 67.10 s > 0: __rustc::rust_begin_unwind
  946. 67.10 s > 1: core::panicking::panic_fmt
  947. 67.10 s > 2: core::result::unwrap_failed
  948. 67.10 s > 3: alphal00p_docs_builder::tests::checked_in_registry_is_valid
  949. 67.10 s > 4: <alphal00p_docs_builder::tests::checked_in_registry_is_valid::{closure#0} as core::ops::function::FnOnce<()>>::call_once
  950. 67.10 s > note: Some details are omitted, run with `RUST_BACKTRACE=full` for a verbose backtrace.
  951. 67.10 s > system-out
  952. 67.10 s > running 1 test
  953. 67.10 s > test tests::checked_in_registry_is_valid ... FAILED
  954. 67.10 s >
  955. 67.10 s > failures:
  956. 67.10 s >
  957. 67.10 s > failures:
  958. 67.10 s > tests::checked_in_registry_is_valid
  959. 67.10 s >
  960. 67.10 s > test result: FAILED. 0 passed; 1 failed; 0 ignored; 0 measured; 128 filtered out; finished in 0.23s
  961. 67.10 s > system-err
  962. 67.10 s > thread 'tests::checked_in_registry_is_valid' (200) panicked at crates/alphal00p-docs-builder/src/lib.rs:12178:50:
  963. 67.10 s > called `Result::unwrap()` on an `Err` value: developer note nix-crane-cache-reuse verified scope nix/rust-workspace.nix changed (expected 66f700580ce13b9eaee90fe0111639e46968c531, found 0a568cb5712045aee37d96bfb2f91d3d32b7e9b9); owner review or an explicit no-impact attestation is required
  964. 67.10 s >
  965. 67.10 s > Location:
  966. 67.10 s > crates/alphal00p-docs-builder/src/lib.rs:992:29
  967. 67.10 s > stack backtrace:
  968. 67.10 s > 0: __rustc::rust_begin_unwind
  969. 67.10 s > 1: core::panicking::panic_fmt
  970. 67.10 s > 2: core::result::unwrap_failed
  971. 67.10 s > 3: alphal00p_docs_builder::tests::checked_in_registry_is_valid
  972. 67.10 s > 4: <alphal00p_docs_builder::tests::checked_in_registry_is_valid::{closure#0} as core::ops::function::FnOnce<()>>::call_once
  973. 67.10 s > note: Some details are omitted, run with `RUST_BACKTRACE=full` for a verbose backtrace.
  974. 67.10 s >
  975. 67.10 s > 2. alphal00p-docs-builder::provenance_tests::each_build_captures_one_revision_before_rendering
  976. 67.10 s > failure: test failure with exit code 101
  977. 67.10 s > thread 'provenance_tests::each_build_captures_one_revision_before_rendering' (163) panicked at crates/alphal00p-docs-builder/src/provenance_tests.rs:274:9:
  978. 67.10 s > assertion failed: command.status().unwrap().success()
  979. 67.10 s > stack backtrace:
  980. 67.10 s > 0: __rustc::rust_begin_unwind
  981. 67.10 s > 1: core::panicking::panic_fmt
  982. 67.10 s > 2: core::panicking::panic
  983. 67.10 s > 3: alphal00p_docs_builder::provenance_tests::each_build_captures_one_revision_before_rendering
  984. 67.10 s > 4: <alphal00p_docs_builder::provenance_tests::each_build_captures_one_revision_before_rendering::{closure#0} as core::ops::function::FnOnce<()>>::call_once
  985. 67.10 s > note: Some details are omitted, run with `RUST_BACKTRACE=full` for a verbose backtrace.
  986. 67.10 s > system-out
  987. 67.10 s > running 1 test
  988. 67.10 s >
  989. 67.10 s > running 1 test
  990. 67.10 s > test provenance_tests::each_build_captures_one_revision_before_rendering ... FAILED
  991. 67.10 s >
  992. 67.10 s > failures:
  993. 67.10 s >
  994. 67.10 s > failures:
  995. 67.10 s > provenance_tests::each_build_captures_one_revision_before_rendering
  996. 67.10 s >
  997. 67.10 s > test result: FAILED. 0 passed; 1 failed; 0 ignored; 0 measured; 128 filtered out; finished in 0.27s
  998. 67.10 s >
  999. 67.10 s > test provenance_tests::each_build_captures_one_revision_before_rendering ... FAILED
  1000. 67.10 s >
  1001. 67.10 s > failures:
  1002. 67.10 s >
  1003. 67.10 s > failures:
  1004. 67.10 s > provenance_tests::each_build_captures_one_revision_before_rendering
  1005. 67.10 s >
  1006. 67.10 s > test result: FAILED. 0 passed; 1 failed; 0 ignored; 0 measured; 128 filtered out; finished in 0.28s
  1007. 67.10 s > system-err
  1008. 67.10 s > thread 'provenance_tests::each_build_captures_one_revision_before_rendering' (209) panicked at crates/alphal00p-docs-builder/src/provenance_tests.rs:297:14:
  1009. 67.10 s > called `Result::unwrap()` on an `Err` value: developer note nix-crane-cache-reuse verified scope nix/rust-workspace.nix changed (expected 66f700580ce13b9eaee90fe0111639e46968c531, found 0a568cb5712045aee37d96bfb2f91d3d32b7e9b9); owner review or an explicit no-impact attestation is required
  1010. 67.10 s >
  1011. 67.10 s > Location:
  1012. 67.10 s > crates/alphal00p-docs-builder/src/lib.rs:992:29
  1013. 67.10 s > stack backtrace:
  1014. 67.10 s > 0: __rustc::rust_begin_unwind
  1015. 67.10 s > 1: core::panicking::panic_fmt
  1016. 67.10 s > 2: core::result::unwrap_failed
  1017. 67.10 s > 3: alphal00p_docs_builder::provenance_tests::each_build_captures_one_revision_before_rendering
  1018. 67.10 s > 4: <alphal00p_docs_builder::provenance_tests::each_build_captures_one_revision_before_rendering::{closure#0} as core::ops::function::FnOnce<()>>::call_once
  1019. 67.10 s > note: Some details are omitted, run with `RUST_BACKTRACE=full` for a verbose backtrace.
  1020. 67.10 s >
  1021. 67.10 s > thread 'provenance_tests::each_build_captures_one_revision_before_rendering' (163) panicked at crates/alphal00p-docs-builder/src/provenance_tests.rs:274:9:
  1022. 67.10 s > assertion failed: command.status().unwrap().success()
  1023. 67.10 s > stack backtrace:
  1024. 67.10 s > 0: __rustc::rust_begin_unwind
  1025. 67.10 s > 1: core::panicking::panic_fmt
  1026. 67.10 s > 2: core::panicking::panic
  1027. 67.10 s > 3: alphal00p_docs_builder::provenance_tests::each_build_captures_one_revision_before_rendering
  1028. 67.10 s > 4: <alphal00p_docs_builder::provenance_tests::each_build_captures_one_revision_before_rendering::{closure#0} as core::ops::function::FnOnce<()>>::call_once
  1029. 67.10 s > note: Some details are omitted, run with `RUST_BACKTRACE=full` for a verbose backtrace.
  1030. 67.10 s >
  1031. 67.10 s > 3. alphal00p-docs-builder::tests::developer_scope_ranges_ignore_unrelated_edits_and_warn_only_while_watching
  1032. 67.10 s > failure: test failure with exit code 101
  1033. 67.10 s > thread 'tests::developer_scope_ranges_ignore_unrelated_edits_and_warn_only_while_watching' (286) panicked at crates/alphal00p-docs-builder/src/lib.rs:12263:29:
  1034. 67.10 s > called `Result::unwrap()` on an `Err` value: developer note nix-crane-cache-reuse verified scope nix/rust-workspace.nix changed (expected 66f700580ce13b9eaee90fe0111639e46968c531, found 0a568cb5712045aee37d96bfb2f91d3d32b7e9b9); owner review or an explicit no-impact attestation is required
  1035. 67.10 s >
  1036. 67.10 s > Location:
  1037. 67.10 s > crates/alphal00p-docs-builder/src/lib.rs:992:29
  1038. 67.10 s > stack backtrace:
  1039. 67.10 s > 0: __rustc::rust_begin_unwind
  1040. 67.10 s > 1: core::panicking::panic_fmt
  1041. 67.10 s > 2: core::result::unwrap_failed
  1042. 67.10 s > 3: alphal00p_docs_builder::tests::developer_scope_ranges_ignore_unrelated_edits_and_warn_only_while_watching
  1043. 67.10 s > 4: <alphal00p_docs_builder::tests::developer_scope_ranges_ignore_unrelated_edits_and_warn_only_while_watching::{closure#0} as core::ops::function::FnOnce<()>>::call_once
  1044. 67.10 s > note: Some details are omitted, run with `RUST_BACKTRACE=full` for a verbose backtrace.
  1045. 67.10 s > system-out
  1046. 67.10 s > running 1 test
  1047. 67.10 s > test tests::developer_scope_ranges_ignore_unrelated_edits_and_warn_only_while_watching ... FAILED
  1048. 67.10 s >
  1049. 67.10 s > failures:
  1050. 67.10 s >
  1051. 67.10 s > failures:
  1052. 67.10 s > tests::developer_scope_ranges_ignore_unrelated_edits_and_warn_only_while_watching
  1053. 67.10 s >
  1054. 67.10 s > test result: FAILED. 0 passed; 1 failed; 0 ignored; 0 measured; 128 filtered out; finished in 0.26s
  1055. 67.10 s > system-err
  1056. 67.10 s > thread 'tests::developer_scope_ranges_ignore_unrelated_edits_and_warn_only_while_watching' (286) panicked at crates/alphal00p-docs-builder/src/lib.rs:12263:29:
  1057. 67.10 s > called `Result::unwrap()` on an `Err` value: developer note nix-crane-cache-reuse verified scope nix/rust-workspace.nix changed (expected 66f700580ce13b9eaee90fe0111639e46968c531, found 0a568cb5712045aee37d96bfb2f91d3d32b7e9b9); owner review or an explicit no-impact attestation is required
  1058. 67.10 s >
  1059. 67.10 s > Location:
  1060. 67.10 s > crates/alphal00p-docs-builder/src/lib.rs:992:29
  1061. 67.10 s > stack backtrace:
  1062. 67.10 s > 0: __rustc::rust_begin_unwind
  1063. 67.10 s > 1: core::panicking::panic_fmt
  1064. 67.10 s > 2: core::result::unwrap_failed
  1065. 67.10 s > 3: alphal00p_docs_builder::tests::developer_scope_ranges_ignore_unrelated_edits_and_warn_only_while_watching
  1066. 67.10 s > 4: <alphal00p_docs_builder::tests::developer_scope_ranges_ignore_unrelated_edits_and_warn_only_while_watching::{closure#0} as core::ops::function::FnOnce<()>>::call_once
  1067. 67.10 s > note: Some details are omitted, run with `RUST_BACKTRACE=full` for a verbose backtrace.
  1068. 67.10 s >
  1069. 67.10 s > 4. alphal00p-docs-builder::tests::every_product_requires_a_task_chooser_and_each_supported_interface
  1070. 67.10 s > failure: test failure with exit code 101
  1071. 67.10 s > thread 'tests::every_product_requires_a_task_chooser_and_each_supported_interface' (315) panicked at crates/alphal00p-docs-builder/src/lib.rs:12192:9:
  1072. 67.10 s > assertion failed: format!("{error:#}").contains("has no quickstart page")
  1073. 67.10 s > stack backtrace:
  1074. 67.10 s > 0: __rustc::rust_begin_unwind
  1075. 67.10 s > 1: core::panicking::panic_fmt
  1076. 67.10 s > 2: core::panicking::panic
  1077. 67.10 s > 3: alphal00p_docs_builder::tests::every_product_requires_a_task_chooser_and_each_supported_interface
  1078. 67.10 s > 4: <alphal00p_docs_builder::tests::every_product_requires_a_task_chooser_and_each_supported_interface::{closure#0} as core::ops::function::FnOnce<()>>::call_once
  1079. 67.10 s > note: Some details are omitted, run with `RUST_BACKTRACE=full` for a verbose backtrace.
  1080. 67.10 s > system-out
  1081. 67.10 s > running 1 test
  1082. 67.10 s > test tests::every_product_requires_a_task_chooser_and_each_supported_interface ... FAILED
  1083. 67.10 s >
  1084. 67.10 s > failures:
  1085. 67.10 s >
  1086. 67.10 s > failures:
  1087. 67.10 s > tests::every_product_requires_a_task_chooser_and_each_supported_interface
  1088. 67.10 s >
  1089. 67.10 s > test result: FAILED. 0 passed; 1 failed; 0 ignored; 0 measured; 128 filtered out; finished in 0.28s
  1090. 67.10 s > system-err
  1091. 67.10 s > thread 'tests::every_product_requires_a_task_chooser_and_each_supported_interface' (315) panicked at crates/alphal00p-docs-builder/src/lib.rs:12192:9:
  1092. 67.10 s > assertion failed: format!("{error:#}").contains("has no quickstart page")
  1093. 67.10 s > stack backtrace:
  1094. 67.10 s > 0: __rustc::rust_begin_unwind
  1095. 67.10 s > 1: core::panicking::panic_fmt
  1096. 67.10 s > 2: core::panicking::panic
  1097. 67.10 s > 3: alphal00p_docs_builder::tests::every_product_requires_a_task_chooser_and_each_supported_interface
  1098. 67.10 s > 4: <alphal00p_docs_builder::tests::every_product_requires_a_task_chooser_and_each_supported_interface::{closure#0} as core::ops::function::FnOnce<()>>::call_once
  1099. 67.10 s > note: Some details are omitted, run with `RUST_BACKTRACE=full` for a verbose backtrace.
  1100. 67.10 s >
  1101. 67.10 s > 5. alphal00p-docs-builder::tests::pdf_manual_chapter_order_must_match_the_page_registry
  1102. 67.10 s > failure: test failure with exit code 101
  1103. 67.10 s > thread 'tests::pdf_manual_chapter_order_must_match_the_page_registry' (408) panicked at crates/alphal00p-docs-builder/src/lib.rs:12243:9:
  1104. 67.10 s > assertion failed: format!("{error:#}").contains("PDF manual chapter order differs")
  1105. 67.10 s > stack backtrace:
  1106. 67.10 s > 0: __rustc::rust_begin_unwind
  1107. 67.10 s > 1: core::panicking::panic_fmt
  1108. 67.10 s > 2: core::panicking::panic
  1109. 67.10 s > 3: alphal00p_docs_builder::tests::pdf_manual_chapter_order_must_match_the_page_registry
  1110. 67.10 s > 4: <alphal00p_docs_builder::tests::pdf_manual_chapter_order_must_match_the_page_registry::{closure#0} as core::ops::function::FnOnce<()>>::call_once
  1111. 67.10 s > note: Some details are omitted, run with `RUST_BACKTRACE=full` for a verbose backtrace.
  1112. 67.10 s > system-out
  1113. 67.10 s > running 1 test
  1114. 67.10 s > test tests::pdf_manual_chapter_order_must_match_the_page_registry ... FAILED
  1115. 67.10 s >
  1116. 67.10 s > failures:
  1117. 67.10 s >
  1118. 67.10 s > failures:
  1119. 67.10 s > tests::pdf_manual_chapter_order_must_match_the_page_registry
  1120. 67.10 s >
  1121. 67.10 s > test result: FAILED. 0 passed; 1 failed; 0 ignored; 0 measured; 128 filtered out; finished in 0.26s
  1122. 67.10 s > system-err
  1123. 67.10 s > thread 'tests::pdf_manual_chapter_order_must_match_the_page_registry' (408) panicked at crates/alphal00p-docs-builder/src/lib.rs:12243:9:
  1124. 67.10 s > assertion failed: format!("{error:#}").contains("PDF manual chapter order differs")
  1125. 67.10 s > stack backtrace:
  1126. 67.10 s > 0: __rustc::rust_begin_unwind
  1127. 67.10 s > 1: core::panicking::panic_fmt
  1128. 67.10 s > 2: core::panicking::panic
  1129. 67.10 s > 3: alphal00p_docs_builder::tests::pdf_manual_chapter_order_must_match_the_page_registry
  1130. 67.10 s > 4: <alphal00p_docs_builder::tests::pdf_manual_chapter_order_must_match_the_page_registry::{closure#0} as core::ops::function::FnOnce<()>>::call_once
  1131. 67.10 s > note: Some details are omitted, run with `RUST_BACKTRACE=full` for a verbose backtrace.
  1132. 67.10 s > =========================================
  1133. 67.10 s > Extracting 2 binaries to /build/source
  1134. 67.10 s > Extracted 5 files to /build/source in 0.05s
  1135. 67.10 s > ------------
  1136. 67.10 s > Nextest run ID 42c79af4-4823-488a-b614-fc71eda6536d with nextest profile: ci_gammaloop
  1137. 67.10 s > Starting 22 tests across 2 binaries
  1138. 67.10 s > ------------
  1139. 67.10 s > Summary [ 0.030s] 22 tests run: 22 passed, 0 skipped
  1140. 67.10 s >
  1141. 67.10 s > ========== nextest test summary ==========
  1142. 67.10 s > report: target/nextest/ci_gammaloop/junit.xml
  1143. 67.10 s > tests: 22, failures: 0, errors: 0
  1144. 67.10 s > No failing testcases found.
  1145. 67.10 s > =========================================
  1146. 67.10 s > Extracting 3 binaries (including 2 non-test binaries), 1 build script output directory, and 2 linked paths to /build/source
  1147. 67.10 s > Extracted 22 files to /build/source in 0.36s
  1148. 67.10 s > ------------
  1149. 67.10 s > Nextest run ID 4a461ab7-b12b-4e88-843a-29bc7f3ed4df with nextest profile: ci_gammaloop
  1150. 67.10 s > Starting 89 tests across 1 binary
  1151. 67.10 s > ------------
  1152. 67.10 s > Summary [ 0.058s] 89 tests run: 89 passed, 0 skipped
  1153. 67.10 s >
  1154. 67.10 s > ========== nextest test summary ==========
  1155. 67.10 s > report: target/nextest/ci_gammaloop/junit.xml
  1156. 67.10 s > tests: 89, failures: 0, errors: 0
  1157. 67.10 s > No failing testcases found.
  1158. 67.10 s > =========================================
  1159. 67.10 s > Extracting 2 binaries to /build/source
  1160. 67.10 s > Extracted 5 files to /build/source in 0.05s
  1161. 67.10 s > ------------
  1162. 67.10 s > Nextest run ID 5855c3fe-5f1f-4c40-96d1-a6572b51532f with nextest profile: ci_gammaloop
  1163. 67.10 s > Starting 10 tests across 2 binaries
  1164. 67.10 s > ------------
  1165. 67.10 s > Summary [ 13.928s] 10 tests run: 10 passed, 0 skipped
  1166. 67.10 s >
  1167. 67.10 s > ========== nextest test summary ==========
  1168. 67.10 s > report: target/nextest/ci_gammaloop/junit.xml
  1169. 67.10 s > tests: 10, failures: 0, errors: 0
  1170. 67.10 s > No failing testcases found.
  1171. 67.10 s > =========================================
  1172. 67.10 s > Extracting 1 binary to /build/source
  1173. 67.10 s > Extracted 4 files to /build/source in 0.04s
  1174. 67.10 s > ------------
  1175. 67.10 s > Nextest run ID fe9ae595-cc28-4766-93ae-626af9da8dba with nextest profile: ci_gammaloop
  1176. 67.10 s > Starting 0 tests across 1 binary
  1177. 67.10 s > ------------
  1178. 67.10 s > Summary [ 0.000s] 0 tests run: 0 passed, 0 skipped
  1179. 67.10 s >
  1180. 67.10 s > ========== nextest test summary ==========
  1181. 67.10 s > report: target/nextest/ci_gammaloop/junit.xml
  1182. 67.10 s > tests: 0, failures: 0, errors: 0
  1183. 67.10 s > No failing testcases found.
  1184. 67.10 s > =========================================
  1185. 67.10 s > Extracting 1 binary to /build/source
  1186. 67.10 s > Extracted 4 files to /build/source in 0.04s
  1187. 67.10 s > ------------
  1188. 67.10 s > Nextest run ID d3eda8cc-d9e5-4408-ad1c-69ffda22ae09 with nextest profile: ci_gammaloop
  1189. 67.10 s > Starting 5 tests across 1 binary
  1190. 67.10 s > ------------
  1191. 67.10 s > Summary [ 0.005s] 5 tests run: 5 passed, 0 skipped
  1192. 67.10 s >
  1193. 67.10 s > ========== nextest test summary ==========
  1194. 67.10 s > report: target/nextest/ci_gammaloop/junit.xml
  1195. 67.10 s > tests: 5, failures: 0, errors: 0
  1196. 67.10 s > No failing testcases found.
  1197. 67.10 s > =========================================
  1198. 67.10 s For full logs, run:
  1199. 67.10 s nix log /nix/store/vj8wdqhcdhpl16s0z9h5y6gmk5iqkmvb-gammaloop-nextest-docs.drv
  1200. 67.27 s [0 built (1 failed)]Run failed.