1. 0.01 s $ /nix/store/bhv6xyvqw6gjs3j488gi1z6wdv18bdpa-coreutils-9.11/bin/timeout --kill-after=15s 7200s /nix/store/5np0yidzrnyjbb243hvgqpgpss865p0n-nix-2.34.9/bin/nix --extra-experimental-features nix-command --extra-experimental-features flakes flake clone git+https://github.com/alphal00p/gammaloop --dest /tmp/nix-ci-worker/stable-pwd/repo/
  2. 0.35 s Cloning into '/tmp/nix-ci-worker/stable-pwd/repo'...
  3. 3.89 s remote: Enumerating objects: 157628 remote: Enumerating objects: 172467, done.
  4. 4.11 s remote: Counting objects: 0% (1/14839) remote: Counting objects: 1% (149/14839) remote: Counting objects: 2% (297/14839) remote: Counting objects: 3% (446/14839) remote: Counting objects: 4% (594/14839) remote: Counting objects: 5% (742/14839) remote: Counting objects: 6% (891/14839) remote: Counting objects: 7% (1039/14839) remote: Counting objects: 8% (1188/14839) remote: Counting objects: 9% (1336/14839) remote: Counting objects: 10% (1484/14839) remote: Counting objects: 11% (1633/14839) remote: Counting objects: 12% (1781/14839) remote: Counting objects: 13% (1930/14839) remote: Counting objects: 14% (2078/14839) remote: Counting objects: 15% (2226/14839) remote: Counting objects: 16% (2375/14839) remote: Counting objects: 17% (2523/14839) remote: Counting objects: 18% (2672/14839) remote: Counting objects: 19% (2820/14839) remote: Counting objects: 20% (2968/14839) remote: Counting objects: 21% (3117/14839) remote: Counting objects: 22% (3265/14839) remote: Counting objects: 23% (3413/14839) remote: Counting objects: 24% (3562/14839) remote: Counting objects: 25% (3710/14839) remote: Counting objects: 26% (3859/14839) remote: Counting objects: 27% (4007/14839) remote: Counting objects: 28% (4155/14839) remote: Counting objects: 29% (4304/14839) remote: Counting objects: 30% (4452/14839) remote: Counting objects: 31% (4601/14839) remote: Counting objects: 32% (4749/14839) remote: Counting objects: 33% (4897/14839) remote: Counting objects: 34% (5046/14839) remote: Counting objects: 35% (5194/14839) remote: Counting objects: 36% (5343/14839) remote: Counting objects: 37% (5491/14839) remote: Counting objects: 38% (5639/14839) remote: Counting objects: 39% (5788/14839) remote: Counting objects: 40% (5936/14839) remote: Counting objects: 41% (6084/14839) remote: Counting objects: 42% (6233/14839) remote: Counting objects: 43% (6381/14839) remote: Counting objects: 44% (6530/14839) remote: Counting objects: 45% (6678/14839) remote: Counting objects: 46% (6826/14839) remote: Counting objects: 47% (6975/14839) remote: Counting objects: 48% (7123/14839) remote: Counting objects: 49% (7272/14839) remote: Counting objects: 50% (7420/14839) remote: Counting objects: 51% (7568/14839) remote: Counting objects: 52% (7717/14839) remote: Counting objects: 53% (7865/14839) remote: Counting objects: 54% (8014/14839) remote: Counting objects: 55% (8162/14839) remote: Counting objects: 56% (8310/14839) remote: Counting objects: 57% (8459/14839) remote: Counting objects: 58% (8607/14839) remote: Counting objects: 59% (8756/14839) remote: Counting objects: 60% (8904/14839) remote: Counting objects: 61% (9052/14839) remote: Counting objects: 62% (9201/14839) remote: Counting objects: 63% (9349/14839) remote: Counting objects: 64% (9497/14839) remote: Counting objects: 65% (9646/14839) remote: Counting objects: 66% (9794/14839) remote: Counting objects: 67% (9943/14839) remote: Counting objects: 68% (10091/14839) remote: Counting objects: 69% (10239/14839) remote: Counting objects: 70% (10388/14839) remote: Counting objects: 71% (10536/14839) remote: Counting objects: 72% (10685/14839) remote: Counting objects: 73% (10833/14839) remote: Counting objects: 74% (10981/14839) remote: Counting objects: 75% (11130/14839) remote: Counting objects: 76% (11278/14839) remote: Counting objects: 77% (11427/14839) remote: Counting objects: 78% (11575/14839) remote: Counting objects: 79% (11723/14839) remote: Counting objects: 80% (11872/14839) remote: Counting objects: 81% (12020/14839) remote: Counting objects: 82% (12168/14839) remote: Counting objects: 83% (12317/14839) remote: Counting objects: 84% (12465/14839) remote: Counting objects: 85% (12614/14839) remote: Counting objects: 86% (12762/14839) remote: Counting objects: 87% (12910/14839) remote: Counting objects: 88% (13059/14839) remote: Counting objects: 89% (13207/14839) remote: Counting objects: 90% (13356/14839) remote: Counting objects: 91% (13504/14839) remote: Counting objects: 92% (13652/14839) remote: Counting objects: 93% (13801/14839) remote: Counting objects: 94% (13949/14839) remote: Counting objects: 95% (14098/14839) remote: Counting objects: 96% (14246/14839) remote: Counting objects: 97% (14394/14839) remote: Counting objects: 98% (14543/14839) remote: Counting objects: 99% (14691/14839) remote: Counting objects: 100% (14839/14839) remote: Counting objects: 100% (14839/14839), done.
  5. 4.78 s remote: Compressing objects: 0% (1/3073) remote: Compressing objects: 1% (31/3073) remote: Compressing objects: 2% (62/3073) remote: Compressing objects: 3% (93/3073) remote: Compressing objects: 4% (123/3073) remote: Compressing objects: 5% (154/3073)
  6. 9.99 s remote: Compressing objects: 5% (166/3073) remote: Compressing objects: 6% (185/3073) remote: Compressing objects: 6% (206/3073) remote: Compressing objects: 7% (216/3073) remote: Compressing objects: 8% (246/3073) remote: Compressing objects: 8% (267/3073) remote: Compressing objects: 9% (277/3073) remote: Compressing objects: 10% (308/3073) remote: Compressing objects: 11% (339/3073) remote: Compressing objects: 12% (369/3073) remote: Compressing objects: 12% (389/3073) remote: Compressing objects: 13% (400/3073) remote: Compressing objects: 14% (431/3073) remote: Compressing objects: 15% (461/3073) remote: Compressing objects: 16% (492/3073) remote: Compressing objects: 17% (523/3073) remote: Compressing objects: 17% (526/3073) remote: Compressing objects: 18% (554/3073) remote: Compressing objects: 19% (584/3073) remote: Compressing objects: 20% (615/3073) remote: Compressing objects: 21% (646/3073) remote: Compressing objects: 22% (677/3073) remote: Compressing objects: 23% (707/3073) remote: Compressing objects: 24% (738/3073) remote: Compressing objects: 25% (769/3073)
  7. 10.54 s remote: Compressing objects: 25% (780/3073) remote: Compressing objects: 26% (799/3073) remote: Compressing objects: 27% (830/3073) remote: Compressing objects: 28% (861/3073) remote: Compressing objects: 29% (892/3073) remote: Compressing objects: 30% (922/3073) remote: Compressing objects: 31% (953/3073) remote: Compressing objects: 32% (984/3073) remote: Compressing objects: 33% (1015/3073) remote: Compressing objects: 34% (1045/3073) remote: Compressing objects: 35% (1076/3073) remote: Compressing objects: 36% (1107/3073) remote: Compressing objects: 37% (1138/3073) remote: Compressing objects: 38% (1168/3073) remote: Compressing objects: 39% (1199/3073) remote: Compressing objects: 40% (1230/3073) remote: Compressing objects: 41% (1260/3073) remote: Compressing objects: 42% (1291/3073) remote: Compressing objects: 43% (1322/3073) remote: Compressing objects: 44% (1353/3073) remote: Compressing objects: 45% (1383/3073) remote: Compressing objects: 46% (1414/3073) remote: Compressing objects: 47% (1445/3073) remote: Compressing objects: 48% (1476/3073) remote: Compressing objects: 49% (1506/3073) remote: Compressing objects: 50% (1537/3073) remote: Compressing objects: 51% (1568/3073) remote: Compressing objects: 52% (1598/3073) remote: Compressing objects: 53% (1629/3073) remote: Compressing objects: 54% (1660/3073) remote: Compressing objects: 55% (1691/3073) remote: Compressing objects: 56% (1721/3073) remote: Compressing objects: 57% (1752/3073) remote: Compressing objects: 58% (1783/3073) remote: Compressing objects: 59% (1814/3073) remote: Compressing objects: 60% (1844/3073) remote: Compressing objects: 61% (1875/3073) remote: Compressing objects: 62% (1906/3073) remote: Compressing objects: 63% (1936/3073) remote: Compressing objects: 64% (1967/3073) remote: Compressing objects: 65% (1998/3073) remote: Compressing objects: 66% (2029/3073) remote: Compressing objects: 67% (2059/3073) remote: Compressing objects: 68% (2090/3073) remote: Compressing objects: 69% (2121/3073) remote: Compressing objects: 70% (2152/3073) remote: Compressing objects: 71% (2182/3073) remote: Compressing objects: 72% (2213/3073) remote: Compressing objects: 73% (2244/3073) remote: Compressing objects: 74% (2275/3073) remote: Compressing objects: 75% (2305/3073) remote: Compressing objects: 76% (2336/3073) remote: Compressing objects: 77% (2367/3073) remote: Compressing objects: 78% (2397/3073) remote: Compressing objects: 79% (2428/3073) remote: Compressing objects: 80% (2459/3073) remote: Compressing objects: 81% (2490/3073) remote: Compressing objects: 82% (2520/3073) remote: Compressing objects: 83% (2551/3073) remote: Compressing objects: 84% (2582/3073) remote: Compressing objects: 85% (2613/3073) remote: Compressing objects: 86% (2643/3073) remote: Compressing objects: 87% (2674/3073) remote: Compressing objects: 88% (2705/3073) remote: Compressing objects: 89% (2735/3073) remote: Compressing objects: 90% (2766/3073) remote: Compressing objects: 91% (2797/3073) remote: Compressing objects: 92% (2828/3073) remote: Compressing objects: 93% (2858/3073) remote: Compressing objects: 94% (2889/3073) remote: Compressing objects: 95% (2920/3073) remote: Compressing objects: 96% (2951/3073) remote: Compressing objects: 97% (2981/3073) remote: Compressing objects: 98% (3012/3073) remote: Compressing objects: 99% (3043/3073) remote: Compressing objects: 100% (3073/3073) remote: Compressing objects: 100% (3073/3073), done.
  8. 15.21 s Receiving objects: 0% (1/172467) Receiving objects: 1% (1725/172467), 1.94 MiB | 3.64 MiB/s Receiving objects: 1% (3312/172467), 1.94 MiB | 3.64 MiB/s Receiving objects: 2% (3450/172467), 1.94 MiB | 3.64 MiB/s Receiving objects: 3% (5175/172467), 17.24 MiB | 16.71 MiB/s Receiving objects: 4% (6899/172467), 17.24 MiB | 16.71 MiB/s Receiving objects: 5% (8624/172467), 35.78 MiB | 22.91 MiB/s Receiving objects: 6% (10349/172467), 35.78 MiB | 22.91 MiB/s Receiving objects: 6% (11524/172467), 35.78 MiB | 22.91 MiB/s Receiving objects: 7% (12073/172467), 54.79 MiB | 26.57 MiB/s Receiving objects: 8% (13798/172467), 54.79 MiB | 26.57 MiB/s Receiving objects: 9% (15523/172467), 72.06 MiB | 28.13 MiB/s Receiving objects: 10% (17247/172467), 72.06 MiB | 28.13 MiB/s Receiving objects: 11% (18972/172467), 72.06 MiB | 28.13 MiB/s Receiving objects: 11% (19704/172467), 72.06 MiB | 28.13 MiB/s Receiving objects: 12% (20697/172467), 83.75 MiB | 27.35 MiB/s Receiving objects: 13% (22421/172467), 83.75 MiB | 27.35 MiB/s Receiving objects: 14% (24146/172467), 83.75 MiB | 27.35 MiB/s Receiving objects: 15% (25871/172467), 83.75 MiB | 27.35 MiB/s Receiving objects: 16% (27595/172467), 83.75 MiB | 27.35 MiB/s Receiving objects: 17% (29320/172467), 83.75 MiB | 27.35 MiB/s Receiving objects: 18% (31045/172467), 83.75 MiB | 27.35 MiB/s Receiving objects: 19% (32769/172467), 83.75 MiB | 27.35 MiB/s Receiving objects: 20% (34494/172467), 83.75 MiB | 27.35 MiB/s Receiving objects: 21% (36219/172467), 83.75 MiB | 27.35 MiB/s Receiving objects: 22% (37943/172467), 83.75 MiB | 27.35 MiB/s Receiving objects: 23% (39668/172467), 83.75 MiB | 27.35 MiB/s Receiving objects: 24% (41393/172467), 83.75 MiB | 27.35 MiB/s Receiving objects: 25% (43117/172467), 83.75 MiB | 27.35 MiB/s Receiving objects: 26% (44842/172467), 83.75 MiB | 27.35 MiB/s Receiving objects: 27% (46567/172467), 83.75 MiB | 27.35 MiB/s Receiving objects: 28% (48291/172467), 83.75 MiB | 27.35 MiB/s Receiving objects: 29% (50016/172467), 107.28 MiB | 30.12 MiB/s Receiving objects: 30% (51741/172467), 107.28 MiB | 30.12 MiB/s Receiving objects: 31% (53465/172467), 107.28 MiB | 30.12 MiB/s Receiving objects: 32% (55190/172467), 107.28 MiB | 30.12 MiB/s Receiving objects: 33% (56915/172467), 107.28 MiB | 30.12 MiB/s Receiving objects: 33% (58624/172467), 107.28 MiB | 30.12 MiB/s Receiving objects: 34% (58639/172467), 107.28 MiB | 30.12 MiB/s Receiving objects: 35% (60364/172467), 126.57 MiB | 31.17 MiB/s Receiving objects: 36% (62089/172467), 126.57 MiB | 31.17 MiB/s Receiving objects: 37% (63813/172467), 126.57 MiB | 31.17 MiB/s Receiving objects: 38% (65538/172467), 126.57 MiB | 31.17 MiB/s Receiving objects: 39% (67263/172467), 126.57 MiB | 31.17 MiB/s
  9. 20.21 s Receiving objects: 39% (68210/172467), 162.00 MiB | 35.31 MiB/s Receiving objects: 40% (68987/172467), 162.00 MiB | 35.31 MiB/s Receiving objects: 41% (70712/172467), 162.00 MiB | 35.31 MiB/s Receiving objects: 42% (72437/172467), 162.00 MiB | 35.31 MiB/s Receiving objects: 43% (74161/172467), 162.00 MiB | 35.31 MiB/s Receiving objects: 44% (75886/172467), 180.93 MiB | 36.11 MiB/s Receiving objects: 45% (77611/172467), 180.93 MiB | 36.11 MiB/s Receiving objects: 46% (79335/172467), 180.93 MiB | 36.11 MiB/s Receiving objects: 47% (81060/172467), 180.93 MiB | 36.11 MiB/s Receiving objects: 48% (82785/172467), 180.93 MiB | 36.11 MiB/s Receiving objects: 49% (84509/172467), 180.93 MiB | 36.11 MiB/s Receiving objects: 49% (86180/172467), 198.34 MiB | 36.10 MiB/s Receiving objects: 50% (86234/172467), 198.34 MiB | 36.10 MiB/s Receiving objects: 51% (87959/172467), 198.34 MiB | 36.10 MiB/s Receiving objects: 52% (89683/172467), 198.34 MiB | 36.10 MiB/s Receiving objects: 52% (89800/172467), 217.00 MiB | 35.94 MiB/s Receiving objects: 53% (91408/172467), 253.47 MiB | 37.58 MiB/s Receiving objects: 53% (92097/172467), 253.47 MiB | 37.58 MiB/s Receiving objects: 54% (93133/172467), 272.36 MiB | 36.49 MiB/s Receiving objects: 55% (94857/172467), 272.36 MiB | 36.49 MiB/s Receiving objects: 56% (96582/172467), 272.36 MiB | 36.49 MiB/s Receiving objects: 57% (98307/172467), 290.65 MiB | 36.26 MiB/s Receiving objects: 58% (100031/172467), 290.65 MiB | 36.26 MiB/s Receiving objects: 59% (101756/172467), 290.65 MiB | 36.26 MiB/s Receiving objects: 60% (103481/172467), 290.65 MiB | 36.26 MiB/s Receiving objects: 61% (105205/172467), 290.65 MiB | 36.26 MiB/s Receiving objects: 62% (106930/172467), 290.65 MiB | 36.26 MiB/s Receiving objects: 63% (108655/172467), 290.65 MiB | 36.26 MiB/s Receiving objects: 64% (110379/172467), 290.65 MiB | 36.26 MiB/s Receiving objects: 64% (110514/172467), 290.65 MiB | 36.26 MiB/s Receiving objects: 65% (112104/172467), 290.65 MiB | 36.26 MiB/s Receiving objects: 66% (113829/172467), 308.65 MiB | 36.17 MiB/s Receiving objects: 67% (115553/172467), 308.65 MiB | 36.17 MiB/s Receiving objects: 68% (117278/172467), 308.65 MiB | 36.17 MiB/s
  10. 25.16 s Receiving objects: 69% (119003/172467), 327.01 MiB | 36.50 MiB/s Receiving objects: 70% (120727/172467), 327.01 MiB | 36.50 MiB/s Receiving objects: 70% (122140/172467), 327.01 MiB | 36.50 MiB/s Receiving objects: 71% (122452/172467), 327.01 MiB | 36.50 MiB/s Receiving objects: 72% (124177/172467), 363.23 MiB | 36.41 MiB/s Receiving objects: 72% (125892/172467), 363.23 MiB | 36.41 MiB/s Receiving objects: 73% (125901/172467), 363.23 MiB | 36.41 MiB/s Receiving objects: 74% (127626/172467), 381.79 MiB | 36.37 MiB/s Receiving objects: 75% (129351/172467), 381.79 MiB | 36.37 MiB/s Receiving objects: 76% (131075/172467), 400.54 MiB | 36.49 MiB/s Receiving objects: 76% (132249/172467), 400.54 MiB | 36.49 MiB/s Receiving objects: 77% (132800/172467), 418.66 MiB | 36.47 MiB/s Receiving objects: 78% (134525/172467), 436.44 MiB | 36.20 MiB/s Receiving objects: 79% (136249/172467), 436.44 MiB | 36.20 MiB/s Receiving objects: 80% (137974/172467), 436.44 MiB | 36.20 MiB/s Receiving objects: 80% (138101/172467), 436.44 MiB | 36.20 MiB/s Receiving objects: 81% (139699/172467), 455.15 MiB | 36.30 MiB/s Receiving objects: 82% (141423/172467), 473.11 MiB | 36.29 MiB/s Receiving objects: 82% (141843/172467), 473.11 MiB | 36.29 MiB/s Receiving objects: 83% (143148/172467), 491.90 MiB | 36.30 MiB/s
  11. 29.70 s Receiving objects: 84% (144873/172467), 511.44 MiB | 36.68 MiB/s Receiving objects: 84% (145043/172467), 511.44 MiB | 36.68 MiB/s Receiving objects: 85% (146597/172467), 528.32 MiB | 36.38 MiB/s Receiving objects: 85% (147545/172467), 547.54 MiB | 36.48 MiB/s Receiving objects: 85% (147551/172467), 602.79 MiB | 36.69 MiB/s Receiving objects: 85% (147553/172467), 621.41 MiB | 36.67 MiB/s Receiving objects: 85% (147557/172467), 657.73 MiB | 36.56 MiB/s
  12. 33.72 s Receiving objects: 85% (147565/172467), 713.08 MiB | 36.61 MiB/s Receiving objects: 85% (148255/172467), 731.65 MiB | 36.43 MiB/s Receiving objects: 86% (148322/172467), 731.65 MiB | 36.43 MiB/s Receiving objects: 87% (150047/172467), 731.65 MiB | 36.43 MiB/s Receiving objects: 88% (151771/172467), 749.51 MiB | 36.52 MiB/s Receiving objects: 89% (153496/172467), 749.51 MiB | 36.52 MiB/s Receiving objects: 90% (155221/172467), 767.88 MiB | 36.43 MiB/s Receiving objects: 91% (156945/172467), 767.88 MiB | 36.43 MiB/s Receiving objects: 92% (158670/172467), 767.88 MiB | 36.43 MiB/s Receiving objects: 93% (160395/172467), 767.88 MiB | 36.43 MiB/s Receiving objects: 94% (162119/172467), 767.88 MiB | 36.43 MiB/s Receiving objects: 95% (163844/172467), 767.88 MiB | 36.43 MiB/s Receiving objects: 96% (165569/172467), 767.88 MiB | 36.43 MiB/s Receiving objects: 96% (165843/172467), 767.88 MiB | 36.43 MiB/s Receiving objects: 97% (167293/172467), 767.88 MiB | 36.43 MiB/s Receiving objects: 98% (169018/172467), 767.88 MiB | 36.43 MiB/s Receiving objects: 99% (170743/172467), 767.88 MiB | 36.43 MiB/s Receiving objects: 99% (172373/172467), 793.14 MiB | 33.92 MiB/s remote: Total 172467 (delta 12813), reused 11932 (delta 11758), pack-reused 157628 (from 3)
  13. 33.73 s Receiving objects: 100% (172467/172467), 793.14 MiB | 33.92 MiB/s Receiving objects: 100% (172467/172467), 798.59 MiB | 34.61 MiB/s, done.
  14. 35.39 s Resolving deltas: 0% (0/106083) Resolving deltas: 1% (1061/106083) Resolving deltas: 2% (2122/106083) Resolving deltas: 3% (3183/106083) Resolving deltas: 4% (4244/106083) Resolving deltas: 5% (5305/106083) Resolving deltas: 6% (6365/106083) Resolving deltas: 7% (7426/106083) Resolving deltas: 8% (8487/106083) Resolving deltas: 9% (9549/106083) Resolving deltas: 10% (10610/106083) Resolving deltas: 11% (11670/106083) Resolving deltas: 12% (12730/106083) Resolving deltas: 13% (13791/106083) Resolving deltas: 14% (14852/106083) Resolving deltas: 15% (15914/106083) Resolving deltas: 16% (16974/106083) Resolving deltas: 17% (18035/106083) Resolving deltas: 18% (19095/106083) Resolving deltas: 18% (19339/106083) Resolving deltas: 19% (20156/106083) Resolving deltas: 20% (21217/106083) Resolving deltas: 21% (22278/106083) Resolving deltas: 22% (23339/106083) Resolving deltas: 23% (24400/106083) Resolving deltas: 24% (25460/106083) Resolving deltas: 25% (26521/106083) Resolving deltas: 26% (27582/106083) Resolving deltas: 27% (28643/106083) Resolving deltas: 28% (29705/106083)
  15. 39.24 s Resolving deltas: 29% (30765/106083) Resolving deltas: 30% (31825/106083) Resolving deltas: 31% (32886/106083) Resolving deltas: 32% (33947/106083) Resolving deltas: 33% (35008/106083) Resolving deltas: 34% (36069/106083) Resolving deltas: 35% (37130/106083) Resolving deltas: 36% (38190/106083) Resolving deltas: 36% (38534/106083) Resolving deltas: 37% (39251/106083) Resolving deltas: 38% (40312/106083) Resolving deltas: 39% (41374/106083) Resolving deltas: 40% (42436/106083) Resolving deltas: 41% (43495/106083) Resolving deltas: 42% (44555/106083) Resolving deltas: 43% (45616/106083) Resolving deltas: 44% (46677/106083) Resolving deltas: 45% (47738/106083) Resolving deltas: 46% (48799/106083) Resolving deltas: 47% (49860/106083) Resolving deltas: 48% (50920/106083) Resolving deltas: 49% (51981/106083) Resolving deltas: 50% (53042/106083) Resolving deltas: 51% (54103/106083) Resolving deltas: 52% (55164/106083) Resolving deltas: 53% (56224/106083) Resolving deltas: 54% (57285/106083) Resolving deltas: 55% (58346/106083) Resolving deltas: 56% (59407/106083) Resolving deltas: 57% (60468/106083) Resolving deltas: 58% (61529/106083) Resolving deltas: 59% (62589/106083) Resolving deltas: 60% (63650/106083) Resolving deltas: 61% (64711/106083) Resolving deltas: 61% (64873/106083) Resolving deltas: 62% (65772/106083) Resolving deltas: 63% (66833/106083) Resolving deltas: 64% (67894/106083) Resolving deltas: 65% (68954/106083) Resolving deltas: 66% (70015/106083) Resolving deltas: 67% (71076/106083) Resolving deltas: 68% (72137/106083) Resolving deltas: 69% (73198/106083) Resolving deltas: 70% (74259/106083) Resolving deltas: 71% (75319/106083) Resolving deltas: 72% (76380/106083) Resolving deltas: 73% (77441/106083) Resolving deltas: 74% (78502/106083) Resolving deltas: 75% (79563/106083) Resolving deltas: 76% (80624/106083) Resolving deltas: 77% (81684/106083) Resolving deltas: 78% (82745/106083) Resolving deltas: 79% (83806/106083) Resolving deltas: 80% (84867/106083) Resolving deltas: 81% (85928/106083) Resolving deltas: 82% (86989/106083) Resolving deltas: 82% (87647/106083) Resolving deltas: 83% (88049/106083) Resolving deltas: 84% (89111/106083) Resolving deltas: 85% (90171/106083) Resolving deltas: 86% (91232/106083) Resolving deltas: 87% (92293/106083) Resolving deltas: 88% (93354/106083) Resolving deltas: 89% (94414/106083) Resolving deltas: 90% (95475/106083) Resolving deltas: 91% (96536/106083) Resolving deltas: 92% (97597/106083) Resolving deltas: 93% (98658/106083) Resolving deltas: 94% (99719/106083) Resolving deltas: 95% (100779/106083) Resolving deltas: 95% (100955/106083) Resolving deltas: 96% (101841/106083) Resolving deltas: 97% (102901/106083) Resolving deltas: 98% (103963/106083) Resolving deltas: 99% (105023/106083) Resolving deltas: 100% (106083/106083) Resolving deltas: 100% (106083/106083), done.
  16. 41.25 s Fetching commit 1e8063a763d3aa515749c33616ee59aa827705be for ninjars-combined ...
  17. 41.25 s $ /nix/store/b1wn5clix1mz4vpfih7x9cnj9qfh7c6h-git-2.54.0/bin/git fetch origin 1e8063a763d3aa515749c33616ee59aa827705be
  18. 42.10 s From https://github.com/alphal00p/gammaloop
  19. 42.10 s * branch 1e8063a763d3aa515749c33616ee59aa827705be -> FETCH_HEAD
  20. 42.23 s $ /nix/store/bhv6xyvqw6gjs3j488gi1z6wdv18bdpa-coreutils-9.11/bin/timeout --kill-after=15s 7200s /nix/store/b1wn5clix1mz4vpfih7x9cnj9qfh7c6h-git-2.54.0/bin/git -c advice.detachedHead=false checkout 1e8063a763d3aa515749c33616ee59aa827705be
  21. 43.01 s HEAD is now at 1e8063a76 Merge commit '30fb0f28c' into ninjars-combined
  22. 43.03 s $ /nix/store/bhv6xyvqw6gjs3j488gi1z6wdv18bdpa-coreutils-9.11/bin/timeout --kill-after=15s 7200s /nix/store/5np0yidzrnyjbb243hvgqpgpss865p0n-nix-2.34.9/bin/nix --extra-experimental-features nix-command --extra-experimental-features flakes --log-format internal-json run .#packages.x86_64-linux.nix-ci-check-gammaloop-nextest-clinnet --print-build-logs
  23. 43.56 s warning: ignoring untrusted flake configuration setting 'extra-substituters'.
  24. 43.56 s Pass '--accept-flake-config' to trust it
  25. 43.56 s warning: ignoring untrusted flake configuration setting 'extra-trusted-public-keys'.
  26. 43.56 s Pass '--accept-flake-config' to trust it
  27. 50.77 s
  28. 50.94 s Downloading cached nix-ci-check-gammaloop-nextest-clinnet from https://cache.nix-ci.com
  29. 51.07 s Downloaded cached nix-ci-check-gammaloop-nextest-clinnet (1128 B) in 122ms
  30. 51.07 s Progress: 0 of 1 built, 1 of 1 downloaded from cache
  31. 51.32 s evaluating derivation 'gdo you want to allow configuration setting 'extra-substituters' to be set to 'https://cache.nix-ci.com' (y/N)? do you want to permanently mark this value as untrusted (y/N)? warning: ignoring untrusted flake configuration setting 'extra-substituters'.
  32. 51.32 s Pass '--accept-flake-config' to trust it
  33. 51.32 s do you want to allow configuration setting 'extra-trusted-public-keys' to be set to 'nix-ci:g3xV5BDTLtIBZr/A00IU1x0EtKKlb7YLgBN2SgYgM6A=' (y/N)? do you want to permanently mark this value as untrusted (y/N)? warning: ignoring untrusted flake configuration setting 'extra-trusted-public-keys'.
  34. 51.32 s Pass '--accept-flake-config' to trust it
  35. 55.86 s copying '/nix/store/l3sx evaluating derivation 'g copying '/nix/store/l3sx evaluating derivation 'g copying '/nix/store/l3sx evaluating derivation 'g copying '/nix/store/l3sx evaluating derivation 'g
  36. 60.15 s copying '/nix/store/l3sx evaluating derivation 'g copying '/nix/store/l3sx evaluating derivation 'g copying '/nix/store/l3sx evaluating derivation 'g copying '/nix/store/l3sx evaluating derivation 'g querying gammaloop-nexte [0/3 built, 1/0/1 copied [0/2 built, 1 copied (9. [1/0/2 built, 1 copied (gammaloop-nextest-binaries-clinnet (post)> Uploading to the NixCI cache: /nix/store/r6d9ks0lpr631mrcy43137c895a0w5ns-gammaloop-nextest-binaries-clinnet
  37. 60.20 s gammaloop-nextest-binaries-clinnet (post)> warning: 'warn-short-path-literals' is deprecated, use 'lint-short-path-literals = ignore' instead
  38. 60.21 s gammaloop-nextest-binaries-clinnet (post)> copying 0 paths...
  39. 60.27 s gammaloop-nextest-binaries-clinnet (post)> warning: 'warn-short-path-literals' is deprecated, use 'lint-short-path-literals = ignore' instead
  40. 60.44 s gammaloop-nextest-binaries-clinnet (post)> copying 0 paths...
  41. 60.95 s [1/3 built, 1 copied (9. [1/1/2 built, 1 copied (gammaloop-nextest-clinnet> Nextest worker budget: 16
  42. 60.96 s gammaloop-nextest-clinnet> Extracting 4 binaries (including 1 non-test binary), 1 build script output directory, and 1 linked path to /build/source
  43. 61.05 s gammaloop-nextest-clinnet> Extracted 16 files to /build/source in 0.09s
  44. 61.06 s gammaloop-nextest-clinnet> ------------
  45. 61.06 s gammaloop-nextest-clinnet> Nextest run ID fcdab1bd-668b-493d-852c-e1d265152770 with nextest profile: ci_gammaloop
  46. 61.06 s gammaloop-nextest-clinnet> Starting 38 tests across 3 binaries
  47. 155.57 s gammaloop-nextest-clinnet> FAIL [ 94.481s] (32/38) clinnet::public_typst_behavior public_linnest_fixture_assertions_hold
  48. 155.57 s gammaloop-nextest-clinnet> stdout ---
  49. 155.57 s gammaloop-nextest-clinnet>
  50. 155.57 s gammaloop-nextest-clinnet> running 1 test
  51. 155.57 s gammaloop-nextest-clinnet> test public_linnest_fixture_assertions_hold has been running for over 60 seconds
  52. 155.57 s gammaloop-nextest-clinnet> test public_linnest_fixture_assertions_hold ... FAILED
  53. 155.57 s gammaloop-nextest-clinnet>
  54. 155.57 s gammaloop-nextest-clinnet> failures:
  55. 155.57 s gammaloop-nextest-clinnet>
  56. 155.57 s gammaloop-nextest-clinnet> failures:
  57. 155.57 s gammaloop-nextest-clinnet> public_linnest_fixture_assertions_hold
  58. 155.57 s gammaloop-nextest-clinnet>
  59. 155.57 s gammaloop-nextest-clinnet> test result: FAILED. 0 passed; 1 failed; 0 ignored; 0 measured; 17 filtered out; finished in 94.47s
  60. 155.57 s gammaloop-nextest-clinnet>
  61. 155.57 s gammaloop-nextest-clinnet> stderr ---
  62. 155.57 s gammaloop-nextest-clinnet>
  63. 155.57 s gammaloop-nextest-clinnet> thread 'public_linnest_fixture_assertions_hold' (276) panicked at crates/clinnet/tests/public_typst_behavior.rs:81:55:
  64. 155.57 s gammaloop-nextest-clinnet> called `Result::unwrap()` on an `Err` value: typst failed while compiling template /build/.tmp00KetD/.clinnet/templates/linnest-public-behavior.svg
  65. 155.57 s gammaloop-nextest-clinnet>
  66. 155.57 s gammaloop-nextest-clinnet> Command executed:
  67. 155.57 s gammaloop-nextest-clinnet> "typst" "c" "/build/.tmp00KetD/.clinnet/templates/linnest-public-behavior.typ" "/build/.tmp00KetD/.clinnet/templates/linnest-public-behavior.svg" "--root" "/build/.tmp00KetD/.clinnet/templates"
  68. 155.57 s gammaloop-nextest-clinnet>
  69. 155.57 s gammaloop-nextest-clinnet> Typst stdout:
  70. 155.57 s gammaloop-nextest-clinnet>
  71. 155.57 s gammaloop-nextest-clinnet>
  72. 155.57 s gammaloop-nextest-clinnet> Typst stderr:
  73. 155.57 s gammaloop-nextest-clinnet>
  74. 155.57 s gammaloop-nextest-clinnet>
  75. 155.57 s gammaloop-nextest-clinnet> Location:
  76. 155.57 s gammaloop-nextest-clinnet> crates/clinnet/src/lib.rs:741:13
  77. 155.57 s gammaloop-nextest-clinnet> stack backtrace:
  78. 155.57 s gammaloop-nextest-clinnet> 0: __rustc::rust_begin_unwind
  79. 155.57 s gammaloop-nextest-clinnet> 1: core::panicking::panic_fmt
  80. 155.57 s gammaloop-nextest-clinnet> 2: core::result::unwrap_failed
  81. 155.57 s gammaloop-nextest-clinnet> 3: public_typst_behavior::render
  82. 155.57 s gammaloop-nextest-clinnet> 4: <std::sync::once::Once>::call_once_force::<<std::sync::once_lock::OnceLock<alloc::string::String>>::initialize<<std::sync::once_lock::OnceLock<alloc::string::String>>::get_or_init<public_typst_behavior::linnest_public_svg::{closure#0}>::{closure#0}, !>::{closure#0}>::{closure#0}
  83. 155.57 s gammaloop-nextest-clinnet> 5: <std::sys::sync::once::futex::Once>::call
  84. 155.57 s gammaloop-nextest-clinnet> 6: <std::sync::once_lock::OnceLock<alloc::string::String>>::initialize::<<std::sync::once_lock::OnceLock<alloc::string::String>>::get_or_init<public_typst_behavior::linnest_public_svg::{closure#0}>::{closure#0}, !>
  85. 155.57 s gammaloop-nextest-clinnet> 7: <public_typst_behavior::public_linnest_fixture_assertions_hold::{closure#0} as core::ops::function::FnOnce<()>>::call_once
  86. 155.57 s gammaloop-nextest-clinnet> note: Some details are omitted, run with `RUST_BACKTRACE=full` for a verbose backtrace.
  87. 155.57 s gammaloop-nextest-clinnet>
  88. 158.43 s gammaloop-nextest-clinnet> FAIL [ 97.248s] (33/38) clinnet::public_typst_behavior public_linnest_overlays_follow_the_unit
  89. 158.43 s gammaloop-nextest-clinnet> stdout ---
  90. 158.43 s gammaloop-nextest-clinnet>
  91. 158.43 s gammaloop-nextest-clinnet> running 1 test
  92. 158.43 s gammaloop-nextest-clinnet> test public_linnest_overlays_follow_the_unit has been running for over 60 seconds
  93. 158.43 s gammaloop-nextest-clinnet> test public_linnest_overlays_follow_the_unit ... FAILED
  94. 158.43 s gammaloop-nextest-clinnet>
  95. 158.43 s gammaloop-nextest-clinnet> failures:
  96. 158.43 s gammaloop-nextest-clinnet>
  97. 158.43 s gammaloop-nextest-clinnet> failures:
  98. 158.43 s gammaloop-nextest-clinnet> public_linnest_overlays_follow_the_unit
  99. 158.43 s gammaloop-nextest-clinnet>
  100. 158.43 s gammaloop-nextest-clinnet> test result: FAILED. 0 passed; 1 failed; 0 ignored; 0 measured; 17 filtered out; finished in 97.23s
  101. 158.43 s gammaloop-nextest-clinnet>
  102. 158.43 s gammaloop-nextest-clinnet> stderr ---
  103. 158.43 s gammaloop-nextest-clinnet>
  104. 158.43 s gammaloop-nextest-clinnet> thread 'public_linnest_overlays_follow_the_unit' (316) panicked at crates/clinnet/tests/public_typst_behavior.rs:81:55:
  105. 158.43 s gammaloop-nextest-clinnet> called `Result::unwrap()` on an `Err` value: typst failed while compiling template /build/.tmpkPG7Ve/.clinnet/templates/linnest-public-behavior.svg
  106. 158.43 s gammaloop-nextest-clinnet>
  107. 158.43 s gammaloop-nextest-clinnet> Command executed:
  108. 158.43 s gammaloop-nextest-clinnet> "typst" "c" "/build/.tmpkPG7Ve/.clinnet/templates/linnest-public-behavior.typ" "/build/.tmpkPG7Ve/.clinnet/templates/linnest-public-behavior.svg" "--root" "/build/.tmpkPG7Ve/.clinnet/templates"
  109. 158.43 s gammaloop-nextest-clinnet>
  110. 158.43 s gammaloop-nextest-clinnet> Typst stdout:
  111. 158.43 s gammaloop-nextest-clinnet>
  112. 158.43 s gammaloop-nextest-clinnet>
  113. 158.43 s gammaloop-nextest-clinnet> Typst stderr:
  114. 158.43 s gammaloop-nextest-clinnet>
  115. 158.43 s gammaloop-nextest-clinnet>
  116. 158.43 s gammaloop-nextest-clinnet> Location:
  117. 158.43 s gammaloop-nextest-clinnet> crates/clinnet/src/lib.rs:741:13
  118. 158.43 s gammaloop-nextest-clinnet> stack backtrace:
  119. 158.43 s gammaloop-nextest-clinnet> 0: __rustc::rust_begin_unwind
  120. 158.43 s gammaloop-nextest-clinnet> 1: core::panicking::panic_fmt
  121. 158.43 s gammaloop-nextest-clinnet> 2: core::result::unwrap_failed
  122. 158.43 s gammaloop-nextest-clinnet> 3: public_typst_behavior::render
  123. 158.43 s gammaloop-nextest-clinnet> 4: <std::sync::once::Once>::call_once_force::<<std::sync::once_lock::OnceLock<alloc::string::String>>::initialize<<std::sync::once_lock::OnceLock<alloc::string::String>>::get_or_init<public_typst_behavior::linnest_public_svg::{closure#0}>::{closure#0}, !>::{closure#0}>::{closure#0}
  124. 158.43 s gammaloop-nextest-clinnet> 5: <std::sys::sync::once::futex::Once>::call
  125. 158.43 s gammaloop-nextest-clinnet> 6: <std::sync::once_lock::OnceLock<alloc::string::String>>::initialize::<<std::sync::once_lock::OnceLock<alloc::string::String>>::get_or_init<public_typst_behavior::linnest_public_svg::{closure#0}>::{closure#0}, !>
  126. 158.43 s gammaloop-nextest-clinnet> 7: <public_typst_behavior::public_linnest_overlays_follow_the_unit::{closure#0} as core::ops::function::FnOnce<()>>::call_once
  127. 158.43 s gammaloop-nextest-clinnet> note: Some details are omitted, run with `RUST_BACKTRACE=full` for a verbose backtrace.
  128. 158.43 s gammaloop-nextest-clinnet>
  129. 302.34 s gammaloop-nextest-clinnet> TERMINATING [>240.000s] (-----) clinnet::public_typst_behavior public_linnest_labels_follow_their_carriers
  130. 302.36 s gammaloop-nextest-clinnet> TERMINATING [>240.000s] (-----) clinnet::public_typst_behavior public_linnest_arrow_shafts_and_crossing_gaps
  131. 302.36 s gammaloop-nextest-clinnet> TERMINATING [>240.000s] (-----) clinnet::public_typst_behavior public_linnest_endpoint_anchor_distances_stay_local
  132. 302.36 s gammaloop-nextest-clinnet> TERMINATING [>240.000s] (-----) clinnet::public_typst_behavior public_linnest_momentum_layers_place_shafts_and_labels
  133. 302.36 s gammaloop-nextest-clinnet> TERMINATING [>240.000s] (-----) clinnet::public_typst_behavior public_linnest_edge_styles_skip_fallbacks
  134. 302.36 s gammaloop-nextest-clinnet> TIMEOUT [ 241.145s] (34/38) clinnet::public_typst_behavior public_linnest_labels_follow_their_carriers
  135. 302.36 s gammaloop-nextest-clinnet> stdout ---
  136. 302.36 s gammaloop-nextest-clinnet>
  137. 302.36 s gammaloop-nextest-clinnet> running 1 test
  138. 302.36 s gammaloop-nextest-clinnet> test public_linnest_labels_follow_their_carriers has been running for over 60 seconds
  139. 302.36 s gammaloop-nextest-clinnet>
  140. 302.36 s gammaloop-nextest-clinnet> (test timed out)
  141. 302.36 s gammaloop-nextest-clinnet>
  142. 302.36 s gammaloop-nextest-clinnet> TIMEOUT [ 241.158s] (35/38) clinnet::public_typst_behavior public_linnest_edge_styles_skip_fallbacks
  143. 302.36 s gammaloop-nextest-clinnet> stdout ---
  144. 302.36 s gammaloop-nextest-clinnet>
  145. 302.36 s gammaloop-nextest-clinnet> running 1 test
  146. 302.36 s gammaloop-nextest-clinnet> test public_linnest_edge_styles_skip_fallbacks has been running for over 60 seconds
  147. 302.36 s gammaloop-nextest-clinnet>
  148. 302.36 s gammaloop-nextest-clinnet> (test timed out)
  149. 302.36 s gammaloop-nextest-clinnet>
  150. 302.36 s gammaloop-nextest-clinnet> TIMEOUT [ 241.160s] (36/38) clinnet::public_typst_behavior public_linnest_endpoint_anchor_distances_stay_local
  151. 302.36 s gammaloop-nextest-clinnet> stdout ---
  152. 302.36 s gammaloop-nextest-clinnet>
  153. 302.36 s gammaloop-nextest-clinnet> running 1 test
  154. 302.36 s gammaloop-nextest-clinnet> test public_linnest_endpoint_anchor_distances_stay_local has been running for over 60 seconds
  155. 302.36 s gammaloop-nextest-clinnet>
  156. 302.36 s gammaloop-nextest-clinnet> (test timed out)
  157. 302.36 s gammaloop-nextest-clinnet>
  158. 302.36 s gammaloop-nextest-clinnet> TIMEOUT [ 241.143s] (37/38) clinnet::public_typst_behavior public_linnest_momentum_layers_place_shafts_and_labels
  159. 302.36 s gammaloop-nextest-clinnet> stdout ---
  160. 302.36 s gammaloop-nextest-clinnet>
  161. 302.36 s gammaloop-nextest-clinnet> running 1 test
  162. 302.36 s gammaloop-nextest-clinnet> test public_linnest_momentum_layers_place_shafts_and_labels has been running for over 60 seconds
  163. 302.36 s gammaloop-nextest-clinnet>
  164. 302.36 s gammaloop-nextest-clinnet> (test timed out)
  165. 302.36 s gammaloop-nextest-clinnet>
  166. 302.36 s gammaloop-nextest-clinnet> TIMEOUT [ 241.160s] (38/38) clinnet::public_typst_behavior public_linnest_arrow_shafts_and_crossing_gaps
  167. 302.36 s gammaloop-nextest-clinnet> stdout ---
  168. 302.36 s gammaloop-nextest-clinnet>
  169. 302.36 s gammaloop-nextest-clinnet> running 1 test
  170. 302.36 s gammaloop-nextest-clinnet> test public_linnest_arrow_shafts_and_crossing_gaps has been running for over 60 seconds
  171. 302.36 s gammaloop-nextest-clinnet>
  172. 302.36 s gammaloop-nextest-clinnet> (test timed out)
  173. 302.36 s gammaloop-nextest-clinnet>
  174. 302.36 s gammaloop-nextest-clinnet> ------------
  175. 302.36 s gammaloop-nextest-clinnet> Summary [ 241.178s] 38 tests run: 31 passed, 2 failed, 5 timed out, 0 skipped
  176. 302.36 s gammaloop-nextest-clinnet> FAIL [ 94.481s] (32/38) clinnet::public_typst_behavior public_linnest_fixture_assertions_hold
  177. 302.36 s gammaloop-nextest-clinnet> stdout ---
  178. 302.36 s gammaloop-nextest-clinnet>
  179. 302.36 s gammaloop-nextest-clinnet> running 1 test
  180. 302.36 s gammaloop-nextest-clinnet> test public_linnest_fixture_assertions_hold has been running for over 60 seconds
  181. 302.36 s gammaloop-nextest-clinnet> test public_linnest_fixture_assertions_hold ... FAILED
  182. 302.36 s gammaloop-nextest-clinnet>
  183. 302.36 s gammaloop-nextest-clinnet> failures:
  184. 302.36 s gammaloop-nextest-clinnet>
  185. 302.36 s gammaloop-nextest-clinnet> failures:
  186. 302.36 s gammaloop-nextest-clinnet> public_linnest_fixture_assertions_hold
  187. 302.36 s gammaloop-nextest-clinnet>
  188. 302.36 s gammaloop-nextest-clinnet> test result: FAILED. 0 passed; 1 failed; 0 ignored; 0 measured; 17 filtered out; finished in 94.47s
  189. 302.36 s gammaloop-nextest-clinnet>
  190. 302.36 s gammaloop-nextest-clinnet> stderr ---
  191. 302.36 s gammaloop-nextest-clinnet>
  192. 302.36 s gammaloop-nextest-clinnet> thread 'public_linnest_fixture_assertions_hold' (276) panicked at crates/clinnet/tests/public_typst_behavior.rs:81:55:
  193. 302.36 s gammaloop-nextest-clinnet> called `Result::unwrap()` on an `Err` value: typst failed while compiling template /build/.tmp00KetD/.clinnet/templates/linnest-public-behavior.svg
  194. 302.36 s gammaloop-nextest-clinnet>
  195. 302.36 s gammaloop-nextest-clinnet> Command executed:
  196. 302.36 s gammaloop-nextest-clinnet> "typst" "c" "/build/.tmp00KetD/.clinnet/templates/linnest-public-behavior.typ" "/build/.tmp00KetD/.clinnet/templates/linnest-public-behavior.svg" "--root" "/build/.tmp00KetD/.clinnet/templates"
  197. 302.36 s gammaloop-nextest-clinnet>
  198. 302.36 s gammaloop-nextest-clinnet> Typst stdout:
  199. 302.36 s gammaloop-nextest-clinnet>
  200. 302.36 s gammaloop-nextest-clinnet>
  201. 302.36 s gammaloop-nextest-clinnet> Typst stderr:
  202. 302.36 s gammaloop-nextest-clinnet>
  203. 302.36 s gammaloop-nextest-clinnet>
  204. 302.36 s gammaloop-nextest-clinnet> Location:
  205. 302.36 s gammaloop-nextest-clinnet> crates/clinnet/src/lib.rs:741:13
  206. 302.36 s gammaloop-nextest-clinnet> stack backtrace:
  207. 302.36 s gammaloop-nextest-clinnet> 0: __rustc::rust_begin_unwind
  208. 302.36 s gammaloop-nextest-clinnet> 1: core::panicking::panic_fmt
  209. 302.36 s gammaloop-nextest-clinnet> 2: core::result::unwrap_failed
  210. 302.36 s gammaloop-nextest-clinnet> 3: public_typst_behavior::render
  211. 302.36 s gammaloop-nextest-clinnet> 4: <std::sync::once::Once>::call_once_force::<<std::sync::once_lock::OnceLock<alloc::string::String>>::initialize<<std::sync::once_lock::OnceLock<alloc::string::String>>::get_or_init<public_typst_behavior::linnest_public_svg::{closure#0}>::{closure#0}, !>::{closure#0}>::{closure#0}
  212. 302.36 s gammaloop-nextest-clinnet> 5: <std::sys::sync::once::futex::Once>::call
  213. 302.36 s gammaloop-nextest-clinnet> 6: <std::sync::once_lock::OnceLock<alloc::string::String>>::initialize::<<std::sync::once_lock::OnceLock<alloc::string::String>>::get_or_init<public_typst_behavior::linnest_public_svg::{closure#0}>::{closure#0}, !>
  214. 302.36 s gammaloop-nextest-clinnet> 7: <public_typst_behavior::public_linnest_fixture_assertions_hold::{closure#0} as core::ops::function::FnOnce<()>>::call_once
  215. 302.36 s gammaloop-nextest-clinnet> note: Some details are omitted, run with `RUST_BACKTRACE=full` for a verbose backtrace.
  216. 302.36 s gammaloop-nextest-clinnet>
  217. 302.36 s gammaloop-nextest-clinnet> FAIL [ 97.248s] (33/38) clinnet::public_typst_behavior public_linnest_overlays_follow_the_unit
  218. 302.36 s gammaloop-nextest-clinnet> stdout ---
  219. 302.36 s gammaloop-nextest-clinnet>
  220. 302.36 s gammaloop-nextest-clinnet> running 1 test
  221. 302.36 s gammaloop-nextest-clinnet> test public_linnest_overlays_follow_the_unit has been running for over 60 seconds
  222. 302.36 s gammaloop-nextest-clinnet> test public_linnest_overlays_follow_the_unit ... FAILED
  223. 302.36 s gammaloop-nextest-clinnet>
  224. 302.36 s gammaloop-nextest-clinnet> failures:
  225. 302.36 s gammaloop-nextest-clinnet>
  226. 302.36 s gammaloop-nextest-clinnet> failures:
  227. 302.36 s gammaloop-nextest-clinnet> public_linnest_overlays_follow_the_unit
  228. 302.36 s gammaloop-nextest-clinnet>
  229. 302.36 s gammaloop-nextest-clinnet> test result: FAILED. 0 passed; 1 failed; 0 ignored; 0 measured; 17 filtered out; finished in 97.23s
  230. 302.36 s gammaloop-nextest-clinnet>
  231. 302.36 s gammaloop-nextest-clinnet> stderr ---
  232. 302.36 s gammaloop-nextest-clinnet>
  233. 302.36 s gammaloop-nextest-clinnet> thread 'public_linnest_overlays_follow_the_unit' (316) panicked at crates/clinnet/tests/public_typst_behavior.rs:81:55:
  234. 302.36 s gammaloop-nextest-clinnet> called `Result::unwrap()` on an `Err` value: typst failed while compiling template /build/.tmpkPG7Ve/.clinnet/templates/linnest-public-behavior.svg
  235. 302.36 s gammaloop-nextest-clinnet>
  236. 302.36 s gammaloop-nextest-clinnet> Command executed:
  237. 302.36 s gammaloop-nextest-clinnet> "typst" "c" "/build/.tmpkPG7Ve/.clinnet/templates/linnest-public-behavior.typ" "/build/.tmpkPG7Ve/.clinnet/templates/linnest-public-behavior.svg" "--root" "/build/.tmpkPG7Ve/.clinnet/templates"
  238. 302.36 s gammaloop-nextest-clinnet>
  239. 302.36 s gammaloop-nextest-clinnet> Typst stdout:
  240. 302.36 s gammaloop-nextest-clinnet>
  241. 302.36 s gammaloop-nextest-clinnet>
  242. 302.36 s gammaloop-nextest-clinnet> Typst stderr:
  243. 302.36 s gammaloop-nextest-clinnet>
  244. 302.36 s gammaloop-nextest-clinnet>
  245. 302.36 s gammaloop-nextest-clinnet> Location:
  246. 302.36 s gammaloop-nextest-clinnet> crates/clinnet/src/lib.rs:741:13
  247. 302.36 s gammaloop-nextest-clinnet> stack backtrace:
  248. 302.36 s gammaloop-nextest-clinnet> 0: __rustc::rust_begin_unwind
  249. 302.36 s gammaloop-nextest-clinnet> 1: core::panicking::panic_fmt
  250. 302.36 s gammaloop-nextest-clinnet> 2: core::result::unwrap_failed
  251. 302.36 s gammaloop-nextest-clinnet> 3: public_typst_behavior::render
  252. 302.36 s gammaloop-nextest-clinnet> 4: <std::sync::once::Once>::call_once_force::<<std::sync::once_lock::OnceLock<alloc::string::String>>::initialize<<std::sync::once_lock::OnceLock<alloc::string::String>>::get_or_init<public_typst_behavior::linnest_public_svg::{closure#0}>::{closure#0}, !>::{closure#0}>::{closure#0}
  253. 302.36 s gammaloop-nextest-clinnet> 5: <std::sys::sync::once::futex::Once>::call
  254. 302.36 s gammaloop-nextest-clinnet> 6: <std::sync::once_lock::OnceLock<alloc::string::String>>::initialize::<<std::sync::once_lock::OnceLock<alloc::string::String>>::get_or_init<public_typst_behavior::linnest_public_svg::{closure#0}>::{closure#0}, !>
  255. 302.36 s gammaloop-nextest-clinnet> 7: <public_typst_behavior::public_linnest_overlays_follow_the_unit::{closure#0} as core::ops::function::FnOnce<()>>::call_once
  256. 302.36 s gammaloop-nextest-clinnet> note: Some details are omitted, run with `RUST_BACKTRACE=full` for a verbose backtrace.
  257. 302.36 s gammaloop-nextest-clinnet>
  258. 302.36 s gammaloop-nextest-clinnet> TIMEOUT [ 241.145s] (34/38) clinnet::public_typst_behavior public_linnest_labels_follow_their_carriers
  259. 302.36 s gammaloop-nextest-clinnet> stdout ---
  260. 302.36 s gammaloop-nextest-clinnet>
  261. 302.36 s gammaloop-nextest-clinnet> running 1 test
  262. 302.36 s gammaloop-nextest-clinnet> test public_linnest_labels_follow_their_carriers has been running for over 60 seconds
  263. 302.36 s gammaloop-nextest-clinnet>
  264. 302.36 s gammaloop-nextest-clinnet> (test timed out)
  265. 302.36 s gammaloop-nextest-clinnet>
  266. 302.36 s gammaloop-nextest-clinnet> TIMEOUT [ 241.158s] (35/38) clinnet::public_typst_behavior public_linnest_edge_styles_skip_fallbacks
  267. 302.36 s gammaloop-nextest-clinnet> stdout ---
  268. 302.36 s gammaloop-nextest-clinnet>
  269. 302.36 s gammaloop-nextest-clinnet> running 1 test
  270. 302.36 s gammaloop-nextest-clinnet> test public_linnest_edge_styles_skip_fallbacks has been running for over 60 seconds
  271. 302.36 s gammaloop-nextest-clinnet>
  272. 302.36 s gammaloop-nextest-clinnet> (test timed out)
  273. 302.36 s gammaloop-nextest-clinnet>
  274. 302.36 s gammaloop-nextest-clinnet> TIMEOUT [ 241.160s] (36/38) clinnet::public_typst_behavior public_linnest_endpoint_anchor_distances_stay_local
  275. 302.36 s gammaloop-nextest-clinnet> stdout ---
  276. 302.36 s gammaloop-nextest-clinnet>
  277. 302.36 s gammaloop-nextest-clinnet> running 1 test
  278. 302.36 s gammaloop-nextest-clinnet> test public_linnest_endpoint_anchor_distances_stay_local has been running for over 60 seconds
  279. 302.36 s gammaloop-nextest-clinnet>
  280. 302.36 s gammaloop-nextest-clinnet> (test timed out)
  281. 302.36 s gammaloop-nextest-clinnet>
  282. 302.36 s gammaloop-nextest-clinnet> TIMEOUT [ 241.143s] (37/38) clinnet::public_typst_behavior public_linnest_momentum_layers_place_shafts_and_labels
  283. 302.36 s gammaloop-nextest-clinnet> stdout ---
  284. 302.36 s gammaloop-nextest-clinnet>
  285. 302.36 s gammaloop-nextest-clinnet> running 1 test
  286. 302.36 s gammaloop-nextest-clinnet> test public_linnest_momentum_layers_place_shafts_and_labels has been running for over 60 seconds
  287. 302.36 s gammaloop-nextest-clinnet>
  288. 302.36 s gammaloop-nextest-clinnet> (test timed out)
  289. 302.36 s gammaloop-nextest-clinnet>
  290. 302.36 s gammaloop-nextest-clinnet> TIMEOUT [ 241.160s] (38/38) clinnet::public_typst_behavior public_linnest_arrow_shafts_and_crossing_gaps
  291. 302.36 s gammaloop-nextest-clinnet> stdout ---
  292. 302.36 s gammaloop-nextest-clinnet>
  293. 302.36 s gammaloop-nextest-clinnet> running 1 test
  294. 302.36 s gammaloop-nextest-clinnet> test public_linnest_arrow_shafts_and_crossing_gaps has been running for over 60 seconds
  295. 302.36 s gammaloop-nextest-clinnet>
  296. 302.36 s gammaloop-nextest-clinnet> (test timed out)
  297. 302.36 s gammaloop-nextest-clinnet>
  298. 302.36 s gammaloop-nextest-clinnet> error: test run failed
  299. 302.50 s gammaloop-nextest-clinnet>
  300. 302.50 s gammaloop-nextest-clinnet> ========== nextest test summary ==========
  301. 302.50 s gammaloop-nextest-clinnet> report: target/nextest/ci_gammaloop/junit.xml
  302. 302.50 s gammaloop-nextest-clinnet> tests: 38, failures: 7, errors: 0
  303. 302.50 s gammaloop-nextest-clinnet>
  304. 302.50 s gammaloop-nextest-clinnet> 1. clinnet::public_typst_behavior::public_linnest_fixture_assertions_hold
  305. 302.50 s gammaloop-nextest-clinnet> failure: test failure with exit code 101
  306. 302.50 s gammaloop-nextest-clinnet> thread 'public_linnest_fixture_assertions_hold' (276) panicked at crates/clinnet/tests/public_typst_behavior.rs:81:55:
  307. 302.50 s gammaloop-nextest-clinnet> called `Result::unwrap()` on an `Err` value: typst failed while compiling template /build/.tmp00KetD/.clinnet/templates/linnest-public-behavior.svg
  308. 302.50 s gammaloop-nextest-clinnet>
  309. 302.50 s gammaloop-nextest-clinnet> Command executed:
  310. 302.50 s gammaloop-nextest-clinnet> "typst" "c" "/build/.tmp00KetD/.clinnet/templates/linnest-public-behavior.typ" "/build/.tmp00KetD/.clinnet/templates/linnest-public-behavior.svg" "--root" "/build/.tmp00KetD/.clinnet/templates"
  311. 302.50 s gammaloop-nextest-clinnet>
  312. 302.50 s gammaloop-nextest-clinnet> Typst stdout:
  313. 302.50 s gammaloop-nextest-clinnet>
  314. 302.50 s gammaloop-nextest-clinnet>
  315. 302.50 s gammaloop-nextest-clinnet> Typst stderr:
  316. 302.50 s gammaloop-nextest-clinnet>
  317. 302.50 s gammaloop-nextest-clinnet>
  318. 302.50 s gammaloop-nextest-clinnet> Location:
  319. 302.50 s gammaloop-nextest-clinnet> crates/clinnet/src/lib.rs:741:13
  320. 302.50 s gammaloop-nextest-clinnet> stack backtrace:
  321. 302.50 s gammaloop-nextest-clinnet> 0: __rustc::rust_begin_unwind
  322. 302.50 s gammaloop-nextest-clinnet> 1: core::panicking::panic_fmt
  323. 302.50 s gammaloop-nextest-clinnet> 2: core::result::unwrap_failed
  324. 302.50 s gammaloop-nextest-clinnet> 3: public_typst_behavior::render
  325. 302.50 s gammaloop-nextest-clinnet> 4: <std::sync::once::Once>::call_once_force::<<std::sync::once_lock::OnceLock<alloc::string::String>>::initialize<<std::sync::once_lock::OnceLock<alloc::string::String>>::get_or_init<public_typst_behavior::linnest_public_svg::{closure#0}>::{closure#0}, !>::{closure#0}>::{closure#0}
  326. 302.50 s gammaloop-nextest-clinnet> 5: <std::sys::sync::once::futex::Once>::call
  327. 302.50 s gammaloop-nextest-clinnet> 6: <std::sync::once_lock::OnceLock<alloc::string::String>>::initialize::<<std::sync::once_lock::OnceLock<alloc::string::String>>::get_or_init<public_typst_behavior::linnest_public_svg::{closure#0}>::{closure#0}, !>
  328. 302.50 s gammaloop-nextest-clinnet> 7: <public_typst_behavior::public_linnest_fixture_assertions_hold::{closure#0} as core::ops::function::FnOnce<()>>::call_once
  329. 302.50 s gammaloop-nextest-clinnet> note: Some details are omitted, run with `RUST_BACKTRACE=full` for a verbose backtrace.
  330. 302.50 s gammaloop-nextest-clinnet> system-out
  331. 302.50 s gammaloop-nextest-clinnet> running 1 test
  332. 302.50 s gammaloop-nextest-clinnet> test public_linnest_fixture_assertions_hold has been running for over 60 seconds
  333. 302.50 s gammaloop-nextest-clinnet> test public_linnest_fixture_assertions_hold ... FAILED
  334. 302.50 s gammaloop-nextest-clinnet>
  335. 302.50 s gammaloop-nextest-clinnet> failures:
  336. 302.50 s gammaloop-nextest-clinnet>
  337. 302.50 s gammaloop-nextest-clinnet> failures:
  338. 302.50 s gammaloop-nextest-clinnet> public_linnest_fixture_assertions_hold
  339. 302.50 s gammaloop-nextest-clinnet>
  340. 302.50 s gammaloop-nextest-clinnet> test result: FAILED. 0 passed; 1 failed; 0 ignored; 0 measured; 17 filtered out; finished in 94.47s
  341. 302.50 s gammaloop-nextest-clinnet> system-err
  342. 302.50 s gammaloop-nextest-clinnet> thread 'public_linnest_fixture_assertions_hold' (276) panicked at crates/clinnet/tests/public_typst_behavior.rs:81:55:
  343. 302.50 s gammaloop-nextest-clinnet> called `Result::unwrap()` on an `Err` value: typst failed while compiling template /build/.tmp00KetD/.clinnet/templates/linnest-public-behavior.svg
  344. 302.50 s gammaloop-nextest-clinnet>
  345. 302.50 s gammaloop-nextest-clinnet> Command executed:
  346. 302.50 s gammaloop-nextest-clinnet> "typst" "c" "/build/.tmp00KetD/.clinnet/templates/linnest-public-behavior.typ" "/build/.tmp00KetD/.clinnet/templates/linnest-public-behavior.svg" "--root" "/build/.tmp00KetD/.clinnet/templates"
  347. 302.50 s gammaloop-nextest-clinnet>
  348. 302.50 s gammaloop-nextest-clinnet> Typst stdout:
  349. 302.50 s gammaloop-nextest-clinnet>
  350. 302.50 s gammaloop-nextest-clinnet>
  351. 302.50 s gammaloop-nextest-clinnet> Typst stderr:
  352. 302.50 s gammaloop-nextest-clinnet>
  353. 302.50 s gammaloop-nextest-clinnet>
  354. 302.50 s gammaloop-nextest-clinnet> Location:
  355. 302.50 s gammaloop-nextest-clinnet> crates/clinnet/src/lib.rs:741:13
  356. 302.50 s gammaloop-nextest-clinnet> stack backtrace:
  357. 302.50 s gammaloop-nextest-clinnet> 0: __rustc::rust_begin_unwind
  358. 302.50 s gammaloop-nextest-clinnet> 1: core::panicking::panic_fmt
  359. 302.50 s gammaloop-nextest-clinnet> 2: core::result::unwrap_failed
  360. 302.50 s gammaloop-nextest-clinnet> 3: public_typst_behavior::render
  361. 302.50 s gammaloop-nextest-clinnet> 4: <std::sync::once::Once>::call_once_force::<<std::sync::once_lock::OnceLock<alloc::string::String>>::initialize<<std::sync::once_lock::OnceLock<alloc::string::String>>::get_or_init<public_typst_behavior::linnest_public_svg::{closure#0}>::{closure#0}, !>::{closure#0}>::{closure#0}
  362. 302.50 s gammaloop-nextest-clinnet> 5: <std::sys::sync::once::futex::Once>::call
  363. 302.50 s gammaloop-nextest-clinnet> 6: <std::sync::once_lock::OnceLock<alloc::string::String>>::initialize::<<std::sync::once_lock::OnceLock<alloc::string::String>>::get_or_init<public_typst_behavior::linnest_public_svg::{closure#0}>::{closure#0}, !>
  364. 302.50 s gammaloop-nextest-clinnet> 7: <public_typst_behavior::public_linnest_fixture_assertions_hold::{closure#0} as core::ops::function::FnOnce<()>>::call_once
  365. 302.50 s gammaloop-nextest-clinnet> note: Some details are omitted, run with `RUST_BACKTRACE=full` for a verbose backtrace.
  366. 302.50 s gammaloop-nextest-clinnet>
  367. 302.50 s gammaloop-nextest-clinnet> 2. clinnet::public_typst_behavior::public_linnest_overlays_follow_the_unit
  368. 302.50 s gammaloop-nextest-clinnet> failure: test failure with exit code 101
  369. 302.50 s gammaloop-nextest-clinnet> thread 'public_linnest_overlays_follow_the_unit' (316) panicked at crates/clinnet/tests/public_typst_behavior.rs:81:55:
  370. 302.51 s gammaloop-nextest-clinnet> called `Result::unwrap()` on an `Err` value: typst failed while compiling template /build/.tmpkPG7Ve/.clinnet/templates/linnest-public-behavior.svg
  371. 302.51 s gammaloop-nextest-clinnet>
  372. 302.51 s gammaloop-nextest-clinnet> Command executed:
  373. 302.51 s gammaloop-nextest-clinnet> "typst" "c" "/build/.tmpkPG7Ve/.clinnet/templates/linnest-public-behavior.typ" "/build/.tmpkPG7Ve/.clinnet/templates/linnest-public-behavior.svg" "--root" "/build/.tmpkPG7Ve/.clinnet/templates"
  374. 302.51 s gammaloop-nextest-clinnet>
  375. 302.51 s gammaloop-nextest-clinnet> Typst stdout:
  376. 302.51 s gammaloop-nextest-clinnet>
  377. 302.51 s gammaloop-nextest-clinnet>
  378. 302.51 s gammaloop-nextest-clinnet> Typst stderr:
  379. 302.51 s gammaloop-nextest-clinnet>
  380. 302.51 s gammaloop-nextest-clinnet>
  381. 302.51 s gammaloop-nextest-clinnet> Location:
  382. 302.51 s gammaloop-nextest-clinnet> crates/clinnet/src/lib.rs:741:13
  383. 302.51 s gammaloop-nextest-clinnet> stack backtrace:
  384. 302.51 s gammaloop-nextest-clinnet> 0: __rustc::rust_begin_unwind
  385. 302.51 s gammaloop-nextest-clinnet> 1: core::panicking::panic_fmt
  386. 302.51 s gammaloop-nextest-clinnet> 2: core::result::unwrap_failed
  387. 302.51 s gammaloop-nextest-clinnet> 3: public_typst_behavior::render
  388. 302.51 s gammaloop-nextest-clinnet> 4: <std::sync::once::Once>::call_once_force::<<std::sync::once_lock::OnceLock<alloc::string::String>>::initialize<<std::sync::once_lock::OnceLock<alloc::string::String>>::get_or_init<public_typst_behavior::linnest_public_svg::{closure#0}>::{closure#0}, !>::{closure#0}>::{closure#0}
  389. 302.51 s gammaloop-nextest-clinnet> 5: <std::sys::sync::once::futex::Once>::call
  390. 302.51 s gammaloop-nextest-clinnet> 6: <std::sync::once_lock::OnceLock<alloc::string::String>>::initialize::<<std::sync::once_lock::OnceLock<alloc::string::String>>::get_or_init<public_typst_behavior::linnest_public_svg::{closure#0}>::{closure#0}, !>
  391. 302.51 s gammaloop-nextest-clinnet> 7: <public_typst_behavior::public_linnest_overlays_follow_the_unit::{closure#0} as core::ops::function::FnOnce<()>>::call_once
  392. 302.51 s gammaloop-nextest-clinnet> note: Some details are omitted, run with `RUST_BACKTRACE=full` for a verbose backtrace.
  393. 302.51 s gammaloop-nextest-clinnet> system-out
  394. 302.51 s gammaloop-nextest-clinnet> running 1 test
  395. 302.51 s gammaloop-nextest-clinnet> test public_linnest_overlays_follow_the_unit has been running for over 60 seconds
  396. 302.51 s gammaloop-nextest-clinnet> test public_linnest_overlays_follow_the_unit ... FAILED
  397. 302.51 s gammaloop-nextest-clinnet>
  398. 302.51 s gammaloop-nextest-clinnet> failures:
  399. 302.51 s gammaloop-nextest-clinnet>
  400. 302.51 s gammaloop-nextest-clinnet> failures:
  401. 302.51 s gammaloop-nextest-clinnet> public_linnest_overlays_follow_the_unit
  402. 302.51 s gammaloop-nextest-clinnet>
  403. 302.51 s gammaloop-nextest-clinnet> test result: FAILED. 0 passed; 1 failed; 0 ignored; 0 measured; 17 filtered out; finished in 97.23s
  404. 302.51 s gammaloop-nextest-clinnet> system-err
  405. 302.51 s gammaloop-nextest-clinnet> thread 'public_linnest_overlays_follow_the_unit' (316) panicked at crates/clinnet/tests/public_typst_behavior.rs:81:55:
  406. 302.51 s gammaloop-nextest-clinnet> called `Result::unwrap()` on an `Err` value: typst failed while compiling template /build/.tmpkPG7Ve/.clinnet/templates/linnest-public-behavior.svg
  407. 302.51 s gammaloop-nextest-clinnet>
  408. 302.51 s gammaloop-nextest-clinnet> Command executed:
  409. 302.51 s gammaloop-nextest-clinnet> "typst" "c" "/build/.tmpkPG7Ve/.clinnet/templates/linnest-public-behavior.typ" "/build/.tmpkPG7Ve/.clinnet/templates/linnest-public-behavior.svg" "--root" "/build/.tmpkPG7Ve/.clinnet/templates"
  410. 302.51 s gammaloop-nextest-clinnet>
  411. 302.51 s gammaloop-nextest-clinnet> Typst stdout:
  412. 302.51 s gammaloop-nextest-clinnet>
  413. 302.51 s gammaloop-nextest-clinnet>
  414. 302.51 s gammaloop-nextest-clinnet> Typst stderr:
  415. 302.51 s gammaloop-nextest-clinnet>
  416. 302.51 s gammaloop-nextest-clinnet>
  417. 302.51 s gammaloop-nextest-clinnet> Location:
  418. 302.51 s gammaloop-nextest-clinnet> crates/clinnet/src/lib.rs:741:13
  419. 302.51 s gammaloop-nextest-clinnet> stack backtrace:
  420. 302.51 s gammaloop-nextest-clinnet> 0: __rustc::rust_begin_unwind
  421. 302.51 s gammaloop-nextest-clinnet> 1: core::panicking::panic_fmt
  422. 302.51 s gammaloop-nextest-clinnet> 2: core::result::unwrap_failed
  423. 302.51 s gammaloop-nextest-clinnet> 3: public_typst_behavior::render
  424. 302.51 s gammaloop-nextest-clinnet> 4: <std::sync::once::Once>::call_once_force::<<std::sync::once_lock::OnceLock<alloc::string::String>>::initialize<<std::sync::once_lock::OnceLock<alloc::string::String>>::get_or_init<public_typst_behavior::linnest_public_svg::{closure#0}>::{closure#0}, !>::{closure#0}>::{closure#0}
  425. 302.51 s gammaloop-nextest-clinnet> 5: <std::sys::sync::once::futex::Once>::call
  426. 302.51 s gammaloop-nextest-clinnet> 6: <std::sync::once_lock::OnceLock<alloc::string::String>>::initialize::<<std::sync::once_lock::OnceLock<alloc::string::String>>::get_or_init<public_typst_behavior::linnest_public_svg::{closure#0}>::{closure#0}, !>
  427. 302.51 s gammaloop-nextest-clinnet> 7: <public_typst_behavior::public_linnest_overlays_follow_the_unit::{closure#0} as core::ops::function::FnOnce<()>>::call_once
  428. 302.51 s gammaloop-nextest-clinnet> note: Some details are omitted, run with `RUST_BACKTRACE=full` for a verbose backtrace.
  429. 302.51 s gammaloop-nextest-clinnet>
  430. 302.51 s gammaloop-nextest-clinnet> 3. clinnet::public_typst_behavior::public_linnest_labels_follow_their_carriers
  431. 302.51 s gammaloop-nextest-clinnet> failure: test timeout
  432. 302.51 s gammaloop-nextest-clinnet> system-out
  433. 302.51 s gammaloop-nextest-clinnet> running 1 test
  434. 302.51 s gammaloop-nextest-clinnet> test public_linnest_labels_follow_their_carriers has been running for over 60 seconds
  435. 302.51 s gammaloop-nextest-clinnet>
  436. 302.51 s gammaloop-nextest-clinnet> 4. clinnet::public_typst_behavior::public_linnest_edge_styles_skip_fallbacks
  437. 302.51 s gammaloop-nextest-clinnet> failure: test timeout
  438. 302.51 s gammaloop-nextest-clinnet> system-out
  439. 302.51 s gammaloop-nextest-clinnet> running 1 test
  440. 302.51 s gammaloop-nextest-clinnet> test public_linnest_edge_styles_skip_fallbacks has been running for over 60 seconds
  441. 302.51 s gammaloop-nextest-clinnet>
  442. 302.51 s gammaloop-nextest-clinnet> 5. clinnet::public_typst_behavior::public_linnest_endpoint_anchor_distances_stay_local
  443. 302.51 s gammaloop-nextest-clinnet> failure: test timeout
  444. 302.51 s gammaloop-nextest-clinnet> system-out
  445. 302.51 s gammaloop-nextest-clinnet> running 1 test
  446. 302.51 s gammaloop-nextest-clinnet> test public_linnest_endpoint_anchor_distances_stay_local has been running for over 60 seconds
  447. 302.51 s gammaloop-nextest-clinnet>
  448. 302.51 s gammaloop-nextest-clinnet> 6. clinnet::public_typst_behavior::public_linnest_momentum_layers_place_shafts_and_labels
  449. 302.51 s gammaloop-nextest-clinnet> failure: test timeout
  450. 302.51 s gammaloop-nextest-clinnet> system-out
  451. 302.51 s gammaloop-nextest-clinnet> running 1 test
  452. 302.51 s gammaloop-nextest-clinnet> test public_linnest_momentum_layers_place_shafts_and_labels has been running for over 60 seconds
  453. 302.51 s gammaloop-nextest-clinnet>
  454. 302.51 s gammaloop-nextest-clinnet> 7. clinnet::public_typst_behavior::public_linnest_arrow_shafts_and_crossing_gaps
  455. 302.51 s gammaloop-nextest-clinnet> failure: test timeout
  456. 302.51 s gammaloop-nextest-clinnet> system-out
  457. 302.51 s gammaloop-nextest-clinnet> running 1 test
  458. 302.51 s gammaloop-nextest-clinnet> test public_linnest_arrow_shafts_and_crossing_gaps has been running for over 60 seconds
  459. 302.51 s gammaloop-nextest-clinnet> =========================================
  460. 304.93 s [1 built (1 failed), 1 cerror: Cannot build '/nix/store/4pqspwvh8pi9s2vg9g6mfsggpl9ynwzx-gammaloop-nextest-clinnet.drv'.
  461. 304.93 s Reason: builder failed with exit code 100.
  462. 304.93 s Output paths:
  463. 304.93 s /nix/store/v9zka7gxdrym1pq03r0i4w2q43fgdwcq-gammaloop-nextest-clinnet
  464. 304.93 s Last 419 log lines:
  465. 304.93 s > Nextest worker budget: 16
  466. 304.93 s > Extracting 4 binaries (including 1 non-test binary), 1 build script output directory, and 1 linked path to /build/source
  467. 304.93 s > Extracted 16 files to /build/source in 0.09s
  468. 304.93 s > ------------
  469. 304.93 s > Nextest run ID fcdab1bd-668b-493d-852c-e1d265152770 with nextest profile: ci_gammaloop
  470. 304.93 s > Starting 38 tests across 3 binaries
  471. 304.93 s > FAIL [ 94.481s] (32/38) clinnet::public_typst_behavior public_linnest_fixture_assertions_hold
  472. 304.93 s > stdout ---
  473. 304.93 s >
  474. 304.93 s > running 1 test
  475. 304.93 s > test public_linnest_fixture_assertions_hold has been running for over 60 seconds
  476. 304.93 s > test public_linnest_fixture_assertions_hold ... FAILED
  477. 304.93 s >
  478. 304.93 s > failures:
  479. 304.93 s >
  480. 304.93 s > failures:
  481. 304.93 s > public_linnest_fixture_assertions_hold
  482. 304.93 s >
  483. 304.93 s > test result: FAILED. 0 passed; 1 failed; 0 ignored; 0 measured; 17 filtered out; finished in 94.47s
  484. 304.93 s >
  485. 304.93 s > stderr ---
  486. 304.93 s >
  487. 304.93 s > thread 'public_linnest_fixture_assertions_hold' (276) panicked at crates/clinnet/tests/public_typst_behavior.rs:81:55:
  488. 304.93 s > called `Result::unwrap()` on an `Err` value: typst failed while compiling template /build/.tmp00KetD/.clinnet/templates/linnest-public-behavior.svg
  489. 304.93 s >
  490. 304.93 s > Command executed:
  491. 304.93 s > "typst" "c" "/build/.tmp00KetD/.clinnet/templates/linnest-public-behavior.typ" "/build/.tmp00KetD/.clinnet/templates/linnest-public-behavior.svg" "--root" "/build/.tmp00KetD/.clinnet/templates"
  492. 304.93 s >
  493. 304.93 s > Typst stdout:
  494. 304.93 s >
  495. 304.93 s >
  496. 304.93 s > Typst stderr:
  497. 304.93 s >
  498. 304.93 s >
  499. 304.93 s > Location:
  500. 304.93 s > crates/clinnet/src/lib.rs:741:13
  501. 304.93 s > stack backtrace:
  502. 304.93 s > 0: __rustc::rust_begin_unwind
  503. 304.93 s > 1: core::panicking::panic_fmt
  504. 304.93 s > 2: core::result::unwrap_failed
  505. 304.93 s > 3: public_typst_behavior::render
  506. 304.93 s > 4: <std::sync::once::Once>::call_once_force::<<std::sync::once_lock::OnceLock<alloc::string::String>>::initialize<<std::sync::once_lock::OnceLock<alloc::string::String>>::get_or_init<public_typst_behavior::linnest_public_svg::{closure#0}>::{closure#0}, !>::{closure#0}>::{closure#0}
  507. 304.93 s > 5: <std::sys::sync::once::futex::Once>::call
  508. 304.93 s > 6: <std::sync::once_lock::OnceLock<alloc::string::String>>::initialize::<<std::sync::once_lock::OnceLock<alloc::string::String>>::get_or_init<public_typst_behavior::linnest_public_svg::{closure#0}>::{closure#0}, !>
  509. 304.93 s > 7: <public_typst_behavior::public_linnest_fixture_assertions_hold::{closure#0} as core::ops::function::FnOnce<()>>::call_once
  510. 304.93 s > note: Some details are omitted, run with `RUST_BACKTRACE=full` for a verbose backtrace.
  511. 304.93 s >
  512. 304.93 s > FAIL [ 97.248s] (33/38) clinnet::public_typst_behavior public_linnest_overlays_follow_the_unit
  513. 304.93 s > stdout ---
  514. 304.93 s >
  515. 304.93 s > running 1 test
  516. 304.93 s > test public_linnest_overlays_follow_the_unit has been running for over 60 seconds
  517. 304.93 s > test public_linnest_overlays_follow_the_unit ... FAILED
  518. 304.93 s >
  519. 304.93 s > failures:
  520. 304.93 s >
  521. 304.93 s > failures:
  522. 304.93 s > public_linnest_overlays_follow_the_unit
  523. 304.93 s >
  524. 304.93 s > test result: FAILED. 0 passed; 1 failed; 0 ignored; 0 measured; 17 filtered out; finished in 97.23s
  525. 304.93 s >
  526. 304.93 s > stderr ---
  527. 304.93 s >
  528. 304.93 s > thread 'public_linnest_overlays_follow_the_unit' (316) panicked at crates/clinnet/tests/public_typst_behavior.rs:81:55:
  529. 304.93 s > called `Result::unwrap()` on an `Err` value: typst failed while compiling template /build/.tmpkPG7Ve/.clinnet/templates/linnest-public-behavior.svg
  530. 304.93 s >
  531. 304.93 s > Command executed:
  532. 304.93 s > "typst" "c" "/build/.tmpkPG7Ve/.clinnet/templates/linnest-public-behavior.typ" "/build/.tmpkPG7Ve/.clinnet/templates/linnest-public-behavior.svg" "--root" "/build/.tmpkPG7Ve/.clinnet/templates"
  533. 304.93 s >
  534. 304.93 s > Typst stdout:
  535. 304.93 s >
  536. 304.93 s >
  537. 304.93 s > Typst stderr:
  538. 304.93 s >
  539. 304.93 s >
  540. 304.93 s > Location:
  541. 304.93 s > crates/clinnet/src/lib.rs:741:13
  542. 304.93 s > stack backtrace:
  543. 304.93 s > 0: __rustc::rust_begin_unwind
  544. 304.93 s > 1: core::panicking::panic_fmt
  545. 304.93 s > 2: core::result::unwrap_failed
  546. 304.93 s > 3: public_typst_behavior::render
  547. 304.93 s > 4: <std::sync::once::Once>::call_once_force::<<std::sync::once_lock::OnceLock<alloc::string::String>>::initialize<<std::sync::once_lock::OnceLock<alloc::string::String>>::get_or_init<public_typst_behavior::linnest_public_svg::{closure#0}>::{closure#0}, !>::{closure#0}>::{closure#0}
  548. 304.93 s > 5: <std::sys::sync::once::futex::Once>::call
  549. 304.93 s > 6: <std::sync::once_lock::OnceLock<alloc::string::String>>::initialize::<<std::sync::once_lock::OnceLock<alloc::string::String>>::get_or_init<public_typst_behavior::linnest_public_svg::{closure#0}>::{closure#0}, !>
  550. 304.93 s > 7: <public_typst_behavior::public_linnest_overlays_follow_the_unit::{closure#0} as core::ops::function::FnOnce<()>>::call_once
  551. 304.93 s > note: Some details are omitted, run with `RUST_BACKTRACE=full` for a verbose backtrace.
  552. 304.93 s >
  553. 304.93 s > TERMINATING [>240.000s] (-----) clinnet::public_typst_behavior public_linnest_labels_follow_their_carriers
  554. 304.93 s > TERMINATING [>240.000s] (-----) clinnet::public_typst_behavior public_linnest_arrow_shafts_and_crossing_gaps
  555. 304.93 s > TERMINATING [>240.000s] (-----) clinnet::public_typst_behavior public_linnest_endpoint_anchor_distances_stay_local
  556. 304.93 s > TERMINATING [>240.000s] (-----) clinnet::public_typst_behavior public_linnest_momentum_layers_place_shafts_and_labels
  557. 304.93 s > TERMINATING [>240.000s] (-----) clinnet::public_typst_behavior public_linnest_edge_styles_skip_fallbacks
  558. 304.93 s > TIMEOUT [ 241.145s] (34/38) clinnet::public_typst_behavior public_linnest_labels_follow_their_carriers
  559. 304.93 s > stdout ---
  560. 304.93 s >
  561. 304.93 s > running 1 test
  562. 304.93 s > test public_linnest_labels_follow_their_carriers has been running for over 60 seconds
  563. 304.93 s >
  564. 304.93 s > (test timed out)
  565. 304.93 s >
  566. 304.93 s > TIMEOUT [ 241.158s] (35/38) clinnet::public_typst_behavior public_linnest_edge_styles_skip_fallbacks
  567. 304.93 s > stdout ---
  568. 304.93 s >
  569. 304.93 s > running 1 test
  570. 304.93 s > test public_linnest_edge_styles_skip_fallbacks has been running for over 60 seconds
  571. 304.93 s >
  572. 304.93 s > (test timed out)
  573. 304.93 s >
  574. 304.93 s > TIMEOUT [ 241.160s] (36/38) clinnet::public_typst_behavior public_linnest_endpoint_anchor_distances_stay_local
  575. 304.93 s > stdout ---
  576. 304.93 s >
  577. 304.93 s > running 1 test
  578. 304.93 s > test public_linnest_endpoint_anchor_distances_stay_local has been running for over 60 seconds
  579. 304.93 s >
  580. 304.93 s > (test timed out)
  581. 304.93 s >
  582. 304.93 s > TIMEOUT [ 241.143s] (37/38) clinnet::public_typst_behavior public_linnest_momentum_layers_place_shafts_and_labels
  583. 304.93 s > stdout ---
  584. 304.93 s >
  585. 304.93 s > running 1 test
  586. 304.93 s > test public_linnest_momentum_layers_place_shafts_and_labels has been running for over 60 seconds
  587. 304.93 s >
  588. 304.93 s > (test timed out)
  589. 304.93 s >
  590. 304.93 s > TIMEOUT [ 241.160s] (38/38) clinnet::public_typst_behavior public_linnest_arrow_shafts_and_crossing_gaps
  591. 304.93 s > stdout ---
  592. 304.93 s >
  593. 304.93 s > running 1 test
  594. 304.93 s > test public_linnest_arrow_shafts_and_crossing_gaps has been running for over 60 seconds
  595. 304.93 s >
  596. 304.93 s > (test timed out)
  597. 304.93 s >
  598. 304.93 s > ------------
  599. 304.93 s > Summary [ 241.178s] 38 tests run: 31 passed, 2 failed, 5 timed out, 0 skipped
  600. 304.93 s > FAIL [ 94.481s] (32/38) clinnet::public_typst_behavior public_linnest_fixture_assertions_hold
  601. 304.93 s > stdout ---
  602. 304.93 s >
  603. 304.93 s > running 1 test
  604. 304.93 s > test public_linnest_fixture_assertions_hold has been running for over 60 seconds
  605. 304.93 s > test public_linnest_fixture_assertions_hold ... FAILED
  606. 304.93 s >
  607. 304.93 s > failures:
  608. 304.93 s >
  609. 304.93 s > failures:
  610. 304.93 s > public_linnest_fixture_assertions_hold
  611. 304.93 s >
  612. 304.93 s > test result: FAILED. 0 passed; 1 failed; 0 ignored; 0 measured; 17 filtered out; finished in 94.47s
  613. 304.93 s >
  614. 304.93 s > stderr ---
  615. 304.93 s >
  616. 304.93 s > thread 'public_linnest_fixture_assertions_hold' (276) panicked at crates/clinnet/tests/public_typst_behavior.rs:81:55:
  617. 304.93 s > called `Result::unwrap()` on an `Err` value: typst failed while compiling template /build/.tmp00KetD/.clinnet/templates/linnest-public-behavior.svg
  618. 304.93 s >
  619. 304.93 s > Command executed:
  620. 304.93 s > "typst" "c" "/build/.tmp00KetD/.clinnet/templates/linnest-public-behavior.typ" "/build/.tmp00KetD/.clinnet/templates/linnest-public-behavior.svg" "--root" "/build/.tmp00KetD/.clinnet/templates"
  621. 304.93 s >
  622. 304.93 s > Typst stdout:
  623. 304.93 s >
  624. 304.93 s >
  625. 304.93 s > Typst stderr:
  626. 304.93 s >
  627. 304.93 s >
  628. 304.93 s > Location:
  629. 304.93 s > crates/clinnet/src/lib.rs:741:13
  630. 304.93 s > stack backtrace:
  631. 304.93 s > 0: __rustc::rust_begin_unwind
  632. 304.93 s > 1: core::panicking::panic_fmt
  633. 304.93 s > 2: core::result::unwrap_failed
  634. 304.93 s > 3: public_typst_behavior::render
  635. 304.93 s > 4: <std::sync::once::Once>::call_once_force::<<std::sync::once_lock::OnceLock<alloc::string::String>>::initialize<<std::sync::once_lock::OnceLock<alloc::string::String>>::get_or_init<public_typst_behavior::linnest_public_svg::{closure#0}>::{closure#0}, !>::{closure#0}>::{closure#0}
  636. 304.93 s > 5: <std::sys::sync::once::futex::Once>::call
  637. 304.93 s > 6: <std::sync::once_lock::OnceLock<alloc::string::String>>::initialize::<<std::sync::once_lock::OnceLock<alloc::string::String>>::get_or_init<public_typst_behavior::linnest_public_svg::{closure#0}>::{closure#0}, !>
  638. 304.93 s > 7: <public_typst_behavior::public_linnest_fixture_assertions_hold::{closure#0} as core::ops::function::FnOnce<()>>::call_once
  639. 304.93 s > note: Some details are omitted, run with `RUST_BACKTRACE=full` for a verbose backtrace.
  640. 304.93 s >
  641. 304.93 s > FAIL [ 97.248s] (33/38) clinnet::public_typst_behavior public_linnest_overlays_follow_the_unit
  642. 304.93 s > stdout ---
  643. 304.93 s >
  644. 304.93 s > running 1 test
  645. 304.93 s > test public_linnest_overlays_follow_the_unit has been running for over 60 seconds
  646. 304.93 s > test public_linnest_overlays_follow_the_unit ... FAILED
  647. 304.93 s >
  648. 304.93 s > failures:
  649. 304.93 s >
  650. 304.93 s > failures:
  651. 304.93 s > public_linnest_overlays_follow_the_unit
  652. 304.93 s >
  653. 304.93 s > test result: FAILED. 0 passed; 1 failed; 0 ignored; 0 measured; 17 filtered out; finished in 97.23s
  654. 304.93 s >
  655. 304.93 s > stderr ---
  656. 304.93 s >
  657. 304.93 s > thread 'public_linnest_overlays_follow_the_unit' (316) panicked at crates/clinnet/tests/public_typst_behavior.rs:81:55:
  658. 304.93 s > called `Result::unwrap()` on an `Err` value: typst failed while compiling template /build/.tmpkPG7Ve/.clinnet/templates/linnest-public-behavior.svg
  659. 304.93 s >
  660. 304.93 s > Command executed:
  661. 304.93 s > "typst" "c" "/build/.tmpkPG7Ve/.clinnet/templates/linnest-public-behavior.typ" "/build/.tmpkPG7Ve/.clinnet/templates/linnest-public-behavior.svg" "--root" "/build/.tmpkPG7Ve/.clinnet/templates"
  662. 304.93 s >
  663. 304.93 s > Typst stdout:
  664. 304.93 s >
  665. 304.93 s >
  666. 304.93 s > Typst stderr:
  667. 304.93 s >
  668. 304.93 s >
  669. 304.93 s > Location:
  670. 304.93 s > crates/clinnet/src/lib.rs:741:13
  671. 304.93 s > stack backtrace:
  672. 304.93 s > 0: __rustc::rust_begin_unwind
  673. 304.93 s > 1: core::panicking::panic_fmt
  674. 304.93 s > 2: core::result::unwrap_failed
  675. 304.93 s > 3: public_typst_behavior::render
  676. 304.93 s > 4: <std::sync::once::Once>::call_once_force::<<std::sync::once_lock::OnceLock<alloc::string::String>>::initialize<<std::sync::once_lock::OnceLock<alloc::string::String>>::get_or_init<public_typst_behavior::linnest_public_svg::{closure#0}>::{closure#0}, !>::{closure#0}>::{closure#0}
  677. 304.93 s > 5: <std::sys::sync::once::futex::Once>::call
  678. 304.93 s > 6: <std::sync::once_lock::OnceLock<alloc::string::String>>::initialize::<<std::sync::once_lock::OnceLock<alloc::string::String>>::get_or_init<public_typst_behavior::linnest_public_svg::{closure#0}>::{closure#0}, !>
  679. 304.93 s > 7: <public_typst_behavior::public_linnest_overlays_follow_the_unit::{closure#0} as core::ops::function::FnOnce<()>>::call_once
  680. 304.93 s > note: Some details are omitted, run with `RUST_BACKTRACE=full` for a verbose backtrace.
  681. 304.93 s >
  682. 304.93 s > TIMEOUT [ 241.145s] (34/38) clinnet::public_typst_behavior public_linnest_labels_follow_their_carriers
  683. 304.93 s > stdout ---
  684. 304.93 s >
  685. 304.93 s > running 1 test
  686. 304.93 s > test public_linnest_labels_follow_their_carriers has been running for over 60 seconds
  687. 304.93 s >
  688. 304.93 s > (test timed out)
  689. 304.93 s >
  690. 304.93 s > TIMEOUT [ 241.158s] (35/38) clinnet::public_typst_behavior public_linnest_edge_styles_skip_fallbacks
  691. 304.93 s > stdout ---
  692. 304.93 s >
  693. 304.93 s > running 1 test
  694. 304.93 s > test public_linnest_edge_styles_skip_fallbacks has been running for over 60 seconds
  695. 304.93 s >
  696. 304.93 s > (test timed out)
  697. 304.93 s >
  698. 304.93 s > TIMEOUT [ 241.160s] (36/38) clinnet::public_typst_behavior public_linnest_endpoint_anchor_distances_stay_local
  699. 304.93 s > stdout ---
  700. 304.93 s >
  701. 304.93 s > running 1 test
  702. 304.93 s > test public_linnest_endpoint_anchor_distances_stay_local has been running for over 60 seconds
  703. 304.93 s >
  704. 304.93 s > (test timed out)
  705. 304.93 s >
  706. 304.93 s > TIMEOUT [ 241.143s] (37/38) clinnet::public_typst_behavior public_linnest_momentum_layers_place_shafts_and_labels
  707. 304.93 s > stdout ---
  708. 304.93 s >
  709. 304.93 s > running 1 test
  710. 304.93 s > test public_linnest_momentum_layers_place_shafts_and_labels has been running for over 60 seconds
  711. 304.93 s >
  712. 304.93 s > (test timed out)
  713. 304.93 s >
  714. 304.93 s > TIMEOUT [ 241.160s] (38/38) clinnet::public_typst_behavior public_linnest_arrow_shafts_and_crossing_gaps
  715. 304.93 s > stdout ---
  716. 304.93 s >
  717. 304.93 s > running 1 test
  718. 304.93 s > test public_linnest_arrow_shafts_and_crossing_gaps has been running for over 60 seconds
  719. 304.93 s >
  720. 304.93 s > (test timed out)
  721. 304.93 s >
  722. 304.93 s > error: test run failed
  723. 304.93 s >
  724. 304.93 s > ========== nextest test summary ==========
  725. 304.93 s > report: target/nextest/ci_gammaloop/junit.xml
  726. 304.93 s > tests: 38, failures: 7, errors: 0
  727. 304.93 s >
  728. 304.93 s > 1. clinnet::public_typst_behavior::public_linnest_fixture_assertions_hold
  729. 304.93 s > failure: test failure with exit code 101
  730. 304.93 s > thread 'public_linnest_fixture_assertions_hold' (276) panicked at crates/clinnet/tests/public_typst_behavior.rs:81:55:
  731. 304.93 s > called `Result::unwrap()` on an `Err` value: typst failed while compiling template /build/.tmp00KetD/.clinnet/templates/linnest-public-behavior.svg
  732. 304.93 s >
  733. 304.93 s > Command executed:
  734. 304.93 s > "typst" "c" "/build/.tmp00KetD/.clinnet/templates/linnest-public-behavior.typ" "/build/.tmp00KetD/.clinnet/templates/linnest-public-behavior.svg" "--root" "/build/.tmp00KetD/.clinnet/templates"
  735. 304.93 s >
  736. 304.93 s > Typst stdout:
  737. 304.93 s >
  738. 304.93 s >
  739. 304.93 s > Typst stderr:
  740. 304.93 s >
  741. 304.93 s >
  742. 304.93 s > Location:
  743. 304.93 s > crates/clinnet/src/lib.rs:741:13
  744. 304.93 s > stack backtrace:
  745. 304.93 s > 0: __rustc::rust_begin_unwind
  746. 304.93 s > 1: core::panicking::panic_fmt
  747. 304.93 s > 2: core::result::unwrap_failed
  748. 304.93 s > 3: public_typst_behavior::render
  749. 304.93 s > 4: <std::sync::once::Once>::call_once_force::<<std::sync::once_lock::OnceLock<alloc::string::String>>::initialize<<std::sync::once_lock::OnceLock<alloc::string::String>>::get_or_init<public_typst_behavior::linnest_public_svg::{closure#0}>::{closure#0}, !>::{closure#0}>::{closure#0}
  750. 304.93 s > 5: <std::sys::sync::once::futex::Once>::call
  751. 304.93 s > 6: <std::sync::once_lock::OnceLock<alloc::string::String>>::initialize::<<std::sync::once_lock::OnceLock<alloc::string::String>>::get_or_init<public_typst_behavior::linnest_public_svg::{closure#0}>::{closure#0}, !>
  752. 304.93 s > 7: <public_typst_behavior::public_linnest_fixture_assertions_hold::{closure#0} as core::ops::function::FnOnce<()>>::call_once
  753. 304.93 s > note: Some details are omitted, run with `RUST_BACKTRACE=full` for a verbose backtrace.
  754. 304.93 s > system-out
  755. 304.93 s > running 1 test
  756. 304.93 s > test public_linnest_fixture_assertions_hold has been running for over 60 seconds
  757. 304.93 s > test public_linnest_fixture_assertions_hold ... FAILED
  758. 304.93 s >
  759. 304.93 s > failures:
  760. 304.93 s >
  761. 304.93 s > failures:
  762. 304.93 s > public_linnest_fixture_assertions_hold
  763. 304.93 s >
  764. 304.93 s > test result: FAILED. 0 passed; 1 failed; 0 ignored; 0 measured; 17 filtered out; finished in 94.47s
  765. 304.93 s > system-err
  766. 304.93 s > thread 'public_linnest_fixture_assertions_hold' (276) panicked at crates/clinnet/tests/public_typst_behavior.rs:81:55:
  767. 304.93 s > called `Result::unwrap()` on an `Err` value: typst failed while compiling template /build/.tmp00KetD/.clinnet/templates/linnest-public-behavior.svg
  768. 304.93 s >
  769. 304.93 s > Command executed:
  770. 304.93 s > "typst" "c" "/build/.tmp00KetD/.clinnet/templates/linnest-public-behavior.typ" "/build/.tmp00KetD/.clinnet/templates/linnest-public-behavior.svg" "--root" "/build/.tmp00KetD/.clinnet/templates"
  771. 304.93 s >
  772. 304.93 s > Typst stdout:
  773. 304.93 s >
  774. 304.93 s >
  775. 304.93 s > Typst stderr:
  776. 304.93 s >
  777. 304.93 s >
  778. 304.93 s > Location:
  779. 304.93 s > crates/clinnet/src/lib.rs:741:13
  780. 304.93 s > stack backtrace:
  781. 304.93 s > 0: __rustc::rust_begin_unwind
  782. 304.93 s > 1: core::panicking::panic_fmt
  783. 304.93 s > 2: core::result::unwrap_failed
  784. 304.93 s > 3: public_typst_behavior::render
  785. 304.93 s > 4: <std::sync::once::Once>::call_once_force::<<std::sync::once_lock::OnceLock<alloc::string::String>>::initialize<<std::sync::once_lock::OnceLock<alloc::string::String>>::get_or_init<public_typst_behavior::linnest_public_svg::{closure#0}>::{closure#0}, !>::{closure#0}>::{closure#0}
  786. 304.93 s > 5: <std::sys::sync::once::futex::Once>::call
  787. 304.93 s > 6: <std::sync::once_lock::OnceLock<alloc::string::String>>::initialize::<<std::sync::once_lock::OnceLock<alloc::string::String>>::get_or_init<public_typst_behavior::linnest_public_svg::{closure#0}>::{closure#0}, !>
  788. 304.93 s > 7: <public_typst_behavior::public_linnest_fixture_assertions_hold::{closure#0} as core::ops::function::FnOnce<()>>::call_once
  789. 304.93 s > note: Some details are omitted, run with `RUST_BACKTRACE=full` for a verbose backtrace.
  790. 304.93 s >
  791. 304.93 s > 2. clinnet::public_typst_behavior::public_linnest_overlays_follow_the_unit
  792. 304.93 s > failure: test failure with exit code 101
  793. 304.93 s > thread 'public_linnest_overlays_follow_the_unit' (316) panicked at crates/clinnet/tests/public_typst_behavior.rs:81:55:
  794. 304.93 s > called `Result::unwrap()` on an `Err` value: typst failed while compiling template /build/.tmpkPG7Ve/.clinnet/templates/linnest-public-behavior.svg
  795. 304.93 s >
  796. 304.93 s > Command executed:
  797. 304.93 s > "typst" "c" "/build/.tmpkPG7Ve/.clinnet/templates/linnest-public-behavior.typ" "/build/.tmpkPG7Ve/.clinnet/templates/linnest-public-behavior.svg" "--root" "/build/.tmpkPG7Ve/.clinnet/templates"
  798. 304.93 s >
  799. 304.93 s > Typst stdout:
  800. 304.93 s >
  801. 304.93 s >
  802. 304.93 s > Typst stderr:
  803. 304.93 s >
  804. 304.93 s >
  805. 304.93 s > Location:
  806. 304.93 s > crates/clinnet/src/lib.rs:741:13
  807. 304.93 s > stack backtrace:
  808. 304.93 s > 0: __rustc::rust_begin_unwind
  809. 304.93 s > 1: core::panicking::panic_fmt
  810. 304.93 s > 2: core::result::unwrap_failed
  811. 304.93 s > 3: public_typst_behavior::render
  812. 304.93 s > 4: <std::sync::once::Once>::call_once_force::<<std::sync::once_lock::OnceLock<alloc::string::String>>::initialize<<std::sync::once_lock::OnceLock<alloc::string::String>>::get_or_init<public_typst_behavior::linnest_public_svg::{closure#0}>::{closure#0}, !>::{closure#0}>::{closure#0}
  813. 304.93 s > 5: <std::sys::sync::once::futex::Once>::call
  814. 304.93 s > 6: <std::sync::once_lock::OnceLock<alloc::string::String>>::initialize::<<std::sync::once_lock::OnceLock<alloc::string::String>>::get_or_init<public_typst_behavior::linnest_public_svg::{closure#0}>::{closure#0}, !>
  815. 304.93 s > 7: <public_typst_behavior::public_linnest_overlays_follow_the_unit::{closure#0} as core::ops::function::FnOnce<()>>::call_once
  816. 304.93 s > note: Some details are omitted, run with `RUST_BACKTRACE=full` for a verbose backtrace.
  817. 304.93 s > system-out
  818. 304.93 s > running 1 test
  819. 304.93 s > test public_linnest_overlays_follow_the_unit has been running for over 60 seconds
  820. 304.93 s > test public_linnest_overlays_follow_the_unit ... FAILED
  821. 304.93 s >
  822. 304.93 s > failures:
  823. 304.93 s >
  824. 304.93 s > failures:
  825. 304.93 s > public_linnest_overlays_follow_the_unit
  826. 304.93 s >
  827. 304.93 s > test result: FAILED. 0 passed; 1 failed; 0 ignored; 0 measured; 17 filtered out; finished in 97.23s
  828. 304.93 s > system-err
  829. 304.93 s > thread 'public_linnest_overlays_follow_the_unit' (316) panicked at crates/clinnet/tests/public_typst_behavior.rs:81:55:
  830. 304.93 s > called `Result::unwrap()` on an `Err` value: typst failed while compiling template /build/.tmpkPG7Ve/.clinnet/templates/linnest-public-behavior.svg
  831. 304.93 s >
  832. 304.93 s > Command executed:
  833. 304.93 s > "typst" "c" "/build/.tmpkPG7Ve/.clinnet/templates/linnest-public-behavior.typ" "/build/.tmpkPG7Ve/.clinnet/templates/linnest-public-behavior.svg" "--root" "/build/.tmpkPG7Ve/.clinnet/templates"
  834. 304.93 s >
  835. 304.93 s > Typst stdout:
  836. 304.93 s >
  837. 304.93 s >
  838. 304.93 s > Typst stderr:
  839. 304.93 s >
  840. 304.93 s >
  841. 304.93 s > Location:
  842. 304.93 s > crates/clinnet/src/lib.rs:741:13
  843. 304.93 s > stack backtrace:
  844. 304.93 s > 0: __rustc::rust_begin_unwind
  845. 304.93 s > 1: core::panicking::panic_fmt
  846. 304.93 s > 2: core::result::unwrap_failed
  847. 304.93 s > 3: public_typst_behavior::render
  848. 304.93 s > 4: <std::sync::once::Once>::call_once_force::<<std::sync::once_lock::OnceLock<alloc::string::String>>::initialize<<std::sync::once_lock::OnceLock<alloc::string::String>>::get_or_init<public_typst_behavior::linnest_public_svg::{closure#0}>::{closure#0}, !>::{closure#0}>::{closure#0}
  849. 304.93 s > 5: <std::sys::sync::once::futex::Once>::call
  850. 304.93 s > 6: <std::sync::once_lock::OnceLock<alloc::string::String>>::initialize::<<std::sync::once_lock::OnceLock<alloc::string::String>>::get_or_init<public_typst_behavior::linnest_public_svg::{closure#0}>::{closure#0}, !>
  851. 304.93 s > 7: <public_typst_behavior::public_linnest_overlays_follow_the_unit::{closure#0} as core::ops::function::FnOnce<()>>::call_once
  852. 304.93 s > note: Some details are omitted, run with `RUST_BACKTRACE=full` for a verbose backtrace.
  853. 304.93 s >
  854. 304.93 s > 3. clinnet::public_typst_behavior::public_linnest_labels_follow_their_carriers
  855. 304.93 s > failure: test timeout
  856. 304.93 s > system-out
  857. 304.93 s > running 1 test
  858. 304.93 s > test public_linnest_labels_follow_their_carriers has been running for over 60 seconds
  859. 304.93 s >
  860. 304.93 s > 4. clinnet::public_typst_behavior::public_linnest_edge_styles_skip_fallbacks
  861. 304.93 s > failure: test timeout
  862. 304.93 s > system-out
  863. 304.93 s > running 1 test
  864. 304.93 s > test public_linnest_edge_styles_skip_fallbacks has been running for over 60 seconds
  865. 304.93 s >
  866. 304.93 s > 5. clinnet::public_typst_behavior::public_linnest_endpoint_anchor_distances_stay_local
  867. 304.93 s > failure: test timeout
  868. 304.93 s > system-out
  869. 304.93 s > running 1 test
  870. 304.93 s > test public_linnest_endpoint_anchor_distances_stay_local has been running for over 60 seconds
  871. 304.93 s >
  872. 304.93 s > 6. clinnet::public_typst_behavior::public_linnest_momentum_layers_place_shafts_and_labels
  873. 304.93 s > failure: test timeout
  874. 304.93 s > system-out
  875. 304.93 s > running 1 test
  876. 304.93 s > test public_linnest_momentum_layers_place_shafts_and_labels has been running for over 60 seconds
  877. 304.93 s >
  878. 304.93 s > 7. clinnet::public_typst_behavior::public_linnest_arrow_shafts_and_crossing_gaps
  879. 304.93 s > failure: test timeout
  880. 304.93 s > system-out
  881. 304.93 s > running 1 test
  882. 304.93 s > test public_linnest_arrow_shafts_and_crossing_gaps has been running for over 60 seconds
  883. 304.93 s > =========================================
  884. 304.93 s For full logs, run:
  885. 304.93 s nix log /nix/store/4pqspwvh8pi9s2vg9g6mfsggpl9ynwzx-gammaloop-nextest-clinnet.drv
  886. 305.29 s Run failed.