test packages.x86_64-linux.nix-ci-check-gammaloop-doctest

Reproduce this run
Original Run
  1. 0.65 s $ /nix/store/9ypz3flqsrl5xl495mm8h645gadjsxi1-coreutils-9.11/bin/timeout --kill-after=15s 7200s /nix/store/23zk8sgzamrbmj1fday15szf7f2279s8-nix-2.34.7/bin/nix --extra-experimental-features nix-command --extra-experimental-features flakes flake clone git+https://github.com/alphal00p/gammaloop --dest /tmp/nix-ci-worker/stable-pwd/repo/
  2. 0.67 s Cloning into '/tmp/nix-ci-worker/stable-pwd/repo'...
  3. 0.99 s remote: Enumerating objects: 64188, done.
  4. 1.10 s remote: Counting objects: 0% (1/9542) remote: Counting objects: 1% (96/9542) remote: Counting objects: 2% (191/9542) remote: Counting objects: 3% (287/9542) remote: Counting objects: 4% (382/9542) remote: Counting objects: 5% (478/9542) remote: Counting objects: 6% (573/9542) remote: Counting objects: 7% (668/9542) remote: Counting objects: 8% (764/9542) remote: Counting objects: 9% (859/9542) remote: Counting objects: 10% (955/9542) remote: Counting objects: 11% (1050/9542) remote: Counting objects: 12% (1146/9542) remote: Counting objects: 13% (1241/9542) remote: Counting objects: 14% (1336/9542) remote: Counting objects: 15% (1432/9542) remote: Counting objects: 16% (1527/9542) remote: Counting objects: 17% (1623/9542) remote: Counting objects: 18% (1718/9542) remote: Counting objects: 19% (1813/9542) remote: Counting objects: 20% (1909/9542) remote: Counting objects: 21% (2004/9542) remote: Counting objects: 22% (2100/9542) remote: Counting objects: 23% (2195/9542) remote: Counting objects: 24% (2291/9542) remote: Counting objects: 25% (2386/9542) remote: Counting objects: 26% (2481/9542) remote: Counting objects: 27% (2577/9542) remote: Counting objects: 28% (2672/9542) remote: Counting objects: 29% (2768/9542) remote: Counting objects: 30% (2863/9542) remote: Counting objects: 31% (2959/9542) remote: Counting objects: 32% (3054/9542) remote: Counting objects: 33% (3149/9542) remote: Counting objects: 34% (3245/9542) remote: Counting objects: 35% (3340/9542) remote: Counting objects: 36% (3436/9542) remote: Counting objects: 37% (3531/9542) remote: Counting objects: 38% (3626/9542) remote: Counting objects: 39% (3722/9542) remote: Counting objects: 40% (3817/9542) remote: Counting objects: 41% (3913/9542) remote: Counting objects: 42% (4008/9542) remote: Counting objects: 43% (4104/9542) remote: Counting objects: 44% (4199/9542) remote: Counting objects: 45% (4294/9542) remote: Counting objects: 46% (4390/9542) remote: Counting objects: 47% (4485/9542) remote: Counting objects: 48% (4581/9542) remote: Counting objects: 49% (4676/9542) remote: Counting objects: 50% (4771/9542) remote: Counting objects: 51% (4867/9542) remote: Counting objects: 52% (4962/9542) remote: Counting objects: 53% (5058/9542) remote: Counting objects: 54% (5153/9542) remote: Counting objects: 55% (5249/9542) remote: Counting objects: 56% (5344/9542) remote: Counting objects: 57% (5439/9542) remote: Counting objects: 58% (5535/9542) remote: Counting objects: 59% (5630/9542) remote: Counting objects: 60% (5726/9542) remote: Counting objects: 61% (5821/9542) remote: Counting objects: 62% (5917/9542) remote: Counting objects: 63% (6012/9542) remote: Counting objects: 64% (6107/9542) remote: Counting objects: 65% (6203/9542) remote: Counting objects: 66% (6298/9542) remote: Counting objects: 67% (6394/9542) remote: Counting objects: 68% (6489/9542) remote: Counting objects: 69% (6584/9542) remote: Counting objects: 70% (6680/9542) remote: Counting objects: 71% (6775/9542) remote: Counting objects: 72% (6871/9542) remote: Counting objects: 73% (6966/9542) remote: Counting objects: 74% (7062/9542) remote: Counting objects: 75% (7157/9542) remote: Counting objects: 76% (7252/9542) remote: Counting objects: 77% (7348/9542) remote: Counting objects: 78% (7443/9542) remote: Counting objects: 79% (7539/9542) remote: Counting objects: 80% (7634/9542) remote: Counting objects: 81% (7730/9542) remote: Counting objects: 82% (7825/9542) remote: Counting objects: 83% (7920/9542) remote: Counting objects: 84% (8016/9542) remote: Counting objects: 85% (8111/9542) remote: Counting objects: 86% (8207/9542) remote: Counting objects: 87% (8302/9542) remote: Counting objects: 88% (8397/9542) remote: Counting objects: 89% (8493/9542) remote: Counting objects: 90% (8588/9542) remote: Counting objects: 91% (8684/9542) remote: Counting objects: 92% (8779/9542) remote: Counting objects: 93% (8875/9542) remote: Counting objects: 94% (8970/9542) remote: Counting objects: 95% (9065/9542) remote: Counting objects: 96% (9161/9542) remote: Counting objects: 97% (9256/9542) remote: Counting objects: 98% (9352/9542) remote: Counting objects: 99% (9447/9542) remote: Counting objects: 100% (9542/9542) remote: Counting objects: 100% (9542/9542), done.
  5. 3.39 s remote: Compressing objects: 0% (1/2327) remote: Compressing objects: 1% (24/2327) remote: Compressing objects: 2% (47/2327) remote: Compressing objects: 3% (70/2327) remote: Compressing objects: 4% (94/2327) remote: Compressing objects: 5% (117/2327) remote: Compressing objects: 6% (140/2327) remote: Compressing objects: 7% (163/2327) remote: Compressing objects: 8% (187/2327) remote: Compressing objects: 9% (210/2327) remote: Compressing objects: 10% (233/2327) remote: Compressing objects: 11% (256/2327) remote: Compressing objects: 12% (280/2327) remote: Compressing objects: 13% (303/2327) remote: Compressing objects: 14% (326/2327) remote: Compressing objects: 15% (350/2327) remote: Compressing objects: 16% (373/2327) remote: Compressing objects: 17% (396/2327) remote: Compressing objects: 18% (419/2327) remote: Compressing objects: 19% (443/2327) remote: Compressing objects: 20% (466/2327) remote: Compressing objects: 21% (489/2327) remote: Compressing objects: 22% (512/2327) remote: Compressing objects: 23% (536/2327) remote: Compressing objects: 23% (551/2327) remote: Compressing objects: 24% (559/2327) remote: Compressing objects: 25% (582/2327) remote: Compressing objects: 26% (606/2327) remote: Compressing objects: 27% (629/2327) remote: Compressing objects: 28% (652/2327) remote: Compressing objects: 29% (675/2327) remote: Compressing objects: 30% (699/2327) remote: Compressing objects: 31% (722/2327) remote: Compressing objects: 31% (734/2327) remote: Compressing objects: 32% (745/2327) remote: Compressing objects: 33% (768/2327) remote: Compressing objects: 34% (792/2327) remote: Compressing objects: 35% (815/2327) remote: Compressing objects: 36% (838/2327) remote: Compressing objects: 37% (861/2327) remote: Compressing objects: 38% (885/2327) remote: Compressing objects: 39% (908/2327) remote: Compressing objects: 40% (931/2327) remote: Compressing objects: 41% (955/2327) remote: Compressing objects: 42% (978/2327) remote: Compressing objects: 43% (1001/2327) remote: Compressing objects: 44% (1024/2327) remote: Compressing objects: 45% (1048/2327) remote: Compressing objects: 46% (1071/2327) remote: Compressing objects: 47% (1094/2327) remote: Compressing objects: 48% (1117/2327) remote: Compressing objects: 49% (1141/2327) remote: Compressing objects: 50% (1164/2327) remote: Compressing objects: 51% (1187/2327) remote: Compressing objects: 52% (1211/2327) remote: Compressing objects: 53% (1234/2327) remote: Compressing objects: 54% (1257/2327) remote: Compressing objects: 55% (1280/2327) remote: Compressing objects: 56% (1304/2327) remote: Compressing objects: 57% (1327/2327) remote: Compressing objects: 58% (1350/2327) remote: Compressing objects: 59% (1373/2327) remote: Compressing objects: 60% (1397/2327) remote: Compressing objects: 61% (1420/2327) remote: Compressing objects: 62% (1443/2327) remote: Compressing objects: 63% (1467/2327) remote: Compressing objects: 64% (1490/2327) remote: Compressing objects: 65% (1513/2327) remote: Compressing objects: 66% (1536/2327) remote: Compressing objects: 67% (1560/2327) remote: Compressing objects: 68% (1583/2327) remote: Compressing objects: 69% (1606/2327) remote: Compressing objects: 70% (1629/2327) remote: Compressing objects: 71% (1653/2327) remote: Compressing objects: 72% (1676/2327) remote: Compressing objects: 73% (1699/2327) remote: Compressing objects: 74% (1722/2327) remote: Compressing objects: 75% (1746/2327) remote: Compressing objects: 76% (1769/2327) remote: Compressing objects: 77% (1792/2327) remote: Compressing objects: 78% (1816/2327) remote: Compressing objects: 79% (1839/2327) remote: Compressing objects: 80% (1862/2327) remote: Compressing objects: 81% (1885/2327) remote: Compressing objects: 82% (1909/2327) remote: Compressing objects: 83% (1932/2327) remote: Compressing objects: 84% (1955/2327) remote: Compressing objects: 85% (1978/2327) remote: Compressing objects: 86% (2002/2327) remote: Compressing objects: 87% (2025/2327) remote: Compressing objects: 88% (2048/2327) remote: Compressing objects: 89% (2072/2327) remote: Compressing objects: 90% (2095/2327) remote: Compressing objects: 91% (2118/2327) remote: Compressing objects: 92% (2141/2327) remote: Compressing objects: 93% (2165/2327) remote: Compressing objects: 94% (2188/2327) remote: Compressing objects: 95% (2211/2327) remote: Compressing objects: 96% (2234/2327) remote: Compressing objects: 97% (2258/2327) remote: Compressing objects: 98% (2281/2327) remote: Compressing objects: 99% (2304/2327) remote: Compressing objects: 100% (2327/2327) remote: Compressing objects: 100% (2327/2327), done.
  6. 6.30 s Receiving objects: 0% (1/64188) Receiving objects: 1% (642/64188) Receiving objects: 2% (1284/64188) Receiving objects: 3% (1926/64188) Receiving objects: 4% (2568/64188) Receiving objects: 5% (3210/64188) Receiving objects: 6% (3852/64188) Receiving objects: 7% (4494/64188) Receiving objects: 8% (5136/64188) Receiving objects: 9% (5777/64188) Receiving objects: 10% (6419/64188), 11.34 MiB | 22.67 MiB/s Receiving objects: 11% (7061/64188), 11.34 MiB | 22.67 MiB/s Receiving objects: 12% (7703/64188), 11.34 MiB | 22.67 MiB/s Receiving objects: 13% (8345/64188), 11.34 MiB | 22.67 MiB/s Receiving objects: 14% (8987/64188), 11.34 MiB | 22.67 MiB/s Receiving objects: 15% (9629/64188), 11.34 MiB | 22.67 MiB/s Receiving objects: 16% (10271/64188), 11.34 MiB | 22.67 MiB/s Receiving objects: 17% (10912/64188), 11.34 MiB | 22.67 MiB/s Receiving objects: 18% (11554/64188), 11.34 MiB | 22.67 MiB/s Receiving objects: 19% (12196/64188), 11.34 MiB | 22.67 MiB/s Receiving objects: 20% (12838/64188), 11.34 MiB | 22.67 MiB/s Receiving objects: 21% (13480/64188), 11.34 MiB | 22.67 MiB/s Receiving objects: 22% (14122/64188), 11.34 MiB | 22.67 MiB/s Receiving objects: 23% (14764/64188), 11.34 MiB | 22.67 MiB/s Receiving objects: 24% (15406/64188), 11.34 MiB | 22.67 MiB/s Receiving objects: 25% (16047/64188), 11.34 MiB | 22.67 MiB/s Receiving objects: 26% (16689/64188), 11.34 MiB | 22.67 MiB/s Receiving objects: 27% (17331/64188), 11.34 MiB | 22.67 MiB/s Receiving objects: 28% (17973/64188), 11.34 MiB | 22.67 MiB/s Receiving objects: 29% (18615/64188), 11.34 MiB | 22.67 MiB/s Receiving objects: 30% (19257/64188), 11.34 MiB | 22.67 MiB/s Receiving objects: 31% (19899/64188), 11.34 MiB | 22.67 MiB/s Receiving objects: 32% (20541/64188), 11.34 MiB | 22.67 MiB/s Receiving objects: 33% (21183/64188), 11.34 MiB | 22.67 MiB/s Receiving objects: 34% (21824/64188), 11.34 MiB | 22.67 MiB/s Receiving objects: 35% (22466/64188), 11.34 MiB | 22.67 MiB/s Receiving objects: 36% (23108/64188), 11.34 MiB | 22.67 MiB/s Receiving objects: 37% (23750/64188), 11.34 MiB | 22.67 MiB/s Receiving objects: 38% (24392/64188), 11.34 MiB | 22.67 MiB/s Receiving objects: 39% (25034/64188), 11.34 MiB | 22.67 MiB/s Receiving objects: 40% (25676/64188), 11.34 MiB | 22.67 MiB/s Receiving objects: 41% (26318/64188), 11.34 MiB | 22.67 MiB/s Receiving objects: 42% (26959/64188), 11.34 MiB | 22.67 MiB/s Receiving objects: 43% (27601/64188), 11.34 MiB | 22.67 MiB/s Receiving objects: 44% (28243/64188), 11.34 MiB | 22.67 MiB/s Receiving objects: 45% (28885/64188), 11.34 MiB | 22.67 MiB/s Receiving objects: 46% (29527/64188), 11.34 MiB | 22.67 MiB/s Receiving objects: 47% (30169/64188), 11.34 MiB | 22.67 MiB/s Receiving objects: 48% (30811/64188), 11.34 MiB | 22.67 MiB/s Receiving objects: 49% (31453/64188), 11.34 MiB | 22.67 MiB/s Receiving objects: 50% (32094/64188), 11.34 MiB | 22.67 MiB/s Receiving objects: 51% (32736/64188), 11.34 MiB | 22.67 MiB/s Receiving objects: 51% (33252/64188), 31.62 MiB | 31.62 MiB/s Receiving objects: 52% (33378/64188), 31.62 MiB | 31.62 MiB/s Receiving objects: 53% (34020/64188), 31.62 MiB | 31.62 MiB/s Receiving objects: 54% (34662/64188), 31.62 MiB | 31.62 MiB/s Receiving objects: 55% (35304/64188), 31.62 MiB | 31.62 MiB/s Receiving objects: 56% (35946/64188), 31.62 MiB | 31.62 MiB/s Receiving objects: 57% (36588/64188), 31.62 MiB | 31.62 MiB/s Receiving objects: 58% (37230/64188), 31.62 MiB | 31.62 MiB/s Receiving objects: 59% (37871/64188), 31.62 MiB | 31.62 MiB/s Receiving objects: 60% (38513/64188), 31.62 MiB | 31.62 MiB/s Receiving objects: 61% (39155/64188), 48.86 MiB | 32.57 MiB/s Receiving objects: 62% (39797/64188), 48.86 MiB | 32.57 MiB/s Receiving objects: 63% (40439/64188), 48.86 MiB | 32.57 MiB/s Receiving objects: 64% (41081/64188), 48.86 MiB | 32.57 MiB/s Receiving objects: 65% (41723/64188), 48.86 MiB | 32.57 MiB/s Receiving objects: 66% (42365/64188), 48.86 MiB | 32.57 MiB/s Receiving objects: 67% (43006/64188), 48.86 MiB | 32.57 MiB/s Receiving objects: 68% (43648/64188), 48.86 MiB | 32.57 MiB/s Receiving objects: 69% (44290/64188), 48.86 MiB | 32.57 MiB/s Receiving objects: 70% (44932/64188), 48.86 MiB | 32.57 MiB/s Receiving objects: 70% (45334/64188), 48.86 MiB | 32.57 MiB/s Receiving objects: 71% (45574/64188), 65.79 MiB | 32.89 MiB/s Receiving objects: 72% (46216/64188), 65.79 MiB | 32.89 MiB/s Receiving objects: 73% (46858/64188), 65.79 MiB | 32.89 MiB/s Receiving objects: 74% (47500/64188), 65.79 MiB | 32.89 MiB/s Receiving objects: 75% (48141/64188), 65.79 MiB | 32.89 MiB/s Receiving objects: 76% (48783/64188), 65.79 MiB | 32.89 MiB/s Receiving objects: 77% (49425/64188), 65.79 MiB | 32.89 MiB/s Receiving objects: 78% (50067/64188), 65.79 MiB | 32.89 MiB/s Receiving objects: 79% (50709/64188), 65.79 MiB | 32.89 MiB/s Receiving objects: 80% (51351/64188), 65.79 MiB | 32.89 MiB/s Receiving objects: 81% (51993/64188), 65.79 MiB | 32.89 MiB/s Receiving objects: 82% (52635/64188), 65.79 MiB | 32.89 MiB/s Receiving objects: 83% (53277/64188), 65.79 MiB | 32.89 MiB/s Receiving objects: 84% (53918/64188), 65.79 MiB | 32.89 MiB/s Receiving objects: 85% (54560/64188), 83.36 MiB | 33.28 MiB/s Receiving objects: 86% (55202/64188), 83.36 MiB | 33.28 MiB/s Receiving objects: 87% (55844/64188), 83.36 MiB | 33.28 MiB/s Receiving objects: 88% (56486/64188), 83.36 MiB | 33.28 MiB/s Receiving objects: 89% (57128/64188), 83.36 MiB | 33.28 MiB/s Receiving objects: 90% (57770/64188), 83.36 MiB | 33.28 MiB/s Receiving objects: 91% (58412/64188), 83.36 MiB | 33.28 MiB/s Receiving objects: 92% (59053/64188), 83.36 MiB | 33.28 MiB/s Receiving objects: 93% (59695/64188), 83.36 MiB | 33.28 MiB/s Receiving objects: 94% (60337/64188), 83.36 MiB | 33.28 MiB/s Receiving objects: 95% (60979/64188), 83.36 MiB | 33.28 MiB/s Receiving objects: 96% (61621/64188), 83.36 MiB | 33.28 MiB/s Receiving objects: 97% (62263/64188), 83.36 MiB | 33.28 MiB/s Receiving objects: 98% (62905/64188), 83.36 MiB | 33.28 MiB/s Receiving objects: 99% (63547/64188), 83.36 MiB | 33.28 MiB/s remote: Total 64188 (delta 7388), reused 7767 (delta 6670), pack-reused 54646 (from 3)
  7. 6.31 s Receiving objects: 100% (64188/64188), 83.36 MiB | 33.28 MiB/s Receiving objects: 100% (64188/64188), 97.83 MiB | 33.68 MiB/s, done.
  8. 7.79 s Resolving deltas: 0% (0/44318) Resolving deltas: 1% (444/44318) Resolving deltas: 2% (887/44318) Resolving deltas: 3% (1330/44318) Resolving deltas: 4% (1773/44318) Resolving deltas: 5% (2216/44318) Resolving deltas: 6% (2662/44318) Resolving deltas: 7% (3104/44318) Resolving deltas: 8% (3546/44318) Resolving deltas: 9% (3989/44318) Resolving deltas: 10% (4432/44318) Resolving deltas: 11% (4877/44318) Resolving deltas: 12% (5319/44318) Resolving deltas: 13% (5762/44318) Resolving deltas: 14% (6205/44318) Resolving deltas: 15% (6648/44318) Resolving deltas: 16% (7091/44318) Resolving deltas: 17% (7535/44318) Resolving deltas: 18% (7978/44318) Resolving deltas: 19% (8421/44318) Resolving deltas: 20% (8864/44318) Resolving deltas: 21% (9307/44318) Resolving deltas: 22% (9750/44318) Resolving deltas: 23% (10194/44318) Resolving deltas: 24% (10637/44318) Resolving deltas: 25% (11080/44318) Resolving deltas: 26% (11523/44318) Resolving deltas: 27% (11966/44318) Resolving deltas: 28% (12410/44318) Resolving deltas: 29% (12853/44318) Resolving deltas: 30% (13296/44318) Resolving deltas: 31% (13739/44318) Resolving deltas: 32% (14182/44318) Resolving deltas: 33% (14625/44318) Resolving deltas: 34% (15069/44318) Resolving deltas: 35% (15512/44318) Resolving deltas: 36% (15955/44318) Resolving deltas: 37% (16399/44318) Resolving deltas: 38% (16841/44318) Resolving deltas: 39% (17285/44318) Resolving deltas: 40% (17728/44318) Resolving deltas: 41% (18171/44318) Resolving deltas: 42% (18614/44318) Resolving deltas: 43% (19057/44318) Resolving deltas: 44% (19500/44318) Resolving deltas: 45% (19944/44318) Resolving deltas: 46% (20387/44318) Resolving deltas: 47% (20830/44318) Resolving deltas: 48% (21274/44318) Resolving deltas: 49% (21716/44318) Resolving deltas: 50% (22161/44318) Resolving deltas: 51% (22603/44318) Resolving deltas: 52% (23046/44318) Resolving deltas: 53% (23489/44318) Resolving deltas: 54% (23932/44318) Resolving deltas: 55% (24375/44318) Resolving deltas: 56% (24819/44318) Resolving deltas: 57% (25262/44318) Resolving deltas: 58% (25705/44318) Resolving deltas: 59% (26149/44318) Resolving deltas: 60% (26591/44318) Resolving deltas: 61% (27034/44318) Resolving deltas: 62% (27481/44318) Resolving deltas: 63% (27921/44318) Resolving deltas: 64% (28364/44318) Resolving deltas: 65% (28807/44318) Resolving deltas: 66% (29250/44318) Resolving deltas: 67% (29694/44318) Resolving deltas: 68% (30137/44318) Resolving deltas: 69% (30580/44318) Resolving deltas: 70% (31023/44318) Resolving deltas: 71% (31466/44318) Resolving deltas: 72% (31909/44318) Resolving deltas: 73% (32353/44318) Resolving deltas: 74% (32798/44318) Resolving deltas: 74% (33004/44318) Resolving deltas: 75% (33239/44318) Resolving deltas: 76% (33683/44318) Resolving deltas: 77% (34125/44318) Resolving deltas: 78% (34569/44318) Resolving deltas: 79% (35012/44318) Resolving deltas: 80% (35455/44318) Resolving deltas: 81% (35898/44318) Resolving deltas: 82% (36341/44318) Resolving deltas: 83% (36785/44318) Resolving deltas: 84% (37228/44318) Resolving deltas: 85% (37671/44318) Resolving deltas: 86% (38114/44318) Resolving deltas: 87% (38557/44318) Resolving deltas: 88% (39000/44318) Resolving deltas: 89% (39444/44318) Resolving deltas: 90% (39887/44318) Resolving deltas: 91% (40332/44318) Resolving deltas: 92% (40773/44318) Resolving deltas: 93% (41216/44318) Resolving deltas: 94% (41659/44318) Resolving deltas: 95% (42103/44318) Resolving deltas: 96% (42546/44318) Resolving deltas: 97% (42989/44318) Resolving deltas: 98% (43433/44318) Resolving deltas: 99% (43875/44318) Resolving deltas: 100% (44318/44318) Resolving deltas: 100% (44318/44318), done.
  9. 8.22 s Fetching commit 08898429f2a98faff9a8de1c43eb54edd82e450c for push-vrpyqyylypmw ...
  10. 8.22 s $ /nix/store/bcnisk3ydfgv26v2gw3zlky24g00yww2-git-2.54.0/bin/git fetch origin 08898429f2a98faff9a8de1c43eb54edd82e450c
  11. 8.63 s From https://github.com/alphal00p/gammaloop
  12. 8.63 s * branch 08898429f2a98faff9a8de1c43eb54edd82e450c -> FETCH_HEAD
  13. 8.65 s $ /nix/store/9ypz3flqsrl5xl495mm8h645gadjsxi1-coreutils-9.11/bin/timeout --kill-after=15s 7200s /nix/store/bcnisk3ydfgv26v2gw3zlky24g00yww2-git-2.54.0/bin/git -c advice.detachedHead=false checkout 08898429f2a98faff9a8de1c43eb54edd82e450c
  14. 8.88 s HEAD is now at 08898429 run documentation tests through the Nix CI secret runner
  15. 8.89 s $ /nix/store/9ypz3flqsrl5xl495mm8h645gadjsxi1-coreutils-9.11/bin/timeout --kill-after=15s 7200s /nix/store/23zk8sgzamrbmj1fday15szf7f2279s8-nix-2.34.7/bin/nix --extra-experimental-features nix-command --extra-experimental-features flakes --log-format internal-json run .#packages.x86_64-linux.nix-ci-check-gammaloop-doctest --print-build-logs
  16. 11.67 s
  17. 11.78 s Downloading cached nix-ci-check-gammaloop-doctest from https://cache.nix-ci.com
  18. 11.79 s Downloaded cached nix-ci-check-gammaloop-doctest (1000 B) in 11ms
  19. 11.79 s Progress: 0 of 1 built, 1 of 1 downloaded from cache
  20. 14.35 s evaluating derivation 'g copying '/nix/store/0fcb evaluating derivation 'g querying gammaloop-works [0/1 built, 0.0 KiB DL] [1/0/1 built, 0.0 KiB DLgammaloop-workspace-doctest> Running phase: unpackPhase
  21. 14.35 s gammaloop-workspace-doctest> unpacking source archive /nix/store/n62xwv096bc248rr6y7qpggfdbwshkw9-source
  22. 14.47 s gammaloop-workspace-doctest> source root is source
  23. 14.50 s gammaloop-workspace-doctest> Running phase: patchPhase
  24. 14.50 s gammaloop-workspace-doctest> Executing configureCargoCommonVars
  25. 14.50 s gammaloop-workspace-doctest> decompressing cargo artifacts from /nix/store/kbgwngi7xvi54jsr0kp8rhj1b9mfja7d-gammaloop-workspace-deps-deps-0.1.0/target.tar.zst to target
  26. 15.89 s gammaloop-workspace-doctest> Running phase: updateAutotoolsGnuConfigScriptsPhase
  27. 15.93 s gammaloop-workspace-doctest> Running phase: configurePhase
  28. 15.93 s gammaloop-workspace-doctest> will append /build/source/.cargo-home/config.toml with contents of /nix/store/xdy1vvhll2bijdplvl9fcc2b9plkxhaa-vendor-cargo-deps/config.toml
  29. 15.93 s gammaloop-workspace-doctest> default configurePhase, nothing to do
  30. 15.93 s gammaloop-workspace-doctest> Running phase: buildPhase
  31. 15.94 s gammaloop-workspace-doctest> +++ command cargo --version
  32. 15.94 s gammaloop-workspace-doctest> cargo 1.97.0 (c980f4866 2026-06-30)
  33. 15.97 s gammaloop-workspace-doctest> +++ command cargo test --profile ci-optim --doc --locked --workspace --features gammaloop-api/cli,gammaloop-tracing-filter/clap,gammaloop-tracing-filter/symbolica,idenso/bincode,idenso/reference-cases,linnet/bincode,linnet/drawing,linnet/nodestore-vec,linnet/rkyv,linnet/serde,linnet/symbolica,spenso-macros/shadowing,spenso/shadowing,symbolica/tracing_max_level_info
  34. 16.28 s gammaloop-workspace-doctest> Compiling target-lexicon v0.13.5
  35. 16.29 s gammaloop-workspace-doctest> Compiling symbolica v2.2.0 (https://github.com/symbolica-dev/symbolica?branch=dev#0441bd7a)
  36. 16.29 s gammaloop-workspace-doctest> Compiling maplit v1.0.2
  37. 16.31 s gammaloop-workspace-doctest> Compiling gammaloop-tracing-filter-macros v0.1.0 (/build/source/crates/gammaloop-tracing-filter-macros)
  38. 16.31 s gammaloop-workspace-doctest> Compiling vakint v0.1.2 (/build/source/crates/vakint)
  39. 16.32 s gammaloop-workspace-doctest> Compiling gammalooprs v0.3.4 (/build/source/crates/gammalooprs)
  40. 16.32 s gammaloop-workspace-doctest> Compiling alphal00p-docs-macros v0.1.0 (/build/source/crates/alphal00p-docs-macros)
  41. 16.32 s gammaloop-workspace-doctest> Compiling alphal00p-docs-schema v0.1.0 (/build/source/crates/alphal00p-docs-schema)
  42. 16.32 s gammaloop-workspace-doctest> Compiling rustc_version v0.4.1
  43. 16.34 s gammaloop-workspace-doctest> Compiling bincode v1.3.3
  44. 16.34 s gammaloop-workspace-doctest> Compiling gungraun-runner v0.18.2
  45. 16.34 s gammaloop-workspace-doctest> Compiling iai-callgrind-runner v0.14.2
  46. 16.34 s gammaloop-workspace-doctest> Compiling target-triple v1.0.1
  47. 16.34 s gammaloop-workspace-doctest> Compiling clinnet v0.1.8 (/build/source/crates/clinnet)
  48. 16.34 s gammaloop-workspace-doctest> Compiling gammaloop-integration-tests v0.1.0 (/build/source/tests)
  49. 16.52 s gammaloop-workspace-doctest> Compiling test-log-core v0.2.20
  50. 16.54 s gammaloop-workspace-doctest> Compiling wait-timeout v0.2.1
  51. 16.55 s gammaloop-workspace-doctest> Compiling quick-error v1.2.3
  52. 16.59 s gammaloop-workspace-doctest> Compiling bit-vec v0.8.0
  53. 16.60 s gammaloop-workspace-doctest> Compiling iai-callgrind v0.14.2
  54. 16.63 s gammaloop-workspace-doctest> Compiling rusty-fork v0.3.1
  55. 16.78 s gammaloop-workspace-doctest> Compiling bit-set v0.8.0
  56. 16.80 s gammaloop-workspace-doctest> Compiling iai-callgrind-macros v0.5.1
  57. 16.81 s gammaloop-workspace-doctest> Compiling rand_xorshift v0.4.0
  58. 16.88 s gammaloop-workspace-doctest> Compiling console v0.15.11
  59. 16.90 s gammaloop-workspace-doctest> Compiling termcolor v1.4.1
  60. 16.93 s gammaloop-workspace-doctest> Compiling base64 v0.21.7
  61. 16.95 s gammaloop-workspace-doctest> Compiling gungraun-macros v0.8.0
  62. 17.07 s gammaloop-workspace-doctest> Compiling unarray v0.1.4
  63. 17.16 s gammaloop-workspace-doctest> Compiling glob v0.3.4
  64. 17.33 s gammaloop-workspace-doctest> Compiling alphal00p-docs-builder v0.1.0 (/build/source/crates/alphal00p-docs-builder)
  65. 17.38 s gammaloop-workspace-doctest> Compiling trybuild v1.0.120
  66. 17.42 s gammaloop-workspace-doctest> Compiling similar-asserts v1.7.0
  67. 17.56 s gammaloop-workspace-doctest> Compiling alphal00p-docs-catalogs v0.1.0 (/build/source/crates/alphal00p-docs-catalogs)
  68. 17.57 s gammaloop-workspace-doctest> Compiling pyo3-build-config v0.28.3
  69. 17.70 s gammaloop-workspace-doctest> Compiling ron v0.8.1
  70. 17.74 s gammaloop-workspace-doctest> Compiling proptest v1.11.0
  71. 17.96 s gammaloop-workspace-doctest> Compiling kurvst v0.1.0 (/build/source/crates/kurvst)
  72. 18.26 s gammaloop-workspace-doctest> Compiling test-log-macros v0.2.20
  73. 21.05 s gammaloop-workspace-doctest> Compiling test-log v0.2.20
  74. 21.74 s gammaloop-workspace-doctest> Compiling alphal00p-docs-examples v0.1.0 (/build/source/crates/alphal00p-docs-examples)
  75. 23.88 s gammaloop-workspace-doctest> Compiling pyo3-macros-backend v0.28.3
  76. 24.04 s gammaloop-workspace-doctest> Compiling pyo3-ffi v0.28.3
  77. 24.13 s gammaloop-workspace-doctest> Compiling pyo3 v0.28.3
  78. 24.33 s gammaloop-workspace-doctest> Compiling numpy v0.28.0
  79. 24.60 s gammaloop-workspace-doctest> Compiling gammaloop-api v0.1.0 (/build/source/crates/gammaloop-api)
  80. 25.92 s gammaloop-workspace-doctest> Compiling gungraun v0.18.2
  81. 34.26 s gammaloop-workspace-doctest> Compiling pyo3-macros v0.28.3
  82. 40.68 s gammaloop-workspace-doctest> Compiling pyo3-stub-gen v0.17.2
  83. 41.52 s gammaloop-workspace-doctest> Compiling numerica v2.2.0 (https://github.com/symbolica-dev/symbolica?branch=dev#0441bd7a)
  84. 44.47 s gammaloop-workspace-doctest> Compiling graphica v2.1.0 (https://github.com/symbolica-dev/symbolica?branch=dev#0441bd7a)
  85. 48.76 s gammaloop-workspace-doctest> Compiling symbolica-utils v0.1.0 (/build/source/crates/symbolica-utils)
  86. 214.07 s gammaloop-workspace-doctest> Compiling gammaloop-workspace-hack v0.1.0 (/build/source/crates/gammaloop-workspace-hack)
  87. 214.08 s gammaloop-workspace-doctest> Compiling spenso-macros v0.3.2 (/build/source/crates/spenso-macros)
  88. 214.23 s gammaloop-workspace-doctest> Compiling linnet v0.17.0 (/build/source/crates/linnet)
  89. 217.63 s gammaloop-workspace-doctest> Compiling spenso v0.6.0 (/build/source/crates/spenso)
  90. 225.74 s gammaloop-workspace-doctest> Compiling idenso v0.3.0 (/build/source/crates/idenso)
  91. 225.76 s gammaloop-workspace-doctest> Compiling gammaloop-tracing-filter v0.1.0 (/build/source/crates/gammaloop-tracing-filter)
  92. 229.55 s gammaloop-workspace-doctest> Compiling spenso-hep-lib v0.1.7 (/build/source/crates/spenso-hep-lib)
  93. 229.79 s gammaloop-workspace-doctest> Compiling spynso3 v0.1.2 (/build/source/crates/spynso3)
  94. 277.67 s gammaloop-workspace-doctest> Compiling linnest v0.1.0 (/build/source/crates/linnest)
  95. 277.68 s gammaloop-workspace-doctest> Compiling linnet-py v0.1.0 (/build/source/crates/linnet-py)
  96. 491.75 s gammaloop-workspace-doctest> Finished `ci-optim` profile [optimized] target(s) in 7m 55s
  97. 491.88 s gammaloop-workspace-doctest> warning: the following packages contain code that will be rejected by a future version of Rust: proc-macro-error2 v2.0.1
  98. 491.88 s gammaloop-workspace-doctest> note: to see what the problems were, use the option `--future-incompat-report`, or run `cargo report future-incompatibilities --id 1`
  99. 491.92 s gammaloop-workspace-doctest> Doc-tests alphal00p_docs_builder
  100. 492.15 s gammaloop-workspace-doctest>
  101. 492.15 s gammaloop-workspace-doctest> running 0 tests
  102. 492.15 s gammaloop-workspace-doctest>
  103. 492.15 s gammaloop-workspace-doctest> test result: ok. 0 passed; 0 failed; 0 ignored; 0 measured; 0 filtered out; finished in 0.00s
  104. 492.15 s gammaloop-workspace-doctest>
  105. 492.16 s gammaloop-workspace-doctest> Doc-tests alphal00p_docs_catalogs
  106. 493.54 s gammaloop-workspace-doctest>
  107. 493.54 s gammaloop-workspace-doctest> running 0 tests
  108. 493.54 s gammaloop-workspace-doctest>
  109. 493.54 s gammaloop-workspace-doctest> test result: ok. 0 passed; 0 failed; 0 ignored; 0 measured; 0 filtered out; finished in 0.00s
  110. 493.54 s gammaloop-workspace-doctest>
  111. 493.55 s gammaloop-workspace-doctest> Doc-tests alphal00p_docs_examples
  112. 493.57 s gammaloop-workspace-doctest>
  113. 493.57 s gammaloop-workspace-doctest> running 0 tests
  114. 493.57 s gammaloop-workspace-doctest>
  115. 493.57 s gammaloop-workspace-doctest> test result: ok. 0 passed; 0 failed; 0 ignored; 0 measured; 0 filtered out; finished in 0.00s
  116. 493.57 s gammaloop-workspace-doctest>
  117. 493.57 s gammaloop-workspace-doctest> Doc-tests alphal00p_docs
  118. 493.64 s gammaloop-workspace-doctest>
  119. 493.64 s gammaloop-workspace-doctest> running 0 tests
  120. 493.64 s gammaloop-workspace-doctest>
  121. 493.64 s gammaloop-workspace-doctest> test result: ok. 0 passed; 0 failed; 0 ignored; 0 measured; 0 filtered out; finished in 0.00s
  122. 493.64 s gammaloop-workspace-doctest>
  123. 493.64 s gammaloop-workspace-doctest> Doc-tests alphal00p_docs_schema
  124. 493.73 s gammaloop-workspace-doctest>
  125. 493.73 s gammaloop-workspace-doctest> running 0 tests
  126. 493.73 s gammaloop-workspace-doctest>
  127. 493.73 s gammaloop-workspace-doctest> test result: ok. 0 passed; 0 failed; 0 ignored; 0 measured; 0 filtered out; finished in 0.00s
  128. 493.73 s gammaloop-workspace-doctest>
  129. 493.74 s gammaloop-workspace-doctest> Doc-tests clinnet
  130. 493.84 s gammaloop-workspace-doctest>
  131. 493.84 s gammaloop-workspace-doctest> running 0 tests
  132. 493.84 s gammaloop-workspace-doctest>
  133. 493.84 s gammaloop-workspace-doctest> test result: ok. 0 passed; 0 failed; 0 ignored; 0 measured; 0 filtered out; finished in 0.00s
  134. 493.84 s gammaloop-workspace-doctest>
  135. 493.85 s gammaloop-workspace-doctest> Doc-tests gammaloop_api
  136. 495.14 s gammaloop-workspace-doctest>
  137. 495.14 s gammaloop-workspace-doctest> running 13 tests
  138. 495.18 s gammaloop-workspace-doctest> test crates/gammaloop-api/src/python.rs - python::GammaLoopAPI::evaluate_sample (line 2926) ... FAILED
  139. 495.18 s gammaloop-workspace-doctest> test crates/gammaloop-api/src/python.rs - python::GammaLoopAPI::get_default_runtime_settings (line 3688) ... FAILED
  140. 495.19 s gammaloop-workspace-doctest> test crates/gammaloop-api/src/python.rs - python::GammaLoopAPI::get_integrand_info (line 3496) ... FAILED
  141. 495.19 s gammaloop-workspace-doctest> test crates/gammaloop-api/src/python.rs - python::GammaLoopAPI::get_active_command_blocks (line 3652) ... FAILED
  142. 495.19 s gammaloop-workspace-doctest> test crates/gammaloop-api/src/python.rs - python::GammaLoopAPI::evaluate_samples (line 3040) ... FAILED
  143. 495.19 s gammaloop-workspace-doctest> test crates/gammaloop-api/src/python.rs - python::GammaLoopAPI::get_integrand_settings (line 3539) ... FAILED
  144. 495.38 s gammaloop-workspace-doctest> test crates/gammaloop-api/src/python.rs - python::GammaLoopAPI::get_run_history (line 3603) ... FAILED
  145. 495.47 s gammaloop-workspace-doctest> test crates/gammaloop-api/src/python.rs - python::GammaLoopAPI::run_command (line 3793) ... FAILED
  146. 495.48 s gammaloop-workspace-doctest> test crates/gammaloop-api/src/python.rs - python::atom_to_dots (line 157) ... FAILED
  147. 495.48 s gammaloop-workspace-doctest> test crates/gammaloop-api/src/python.rs - python::evaluate_graph_overall_factor (line 95) ... FAILED
  148. 495.53 s gammaloop-workspace-doctest> test crates/gammaloop-api/src/python.rs - python::atom_to_canonical_string (line 128) ... FAILED
  149. 495.53 s gammaloop-workspace-doctest> test crates/gammaloop-api/src/python.rs - python::GammaLoopAPI::new_python (line 2804) ... FAILED
  150. 495.54 s gammaloop-workspace-doctest> test crates/gammaloop-api/src/python.rs - python::GammaLoopAPI::get_global_settings (line 3631) ... FAILED
  151. 495.54 s gammaloop-workspace-doctest>
  152. 495.54 s gammaloop-workspace-doctest> failures:
  153. 495.54 s gammaloop-workspace-doctest>
  154. 495.54 s gammaloop-workspace-doctest> ---- crates/gammaloop-api/src/python.rs - python::GammaLoopAPI::evaluate_sample (line 2926) stdout ----
  155. 495.54 s gammaloop-workspace-doctest> error: expected one of `!` or `::`, found `=`
  156. 495.54 s gammaloop-workspace-doctest> --> crates/gammaloop-api/src/python.rs:2927:8
  157. 495.54 s gammaloop-workspace-doctest> |
  158. 495.54 s gammaloop-workspace-doctest> 2927 | result = api.evaluate_sample(point, process_id=0, minimal_output=True)
  159. 495.54 s gammaloop-workspace-doctest> | ^ expected one of `!` or `::`
  160. 495.54 s gammaloop-workspace-doctest>
  161. 495.54 s gammaloop-workspace-doctest> error: aborting due to 1 previous error
  162. 495.54 s gammaloop-workspace-doctest>
  163. 495.54 s gammaloop-workspace-doctest> Couldn't compile the test.
  164. 495.54 s gammaloop-workspace-doctest> ---- crates/gammaloop-api/src/python.rs - python::GammaLoopAPI::get_default_runtime_settings (line 3688) stdout ----
  165. 495.54 s gammaloop-workspace-doctest> error: expected one of `!` or `::`, found `=`
  166. 495.54 s gammaloop-workspace-doctest> --> crates/gammaloop-api/src/python.rs:3689:9
  167. 495.54 s gammaloop-workspace-doctest> |
  168. 495.54 s gammaloop-workspace-doctest> 3689 | runtime = api.get_default_runtime_settings()
  169. 495.54 s gammaloop-workspace-doctest> | ^ expected one of `!` or `::`
  170. 495.54 s gammaloop-workspace-doctest>
  171. 495.54 s gammaloop-workspace-doctest> error: aborting due to 1 previous error
  172. 495.54 s gammaloop-workspace-doctest>
  173. 495.54 s gammaloop-workspace-doctest> Couldn't compile the test.
  174. 495.54 s gammaloop-workspace-doctest> ---- crates/gammaloop-api/src/python.rs - python::GammaLoopAPI::get_integrand_info (line 3496) stdout ----
  175. 495.54 s gammaloop-workspace-doctest> error: expected one of `!` or `::`, found `=`
  176. 495.54 s gammaloop-workspace-doctest> --> crates/gammaloop-api/src/python.rs:3497:6
  177. 495.54 s gammaloop-workspace-doctest> |
  178. 495.54 s gammaloop-workspace-doctest> 3497 | info = api.get_integrand_info(process_id=0)
  179. 495.54 s gammaloop-workspace-doctest> | ^ expected one of `!` or `::`
  180. 495.54 s gammaloop-workspace-doctest>
  181. 495.54 s gammaloop-workspace-doctest> error: aborting due to 1 previous error
  182. 495.54 s gammaloop-workspace-doctest>
  183. 495.54 s gammaloop-workspace-doctest> Couldn't compile the test.
  184. 495.54 s gammaloop-workspace-doctest> ---- crates/gammaloop-api/src/python.rs - python::GammaLoopAPI::get_active_command_blocks (line 3652) stdout ----
  185. 495.54 s gammaloop-workspace-doctest> error: expected item, found keyword `for`
  186. 495.54 s gammaloop-workspace-doctest> --> crates/gammaloop-api/src/python.rs:3653:1
  187. 495.54 s gammaloop-workspace-doctest> |
  188. 495.54 s gammaloop-workspace-doctest> 3653 | for name, commands in api.get_active_command_blocks().items():
  189. 495.54 s gammaloop-workspace-doctest> | ^^^ expected item
  190. 495.54 s gammaloop-workspace-doctest> |
  191. 495.54 s gammaloop-workspace-doctest> = note: for a full list of items that can appear in modules, see <https://doc.rust-lang.org/reference/items.html>
  192. 495.54 s gammaloop-workspace-doctest>
  193. 495.54 s gammaloop-workspace-doctest> error: aborting due to 1 previous error
  194. 495.54 s gammaloop-workspace-doctest>
  195. 495.54 s gammaloop-workspace-doctest> Couldn't compile the test.
  196. 495.54 s gammaloop-workspace-doctest> ---- crates/gammaloop-api/src/python.rs - python::GammaLoopAPI::evaluate_samples (line 3040) stdout ----
  197. 495.54 s gammaloop-workspace-doctest> error: expected one of `!` or `::`, found `=`
  198. 495.54 s gammaloop-workspace-doctest> --> crates/gammaloop-api/src/python.rs:3041:8
  199. 495.54 s gammaloop-workspace-doctest> |
  200. 495.54 s gammaloop-workspace-doctest> 3041 | points = numpy.asarray(points, dtype=numpy.float64)
  201. 495.54 s gammaloop-workspace-doctest> | ^ expected one of `!` or `::`
  202. 495.54 s gammaloop-workspace-doctest>
  203. 495.54 s gammaloop-workspace-doctest> error: aborting due to 1 previous error
  204. 495.54 s gammaloop-workspace-doctest>
  205. 495.54 s gammaloop-workspace-doctest> Couldn't compile the test.
  206. 495.54 s gammaloop-workspace-doctest> ---- crates/gammaloop-api/src/python.rs - python::GammaLoopAPI::get_integrand_settings (line 3539) stdout ----
  207. 495.54 s gammaloop-workspace-doctest> error: expected one of `!` or `::`, found `=`
  208. 495.54 s gammaloop-workspace-doctest> --> crates/gammaloop-api/src/python.rs:3540:10
  209. 495.54 s gammaloop-workspace-doctest> |
  210. 495.54 s gammaloop-workspace-doctest> 3540 | settings = api.get_integrand_settings(process_id=0)
  211. 495.54 s gammaloop-workspace-doctest> | ^ expected one of `!` or `::`
  212. 495.54 s gammaloop-workspace-doctest>
  213. 495.54 s gammaloop-workspace-doctest> error: aborting due to 1 previous error
  214. 495.54 s gammaloop-workspace-doctest>
  215. 495.54 s gammaloop-workspace-doctest> Couldn't compile the test.
  216. 495.54 s gammaloop-workspace-doctest> ---- crates/gammaloop-api/src/python.rs - python::GammaLoopAPI::get_run_history (line 3603) stdout ----
  217. 495.54 s gammaloop-workspace-doctest> error[E0425]: cannot find value `run_card_toml` in this scope
  218. 495.54 s gammaloop-workspace-doctest> --> crates/gammaloop-api/src/python.rs:3604:1
  219. 495.54 s gammaloop-workspace-doctest> |
  220. 495.54 s gammaloop-workspace-doctest> 3604 | run_card_toml = api.get_run_history()
  221. 495.54 s gammaloop-workspace-doctest> | ^^^^^^^^^^^^^
  222. 495.54 s gammaloop-workspace-doctest> |
  223. 495.54 s gammaloop-workspace-doctest> help: you might have meant to introduce a new binding
  224. 495.54 s gammaloop-workspace-doctest> |
  225. 495.54 s gammaloop-workspace-doctest> 3604 | let run_card_toml = api.get_run_history()
  226. 495.54 s gammaloop-workspace-doctest> | +++
  227. 495.54 s gammaloop-workspace-doctest>
  228. 495.54 s gammaloop-workspace-doctest> error[E0425]: cannot find value `api` in this scope
  229. 495.54 s gammaloop-workspace-doctest> --> crates/gammaloop-api/src/python.rs:3604:17
  230. 495.54 s gammaloop-workspace-doctest> |
  231. 495.54 s gammaloop-workspace-doctest> 3604 | run_card_toml = api.get_run_history()
  232. 495.54 s gammaloop-workspace-doctest> | ^^^ not found in this scope
  233. 495.54 s gammaloop-workspace-doctest>
  234. 495.54 s gammaloop-workspace-doctest> error: aborting due to 2 previous errors
  235. 495.54 s gammaloop-workspace-doctest>
  236. 495.54 s gammaloop-workspace-doctest> For more information about this error, try `rustc --explain E0425`.
  237. 495.54 s gammaloop-workspace-doctest> Couldn't compile the test.
  238. 495.54 s gammaloop-workspace-doctest> ---- crates/gammaloop-api/src/python.rs - python::GammaLoopAPI::run_command (line 3793) stdout ----
  239. 495.54 s gammaloop-workspace-doctest> error[E0425]: cannot find value `api` in this scope
  240. 495.54 s gammaloop-workspace-doctest> --> crates/gammaloop-api/src/python.rs:3794:1
  241. 495.54 s gammaloop-workspace-doctest> |
  242. 495.54 s gammaloop-workspace-doctest> 3794 | api.run("display processes")
  243. 495.54 s gammaloop-workspace-doctest> | ^^^ not found in this scope
  244. 495.54 s gammaloop-workspace-doctest>
  245. 495.54 s gammaloop-workspace-doctest> error: aborting due to 1 previous error
  246. 495.54 s gammaloop-workspace-doctest>
  247. 495.54 s gammaloop-workspace-doctest> For more information about this error, try `rustc --explain E0425`.
  248. 495.54 s gammaloop-workspace-doctest> Couldn't compile the test.
  249. 495.54 s gammaloop-workspace-doctest> ---- crates/gammaloop-api/src/python.rs - python::atom_to_dots (line 157) stdout ----
  250. 495.54 s gammaloop-workspace-doctest> error[E0425]: cannot find function `to_dots` in this scope
  251. 495.54 s gammaloop-workspace-doctest> --> crates/gammaloop-api/src/python.rs:158:1
  252. 495.54 s gammaloop-workspace-doctest> |
  253. 495.54 s gammaloop-workspace-doctest> 158 | to_dots("p(mu) * q(mu)")
  254. 495.54 s gammaloop-workspace-doctest> | ^^^^^^^ not found in this scope
  255. 495.54 s gammaloop-workspace-doctest>
  256. 495.54 s gammaloop-workspace-doctest> error: aborting due to 1 previous error
  257. 495.54 s gammaloop-workspace-doctest>
  258. 495.54 s gammaloop-workspace-doctest> For more information about this error, try `rustc --explain E0425`.
  259. 495.54 s gammaloop-workspace-doctest> Couldn't compile the test.
  260. 495.54 s gammaloop-workspace-doctest> ---- crates/gammaloop-api/src/python.rs - python::evaluate_graph_overall_factor (line 95) stdout ----
  261. 495.54 s gammaloop-workspace-doctest> error[E0425]: cannot find function `evaluate_graph_overall_factor` in this scope
  262. 495.54 s gammaloop-workspace-doctest> --> crates/gammaloop-api/src/python.rs:96:1
  263. 495.54 s gammaloop-workspace-doctest> |
  264. 495.54 s gammaloop-workspace-doctest> 96 | evaluate_graph_overall_factor(
  265. 495.54 s gammaloop-workspace-doctest> | ^^^^^^^^^^^^^^^^^^^^^^^^^^^^^ not found in this scope
  266. 495.54 s gammaloop-workspace-doctest>
  267. 495.54 s gammaloop-workspace-doctest> error: aborting due to 1 previous error
  268. 495.54 s gammaloop-workspace-doctest>
  269. 495.54 s gammaloop-workspace-doctest> For more information about this error, try `rustc --explain E0425`.
  270. 495.54 s gammaloop-workspace-doctest> Couldn't compile the test.
  271. 495.54 s gammaloop-workspace-doctest> ---- crates/gammaloop-api/src/python.rs - python::atom_to_canonical_string (line 128) stdout ----
  272. 495.54 s gammaloop-workspace-doctest> error[E0425]: cannot find function `atom_to_canonical_string` in this scope
  273. 495.54 s gammaloop-workspace-doctest> --> crates/gammaloop-api/src/python.rs:129:1
  274. 495.54 s gammaloop-workspace-doctest> |
  275. 495.54 s gammaloop-workspace-doctest> 129 | atom_to_canonical_string("x + x")
  276. 495.54 s gammaloop-workspace-doctest> | ^^^^^^^^^^^^^^^^^^^^^^^^ not found in this scope
  277. 495.54 s gammaloop-workspace-doctest>
  278. 495.54 s gammaloop-workspace-doctest> error: aborting due to 1 previous error
  279. 495.54 s gammaloop-workspace-doctest>
  280. 495.54 s gammaloop-workspace-doctest> For more information about this error, try `rustc --explain E0425`.
  281. 495.54 s gammaloop-workspace-doctest> Couldn't compile the test.
  282. 495.54 s gammaloop-workspace-doctest> ---- crates/gammaloop-api/src/python.rs - python::GammaLoopAPI::new_python (line 2804) stdout ----
  283. 495.54 s gammaloop-workspace-doctest> error[E0425]: cannot find value `api` in this scope
  284. 495.54 s gammaloop-workspace-doctest> --> crates/gammaloop-api/src/python.rs:2805:1
  285. 495.54 s gammaloop-workspace-doctest> |
  286. 495.54 s gammaloop-workspace-doctest> 2805 | api = GammaLoopAPI(state_folder="./state", read_only_state=True)
  287. 495.54 s gammaloop-workspace-doctest> | ^^^
  288. 495.54 s gammaloop-workspace-doctest> |
  289. 495.54 s gammaloop-workspace-doctest> help: you might have meant to introduce a new binding
  290. 495.54 s gammaloop-workspace-doctest> |
  291. 495.54 s gammaloop-workspace-doctest> 2805 | let api = GammaLoopAPI(state_folder="./state", read_only_state=True)
  292. 495.54 s gammaloop-workspace-doctest> | +++
  293. 495.54 s gammaloop-workspace-doctest>
  294. 495.54 s gammaloop-workspace-doctest> error[E0425]: cannot find value `state_folder` in this scope
  295. 495.54 s gammaloop-workspace-doctest> --> crates/gammaloop-api/src/python.rs:2805:20
  296. 495.54 s gammaloop-workspace-doctest> |
  297. 495.54 s gammaloop-workspace-doctest> 2805 | api = GammaLoopAPI(state_folder="./state", read_only_state=True)
  298. 495.54 s gammaloop-workspace-doctest> | ^^^^^^^^^^^^ not found in this scope
  299. 495.54 s gammaloop-workspace-doctest>
  300. 495.54 s gammaloop-workspace-doctest> error[E0425]: cannot find value `read_only_state` in this scope
  301. 495.54 s gammaloop-workspace-doctest> --> crates/gammaloop-api/src/python.rs:2805:44
  302. 495.54 s gammaloop-workspace-doctest> |
  303. 495.54 s gammaloop-workspace-doctest> 2805 | api = GammaLoopAPI(state_folder="./state", read_only_state=True)
  304. 495.54 s gammaloop-workspace-doctest> | ^^^^^^^^^^^^^^^ not found in this scope
  305. 495.54 s gammaloop-workspace-doctest>
  306. 495.54 s gammaloop-workspace-doctest> error[E0425]: cannot find value `True` in this scope
  307. 495.54 s gammaloop-workspace-doctest> --> crates/gammaloop-api/src/python.rs:2805:60
  308. 495.54 s gammaloop-workspace-doctest> |
  309. 495.54 s gammaloop-workspace-doctest> 2805 | api = GammaLoopAPI(state_folder="./state", read_only_state=True)
  310. 495.54 s gammaloop-workspace-doctest> | ^^^^ not found in this scope
  311. 495.54 s gammaloop-workspace-doctest> |
  312. 495.54 s gammaloop-workspace-doctest> help: you may want to use a bool value instead
  313. 495.54 s gammaloop-workspace-doctest> |
  314. 495.54 s gammaloop-workspace-doctest> 2805 - api = GammaLoopAPI(state_folder="./state", read_only_state=True)
  315. 495.54 s gammaloop-workspace-doctest> 2805 + api = GammaLoopAPI(state_folder="./state", read_only_state=true)
  316. 495.54 s gammaloop-workspace-doctest> |
  317. 495.54 s gammaloop-workspace-doctest>
  318. 495.54 s gammaloop-workspace-doctest> error[E0425]: cannot find function, tuple struct or tuple variant `GammaLoopAPI` in this scope
  319. 495.54 s gammaloop-workspace-doctest> --> crates/gammaloop-api/src/python.rs:2805:7
  320. 495.54 s gammaloop-workspace-doctest> |
  321. 495.54 s gammaloop-workspace-doctest> 2805 | api = GammaLoopAPI(state_folder="./state", read_only_state=True)
  322. 495.54 s gammaloop-workspace-doctest> | ^^^^^^^^^^^^ not found in this scope
  323. 495.54 s gammaloop-workspace-doctest>
  324. 495.54 s gammaloop-workspace-doctest> error: aborting due to 5 previous errors
  325. 495.54 s gammaloop-workspace-doctest>
  326. 495.54 s gammaloop-workspace-doctest> For more information about this error, try `rustc --explain E0425`.
  327. 495.54 s gammaloop-workspace-doctest> Couldn't compile the test.
  328. 495.54 s gammaloop-workspace-doctest> ---- crates/gammaloop-api/src/python.rs - python::GammaLoopAPI::get_global_settings (line 3631) stdout ----
  329. 495.54 s gammaloop-workspace-doctest> error[E0425]: cannot find value `settings_toml` in this scope
  330. 495.54 s gammaloop-workspace-doctest> --> crates/gammaloop-api/src/python.rs:3632:1
  331. 495.54 s gammaloop-workspace-doctest> |
  332. 495.54 s gammaloop-workspace-doctest> 3632 | settings_toml = api.get_global_settings()
  333. 495.54 s gammaloop-workspace-doctest> | ^^^^^^^^^^^^^
  334. 495.54 s gammaloop-workspace-doctest> |
  335. 495.54 s gammaloop-workspace-doctest> help: you might have meant to introduce a new binding
  336. 495.54 s gammaloop-workspace-doctest> |
  337. 495.54 s gammaloop-workspace-doctest> 3632 | let settings_toml = api.get_global_settings()
  338. 495.54 s gammaloop-workspace-doctest> | +++
  339. 495.54 s gammaloop-workspace-doctest>
  340. 495.54 s gammaloop-workspace-doctest> error[E0425]: cannot find value `api` in this scope
  341. 495.54 s gammaloop-workspace-doctest> --> crates/gammaloop-api/src/python.rs:3632:17
  342. 495.54 s gammaloop-workspace-doctest> |
  343. 495.54 s gammaloop-workspace-doctest> 3632 | settings_toml = api.get_global_settings()
  344. 495.54 s gammaloop-workspace-doctest> | ^^^ not found in this scope
  345. 495.54 s gammaloop-workspace-doctest>
  346. 495.54 s gammaloop-workspace-doctest> error: aborting due to 2 previous errors
  347. 495.54 s gammaloop-workspace-doctest>
  348. 495.54 s gammaloop-workspace-doctest> For more information about this error, try `rustc --explain E0425`.
  349. 495.54 s gammaloop-workspace-doctest> Couldn't compile the test.
  350. 495.54 s gammaloop-workspace-doctest>
  351. 495.54 s gammaloop-workspace-doctest> failures:
  352. 495.54 s gammaloop-workspace-doctest> crates/gammaloop-api/src/python.rs - python::GammaLoopAPI::evaluate_sample (line 2926)
  353. 495.54 s gammaloop-workspace-doctest> crates/gammaloop-api/src/python.rs - python::GammaLoopAPI::evaluate_samples (line 3040)
  354. 495.54 s gammaloop-workspace-doctest> crates/gammaloop-api/src/python.rs - python::GammaLoopAPI::get_active_command_blocks (line 3652)
  355. 495.54 s gammaloop-workspace-doctest> crates/gammaloop-api/src/python.rs - python::GammaLoopAPI::get_default_runtime_settings (line 3688)
  356. 495.54 s gammaloop-workspace-doctest> crates/gammaloop-api/src/python.rs - python::GammaLoopAPI::get_global_settings (line 3631)
  357. 495.54 s gammaloop-workspace-doctest> crates/gammaloop-api/src/python.rs - python::GammaLoopAPI::get_integrand_info (line 3496)
  358. 495.54 s gammaloop-workspace-doctest> crates/gammaloop-api/src/python.rs - python::GammaLoopAPI::get_integrand_settings (line 3539)
  359. 495.54 s gammaloop-workspace-doctest> crates/gammaloop-api/src/python.rs - python::GammaLoopAPI::get_run_history (line 3603)
  360. 495.54 s gammaloop-workspace-doctest> crates/gammaloop-api/src/python.rs - python::GammaLoopAPI::new_python (line 2804)
  361. 495.54 s gammaloop-workspace-doctest> crates/gammaloop-api/src/python.rs - python::GammaLoopAPI::run_command (line 3793)
  362. 495.54 s gammaloop-workspace-doctest> crates/gammaloop-api/src/python.rs - python::atom_to_canonical_string (line 128)
  363. 495.54 s gammaloop-workspace-doctest> crates/gammaloop-api/src/python.rs - python::atom_to_dots (line 157)
  364. 495.54 s gammaloop-workspace-doctest> crates/gammaloop-api/src/python.rs - python::evaluate_graph_overall_factor (line 95)
  365. 495.54 s gammaloop-workspace-doctest>
  366. 495.54 s gammaloop-workspace-doctest> test result: FAILED. 0 passed; 13 failed; 0 ignored; 0 measured; 0 filtered out; finished in 0.40s
  367. 495.54 s gammaloop-workspace-doctest>
  368. 495.54 s gammaloop-workspace-doctest> error: doctest failed, to rerun pass `-p gammaloop-api --doc`
  369. 496.12 s error: Cannot build '/nix/store/d7n0kzr0ab2qmzp3m3y3jhx03bbngjym-gammaloop-workspace-doctest-0.1.0.drv'.
  370. 496.12 s Reason: builder failed with exit code 101.
  371. 496.12 s Output paths:
  372. 496.12 s /nix/store/m1rbsc5idl2jxvknq7bvqysz3ysaha7l-gammaloop-workspace-doctest-0.1.0
  373. 496.12 s Last 349 log lines:
  374. 496.12 s > Running phase: unpackPhase
  375. 496.12 s > unpacking source archive /nix/store/n62xwv096bc248rr6y7qpggfdbwshkw9-source
  376. 496.12 s > source root is source
  377. 496.12 s > Running phase: patchPhase
  378. 496.12 s > Executing configureCargoCommonVars
  379. 496.12 s > decompressing cargo artifacts from /nix/store/kbgwngi7xvi54jsr0kp8rhj1b9mfja7d-gammaloop-workspace-deps-deps-0.1.0/target.tar.zst to target
  380. 496.12 s > Running phase: updateAutotoolsGnuConfigScriptsPhase
  381. 496.12 s > Running phase: configurePhase
  382. 496.12 s > will append /build/source/.cargo-home/config.toml with contents of /nix/store/xdy1vvhll2bijdplvl9fcc2b9plkxhaa-vendor-cargo-deps/config.toml
  383. 496.12 s > default configurePhase, nothing to do
  384. 496.12 s > Running phase: buildPhase
  385. 496.12 s > +++ command cargo --version
  386. 496.12 s > cargo 1.97.0 (c980f4866 2026-06-30)
  387. 496.12 s > +++ command cargo test --profile ci-optim --doc --locked --workspace --features gammaloop-api/cli,gammaloop-tracing-filter/clap,gammaloop-tracing-filter/symbolica,idenso/bincode,idenso/reference-cases,linnet/bincode,linnet/drawing,linnet/nodestore-vec,linnet/rkyv,linnet/serde,linnet/symbolica,spenso-macros/shadowing,spenso/shadowing,symbolica/tracing_max_level_info
  388. 496.12 s > Compiling target-lexicon v0.13.5
  389. 496.12 s > Compiling symbolica v2.2.0 (https://github.com/symbolica-dev/symbolica?branch=dev#0441bd7a)
  390. 496.12 s > Compiling maplit v1.0.2
  391. 496.12 s > Compiling gammaloop-tracing-filter-macros v0.1.0 (/build/source/crates/gammaloop-tracing-filter-macros)
  392. 496.12 s > Compiling vakint v0.1.2 (/build/source/crates/vakint)
  393. 496.12 s > Compiling gammalooprs v0.3.4 (/build/source/crates/gammalooprs)
  394. 496.12 s > Compiling alphal00p-docs-macros v0.1.0 (/build/source/crates/alphal00p-docs-macros)
  395. 496.12 s > Compiling alphal00p-docs-schema v0.1.0 (/build/source/crates/alphal00p-docs-schema)
  396. 496.12 s > Compiling rustc_version v0.4.1
  397. 496.12 s > Compiling bincode v1.3.3
  398. 496.12 s > Compiling gungraun-runner v0.18.2
  399. 496.12 s > Compiling iai-callgrind-runner v0.14.2
  400. 496.12 s > Compiling target-triple v1.0.1
  401. 496.12 s > Compiling clinnet v0.1.8 (/build/source/crates/clinnet)
  402. 496.12 s > Compiling gammaloop-integration-tests v0.1.0 (/build/source/tests)
  403. 496.12 s > Compiling test-log-core v0.2.20
  404. 496.12 s > Compiling wait-timeout v0.2.1
  405. 496.12 s > Compiling quick-error v1.2.3
  406. 496.12 s > Compiling bit-vec v0.8.0
  407. 496.12 s > Compiling iai-callgrind v0.14.2
  408. 496.12 s > Compiling rusty-fork v0.3.1
  409. 496.12 s > Compiling bit-set v0.8.0
  410. 496.12 s > Compiling iai-callgrind-macros v0.5.1
  411. 496.12 s > Compiling rand_xorshift v0.4.0
  412. 496.12 s > Compiling console v0.15.11
  413. 496.12 s > Compiling termcolor v1.4.1
  414. 496.12 s > Compiling base64 v0.21.7
  415. 496.12 s > Compiling gungraun-macros v0.8.0
  416. 496.12 s > Compiling unarray v0.1.4
  417. 496.12 s > Compiling glob v0.3.4
  418. 496.12 s > Compiling alphal00p-docs-builder v0.1.0 (/build/source/crates/alphal00p-docs-builder)
  419. 496.12 s > Compiling trybuild v1.0.120
  420. 496.12 s > Compiling similar-asserts v1.7.0
  421. 496.12 s > Compiling alphal00p-docs-catalogs v0.1.0 (/build/source/crates/alphal00p-docs-catalogs)
  422. 496.12 s > Compiling pyo3-build-config v0.28.3
  423. 496.12 s > Compiling ron v0.8.1
  424. 496.12 s > Compiling proptest v1.11.0
  425. 496.12 s > Compiling kurvst v0.1.0 (/build/source/crates/kurvst)
  426. 496.12 s > Compiling test-log-macros v0.2.20
  427. 496.12 s > Compiling test-log v0.2.20
  428. 496.12 s > Compiling alphal00p-docs-examples v0.1.0 (/build/source/crates/alphal00p-docs-examples)
  429. 496.12 s > Compiling pyo3-macros-backend v0.28.3
  430. 496.12 s > Compiling pyo3-ffi v0.28.3
  431. 496.12 s > Compiling pyo3 v0.28.3
  432. 496.12 s > Compiling numpy v0.28.0
  433. 496.12 s > Compiling gammaloop-api v0.1.0 (/build/source/crates/gammaloop-api)
  434. 496.12 s > Compiling gungraun v0.18.2
  435. 496.12 s > Compiling pyo3-macros v0.28.3
  436. 496.12 s > Compiling pyo3-stub-gen v0.17.2
  437. 496.12 s > Compiling numerica v2.2.0 (https://github.com/symbolica-dev/symbolica?branch=dev#0441bd7a)
  438. 496.12 s > Compiling graphica v2.1.0 (https://github.com/symbolica-dev/symbolica?branch=dev#0441bd7a)
  439. 496.12 s > Compiling symbolica-utils v0.1.0 (/build/source/crates/symbolica-utils)
  440. 496.12 s > Compiling gammaloop-workspace-hack v0.1.0 (/build/source/crates/gammaloop-workspace-hack)
  441. 496.12 s > Compiling spenso-macros v0.3.2 (/build/source/crates/spenso-macros)
  442. 496.12 s > Compiling linnet v0.17.0 (/build/source/crates/linnet)
  443. 496.12 s > Compiling spenso v0.6.0 (/build/source/crates/spenso)
  444. 496.12 s > Compiling idenso v0.3.0 (/build/source/crates/idenso)
  445. 496.12 s > Compiling gammaloop-tracing-filter v0.1.0 (/build/source/crates/gammaloop-tracing-filter)
  446. 496.12 s > Compiling spenso-hep-lib v0.1.7 (/build/source/crates/spenso-hep-lib)
  447. 496.12 s > Compiling spynso3 v0.1.2 (/build/source/crates/spynso3)
  448. 496.12 s > Compiling linnest v0.1.0 (/build/source/crates/linnest)
  449. 496.12 s > Compiling linnet-py v0.1.0 (/build/source/crates/linnet-py)
  450. 496.12 s > Finished `ci-optim` profile [optimized] target(s) in 7m 55s
  451. 496.12 s > warning: the following packages contain code that will be rejected by a future version of Rust: proc-macro-error2 v2.0.1
  452. 496.12 s > note: to see what the problems were, use the option `--future-incompat-report`, or run `cargo report future-incompatibilities --id 1`
  453. 496.12 s > Doc-tests alphal00p_docs_builder
  454. 496.12 s >
  455. 496.12 s > running 0 tests
  456. 496.12 s >
  457. 496.12 s > test result: ok. 0 passed; 0 failed; 0 ignored; 0 measured; 0 filtered out; finished in 0.00s
  458. 496.12 s >
  459. 496.12 s > Doc-tests alphal00p_docs_catalogs
  460. 496.12 s >
  461. 496.12 s > running 0 tests
  462. 496.12 s >
  463. 496.12 s > test result: ok. 0 passed; 0 failed; 0 ignored; 0 measured; 0 filtered out; finished in 0.00s
  464. 496.12 s >
  465. 496.12 s > Doc-tests alphal00p_docs_examples
  466. 496.12 s >
  467. 496.12 s > running 0 tests
  468. 496.12 s >
  469. 496.12 s > test result: ok. 0 passed; 0 failed; 0 ignored; 0 measured; 0 filtered out; finished in 0.00s
  470. 496.12 s >
  471. 496.12 s > Doc-tests alphal00p_docs
  472. 496.12 s >
  473. 496.12 s > running 0 tests
  474. 496.12 s >
  475. 496.12 s > test result: ok. 0 passed; 0 failed; 0 ignored; 0 measured; 0 filtered out; finished in 0.00s
  476. 496.12 s >
  477. 496.12 s > Doc-tests alphal00p_docs_schema
  478. 496.12 s >
  479. 496.12 s > running 0 tests
  480. 496.12 s >
  481. 496.12 s > test result: ok. 0 passed; 0 failed; 0 ignored; 0 measured; 0 filtered out; finished in 0.00s
  482. 496.12 s >
  483. 496.12 s > Doc-tests clinnet
  484. 496.12 s >
  485. 496.12 s > running 0 tests
  486. 496.12 s >
  487. 496.12 s > test result: ok. 0 passed; 0 failed; 0 ignored; 0 measured; 0 filtered out; finished in 0.00s
  488. 496.12 s >
  489. 496.12 s > Doc-tests gammaloop_api
  490. 496.12 s >
  491. 496.12 s > running 13 tests
  492. 496.12 s > test crates/gammaloop-api/src/python.rs - python::GammaLoopAPI::evaluate_sample (line 2926) ... FAILED
  493. 496.12 s > test crates/gammaloop-api/src/python.rs - python::GammaLoopAPI::get_default_runtime_settings (line 3688) ... FAILED
  494. 496.12 s > test crates/gammaloop-api/src/python.rs - python::GammaLoopAPI::get_integrand_info (line 3496) ... FAILED
  495. 496.12 s > test crates/gammaloop-api/src/python.rs - python::GammaLoopAPI::get_active_command_blocks (line 3652) ... FAILED
  496. 496.12 s > test crates/gammaloop-api/src/python.rs - python::GammaLoopAPI::evaluate_samples (line 3040) ... FAILED
  497. 496.12 s > test crates/gammaloop-api/src/python.rs - python::GammaLoopAPI::get_integrand_settings (line 3539) ... FAILED
  498. 496.12 s > test crates/gammaloop-api/src/python.rs - python::GammaLoopAPI::get_run_history (line 3603) ... FAILED
  499. 496.12 s > test crates/gammaloop-api/src/python.rs - python::GammaLoopAPI::run_command (line 3793) ... FAILED
  500. 496.12 s > test crates/gammaloop-api/src/python.rs - python::atom_to_dots (line 157) ... FAILED
  501. 496.12 s > test crates/gammaloop-api/src/python.rs - python::evaluate_graph_overall_factor (line 95) ... FAILED
  502. 496.12 s > test crates/gammaloop-api/src/python.rs - python::atom_to_canonical_string (line 128) ... FAILED
  503. 496.12 s > test crates/gammaloop-api/src/python.rs - python::GammaLoopAPI::new_python (line 2804) ... FAILED
  504. 496.12 s > test crates/gammaloop-api/src/python.rs - python::GammaLoopAPI::get_global_settings (line 3631) ... FAILED
  505. 496.12 s >
  506. 496.12 s > failures:
  507. 496.12 s >
  508. 496.12 s > ---- crates/gammaloop-api/src/python.rs - python::GammaLoopAPI::evaluate_sample (line 2926) stdout ----
  509. 496.12 s > error: expected one of `!` or `::`, found `=`
  510. 496.12 s > --> crates/gammaloop-api/src/python.rs:2927:8
  511. 496.12 s > |
  512. 496.12 s > 2927 | result = api.evaluate_sample(point, process_id=0, minimal_output=True)
  513. 496.12 s > | ^ expected one of `!` or `::`
  514. 496.12 s >
  515. 496.12 s > error: aborting due to 1 previous error
  516. 496.12 s >
  517. 496.12 s > Couldn't compile the test.
  518. 496.12 s > ---- crates/gammaloop-api/src/python.rs - python::GammaLoopAPI::get_default_runtime_settings (line 3688) stdout ----
  519. 496.12 s > error: expected one of `!` or `::`, found `=`
  520. 496.12 s > --> crates/gammaloop-api/src/python.rs:3689:9
  521. 496.12 s > |
  522. 496.12 s > 3689 | runtime = api.get_default_runtime_settings()
  523. 496.12 s > | ^ expected one of `!` or `::`
  524. 496.12 s >
  525. 496.12 s > error: aborting due to 1 previous error
  526. 496.12 s >
  527. 496.12 s > Couldn't compile the test.
  528. 496.12 s > ---- crates/gammaloop-api/src/python.rs - python::GammaLoopAPI::get_integrand_info (line 3496) stdout ----
  529. 496.12 s > error: expected one of `!` or `::`, found `=`
  530. 496.12 s > --> crates/gammaloop-api/src/python.rs:3497:6
  531. 496.12 s > |
  532. 496.12 s > 3497 | info = api.get_integrand_info(process_id=0)
  533. 496.12 s > | ^ expected one of `!` or `::`
  534. 496.12 s >
  535. 496.12 s > error: aborting due to 1 previous error
  536. 496.12 s >
  537. 496.12 s > Couldn't compile the test.
  538. 496.12 s > ---- crates/gammaloop-api/src/python.rs - python::GammaLoopAPI::get_active_command_blocks (line 3652) stdout ----
  539. 496.12 s > error: expected item, found keyword `for`
  540. 496.12 s > --> crates/gammaloop-api/src/python.rs:3653:1
  541. 496.12 s > |
  542. 496.12 s > 3653 | for name, commands in api.get_active_command_blocks().items():
  543. 496.12 s > | ^^^ expected item
  544. 496.12 s > |
  545. 496.12 s > = note: for a full list of items that can appear in modules, see <https://doc.rust-lang.org/reference/items.html>
  546. 496.12 s >
  547. 496.12 s > error: aborting due to 1 previous error
  548. 496.12 s >
  549. 496.12 s > Couldn't compile the test.
  550. 496.12 s > ---- crates/gammaloop-api/src/python.rs - python::GammaLoopAPI::evaluate_samples (line 3040) stdout ----
  551. 496.12 s > error: expected one of `!` or `::`, found `=`
  552. 496.12 s > --> crates/gammaloop-api/src/python.rs:3041:8
  553. 496.12 s > |
  554. 496.12 s > 3041 | points = numpy.asarray(points, dtype=numpy.float64)
  555. 496.12 s > | ^ expected one of `!` or `::`
  556. 496.12 s >
  557. 496.12 s > error: aborting due to 1 previous error
  558. 496.12 s >
  559. 496.12 s > Couldn't compile the test.
  560. 496.12 s > ---- crates/gammaloop-api/src/python.rs - python::GammaLoopAPI::get_integrand_settings (line 3539) stdout ----
  561. 496.12 s > error: expected one of `!` or `::`, found `=`
  562. 496.12 s > --> crates/gammaloop-api/src/python.rs:3540:10
  563. 496.12 s > |
  564. 496.12 s > 3540 | settings = api.get_integrand_settings(process_id=0)
  565. 496.13 s > | ^ expected one of `!` or `::`
  566. 496.13 s >
  567. 496.13 s > error: aborting due to 1 previous error
  568. 496.13 s >
  569. 496.13 s > Couldn't compile the test.
  570. 496.13 s > ---- crates/gammaloop-api/src/python.rs - python::GammaLoopAPI::get_run_history (line 3603) stdout ----
  571. 496.13 s > error[E0425]: cannot find value `run_card_toml` in this scope
  572. 496.13 s > --> crates/gammaloop-api/src/python.rs:3604:1
  573. 496.13 s > |
  574. 496.13 s > 3604 | run_card_toml = api.get_run_history()
  575. 496.13 s > | ^^^^^^^^^^^^^
  576. 496.13 s > |
  577. 496.13 s > help: you might have meant to introduce a new binding
  578. 496.13 s > |
  579. 496.13 s > 3604 | let run_card_toml = api.get_run_history()
  580. 496.13 s > | +++
  581. 496.13 s >
  582. 496.13 s > error[E0425]: cannot find value `api` in this scope
  583. 496.13 s > --> crates/gammaloop-api/src/python.rs:3604:17
  584. 496.13 s > |
  585. 496.13 s > 3604 | run_card_toml = api.get_run_history()
  586. 496.13 s > | ^^^ not found in this scope
  587. 496.13 s >
  588. 496.13 s > error: aborting due to 2 previous errors
  589. 496.13 s >
  590. 496.13 s > For more information about this error, try `rustc --explain E0425`.
  591. 496.13 s > Couldn't compile the test.
  592. 496.13 s > ---- crates/gammaloop-api/src/python.rs - python::GammaLoopAPI::run_command (line 3793) stdout ----
  593. 496.13 s > error[E0425]: cannot find value `api` in this scope
  594. 496.13 s > --> crates/gammaloop-api/src/python.rs:3794:1
  595. 496.13 s > |
  596. 496.13 s > 3794 | api.run("display processes")
  597. 496.13 s > | ^^^ not found in this scope
  598. 496.13 s >
  599. 496.13 s > error: aborting due to 1 previous error
  600. 496.13 s >
  601. 496.13 s > For more information about this error, try `rustc --explain E0425`.
  602. 496.13 s > Couldn't compile the test.
  603. 496.13 s > ---- crates/gammaloop-api/src/python.rs - python::atom_to_dots (line 157) stdout ----
  604. 496.13 s > error[E0425]: cannot find function `to_dots` in this scope
  605. 496.13 s > --> crates/gammaloop-api/src/python.rs:158:1
  606. 496.13 s > |
  607. 496.13 s > 158 | to_dots("p(mu) * q(mu)")
  608. 496.13 s > | ^^^^^^^ not found in this scope
  609. 496.13 s >
  610. 496.13 s > error: aborting due to 1 previous error
  611. 496.13 s >
  612. 496.13 s > For more information about this error, try `rustc --explain E0425`.
  613. 496.13 s > Couldn't compile the test.
  614. 496.13 s > ---- crates/gammaloop-api/src/python.rs - python::evaluate_graph_overall_factor (line 95) stdout ----
  615. 496.13 s > error[E0425]: cannot find function `evaluate_graph_overall_factor` in this scope
  616. 496.13 s > --> crates/gammaloop-api/src/python.rs:96:1
  617. 496.13 s > |
  618. 496.13 s > 96 | evaluate_graph_overall_factor(
  619. 496.13 s > | ^^^^^^^^^^^^^^^^^^^^^^^^^^^^^ not found in this scope
  620. 496.13 s >
  621. 496.13 s > error: aborting due to 1 previous error
  622. 496.13 s >
  623. 496.13 s > For more information about this error, try `rustc --explain E0425`.
  624. 496.13 s > Couldn't compile the test.
  625. 496.13 s > ---- crates/gammaloop-api/src/python.rs - python::atom_to_canonical_string (line 128) stdout ----
  626. 496.13 s > error[E0425]: cannot find function `atom_to_canonical_string` in this scope
  627. 496.13 s > --> crates/gammaloop-api/src/python.rs:129:1
  628. 496.13 s > |
  629. 496.13 s > 129 | atom_to_canonical_string("x + x")
  630. 496.13 s > | ^^^^^^^^^^^^^^^^^^^^^^^^ not found in this scope
  631. 496.13 s >
  632. 496.13 s > error: aborting due to 1 previous error
  633. 496.13 s >
  634. 496.13 s > For more information about this error, try `rustc --explain E0425`.
  635. 496.13 s > Couldn't compile the test.
  636. 496.13 s > ---- crates/gammaloop-api/src/python.rs - python::GammaLoopAPI::new_python (line 2804) stdout ----
  637. 496.13 s > error[E0425]: cannot find value `api` in this scope
  638. 496.13 s > --> crates/gammaloop-api/src/python.rs:2805:1
  639. 496.13 s > |
  640. 496.13 s > 2805 | api = GammaLoopAPI(state_folder="./state", read_only_state=True)
  641. 496.13 s > | ^^^
  642. 496.13 s > |
  643. 496.13 s > help: you might have meant to introduce a new binding
  644. 496.13 s > |
  645. 496.13 s > 2805 | let api = GammaLoopAPI(state_folder="./state", read_only_state=True)
  646. 496.13 s > | +++
  647. 496.13 s >
  648. 496.13 s > error[E0425]: cannot find value `state_folder` in this scope
  649. 496.13 s > --> crates/gammaloop-api/src/python.rs:2805:20
  650. 496.13 s > |
  651. 496.13 s > 2805 | api = GammaLoopAPI(state_folder="./state", read_only_state=True)
  652. 496.13 s > | ^^^^^^^^^^^^ not found in this scope
  653. 496.13 s >
  654. 496.13 s > error[E0425]: cannot find value `read_only_state` in this scope
  655. 496.13 s > --> crates/gammaloop-api/src/python.rs:2805:44
  656. 496.13 s > |
  657. 496.13 s > 2805 | api = GammaLoopAPI(state_folder="./state", read_only_state=True)
  658. 496.13 s > | ^^^^^^^^^^^^^^^ not found in this scope
  659. 496.13 s >
  660. 496.13 s > error[E0425]: cannot find value `True` in this scope
  661. 496.13 s > --> crates/gammaloop-api/src/python.rs:2805:60
  662. 496.13 s > |
  663. 496.13 s > 2805 | api = GammaLoopAPI(state_folder="./state", read_only_state=True)
  664. 496.13 s > | ^^^^ not found in this scope
  665. 496.13 s > |
  666. 496.13 s > help: you may want to use a bool value instead
  667. 496.13 s > |
  668. 496.13 s > 2805 - api = GammaLoopAPI(state_folder="./state", read_only_state=True)
  669. 496.13 s > 2805 + api = GammaLoopAPI(state_folder="./state", read_only_state=true)
  670. 496.13 s > |
  671. 496.13 s >
  672. 496.13 s > error[E0425]: cannot find function, tuple struct or tuple variant `GammaLoopAPI` in this scope
  673. 496.13 s > --> crates/gammaloop-api/src/python.rs:2805:7
  674. 496.13 s > |
  675. 496.13 s > 2805 | api = GammaLoopAPI(state_folder="./state", read_only_state=True)
  676. 496.13 s > | ^^^^^^^^^^^^ not found in this scope
  677. 496.13 s >
  678. 496.13 s > error: aborting due to 5 previous errors
  679. 496.13 s >
  680. 496.13 s > For more information about this error, try `rustc --explain E0425`.
  681. 496.13 s > Couldn't compile the test.
  682. 496.13 s > ---- crates/gammaloop-api/src/python.rs - python::GammaLoopAPI::get_global_settings (line 3631) stdout ----
  683. 496.13 s > error[E0425]: cannot find value `settings_toml` in this scope
  684. 496.13 s > --> crates/gammaloop-api/src/python.rs:3632:1
  685. 496.13 s > |
  686. 496.13 s > 3632 | settings_toml = api.get_global_settings()
  687. 496.13 s > | ^^^^^^^^^^^^^
  688. 496.13 s > |
  689. 496.13 s > help: you might have meant to introduce a new binding
  690. 496.13 s > |
  691. 496.13 s > 3632 | let settings_toml = api.get_global_settings()
  692. 496.13 s > | +++
  693. 496.13 s >
  694. 496.13 s > error[E0425]: cannot find value `api` in this scope
  695. 496.13 s > --> crates/gammaloop-api/src/python.rs:3632:17
  696. 496.13 s > |
  697. 496.13 s > 3632 | settings_toml = api.get_global_settings()
  698. 496.13 s > | ^^^ not found in this scope
  699. 496.13 s >
  700. 496.13 s > error: aborting due to 2 previous errors
  701. 496.13 s >
  702. 496.13 s > For more information about this error, try `rustc --explain E0425`.
  703. 496.13 s > Couldn't compile the test.
  704. 496.13 s >
  705. 496.13 s > failures:
  706. 496.13 s > crates/gammaloop-api/src/python.rs - python::GammaLoopAPI::evaluate_sample (line 2926)
  707. 496.13 s > crates/gammaloop-api/src/python.rs - python::GammaLoopAPI::evaluate_samples (line 3040)
  708. 496.13 s > crates/gammaloop-api/src/python.rs - python::GammaLoopAPI::get_active_command_blocks (line 3652)
  709. 496.13 s > crates/gammaloop-api/src/python.rs - python::GammaLoopAPI::get_default_runtime_settings (line 3688)
  710. 496.13 s > crates/gammaloop-api/src/python.rs - python::GammaLoopAPI::get_global_settings (line 3631)
  711. 496.13 s > crates/gammaloop-api/src/python.rs - python::GammaLoopAPI::get_integrand_info (line 3496)
  712. 496.13 s > crates/gammaloop-api/src/python.rs - python::GammaLoopAPI::get_integrand_settings (line 3539)
  713. 496.13 s > crates/gammaloop-api/src/python.rs - python::GammaLoopAPI::get_run_history (line 3603)
  714. 496.13 s > crates/gammaloop-api/src/python.rs - python::GammaLoopAPI::new_python (line 2804)
  715. 496.13 s > crates/gammaloop-api/src/python.rs - python::GammaLoopAPI::run_command (line 3793)
  716. 496.13 s > crates/gammaloop-api/src/python.rs - python::atom_to_canonical_string (line 128)
  717. 496.13 s > crates/gammaloop-api/src/python.rs - python::atom_to_dots (line 157)
  718. 496.13 s > crates/gammaloop-api/src/python.rs - python::evaluate_graph_overall_factor (line 95)
  719. 496.13 s >
  720. 496.13 s > test result: FAILED. 0 passed; 13 failed; 0 ignored; 0 measured; 0 filtered out; finished in 0.40s
  721. 496.13 s >
  722. 496.13 s > error: doctest failed, to rerun pass `-p gammaloop-api --doc`
  723. 496.13 s For full logs, run:
  724. 496.13 s nix log /nix/store/d7n0kzr0ab2qmzp3m3y3jhx03bbngjym-gammaloop-workspace-doctest-0.1.0.drv
  725. 496.23 s [0 built (1 failed), 0.0Run failed.