1. 0.90 s $ /nix/store/9ypz3flqsrl5xl495mm8h645gadjsxi1-coreutils-9.11/bin/timeout --kill-after=15s 7200s /nix/store/23zk8sgzamrbmj1fday15szf7f2279s8-nix-2.34.7/bin/nix --extra-experimental-features nix-command --extra-experimental-features flakes flake clone git+https://github.com/alphal00p/gammaloop --dest /tmp/nix-ci-worker/stable-pwd/repo/
  2. 0.95 s Cloning into '/tmp/nix-ci-worker/stable-pwd/repo'...
  3. 0.95 s remote: Enumerating objects: 64188, done.
  4. 0.95 s remote: Counting objects: 0% (1/9554) remote: Counting objects: 1% (96/9554) remote: Counting objects: 2% (192/9554) remote: Counting objects: 3% (287/9554) remote: Counting objects: 4% (383/9554) remote: Counting objects: 5% (478/9554) remote: Counting objects: 6% (574/9554) remote: Counting objects: 7% (669/9554) remote: Counting objects: 8% (765/9554) remote: Counting objects: 9% (860/9554) remote: Counting objects: 10% (956/9554) remote: Counting objects: 11% (1051/9554) remote: Counting objects: 12% (1147/9554) remote: Counting objects: 13% (1243/9554) remote: Counting objects: 14% (1338/9554) remote: Counting objects: 15% (1434/9554) remote: Counting objects: 16% (1529/9554) remote: Counting objects: 17% (1625/9554) remote: Counting objects: 18% (1720/9554) remote: Counting objects: 19% (1816/9554) remote: Counting objects: 20% (1911/9554) remote: Counting objects: 21% (2007/9554) remote: Counting objects: 22% (2102/9554) remote: Counting objects: 23% (2198/9554) remote: Counting objects: 24% (2293/9554) remote: Counting objects: 25% (2389/9554) remote: Counting objects: 26% (2485/9554) remote: Counting objects: 27% (2580/9554) remote: Counting objects: 28% (2676/9554) remote: Counting objects: 29% (2771/9554) remote: Counting objects: 30% (2867/9554) remote: Counting objects: 31% (2962/9554) remote: Counting objects: 32% (3058/9554) remote: Counting objects: 33% (3153/9554) remote: Counting objects: 34% (3249/9554) remote: Counting objects: 35% (3344/9554) remote: Counting objects: 36% (3440/9554) remote: Counting objects: 37% (3535/9554) remote: Counting objects: 38% (3631/9554) remote: Counting objects: 39% (3727/9554) remote: Counting objects: 40% (3822/9554) remote: Counting objects: 41% (3918/9554) remote: Counting objects: 42% (4013/9554) remote: Counting objects: 43% (4109/9554) remote: Counting objects: 44% (4204/9554) remote: Counting objects: 45% (4300/9554) remote: Counting objects: 46% (4395/9554) remote: Counting objects: 47% (4491/9554) remote: Counting objects: 48% (4586/9554) remote: Counting objects: 49% (4682/9554) remote: Counting objects: 50% (4777/9554) remote: Counting objects: 51% (4873/9554) remote: Counting objects: 52% (4969/9554) remote: Counting objects: 53% (5064/9554) remote: Counting objects: 54% (5160/9554) remote: Counting objects: 55% (5255/9554) remote: Counting objects: 56% (5351/9554) remote: Counting objects: 57% (5446/9554) remote: Counting objects: 58% (5542/9554) remote: Counting objects: 59% (5637/9554) remote: Counting objects: 60% (5733/9554) remote: Counting objects: 61% (5828/9554) remote: Counting objects: 62% (5924/9554) remote: Counting objects: 63% (6020/9554) remote: Counting objects: 64% (6115/9554) remote: Counting objects: 65% (6211/9554) remote: Counting objects: 66% (6306/9554) remote: Counting objects: 67% (6402/9554) remote: Counting objects: 68% (6497/9554) remote: Counting objects: 69% (6593/9554) remote: Counting objects: 70% (6688/9554) remote: Counting objects: 71% (6784/9554) remote: Counting objects: 72% (6879/9554) remote: Counting objects: 73% (6975/9554) remote: Counting objects: 74% (7070/9554) remote: Counting objects: 75% (7166/9554) remote: Counting objects: 76% (7262/9554) remote: Counting objects: 77% (7357/9554) remote: Counting objects: 78% (7453/9554) remote: Counting objects: 79% (7548/9554) remote: Counting objects: 80% (7644/9554) remote: Counting objects: 81% (7739/9554) remote: Counting objects: 82% (7835/9554) remote: Counting objects: 83% (7930/9554) remote: Counting objects: 84% (8026/9554) remote: Counting objects: 85% (8121/9554) remote: Counting objects: 86% (8217/9554) remote: Counting objects: 87% (8312/9554) remote: Counting objects: 88% (8408/9554) remote: Counting objects: 89% (8504/9554) remote: Counting objects: 90% (8599/9554) remote: Counting objects: 91% (8695/9554) remote: Counting objects: 92% (8790/9554) remote: Counting objects: 93% (8886/9554) remote: Counting objects: 94% (8981/9554) remote: Counting objects: 95% (9077/9554) remote: Counting objects: 96% (9172/9554) remote: Counting objects: 97% (9268/9554) remote: Counting objects: 98% (9363/9554) remote: Counting objects: 99% (9459/9554) remote: Counting objects: 100% (9554/9554) remote: Counting objects: 100% (9554/9554), done.
  5. 3.09 s remote: Compressing objects: 0% (1/2328) remote: Compressing objects: 1% (24/2328) remote: Compressing objects: 2% (47/2328) remote: Compressing objects: 3% (70/2328) remote: Compressing objects: 4% (94/2328) remote: Compressing objects: 5% (117/2328) remote: Compressing objects: 6% (140/2328) remote: Compressing objects: 7% (163/2328) remote: Compressing objects: 8% (187/2328) remote: Compressing objects: 9% (210/2328) remote: Compressing objects: 10% (233/2328) remote: Compressing objects: 11% (257/2328) remote: Compressing objects: 12% (280/2328) remote: Compressing objects: 13% (303/2328) remote: Compressing objects: 14% (326/2328) remote: Compressing objects: 15% (350/2328) remote: Compressing objects: 16% (373/2328) remote: Compressing objects: 17% (396/2328) remote: Compressing objects: 18% (420/2328) remote: Compressing objects: 19% (443/2328) remote: Compressing objects: 20% (466/2328) remote: Compressing objects: 21% (489/2328) remote: Compressing objects: 22% (513/2328) remote: Compressing objects: 23% (536/2328) remote: Compressing objects: 23% (554/2328) remote: Compressing objects: 24% (559/2328) remote: Compressing objects: 25% (582/2328) remote: Compressing objects: 26% (606/2328) remote: Compressing objects: 27% (629/2328) remote: Compressing objects: 28% (652/2328) remote: Compressing objects: 29% (676/2328) remote: Compressing objects: 30% (699/2328) remote: Compressing objects: 31% (722/2328) remote: Compressing objects: 32% (745/2328) remote: Compressing objects: 33% (769/2328) remote: Compressing objects: 33% (777/2328) remote: Compressing objects: 34% (792/2328) remote: Compressing objects: 35% (815/2328) remote: Compressing objects: 36% (839/2328) remote: Compressing objects: 37% (862/2328) remote: Compressing objects: 38% (885/2328) remote: Compressing objects: 39% (908/2328) remote: Compressing objects: 40% (932/2328) remote: Compressing objects: 41% (955/2328) remote: Compressing objects: 42% (978/2328) remote: Compressing objects: 43% (1002/2328) remote: Compressing objects: 44% (1025/2328) remote: Compressing objects: 45% (1048/2328) remote: Compressing objects: 46% (1071/2328) remote: Compressing objects: 47% (1095/2328) remote: Compressing objects: 48% (1118/2328) remote: Compressing objects: 49% (1141/2328) remote: Compressing objects: 50% (1164/2328) remote: Compressing objects: 51% (1188/2328) remote: Compressing objects: 52% (1211/2328) remote: Compressing objects: 53% (1234/2328) remote: Compressing objects: 54% (1258/2328) remote: Compressing objects: 55% (1281/2328) remote: Compressing objects: 56% (1304/2328) remote: Compressing objects: 57% (1327/2328) remote: Compressing objects: 58% (1351/2328) remote: Compressing objects: 59% (1374/2328) remote: Compressing objects: 60% (1397/2328) remote: Compressing objects: 61% (1421/2328) remote: Compressing objects: 62% (1444/2328) remote: Compressing objects: 63% (1467/2328) remote: Compressing objects: 64% (1490/2328) remote: Compressing objects: 65% (1514/2328) remote: Compressing objects: 66% (1537/2328) remote: Compressing objects: 67% (1560/2328) remote: Compressing objects: 68% (1584/2328) remote: Compressing objects: 69% (1607/2328) remote: Compressing objects: 70% (1630/2328) remote: Compressing objects: 71% (1653/2328) remote: Compressing objects: 72% (1677/2328) remote: Compressing objects: 73% (1700/2328) remote: Compressing objects: 74% (1723/2328) remote: Compressing objects: 75% (1746/2328) remote: Compressing objects: 76% (1770/2328) remote: Compressing objects: 77% (1793/2328) remote: Compressing objects: 78% (1816/2328) remote: Compressing objects: 79% (1840/2328) remote: Compressing objects: 80% (1863/2328) remote: Compressing objects: 81% (1886/2328) remote: Compressing objects: 82% (1909/2328) remote: Compressing objects: 83% (1933/2328) remote: Compressing objects: 84% (1956/2328) remote: Compressing objects: 85% (1979/2328) remote: Compressing objects: 86% (2003/2328) remote: Compressing objects: 87% (2026/2328) remote: Compressing objects: 88% (2049/2328) remote: Compressing objects: 89% (2072/2328) remote: Compressing objects: 90% (2096/2328) remote: Compressing objects: 91% (2119/2328) remote: Compressing objects: 92% (2142/2328) remote: Compressing objects: 93% (2166/2328) remote: Compressing objects: 94% (2189/2328) remote: Compressing objects: 95% (2212/2328) remote: Compressing objects: 96% (2235/2328) remote: Compressing objects: 97% (2259/2328) remote: Compressing objects: 98% (2282/2328) remote: Compressing objects: 99% (2305/2328) remote: Compressing objects: 100% (2328/2328) remote: Compressing objects: 100% (2328/2328), done.
  6. 7.15 s Receiving objects: 0% (1/64188) Receiving objects: 1% (642/64188) Receiving objects: 2% (1284/64188) Receiving objects: 3% (1926/64188) Receiving objects: 4% (2568/64188) Receiving objects: 5% (3210/64188) Receiving objects: 6% (3852/64188) Receiving objects: 7% (4494/64188) Receiving objects: 8% (5136/64188) Receiving objects: 9% (5777/64188) Receiving objects: 10% (6419/64188), 11.99 MiB | 23.55 MiB/s Receiving objects: 11% (7061/64188), 11.99 MiB | 23.55 MiB/s Receiving objects: 12% (7703/64188), 11.99 MiB | 23.55 MiB/s Receiving objects: 13% (8345/64188), 11.99 MiB | 23.55 MiB/s Receiving objects: 14% (8987/64188), 11.99 MiB | 23.55 MiB/s Receiving objects: 15% (9629/64188), 11.99 MiB | 23.55 MiB/s Receiving objects: 16% (10271/64188), 11.99 MiB | 23.55 MiB/s Receiving objects: 17% (10912/64188), 11.99 MiB | 23.55 MiB/s Receiving objects: 18% (11554/64188), 11.99 MiB | 23.55 MiB/s Receiving objects: 19% (12196/64188), 11.99 MiB | 23.55 MiB/s Receiving objects: 20% (12838/64188), 11.99 MiB | 23.55 MiB/s Receiving objects: 21% (13480/64188), 11.99 MiB | 23.55 MiB/s Receiving objects: 22% (14122/64188), 11.99 MiB | 23.55 MiB/s Receiving objects: 23% (14764/64188), 11.99 MiB | 23.55 MiB/s Receiving objects: 24% (15406/64188), 11.99 MiB | 23.55 MiB/s Receiving objects: 25% (16047/64188), 11.99 MiB | 23.55 MiB/s Receiving objects: 26% (16689/64188), 11.99 MiB | 23.55 MiB/s Receiving objects: 27% (17331/64188), 11.99 MiB | 23.55 MiB/s Receiving objects: 28% (17973/64188), 11.99 MiB | 23.55 MiB/s Receiving objects: 29% (18615/64188), 11.99 MiB | 23.55 MiB/s Receiving objects: 30% (19257/64188), 11.99 MiB | 23.55 MiB/s Receiving objects: 31% (19899/64188), 11.99 MiB | 23.55 MiB/s Receiving objects: 32% (20541/64188), 11.99 MiB | 23.55 MiB/s Receiving objects: 33% (21183/64188), 11.99 MiB | 23.55 MiB/s Receiving objects: 34% (21824/64188), 11.99 MiB | 23.55 MiB/s Receiving objects: 35% (22466/64188), 11.99 MiB | 23.55 MiB/s Receiving objects: 36% (23108/64188), 11.99 MiB | 23.55 MiB/s Receiving objects: 37% (23750/64188), 11.99 MiB | 23.55 MiB/s Receiving objects: 38% (24392/64188), 11.99 MiB | 23.55 MiB/s Receiving objects: 39% (25034/64188), 11.99 MiB | 23.55 MiB/s Receiving objects: 40% (25676/64188), 11.99 MiB | 23.55 MiB/s Receiving objects: 41% (26318/64188), 11.99 MiB | 23.55 MiB/s Receiving objects: 42% (26959/64188), 11.99 MiB | 23.55 MiB/s Receiving objects: 43% (27601/64188), 11.99 MiB | 23.55 MiB/s Receiving objects: 43% (28131/64188), 11.99 MiB | 23.55 MiB/s Receiving objects: 44% (28243/64188), 11.99 MiB | 23.55 MiB/s Receiving objects: 45% (28885/64188), 11.99 MiB | 23.55 MiB/s Receiving objects: 46% (29527/64188), 11.99 MiB | 23.55 MiB/s Receiving objects: 47% (30169/64188), 23.30 MiB | 23.12 MiB/s Receiving objects: 48% (30811/64188), 23.30 MiB | 23.12 MiB/s Receiving objects: 49% (31453/64188), 23.30 MiB | 23.12 MiB/s Receiving objects: 50% (32094/64188), 23.30 MiB | 23.12 MiB/s Receiving objects: 51% (32736/64188), 23.30 MiB | 23.12 MiB/s Receiving objects: 52% (33378/64188), 23.30 MiB | 23.12 MiB/s Receiving objects: 53% (34020/64188), 23.30 MiB | 23.12 MiB/s Receiving objects: 54% (34662/64188), 35.16 MiB | 23.18 MiB/s Receiving objects: 55% (35304/64188), 35.16 MiB | 23.18 MiB/s Receiving objects: 56% (35946/64188), 35.16 MiB | 23.18 MiB/s Receiving objects: 57% (36588/64188), 35.16 MiB | 23.18 MiB/s Receiving objects: 58% (37230/64188), 35.16 MiB | 23.18 MiB/s Receiving objects: 59% (37871/64188), 35.16 MiB | 23.18 MiB/s Receiving objects: 60% (38513/64188), 35.16 MiB | 23.18 MiB/s Receiving objects: 61% (39155/64188), 35.16 MiB | 23.18 MiB/s Receiving objects: 61% (39610/64188), 35.16 MiB | 23.18 MiB/s Receiving objects: 62% (39797/64188), 47.27 MiB | 23.44 MiB/s Receiving objects: 63% (40439/64188), 47.27 MiB | 23.44 MiB/s Receiving objects: 64% (41081/64188), 47.27 MiB | 23.44 MiB/s Receiving objects: 65% (41723/64188), 47.27 MiB | 23.44 MiB/s Receiving objects: 66% (42365/64188), 47.27 MiB | 23.44 MiB/s Receiving objects: 67% (43006/64188), 47.27 MiB | 23.44 MiB/s Receiving objects: 68% (43648/64188), 47.27 MiB | 23.44 MiB/s Receiving objects: 69% (44290/64188), 47.27 MiB | 23.44 MiB/s Receiving objects: 70% (44932/64188), 47.27 MiB | 23.44 MiB/s Receiving objects: 71% (45574/64188), 47.27 MiB | 23.44 MiB/s Receiving objects: 72% (46216/64188), 47.27 MiB | 23.44 MiB/s Receiving objects: 73% (46858/64188), 47.27 MiB | 23.44 MiB/s Receiving objects: 74% (47500/64188), 59.92 MiB | 23.81 MiB/s Receiving objects: 75% (48141/64188), 59.92 MiB | 23.81 MiB/s Receiving objects: 76% (48783/64188), 59.92 MiB | 23.81 MiB/s Receiving objects: 77% (49425/64188), 59.92 MiB | 23.81 MiB/s Receiving objects: 77% (49707/64188), 59.92 MiB | 23.81 MiB/s Receiving objects: 78% (50067/64188), 72.49 MiB | 24.03 MiB/s Receiving objects: 79% (50709/64188), 72.49 MiB | 24.03 MiB/s Receiving objects: 80% (51351/64188), 72.49 MiB | 24.03 MiB/s Receiving objects: 81% (51993/64188), 72.49 MiB | 24.03 MiB/s Receiving objects: 82% (52635/64188), 72.49 MiB | 24.03 MiB/s Receiving objects: 83% (53277/64188), 72.49 MiB | 24.03 MiB/s Receiving objects: 84% (53918/64188), 85.30 MiB | 24.25 MiB/s Receiving objects: 85% (54560/64188), 85.30 MiB | 24.25 MiB/s Receiving objects: 86% (55202/64188), 85.30 MiB | 24.25 MiB/s Receiving objects: 87% (55844/64188), 85.30 MiB | 24.25 MiB/s Receiving objects: 88% (56486/64188), 85.30 MiB | 24.25 MiB/s Receiving objects: 89% (57128/64188), 85.30 MiB | 24.25 MiB/s Receiving objects: 90% (57770/64188), 85.30 MiB | 24.25 MiB/s Receiving objects: 91% (58412/64188), 85.30 MiB | 24.25 MiB/s Receiving objects: 92% (59053/64188), 85.30 MiB | 24.25 MiB/s Receiving objects: 93% (59695/64188), 85.30 MiB | 24.25 MiB/s Receiving objects: 94% (60337/64188), 85.30 MiB | 24.25 MiB/s Receiving objects: 95% (60979/64188), 85.30 MiB | 24.25 MiB/s Receiving objects: 96% (61621/64188), 85.30 MiB | 24.25 MiB/s Receiving objects: 97% (62263/64188), 85.30 MiB | 24.25 MiB/s Receiving objects: 98% (62905/64188), 85.30 MiB | 24.25 MiB/s Receiving objects: 99% (63547/64188), 85.30 MiB | 24.25 MiB/s remote: Total 64188 (delta 7399), reused 7778 (delta 6681), pack-reused 54634 (from 3)
  7. 7.93 s Receiving objects: 100% (64188/64188), 85.30 MiB | 24.25 MiB/s Receiving objects: 100% (64188/64188), 97.84 MiB | 24.48 MiB/s, done.
  8. 7.93 s Resolving deltas: 0% (0/44318) Resolving deltas: 1% (444/44318) Resolving deltas: 2% (887/44318) Resolving deltas: 3% (1331/44318) Resolving deltas: 4% (1773/44318) Resolving deltas: 5% (2217/44318) Resolving deltas: 6% (2661/44318) Resolving deltas: 7% (3103/44318) Resolving deltas: 8% (3546/44318) Resolving deltas: 9% (3989/44318) Resolving deltas: 10% (4432/44318) Resolving deltas: 11% (4875/44318) Resolving deltas: 12% (5319/44318) Resolving deltas: 13% (5762/44318) Resolving deltas: 14% (6205/44318) Resolving deltas: 15% (6648/44318) Resolving deltas: 16% (7091/44318) Resolving deltas: 17% (7535/44318) Resolving deltas: 18% (7978/44318) Resolving deltas: 19% (8421/44318) Resolving deltas: 20% (8864/44318) Resolving deltas: 21% (9307/44318) Resolving deltas: 22% (9750/44318) Resolving deltas: 23% (10194/44318) Resolving deltas: 24% (10643/44318) Resolving deltas: 25% (11080/44318) Resolving deltas: 26% (11523/44318) Resolving deltas: 27% (11966/44318) Resolving deltas: 28% (12410/44318) Resolving deltas: 29% (12854/44318) Resolving deltas: 30% (13298/44318) Resolving deltas: 31% (13739/44318) Resolving deltas: 32% (14183/44318) Resolving deltas: 33% (14625/44318) Resolving deltas: 34% (15069/44318) Resolving deltas: 35% (15512/44318) Resolving deltas: 36% (15955/44318) Resolving deltas: 37% (16398/44318) Resolving deltas: 38% (16841/44318) Resolving deltas: 39% (17285/44318) Resolving deltas: 40% (17728/44318) Resolving deltas: 41% (18171/44318) Resolving deltas: 42% (18614/44318) Resolving deltas: 43% (19057/44318) Resolving deltas: 44% (19500/44318) Resolving deltas: 45% (19944/44318) Resolving deltas: 46% (20388/44318) Resolving deltas: 47% (20831/44318) Resolving deltas: 48% (21274/44318) Resolving deltas: 49% (21716/44318) Resolving deltas: 50% (22159/44318) Resolving deltas: 51% (22603/44318) Resolving deltas: 52% (23046/44318) Resolving deltas: 53% (23491/44318) Resolving deltas: 54% (23932/44318) Resolving deltas: 55% (24375/44318) Resolving deltas: 56% (24820/44318) Resolving deltas: 57% (25262/44318) Resolving deltas: 58% (25705/44318) Resolving deltas: 59% (26148/44318) Resolving deltas: 60% (26591/44318) Resolving deltas: 61% (27034/44318) Resolving deltas: 62% (27478/44318) Resolving deltas: 63% (27921/44318) Resolving deltas: 64% (28364/44318) Resolving deltas: 65% (28807/44318) Resolving deltas: 66% (29250/44318) Resolving deltas: 67% (29694/44318) Resolving deltas: 68% (30137/44318) Resolving deltas: 69% (30580/44318) Resolving deltas: 70% (31023/44318) Resolving deltas: 71% (31466/44318) Resolving deltas: 72% (31909/44318) Resolving deltas: 73% (32353/44318) Resolving deltas: 74% (32797/44318) Resolving deltas: 75% (33241/44318) Resolving deltas: 76% (33682/44318) Resolving deltas: 77% (34125/44318) Resolving deltas: 78% (34570/44318) Resolving deltas: 79% (35012/44318) Resolving deltas: 80% (35455/44318) Resolving deltas: 81% (35898/44318) Resolving deltas: 82% (36341/44318) Resolving deltas: 83% (36784/44318) Resolving deltas: 84% (37228/44318) Resolving deltas: 85% (37673/44318) Resolving deltas: 86% (38114/44318) Resolving deltas: 87% (38557/44318) Resolving deltas: 88% (39000/44318) Resolving deltas: 89% (39444/44318) Resolving deltas: 90% (39887/44318) Resolving deltas: 91% (40330/44318) Resolving deltas: 92% (40773/44318) Resolving deltas: 93% (41216/44318) Resolving deltas: 94% (41660/44318) Resolving deltas: 95% (42103/44318) Resolving deltas: 96% (42546/44318) Resolving deltas: 97% (42990/44318) Resolving deltas: 98% (43432/44318) Resolving deltas: 99% (43875/44318) Resolving deltas: 100% (44318/44318) Resolving deltas: 100% (44318/44318), done.
  9. 8.21 s Fetching commit 08898429f2a98faff9a8de1c43eb54edd82e450c for push-vrpyqyylypmw ...
  10. 8.21 s $ /nix/store/bcnisk3ydfgv26v2gw3zlky24g00yww2-git-2.54.0/bin/git fetch origin 08898429f2a98faff9a8de1c43eb54edd82e450c
  11. 8.74 s From https://github.com/alphal00p/gammaloop
  12. 8.74 s * branch 08898429f2a98faff9a8de1c43eb54edd82e450c -> FETCH_HEAD
  13. 8.75 s $ /nix/store/9ypz3flqsrl5xl495mm8h645gadjsxi1-coreutils-9.11/bin/timeout --kill-after=15s 7200s /nix/store/bcnisk3ydfgv26v2gw3zlky24g00yww2-git-2.54.0/bin/git -c advice.detachedHead=false checkout 08898429f2a98faff9a8de1c43eb54edd82e450c
  14. 8.95 s HEAD is now at 08898429 run documentation tests through the Nix CI secret runner
  15. 8.95 s $ /nix/store/9ypz3flqsrl5xl495mm8h645gadjsxi1-coreutils-9.11/bin/timeout --kill-after=15s 7200s /nix/store/23zk8sgzamrbmj1fday15szf7f2279s8-nix-2.34.7/bin/nix --extra-experimental-features nix-command --extra-experimental-features flakes --log-format internal-json run .#packages.x86_64-linux.nix-ci-check-gammaloop-doctest --print-build-logs
  16. 13.36 s
  17. 13.83 s Downloading cached gammaloop-workspace-deps-deps from https://cache.nix-ci.com
  18. 13.94 s Downloading cached boehm-gc from https://cache.nix-ci.com
  19. 13.94 s Downloading cached busybox from https://cache.nix-ci.com
  20. 13.94 s Downloading cached aws-c-common from https://cache.nix-ci.com
  21. 13.94 s Downloading cached editline-1.17.1-unstable-2025-05 from https://cache.nix-ci.com
  22. 13.94 s Downloading cached libcpuid from https://cache.nix-ci.com
  23. 13.94 s Downloading cached libseccomp-2.6.0-lib from https://cache.nix-ci.com
  24. 13.94 s Downloading cached libsodium-1.0.22-unstable-2026-04 from https://cache.nix-ci.com
  25. 13.94 s Downloading cached lowdown-3.0.1-lib from https://cache.nix-ci.com
  26. 13.94 s Downloading cached openssl from https://cache.nix-ci.com
  27. 13.94 s Downloading cached sqlite from https://cache.nix-ci.com
  28. 13.94 s Downloading cached icu4c from https://cache.nix-ci.com
  29. 13.94 s Downloading cached libpsl from https://cache.nix-ci.com
  30. 13.94 s Downloading cached libxml2 from https://cache.nix-ci.com
  31. 13.94 s Downloading cached llhttp from https://cache.nix-ci.com
  32. 13.94 s Downloading cached nghttp2-1.69.0-lib from https://cache.nix-ci.com
  33. 13.96 s Downloaded cached busybox (230 KiB) in 22ms
  34. 13.96 s Progress: 0 of 1 built, 1 of 51 downloaded from cache (15 downloading)
  35. 13.96 s Downloading cached hwloc-2.14.0-lib from https://cache.nix-ci.com
  36. 13.96 s Downloaded cached boehm-gc (312 KiB) in 22ms
  37. 13.96 s Progress: 0 of 1 built, 2 of 51 downloaded from cache (15 downloading)
  38. 13.96 s Downloading cached nghttp3 from https://cache.nix-ci.com
  39. 13.97 s Downloaded cached aws-c-common (1.1 MiB) in 28ms
  40. 13.97 s Progress: 0 of 1 built, 3 of 51 downloaded from cache (15 downloading)
  41. 13.97 s Downloading cached zstd from https://cache.nix-ci.com
  42. 14.03 s Downloaded cached lowdown-3.0.1-lib (341 KiB) in 91ms
  43. 14.03 s Progress: 0 of 1 built, 4 of 51 downloaded from cache (15 downloading)
  44. 14.03 s Downloading cached aws-c-compression from https://cache.nix-ci.com
  45. 14.03 s Downloaded cached libseccomp-2.6.0-lib (193 KiB) in 94ms
  46. 14.03 s Progress: 0 of 1 built, 5 of 51 downloaded from cache (15 downloading)
  47. 14.03 s Downloading cached aws-c-sdkutils from https://cache.nix-ci.com
  48. 14.03 s Downloaded cached libcpuid (326 KiB) in 97ms
  49. 14.04 s Progress: 0 of 1 built, 6 of 51 downloaded from cache (15 downloading)
  50. 14.04 s Downloading cached aws-checksums from https://cache.nix-ci.com
  51. 14.04 s Downloaded cached libsodium-1.0.22-unstable-2026-04 (666 KiB) in 101ms
  52. 14.04 s Progress: 0 of 1 built, 7 of 51 downloaded from cache (15 downloading)
  53. 14.07 s Downloaded cached editline-1.17.1-unstable-2025-05 (58 KiB) in 130ms
  54. 14.07 s Progress: 0 of 1 built, 8 of 51 downloaded from cache (14 downloading)
  55. 14.11 s Downloaded cached sqlite (5.7 MiB) in 174ms
  56. 14.11 s Progress: 0 of 1 built, 9 of 51 downloaded from cache (13 downloading)
  57. 14.15 s Downloaded cached llhttp (89 KiB) in 209ms
  58. 14.15 s Progress: 0 of 1 built, 10 of 51 downloaded from cache (12 downloading)
  59. 14.15 s Downloaded cached nghttp2-1.69.0-lib (225 KiB) in 214ms
  60. 14.16 s Progress: 0 of 1 built, 11 of 51 downloaded from cache (11 downloading)
  61. 14.19 s Downloaded cached nghttp3 (228 KiB) in 226ms
  62. 14.19 s Progress: 0 of 1 built, 12 of 51 downloaded from cache (10 downloading)
  63. 14.20 s Downloaded cached libxml2 (1.4 MiB) in 256ms
  64. 14.20 s Progress: 0 of 1 built, 13 of 51 downloaded from cache (9 downloading)
  65. 14.20 s Downloaded cached hwloc-2.14.0-lib (459 KiB) in 238ms
  66. 14.20 s Progress: 0 of 1 built, 14 of 51 downloaded from cache (8 downloading)
  67. 14.20 s Downloading cached onetbb from https://cache.nix-ci.com
  68. 14.21 s Downloaded cached zstd (1.1 MiB) in 246ms
  69. 14.21 s Progress: 0 of 1 built, 15 of 51 downloaded from cache (8 downloading)
  70. 14.33 s Downloaded cached aws-c-compression (31 KiB) in 305ms
  71. 14.33 s Progress: 0 of 1 built, 16 of 51 downloaded from cache (7 downloading)
  72. 14.34 s Downloaded cached aws-c-sdkutils (155 KiB) in 307ms
  73. 14.34 s Progress: 0 of 1 built, 17 of 51 downloaded from cache (6 downloading)
  74. 14.34 s Downloaded cached aws-checksums (86 KiB) in 305ms
  75. 14.34 s Progress: 0 of 1 built, 18 of 51 downloaded from cache (5 downloading)
  76. 14.43 s Downloaded cached openssl (8.9 MiB) in 487ms
  77. 14.43 s Progress: 0 of 1 built, 19 of 51 downloaded from cache (4 downloading)
  78. 14.43 s Downloading cached aws-c-cal from https://cache.nix-ci.com
  79. 14.43 s Downloading cached krb5-1.22.2-lib from https://cache.nix-ci.com
  80. 14.43 s Downloading cached libarchive-3.8.8-lib from https://cache.nix-ci.com
  81. 14.43 s Downloading cached libssh2 from https://cache.nix-ci.com
  82. 14.43 s Downloading cached ngtcp2 from https://cache.nix-ci.com
  83. 14.43 s Downloading cached s2n-tls from https://cache.nix-ci.com
  84. 14.52 s Downloaded cached icu4c (38.2 MiB) in 577ms
  85. 14.52 s Progress: 0 of 1 built, 20 of 51 downloaded from cache (9 downloading)
  86. 14.52 s Downloading cached boost from https://cache.nix-ci.com
  87. 14.52 s Downloaded cached libpsl (114 KiB) in 581ms
  88. 14.52 s Progress: 0 of 1 built, 21 of 51 downloaded from cache (9 downloading)
  89. 14.53 s Downloaded cached onetbb (626 KiB) in 327ms
  90. 14.53 s Progress: 0 of 1 built, 22 of 51 downloaded from cache (8 downloading)
  91. 14.53 s Downloading cached libblake3 from https://cache.nix-ci.com
  92. 14.72 s Downloaded cached aws-c-cal (158 KiB) in 293ms
  93. 14.72 s Progress: 0 of 1 built, 23 of 51 downloaded from cache (8 downloading)
  94. 14.73 s Downloaded cached libssh2 (330 KiB) in 302ms
  95. 14.73 s Progress: 0 of 1 built, 24 of 51 downloaded from cache (7 downloading)
  96. 14.73 s Downloading cached libgit2-1.9.4-lib from https://cache.nix-ci.com
  97. 14.73 s Downloaded cached ngtcp2 (515 KiB) in 305ms
  98. 14.73 s Progress: 0 of 1 built, 25 of 51 downloaded from cache (7 downloading)
  99. 14.74 s Downloaded cached s2n-tls (1.3 MiB) in 308ms
  100. 14.74 s Progress: 0 of 1 built, 26 of 51 downloaded from cache (6 downloading)
  101. 14.74 s Downloading cached aws-c-io from https://cache.nix-ci.com
  102. 14.74 s Downloaded cached libarchive-3.8.8-lib (953 KiB) in 311ms
  103. 14.74 s Progress: 0 of 1 built, 27 of 51 downloaded from cache (6 downloading)
  104. 14.84 s Downloaded cached libblake3 (117 KiB) in 313ms
  105. 14.84 s Progress: 0 of 1 built, 28 of 51 downloaded from cache (5 downloading)
  106. 14.86 s Downloaded cached krb5-1.22.2-lib (2.7 MiB) in 434ms
  107. 14.86 s Progress: 0 of 1 built, 29 of 51 downloaded from cache (4 downloading)
  108. 14.86 s Downloading cached curl from https://cache.nix-ci.com
  109. 14.95 s Downloaded cached boost (14.5 MiB) in 433ms
  110. 14.95 s Progress: 0 of 1 built, 30 of 51 downloaded from cache (4 downloading)
  111. 14.95 s Downloading cached nix-util from https://cache.nix-ci.com
  112. 15.08 s Downloaded cached aws-c-io (648 KiB) in 349ms
  113. 15.08 s Progress: 0 of 1 built, 31 of 51 downloaded from cache (4 downloading)
  114. 15.09 s Downloading cached aws-c-event-stream from https://cache.nix-ci.com
  115. 15.09 s Downloading cached aws-c-http from https://cache.nix-ci.com
  116. 15.09 s Downloaded cached libgit2-1.9.4-lib (1.6 MiB) in 362ms
  117. 15.09 s Progress: 0 of 1 built, 32 of 51 downloaded from cache (5 downloading)
  118. 15.23 s Downloaded cached curl (1.2 MiB) in 368ms
  119. 15.23 s Progress: 0 of 1 built, 33 of 51 downloaded from cache (4 downloading)
  120. 15.38 s Downloaded cached nix-util (2.4 MiB) in 430ms
  121. 15.38 s Progress: 0 of 1 built, 34 of 51 downloaded from cache (3 downloading)
  122. 15.38 s Downloading cached nix-nswrapper from https://cache.nix-ci.com
  123. 15.50 s Downloaded cached aws-c-event-stream (176 KiB) in 410ms
  124. 15.50 s Progress: 0 of 1 built, 35 of 51 downloaded from cache (3 downloading)
  125. 15.50 s Downloaded cached aws-c-http (641 KiB) in 414ms
  126. 15.50 s Progress: 0 of 1 built, 36 of 51 downloaded from cache (2 downloading)
  127. 15.50 s Downloading cached aws-c-auth from https://cache.nix-ci.com
  128. 15.50 s Downloading cached aws-c-mqtt from https://cache.nix-ci.com
  129. 15.76 s Downloaded cached nix-nswrapper (131 KiB) in 375ms
  130. 15.76 s Progress: 0 of 1 built, 37 of 51 downloaded from cache (3 downloading)
  131. 15.90 s Downloaded cached aws-c-auth (387 KiB) in 399ms
  132. 15.90 s Progress: 0 of 1 built, 38 of 51 downloaded from cache (2 downloading)
  133. 15.90 s Downloading cached aws-c-s3 from https://cache.nix-ci.com
  134. 15.90 s Downloaded cached aws-c-mqtt (557 KiB) in 400ms
  135. 15.90 s Progress: 0 of 1 built, 39 of 51 downloaded from cache (2 downloading)
  136. 16.29 s Downloaded cached aws-c-s3 (384 KiB) in 386ms
  137. 16.29 s Progress: 0 of 1 built, 40 of 51 downloaded from cache (1 downloading)
  138. 16.29 s Downloading cached aws-crt-cpp from https://cache.nix-ci.com
  139. 16.65 s Downloaded cached aws-crt-cpp (979 KiB) in 365ms
  140. 16.65 s Progress: 0 of 1 built, 41 of 51 downloaded from cache (1 downloading)
  141. 16.65 s Downloading cached nix-store from https://cache.nix-ci.com
  142. 17.04 s Downloaded cached nix-store (5.8 MiB) in 391ms
  143. 17.04 s Progress: 0 of 1 built, 42 of 51 downloaded from cache (1 downloading)
  144. 17.04 s Downloading cached nix-fetchers from https://cache.nix-ci.com
  145. 17.04 s Downloading cached nix-main from https://cache.nix-ci.com
  146. 17.37 s Downloaded cached nix-main (393 KiB) in 329ms
  147. 17.37 s Progress: 0 of 1 built, 43 of 51 downloaded from cache (2 downloading)
  148. 17.38 s Downloaded cached nix-fetchers (1.5 MiB) in 331ms
  149. 17.38 s Progress: 0 of 1 built, 44 of 51 downloaded from cache (1 downloading)
  150. 17.38 s Downloading cached nix-expr from https://cache.nix-ci.com
  151. 17.74 s Downloaded cached nix-expr (3.3 MiB) in 367ms
  152. 17.74 s Progress: 0 of 1 built, 45 of 51 downloaded from cache (1 downloading)
  153. 17.74 s Downloading cached nix-flake from https://cache.nix-ci.com
  154. 18.07 s Downloaded cached nix-flake (956 KiB) in 326ms
  155. 18.07 s Progress: 0 of 1 built, 46 of 51 downloaded from cache (1 downloading)
  156. 18.07 s Downloading cached nix-cmd from https://cache.nix-ci.com
  157. 18.42 s Downloaded cached nix-cmd (1 MiB) in 353ms
  158. 18.42 s Progress: 0 of 1 built, 47 of 51 downloaded from cache (1 downloading)
  159. 18.42 s Downloading cached nix from https://cache.nix-ci.com
  160. 18.91 s Downloaded cached nix (3.9 MiB) in 486ms
  161. 18.91 s Progress: 0 of 1 built, 48 of 51 downloaded from cache (1 downloading)
  162. 19.07 s Downloading cached nix from https://cache.nix-ci.com
  163. 19.23 s Downloaded cached nix (8848 B) in 157ms
  164. 19.23 s Progress: 0 of 1 built, 49 of 51 downloaded from cache (1 downloading)
  165. 36.67 s Downloaded cached gammaloop-workspace-deps-deps (354.2 MiB) in 22.8s
  166. 36.84 s Progress: 0 of 1 built, 50 of 51 downloaded from cache
  167. 36.84 s Downloading cached nix-ci-check-gammaloop-doctest from https://cache.nix-ci.com
  168. 36.84 s Downloaded cached nix-ci-check-gammaloop-doctest (1000 B) in 0ms
  169. 36.84 s Progress: 0 of 1 built, 51 of 51 downloaded from cache
  170. 39.22 s evaluating derivation 'g copying '/nix/store/0fcb evaluating derivation 'g querying gammaloop-works querying info about miss querying gammaloop-works [0/1 built, 0.0 KiB DL] [1/0/1 built, 0.0 KiB DLgammaloop-workspace-doctest> Running phase: unpackPhase
  171. 39.23 s gammaloop-workspace-doctest> unpacking source archive /nix/store/n62xwv096bc248rr6y7qpggfdbwshkw9-source
  172. 39.34 s gammaloop-workspace-doctest> source root is source
  173. 39.37 s gammaloop-workspace-doctest> Running phase: patchPhase
  174. 39.37 s gammaloop-workspace-doctest> Executing configureCargoCommonVars
  175. 39.37 s gammaloop-workspace-doctest> decompressing cargo artifacts from /nix/store/kbgwngi7xvi54jsr0kp8rhj1b9mfja7d-gammaloop-workspace-deps-deps-0.1.0/target.tar.zst to target
  176. 40.79 s gammaloop-workspace-doctest> Running phase: updateAutotoolsGnuConfigScriptsPhase
  177. 40.82 s gammaloop-workspace-doctest> Running phase: configurePhase
  178. 40.82 s gammaloop-workspace-doctest> will append /build/source/.cargo-home/config.toml with contents of /nix/store/xdy1vvhll2bijdplvl9fcc2b9plkxhaa-vendor-cargo-deps/config.toml
  179. 40.82 s gammaloop-workspace-doctest> default configurePhase, nothing to do
  180. 40.83 s gammaloop-workspace-doctest> Running phase: buildPhase
  181. 40.83 s gammaloop-workspace-doctest> +++ command cargo --version
  182. 40.83 s gammaloop-workspace-doctest> cargo 1.97.0 (c980f4866 2026-06-30)
  183. 40.86 s gammaloop-workspace-doctest> +++ command cargo test --profile ci-optim --doc --locked --workspace --features gammaloop-api/cli,gammaloop-tracing-filter/clap,gammaloop-tracing-filter/symbolica,idenso/bincode,idenso/reference-cases,linnet/bincode,linnet/drawing,linnet/nodestore-vec,linnet/rkyv,linnet/serde,linnet/symbolica,spenso-macros/shadowing,spenso/shadowing,symbolica/tracing_max_level_info
  184. 41.54 s gammaloop-workspace-doctest> Compiling target-lexicon v0.13.5
  185. 41.56 s gammaloop-workspace-doctest> Compiling symbolica v2.2.0 (https://github.com/symbolica-dev/symbolica?branch=dev#0441bd7a)
  186. 41.56 s gammaloop-workspace-doctest> Compiling maplit v1.0.2
  187. 41.57 s gammaloop-workspace-doctest> Compiling gammaloop-tracing-filter-macros v0.1.0 (/build/source/crates/gammaloop-tracing-filter-macros)
  188. 41.57 s gammaloop-workspace-doctest> Compiling vakint v0.1.2 (/build/source/crates/vakint)
  189. 41.58 s gammaloop-workspace-doctest> Compiling gammalooprs v0.3.4 (/build/source/crates/gammalooprs)
  190. 41.58 s gammaloop-workspace-doctest> Compiling alphal00p-docs-macros v0.1.0 (/build/source/crates/alphal00p-docs-macros)
  191. 41.58 s gammaloop-workspace-doctest> Compiling alphal00p-docs-schema v0.1.0 (/build/source/crates/alphal00p-docs-schema)
  192. 41.59 s gammaloop-workspace-doctest> Compiling rustc_version v0.4.1
  193. 41.59 s gammaloop-workspace-doctest> Compiling bincode v1.3.3
  194. 41.59 s gammaloop-workspace-doctest> Compiling target-triple v1.0.1
  195. 41.59 s gammaloop-workspace-doctest> Compiling gungraun-runner v0.18.2
  196. 41.60 s gammaloop-workspace-doctest> Compiling iai-callgrind-runner v0.14.2
  197. 41.60 s gammaloop-workspace-doctest> Compiling clinnet v0.1.8 (/build/source/crates/clinnet)
  198. 41.61 s gammaloop-workspace-doctest> Compiling gammaloop-integration-tests v0.1.0 (/build/source/tests)
  199. 41.78 s gammaloop-workspace-doctest> Compiling test-log-core v0.2.20
  200. 41.88 s gammaloop-workspace-doctest> Compiling wait-timeout v0.2.1
  201. 41.88 s gammaloop-workspace-doctest> Compiling iai-callgrind v0.14.2
  202. 41.88 s gammaloop-workspace-doctest> Compiling quick-error v1.2.3
  203. 41.88 s gammaloop-workspace-doctest> Compiling bit-vec v0.8.0
  204. 41.90 s gammaloop-workspace-doctest> Compiling rusty-fork v0.3.1
  205. 42.02 s gammaloop-workspace-doctest> Compiling bit-set v0.8.0
  206. 42.03 s gammaloop-workspace-doctest> Compiling iai-callgrind-macros v0.5.1
  207. 42.10 s gammaloop-workspace-doctest> Compiling rand_xorshift v0.4.0
  208. 42.13 s gammaloop-workspace-doctest> Compiling console v0.15.11
  209. 42.19 s gammaloop-workspace-doctest> Compiling termcolor v1.4.1
  210. 42.20 s gammaloop-workspace-doctest> Compiling glob v0.3.4
  211. 42.26 s gammaloop-workspace-doctest> Compiling gungraun-macros v0.8.0
  212. 42.37 s gammaloop-workspace-doctest> Compiling unarray v0.1.4
  213. 42.43 s gammaloop-workspace-doctest> Compiling base64 v0.21.7
  214. 42.52 s gammaloop-workspace-doctest> Compiling similar-asserts v1.7.0
  215. 42.82 s gammaloop-workspace-doctest> Compiling pyo3-build-config v0.28.3
  216. 42.83 s gammaloop-workspace-doctest> Compiling alphal00p-docs-catalogs v0.1.0 (/build/source/crates/alphal00p-docs-catalogs)
  217. 42.87 s gammaloop-workspace-doctest> Compiling ron v0.8.1
  218. 42.88 s gammaloop-workspace-doctest> Compiling trybuild v1.0.120
  219. 42.90 s gammaloop-workspace-doctest> Compiling proptest v1.11.0
  220. 43.02 s gammaloop-workspace-doctest> Compiling alphal00p-docs-builder v0.1.0 (/build/source/crates/alphal00p-docs-builder)
  221. 43.11 s gammaloop-workspace-doctest> Compiling kurvst v0.1.0 (/build/source/crates/kurvst)
  222. 43.33 s gammaloop-workspace-doctest> Compiling test-log-macros v0.2.20
  223. 45.45 s gammaloop-workspace-doctest> Compiling test-log v0.2.20
  224. 45.64 s gammaloop-workspace-doctest> Compiling alphal00p-docs-examples v0.1.0 (/build/source/crates/alphal00p-docs-examples)
  225. 47.24 s gammaloop-workspace-doctest> Compiling pyo3-ffi v0.28.3
  226. 48.98 s gammaloop-workspace-doctest> Compiling pyo3-macros-backend v0.28.3
  227. 48.98 s gammaloop-workspace-doctest> Compiling pyo3 v0.28.3
  228. 48.98 s gammaloop-workspace-doctest> Compiling numpy v0.28.0
  229. 48.98 s gammaloop-workspace-doctest> Compiling gammaloop-api v0.1.0 (/build/source/crates/gammaloop-api)
  230. 48.98 s gammaloop-workspace-doctest> Compiling gungraun v0.18.2
  231. 52.30 s gammaloop-workspace-doctest> Compiling pyo3-macros v0.28.3
  232. 57.00 s gammaloop-workspace-doctest> Compiling pyo3-stub-gen v0.17.2
  233. 57.62 s gammaloop-workspace-doctest> Compiling numerica v2.2.0 (https://github.com/symbolica-dev/symbolica?branch=dev#0441bd7a)
  234. 59.66 s gammaloop-workspace-doctest> Compiling graphica v2.1.0 (https://github.com/symbolica-dev/symbolica?branch=dev#0441bd7a)
  235. 61.64 s gammaloop-workspace-doctest> Compiling symbolica-utils v0.1.0 (/build/source/crates/symbolica-utils)
  236. 263.10 s gammaloop-workspace-doctest> Compiling gammaloop-workspace-hack v0.1.0 (/build/source/crates/gammaloop-workspace-hack)
  237. 263.93 s gammaloop-workspace-doctest> Compiling spenso-macros v0.3.2 (/build/source/crates/spenso-macros)
  238. 263.93 s gammaloop-workspace-doctest> Compiling linnet v0.17.0 (/build/source/crates/linnet)
  239. 267.03 s gammaloop-workspace-doctest> Compiling spenso v0.6.0 (/build/source/crates/spenso)
  240. 275.36 s gammaloop-workspace-doctest> Compiling idenso v0.3.0 (/build/source/crates/idenso)
  241. 275.41 s gammaloop-workspace-doctest> Compiling gammaloop-tracing-filter v0.1.0 (/build/source/crates/gammaloop-tracing-filter)
  242. 280.21 s gammaloop-workspace-doctest> Compiling spenso-hep-lib v0.1.7 (/build/source/crates/spenso-hep-lib)
  243. 280.48 s gammaloop-workspace-doctest> Compiling spynso3 v0.1.2 (/build/source/crates/spynso3)
  244. 331.85 s gammaloop-workspace-doctest> Compiling linnest v0.1.0 (/build/source/crates/linnest)
  245. 332.57 s gammaloop-workspace-doctest> Compiling linnet-py v0.1.0 (/build/source/crates/linnet-py)
  246. 426.51 s gammaloop-workspace-doctest> Finished `ci-optim` profile [optimized] target(s) in 6m 25s
  247. 426.61 s gammaloop-workspace-doctest> warning: the following packages contain code that will be rejected by a future version of Rust: proc-macro-error2 v2.0.1
  248. 426.61 s gammaloop-workspace-doctest> note: to see what the problems were, use the option `--future-incompat-report`, or run `cargo report future-incompatibilities --id 1`
  249. 426.64 s gammaloop-workspace-doctest> Doc-tests alphal00p_docs_builder
  250. 426.77 s gammaloop-workspace-doctest>
  251. 426.77 s gammaloop-workspace-doctest> running 0 tests
  252. 426.77 s gammaloop-workspace-doctest>
  253. 426.77 s gammaloop-workspace-doctest> test result: ok. 0 passed; 0 failed; 0 ignored; 0 measured; 0 filtered out; finished in 0.00s
  254. 426.77 s gammaloop-workspace-doctest>
  255. 426.77 s gammaloop-workspace-doctest> Doc-tests alphal00p_docs_catalogs
  256. 427.85 s gammaloop-workspace-doctest>
  257. 427.85 s gammaloop-workspace-doctest> running 0 tests
  258. 427.85 s gammaloop-workspace-doctest>
  259. 427.85 s gammaloop-workspace-doctest> test result: ok. 0 passed; 0 failed; 0 ignored; 0 measured; 0 filtered out; finished in 0.00s
  260. 427.85 s gammaloop-workspace-doctest>
  261. 427.85 s gammaloop-workspace-doctest> Doc-tests alphal00p_docs_examples
  262. 427.87 s gammaloop-workspace-doctest>
  263. 427.87 s gammaloop-workspace-doctest> running 0 tests
  264. 427.87 s gammaloop-workspace-doctest>
  265. 427.87 s gammaloop-workspace-doctest> test result: ok. 0 passed; 0 failed; 0 ignored; 0 measured; 0 filtered out; finished in 0.00s
  266. 427.87 s gammaloop-workspace-doctest>
  267. 427.87 s gammaloop-workspace-doctest> Doc-tests alphal00p_docs
  268. 427.91 s gammaloop-workspace-doctest>
  269. 427.91 s gammaloop-workspace-doctest> running 0 tests
  270. 427.91 s gammaloop-workspace-doctest>
  271. 427.91 s gammaloop-workspace-doctest> test result: ok. 0 passed; 0 failed; 0 ignored; 0 measured; 0 filtered out; finished in 0.00s
  272. 427.91 s gammaloop-workspace-doctest>
  273. 427.92 s gammaloop-workspace-doctest> Doc-tests alphal00p_docs_schema
  274. 427.98 s gammaloop-workspace-doctest>
  275. 427.98 s gammaloop-workspace-doctest> running 0 tests
  276. 427.98 s gammaloop-workspace-doctest>
  277. 427.98 s gammaloop-workspace-doctest> test result: ok. 0 passed; 0 failed; 0 ignored; 0 measured; 0 filtered out; finished in 0.00s
  278. 427.98 s gammaloop-workspace-doctest>
  279. 427.98 s gammaloop-workspace-doctest> Doc-tests clinnet
  280. 428.02 s gammaloop-workspace-doctest>
  281. 428.02 s gammaloop-workspace-doctest> running 0 tests
  282. 428.02 s gammaloop-workspace-doctest>
  283. 428.02 s gammaloop-workspace-doctest> test result: ok. 0 passed; 0 failed; 0 ignored; 0 measured; 0 filtered out; finished in 0.00s
  284. 428.02 s gammaloop-workspace-doctest>
  285. 428.02 s gammaloop-workspace-doctest> Doc-tests gammaloop_api
  286. 428.89 s gammaloop-workspace-doctest>
  287. 428.89 s gammaloop-workspace-doctest> running 13 tests
  288. 428.91 s gammaloop-workspace-doctest> test crates/gammaloop-api/src/python.rs - python::GammaLoopAPI::evaluate_sample (line 2926) ... FAILED
  289. 428.91 s gammaloop-workspace-doctest> test crates/gammaloop-api/src/python.rs - python::GammaLoopAPI::get_integrand_settings (line 3539) ... FAILED
  290. 428.91 s gammaloop-workspace-doctest> test crates/gammaloop-api/src/python.rs - python::GammaLoopAPI::get_default_runtime_settings (line 3688) ... FAILED
  291. 428.91 s gammaloop-workspace-doctest> test crates/gammaloop-api/src/python.rs - python::GammaLoopAPI::get_integrand_info (line 3496) ... FAILED
  292. 428.91 s gammaloop-workspace-doctest> test crates/gammaloop-api/src/python.rs - python::GammaLoopAPI::get_active_command_blocks (line 3652) ... FAILED
  293. 428.91 s gammaloop-workspace-doctest> test crates/gammaloop-api/src/python.rs - python::GammaLoopAPI::evaluate_samples (line 3040) ... FAILED
  294. 428.99 s gammaloop-workspace-doctest> test crates/gammaloop-api/src/python.rs - python::GammaLoopAPI::run_command (line 3793) ... FAILED
  295. 428.99 s gammaloop-workspace-doctest> test crates/gammaloop-api/src/python.rs - python::GammaLoopAPI::get_run_history (line 3603) ... FAILED
  296. 428.99 s gammaloop-workspace-doctest> test crates/gammaloop-api/src/python.rs - python::GammaLoopAPI::get_global_settings (line 3631) ... FAILED
  297. 429.01 s gammaloop-workspace-doctest> test crates/gammaloop-api/src/python.rs - python::evaluate_graph_overall_factor (line 95) ... FAILED
  298. 429.01 s gammaloop-workspace-doctest> test crates/gammaloop-api/src/python.rs - python::atom_to_canonical_string (line 128) ... FAILED
  299. 429.01 s gammaloop-workspace-doctest> test crates/gammaloop-api/src/python.rs - python::atom_to_dots (line 157) ... FAILED
  300. 429.01 s gammaloop-workspace-doctest> test crates/gammaloop-api/src/python.rs - python::GammaLoopAPI::new_python (line 2804) ... FAILED
  301. 429.01 s gammaloop-workspace-doctest>
  302. 429.01 s gammaloop-workspace-doctest> failures:
  303. 429.01 s gammaloop-workspace-doctest>
  304. 429.01 s gammaloop-workspace-doctest> ---- crates/gammaloop-api/src/python.rs - python::GammaLoopAPI::evaluate_sample (line 2926) stdout ----
  305. 429.01 s gammaloop-workspace-doctest> error: expected one of `!` or `::`, found `=`
  306. 429.01 s gammaloop-workspace-doctest> --> crates/gammaloop-api/src/python.rs:2927:8
  307. 429.01 s gammaloop-workspace-doctest> |
  308. 429.01 s gammaloop-workspace-doctest> 2927 | result = api.evaluate_sample(point, process_id=0, minimal_output=True)
  309. 429.01 s gammaloop-workspace-doctest> | ^ expected one of `!` or `::`
  310. 429.01 s gammaloop-workspace-doctest>
  311. 429.01 s gammaloop-workspace-doctest> error: aborting due to 1 previous error
  312. 429.01 s gammaloop-workspace-doctest>
  313. 429.01 s gammaloop-workspace-doctest> Couldn't compile the test.
  314. 429.01 s gammaloop-workspace-doctest> ---- crates/gammaloop-api/src/python.rs - python::GammaLoopAPI::get_integrand_settings (line 3539) stdout ----
  315. 429.01 s gammaloop-workspace-doctest> error: expected one of `!` or `::`, found `=`
  316. 429.01 s gammaloop-workspace-doctest> --> crates/gammaloop-api/src/python.rs:3540:10
  317. 429.01 s gammaloop-workspace-doctest> |
  318. 429.01 s gammaloop-workspace-doctest> 3540 | settings = api.get_integrand_settings(process_id=0)
  319. 429.01 s gammaloop-workspace-doctest> | ^ expected one of `!` or `::`
  320. 429.01 s gammaloop-workspace-doctest>
  321. 429.01 s gammaloop-workspace-doctest> error: aborting due to 1 previous error
  322. 429.01 s gammaloop-workspace-doctest>
  323. 429.01 s gammaloop-workspace-doctest> Couldn't compile the test.
  324. 429.01 s gammaloop-workspace-doctest> ---- crates/gammaloop-api/src/python.rs - python::GammaLoopAPI::get_default_runtime_settings (line 3688) stdout ----
  325. 429.01 s gammaloop-workspace-doctest> error: expected one of `!` or `::`, found `=`
  326. 429.01 s gammaloop-workspace-doctest> --> crates/gammaloop-api/src/python.rs:3689:9
  327. 429.01 s gammaloop-workspace-doctest> |
  328. 429.01 s gammaloop-workspace-doctest> 3689 | runtime = api.get_default_runtime_settings()
  329. 429.01 s gammaloop-workspace-doctest> | ^ expected one of `!` or `::`
  330. 429.01 s gammaloop-workspace-doctest>
  331. 429.01 s gammaloop-workspace-doctest> error: aborting due to 1 previous error
  332. 429.01 s gammaloop-workspace-doctest>
  333. 429.01 s gammaloop-workspace-doctest> Couldn't compile the test.
  334. 429.01 s gammaloop-workspace-doctest> ---- crates/gammaloop-api/src/python.rs - python::GammaLoopAPI::get_integrand_info (line 3496) stdout ----
  335. 429.01 s gammaloop-workspace-doctest> error: expected one of `!` or `::`, found `=`
  336. 429.01 s gammaloop-workspace-doctest> --> crates/gammaloop-api/src/python.rs:3497:6
  337. 429.01 s gammaloop-workspace-doctest> |
  338. 429.01 s gammaloop-workspace-doctest> 3497 | info = api.get_integrand_info(process_id=0)
  339. 429.01 s gammaloop-workspace-doctest> | ^ expected one of `!` or `::`
  340. 429.01 s gammaloop-workspace-doctest>
  341. 429.01 s gammaloop-workspace-doctest> error: aborting due to 1 previous error
  342. 429.01 s gammaloop-workspace-doctest>
  343. 429.01 s gammaloop-workspace-doctest> Couldn't compile the test.
  344. 429.01 s gammaloop-workspace-doctest> ---- crates/gammaloop-api/src/python.rs - python::GammaLoopAPI::get_active_command_blocks (line 3652) stdout ----
  345. 429.01 s gammaloop-workspace-doctest> error: expected item, found keyword `for`
  346. 429.01 s gammaloop-workspace-doctest> --> crates/gammaloop-api/src/python.rs:3653:1
  347. 429.01 s gammaloop-workspace-doctest> |
  348. 429.01 s gammaloop-workspace-doctest> 3653 | for name, commands in api.get_active_command_blocks().items():
  349. 429.01 s gammaloop-workspace-doctest> | ^^^ expected item
  350. 429.01 s gammaloop-workspace-doctest> |
  351. 429.01 s gammaloop-workspace-doctest> = note: for a full list of items that can appear in modules, see <https://doc.rust-lang.org/reference/items.html>
  352. 429.01 s gammaloop-workspace-doctest>
  353. 429.01 s gammaloop-workspace-doctest> error: aborting due to 1 previous error
  354. 429.01 s gammaloop-workspace-doctest>
  355. 429.01 s gammaloop-workspace-doctest> Couldn't compile the test.
  356. 429.01 s gammaloop-workspace-doctest> ---- crates/gammaloop-api/src/python.rs - python::GammaLoopAPI::evaluate_samples (line 3040) stdout ----
  357. 429.01 s gammaloop-workspace-doctest> error: expected one of `!` or `::`, found `=`
  358. 429.01 s gammaloop-workspace-doctest> --> crates/gammaloop-api/src/python.rs:3041:8
  359. 429.01 s gammaloop-workspace-doctest> |
  360. 429.01 s gammaloop-workspace-doctest> 3041 | points = numpy.asarray(points, dtype=numpy.float64)
  361. 429.01 s gammaloop-workspace-doctest> | ^ expected one of `!` or `::`
  362. 429.01 s gammaloop-workspace-doctest>
  363. 429.01 s gammaloop-workspace-doctest> error: aborting due to 1 previous error
  364. 429.01 s gammaloop-workspace-doctest>
  365. 429.01 s gammaloop-workspace-doctest> Couldn't compile the test.
  366. 429.01 s gammaloop-workspace-doctest> ---- crates/gammaloop-api/src/python.rs - python::GammaLoopAPI::run_command (line 3793) stdout ----
  367. 429.01 s gammaloop-workspace-doctest> error[E0425]: cannot find value `api` in this scope
  368. 429.01 s gammaloop-workspace-doctest> --> crates/gammaloop-api/src/python.rs:3794:1
  369. 429.01 s gammaloop-workspace-doctest> |
  370. 429.01 s gammaloop-workspace-doctest> 3794 | api.run("display processes")
  371. 429.01 s gammaloop-workspace-doctest> | ^^^ not found in this scope
  372. 429.01 s gammaloop-workspace-doctest>
  373. 429.01 s gammaloop-workspace-doctest> error: aborting due to 1 previous error
  374. 429.01 s gammaloop-workspace-doctest>
  375. 429.01 s gammaloop-workspace-doctest> For more information about this error, try `rustc --explain E0425`.
  376. 429.01 s gammaloop-workspace-doctest> Couldn't compile the test.
  377. 429.01 s gammaloop-workspace-doctest> ---- crates/gammaloop-api/src/python.rs - python::GammaLoopAPI::get_run_history (line 3603) stdout ----
  378. 429.01 s gammaloop-workspace-doctest> error[E0425]: cannot find value `run_card_toml` in this scope
  379. 429.01 s gammaloop-workspace-doctest> --> crates/gammaloop-api/src/python.rs:3604:1
  380. 429.01 s gammaloop-workspace-doctest> |
  381. 429.01 s gammaloop-workspace-doctest> 3604 | run_card_toml = api.get_run_history()
  382. 429.01 s gammaloop-workspace-doctest> | ^^^^^^^^^^^^^
  383. 429.01 s gammaloop-workspace-doctest> |
  384. 429.01 s gammaloop-workspace-doctest> help: you might have meant to introduce a new binding
  385. 429.01 s gammaloop-workspace-doctest> |
  386. 429.01 s gammaloop-workspace-doctest> 3604 | let run_card_toml = api.get_run_history()
  387. 429.01 s gammaloop-workspace-doctest> | +++
  388. 429.01 s gammaloop-workspace-doctest>
  389. 429.01 s gammaloop-workspace-doctest> error[E0425]: cannot find value `api` in this scope
  390. 429.01 s gammaloop-workspace-doctest> --> crates/gammaloop-api/src/python.rs:3604:17
  391. 429.01 s gammaloop-workspace-doctest> |
  392. 429.01 s gammaloop-workspace-doctest> 3604 | run_card_toml = api.get_run_history()
  393. 429.01 s gammaloop-workspace-doctest> | ^^^ not found in this scope
  394. 429.01 s gammaloop-workspace-doctest>
  395. 429.01 s gammaloop-workspace-doctest> error: aborting due to 2 previous errors
  396. 429.01 s gammaloop-workspace-doctest>
  397. 429.01 s gammaloop-workspace-doctest> For more information about this error, try `rustc --explain E0425`.
  398. 429.01 s gammaloop-workspace-doctest> Couldn't compile the test.
  399. 429.01 s gammaloop-workspace-doctest> ---- crates/gammaloop-api/src/python.rs - python::GammaLoopAPI::get_global_settings (line 3631) stdout ----
  400. 429.01 s gammaloop-workspace-doctest> error[E0425]: cannot find value `settings_toml` in this scope
  401. 429.01 s gammaloop-workspace-doctest> --> crates/gammaloop-api/src/python.rs:3632:1
  402. 429.01 s gammaloop-workspace-doctest> |
  403. 429.01 s gammaloop-workspace-doctest> 3632 | settings_toml = api.get_global_settings()
  404. 429.01 s gammaloop-workspace-doctest> | ^^^^^^^^^^^^^
  405. 429.01 s gammaloop-workspace-doctest> |
  406. 429.01 s gammaloop-workspace-doctest> help: you might have meant to introduce a new binding
  407. 429.01 s gammaloop-workspace-doctest> |
  408. 429.01 s gammaloop-workspace-doctest> 3632 | let settings_toml = api.get_global_settings()
  409. 429.01 s gammaloop-workspace-doctest> | +++
  410. 429.01 s gammaloop-workspace-doctest>
  411. 429.01 s gammaloop-workspace-doctest> error[E0425]: cannot find value `api` in this scope
  412. 429.01 s gammaloop-workspace-doctest> --> crates/gammaloop-api/src/python.rs:3632:17
  413. 429.01 s gammaloop-workspace-doctest> |
  414. 429.01 s gammaloop-workspace-doctest> 3632 | settings_toml = api.get_global_settings()
  415. 429.01 s gammaloop-workspace-doctest> | ^^^ not found in this scope
  416. 429.01 s gammaloop-workspace-doctest>
  417. 429.01 s gammaloop-workspace-doctest> error: aborting due to 2 previous errors
  418. 429.01 s gammaloop-workspace-doctest>
  419. 429.01 s gammaloop-workspace-doctest> For more information about this error, try `rustc --explain E0425`.
  420. 429.01 s gammaloop-workspace-doctest> Couldn't compile the test.
  421. 429.01 s gammaloop-workspace-doctest> ---- crates/gammaloop-api/src/python.rs - python::evaluate_graph_overall_factor (line 95) stdout ----
  422. 429.01 s gammaloop-workspace-doctest> error[E0425]: cannot find function `evaluate_graph_overall_factor` in this scope
  423. 429.01 s gammaloop-workspace-doctest> --> crates/gammaloop-api/src/python.rs:96:1
  424. 429.01 s gammaloop-workspace-doctest> |
  425. 429.01 s gammaloop-workspace-doctest> 96 | evaluate_graph_overall_factor(
  426. 429.01 s gammaloop-workspace-doctest> | ^^^^^^^^^^^^^^^^^^^^^^^^^^^^^ not found in this scope
  427. 429.01 s gammaloop-workspace-doctest>
  428. 429.01 s gammaloop-workspace-doctest> error: aborting due to 1 previous error
  429. 429.01 s gammaloop-workspace-doctest>
  430. 429.01 s gammaloop-workspace-doctest> For more information about this error, try `rustc --explain E0425`.
  431. 429.01 s gammaloop-workspace-doctest> Couldn't compile the test.
  432. 429.01 s gammaloop-workspace-doctest> ---- crates/gammaloop-api/src/python.rs - python::atom_to_canonical_string (line 128) stdout ----
  433. 429.01 s gammaloop-workspace-doctest> error[E0425]: cannot find function `atom_to_canonical_string` in this scope
  434. 429.01 s gammaloop-workspace-doctest> --> crates/gammaloop-api/src/python.rs:129:1
  435. 429.01 s gammaloop-workspace-doctest> |
  436. 429.01 s gammaloop-workspace-doctest> 129 | atom_to_canonical_string("x + x")
  437. 429.01 s gammaloop-workspace-doctest> | ^^^^^^^^^^^^^^^^^^^^^^^^ not found in this scope
  438. 429.01 s gammaloop-workspace-doctest>
  439. 429.01 s gammaloop-workspace-doctest> error: aborting due to 1 previous error
  440. 429.01 s gammaloop-workspace-doctest>
  441. 429.01 s gammaloop-workspace-doctest> For more information about this error, try `rustc --explain E0425`.
  442. 429.01 s gammaloop-workspace-doctest> Couldn't compile the test.
  443. 429.01 s gammaloop-workspace-doctest> ---- crates/gammaloop-api/src/python.rs - python::atom_to_dots (line 157) stdout ----
  444. 429.01 s gammaloop-workspace-doctest> error[E0425]: cannot find function `to_dots` in this scope
  445. 429.01 s gammaloop-workspace-doctest> --> crates/gammaloop-api/src/python.rs:158:1
  446. 429.01 s gammaloop-workspace-doctest> |
  447. 429.01 s gammaloop-workspace-doctest> 158 | to_dots("p(mu) * q(mu)")
  448. 429.01 s gammaloop-workspace-doctest> | ^^^^^^^ not found in this scope
  449. 429.01 s gammaloop-workspace-doctest>
  450. 429.01 s gammaloop-workspace-doctest> error: aborting due to 1 previous error
  451. 429.01 s gammaloop-workspace-doctest>
  452. 429.01 s gammaloop-workspace-doctest> For more information about this error, try `rustc --explain E0425`.
  453. 429.01 s gammaloop-workspace-doctest> Couldn't compile the test.
  454. 429.01 s gammaloop-workspace-doctest> ---- crates/gammaloop-api/src/python.rs - python::GammaLoopAPI::new_python (line 2804) stdout ----
  455. 429.01 s gammaloop-workspace-doctest> error[E0425]: cannot find value `api` in this scope
  456. 429.01 s gammaloop-workspace-doctest> --> crates/gammaloop-api/src/python.rs:2805:1
  457. 429.01 s gammaloop-workspace-doctest> |
  458. 429.01 s gammaloop-workspace-doctest> 2805 | api = GammaLoopAPI(state_folder="./state", read_only_state=True)
  459. 429.01 s gammaloop-workspace-doctest> | ^^^
  460. 429.01 s gammaloop-workspace-doctest> |
  461. 429.01 s gammaloop-workspace-doctest> help: you might have meant to introduce a new binding
  462. 429.01 s gammaloop-workspace-doctest> |
  463. 429.01 s gammaloop-workspace-doctest> 2805 | let api = GammaLoopAPI(state_folder="./state", read_only_state=True)
  464. 429.01 s gammaloop-workspace-doctest> | +++
  465. 429.01 s gammaloop-workspace-doctest>
  466. 429.01 s gammaloop-workspace-doctest> error[E0425]: cannot find value `state_folder` in this scope
  467. 429.01 s gammaloop-workspace-doctest> --> crates/gammaloop-api/src/python.rs:2805:20
  468. 429.01 s gammaloop-workspace-doctest> |
  469. 429.01 s gammaloop-workspace-doctest> 2805 | api = GammaLoopAPI(state_folder="./state", read_only_state=True)
  470. 429.01 s gammaloop-workspace-doctest> | ^^^^^^^^^^^^ not found in this scope
  471. 429.01 s gammaloop-workspace-doctest>
  472. 429.01 s gammaloop-workspace-doctest> error[E0425]: cannot find value `read_only_state` in this scope
  473. 429.01 s gammaloop-workspace-doctest> --> crates/gammaloop-api/src/python.rs:2805:44
  474. 429.01 s gammaloop-workspace-doctest> |
  475. 429.01 s gammaloop-workspace-doctest> 2805 | api = GammaLoopAPI(state_folder="./state", read_only_state=True)
  476. 429.01 s gammaloop-workspace-doctest> | ^^^^^^^^^^^^^^^ not found in this scope
  477. 429.01 s gammaloop-workspace-doctest>
  478. 429.01 s gammaloop-workspace-doctest> error[E0425]: cannot find value `True` in this scope
  479. 429.01 s gammaloop-workspace-doctest> --> crates/gammaloop-api/src/python.rs:2805:60
  480. 429.01 s gammaloop-workspace-doctest> |
  481. 429.01 s gammaloop-workspace-doctest> 2805 | api = GammaLoopAPI(state_folder="./state", read_only_state=True)
  482. 429.01 s gammaloop-workspace-doctest> | ^^^^ not found in this scope
  483. 429.01 s gammaloop-workspace-doctest> |
  484. 429.01 s gammaloop-workspace-doctest> help: you may want to use a bool value instead
  485. 429.01 s gammaloop-workspace-doctest> |
  486. 429.01 s gammaloop-workspace-doctest> 2805 - api = GammaLoopAPI(state_folder="./state", read_only_state=True)
  487. 429.01 s gammaloop-workspace-doctest> 2805 + api = GammaLoopAPI(state_folder="./state", read_only_state=true)
  488. 429.01 s gammaloop-workspace-doctest> |
  489. 429.01 s gammaloop-workspace-doctest>
  490. 429.01 s gammaloop-workspace-doctest> error[E0425]: cannot find function, tuple struct or tuple variant `GammaLoopAPI` in this scope
  491. 429.01 s gammaloop-workspace-doctest> --> crates/gammaloop-api/src/python.rs:2805:7
  492. 429.01 s gammaloop-workspace-doctest> |
  493. 429.01 s gammaloop-workspace-doctest> 2805 | api = GammaLoopAPI(state_folder="./state", read_only_state=True)
  494. 429.01 s gammaloop-workspace-doctest> | ^^^^^^^^^^^^ not found in this scope
  495. 429.01 s gammaloop-workspace-doctest>
  496. 429.01 s gammaloop-workspace-doctest> error: aborting due to 5 previous errors
  497. 429.01 s gammaloop-workspace-doctest>
  498. 429.01 s gammaloop-workspace-doctest> For more information about this error, try `rustc --explain E0425`.
  499. 429.01 s gammaloop-workspace-doctest> Couldn't compile the test.
  500. 429.01 s gammaloop-workspace-doctest>
  501. 429.01 s gammaloop-workspace-doctest> failures:
  502. 429.01 s gammaloop-workspace-doctest> crates/gammaloop-api/src/python.rs - python::GammaLoopAPI::evaluate_sample (line 2926)
  503. 429.01 s gammaloop-workspace-doctest> crates/gammaloop-api/src/python.rs - python::GammaLoopAPI::evaluate_samples (line 3040)
  504. 429.01 s gammaloop-workspace-doctest> crates/gammaloop-api/src/python.rs - python::GammaLoopAPI::get_active_command_blocks (line 3652)
  505. 429.01 s gammaloop-workspace-doctest> crates/gammaloop-api/src/python.rs - python::GammaLoopAPI::get_default_runtime_settings (line 3688)
  506. 429.01 s gammaloop-workspace-doctest> crates/gammaloop-api/src/python.rs - python::GammaLoopAPI::get_global_settings (line 3631)
  507. 429.01 s gammaloop-workspace-doctest> crates/gammaloop-api/src/python.rs - python::GammaLoopAPI::get_integrand_info (line 3496)
  508. 429.01 s gammaloop-workspace-doctest> crates/gammaloop-api/src/python.rs - python::GammaLoopAPI::get_integrand_settings (line 3539)
  509. 429.01 s gammaloop-workspace-doctest> crates/gammaloop-api/src/python.rs - python::GammaLoopAPI::get_run_history (line 3603)
  510. 429.01 s gammaloop-workspace-doctest> crates/gammaloop-api/src/python.rs - python::GammaLoopAPI::new_python (line 2804)
  511. 429.01 s gammaloop-workspace-doctest> crates/gammaloop-api/src/python.rs - python::GammaLoopAPI::run_command (line 3793)
  512. 429.01 s gammaloop-workspace-doctest> crates/gammaloop-api/src/python.rs - python::atom_to_canonical_string (line 128)
  513. 429.01 s gammaloop-workspace-doctest> crates/gammaloop-api/src/python.rs - python::atom_to_dots (line 157)
  514. 429.01 s gammaloop-workspace-doctest> crates/gammaloop-api/src/python.rs - python::evaluate_graph_overall_factor (line 95)
  515. 429.01 s gammaloop-workspace-doctest>
  516. 429.01 s gammaloop-workspace-doctest> test result: FAILED. 0 passed; 13 failed; 0 ignored; 0 measured; 0 filtered out; finished in 0.12s
  517. 429.01 s gammaloop-workspace-doctest>
  518. 429.01 s gammaloop-workspace-doctest> error: doctest failed, to rerun pass `-p gammaloop-api --doc`
  519. 429.48 s error: Cannot build '/nix/store/d7n0kzr0ab2qmzp3m3y3jhx03bbngjym-gammaloop-workspace-doctest-0.1.0.drv'.
  520. 429.48 s Reason: builder failed with exit code 101.
  521. 429.48 s Output paths:
  522. 429.48 s /nix/store/m1rbsc5idl2jxvknq7bvqysz3ysaha7l-gammaloop-workspace-doctest-0.1.0
  523. 429.48 s Last 349 log lines:
  524. 429.48 s > Running phase: unpackPhase
  525. 429.48 s > unpacking source archive /nix/store/n62xwv096bc248rr6y7qpggfdbwshkw9-source
  526. 429.48 s > source root is source
  527. 429.48 s > Running phase: patchPhase
  528. 429.48 s > Executing configureCargoCommonVars
  529. 429.48 s > decompressing cargo artifacts from /nix/store/kbgwngi7xvi54jsr0kp8rhj1b9mfja7d-gammaloop-workspace-deps-deps-0.1.0/target.tar.zst to target
  530. 429.48 s > Running phase: updateAutotoolsGnuConfigScriptsPhase
  531. 429.48 s > Running phase: configurePhase
  532. 429.48 s > will append /build/source/.cargo-home/config.toml with contents of /nix/store/xdy1vvhll2bijdplvl9fcc2b9plkxhaa-vendor-cargo-deps/config.toml
  533. 429.48 s > default configurePhase, nothing to do
  534. 429.48 s > Running phase: buildPhase
  535. 429.48 s > +++ command cargo --version
  536. 429.48 s > cargo 1.97.0 (c980f4866 2026-06-30)
  537. 429.48 s > +++ command cargo test --profile ci-optim --doc --locked --workspace --features gammaloop-api/cli,gammaloop-tracing-filter/clap,gammaloop-tracing-filter/symbolica,idenso/bincode,idenso/reference-cases,linnet/bincode,linnet/drawing,linnet/nodestore-vec,linnet/rkyv,linnet/serde,linnet/symbolica,spenso-macros/shadowing,spenso/shadowing,symbolica/tracing_max_level_info
  538. 429.48 s > Compiling target-lexicon v0.13.5
  539. 429.48 s > Compiling symbolica v2.2.0 (https://github.com/symbolica-dev/symbolica?branch=dev#0441bd7a)
  540. 429.48 s > Compiling maplit v1.0.2
  541. 429.48 s > Compiling gammaloop-tracing-filter-macros v0.1.0 (/build/source/crates/gammaloop-tracing-filter-macros)
  542. 429.48 s > Compiling vakint v0.1.2 (/build/source/crates/vakint)
  543. 429.48 s > Compiling gammalooprs v0.3.4 (/build/source/crates/gammalooprs)
  544. 429.48 s > Compiling alphal00p-docs-macros v0.1.0 (/build/source/crates/alphal00p-docs-macros)
  545. 429.48 s > Compiling alphal00p-docs-schema v0.1.0 (/build/source/crates/alphal00p-docs-schema)
  546. 429.48 s > Compiling rustc_version v0.4.1
  547. 429.48 s > Compiling bincode v1.3.3
  548. 429.48 s > Compiling target-triple v1.0.1
  549. 429.48 s > Compiling gungraun-runner v0.18.2
  550. 429.48 s > Compiling iai-callgrind-runner v0.14.2
  551. 429.48 s > Compiling clinnet v0.1.8 (/build/source/crates/clinnet)
  552. 429.48 s > Compiling gammaloop-integration-tests v0.1.0 (/build/source/tests)
  553. 429.48 s > Compiling test-log-core v0.2.20
  554. 429.48 s > Compiling wait-timeout v0.2.1
  555. 429.48 s > Compiling iai-callgrind v0.14.2
  556. 429.48 s > Compiling quick-error v1.2.3
  557. 429.48 s > Compiling bit-vec v0.8.0
  558. 429.48 s > Compiling rusty-fork v0.3.1
  559. 429.48 s > Compiling bit-set v0.8.0
  560. 429.48 s > Compiling iai-callgrind-macros v0.5.1
  561. 429.48 s > Compiling rand_xorshift v0.4.0
  562. 429.48 s > Compiling console v0.15.11
  563. 429.48 s > Compiling termcolor v1.4.1
  564. 429.48 s > Compiling glob v0.3.4
  565. 429.48 s > Compiling gungraun-macros v0.8.0
  566. 429.48 s > Compiling unarray v0.1.4
  567. 429.48 s > Compiling base64 v0.21.7
  568. 429.48 s > Compiling similar-asserts v1.7.0
  569. 429.48 s > Compiling pyo3-build-config v0.28.3
  570. 429.48 s > Compiling alphal00p-docs-catalogs v0.1.0 (/build/source/crates/alphal00p-docs-catalogs)
  571. 429.48 s > Compiling ron v0.8.1
  572. 429.48 s > Compiling trybuild v1.0.120
  573. 429.48 s > Compiling proptest v1.11.0
  574. 429.48 s > Compiling alphal00p-docs-builder v0.1.0 (/build/source/crates/alphal00p-docs-builder)
  575. 429.48 s > Compiling kurvst v0.1.0 (/build/source/crates/kurvst)
  576. 429.48 s > Compiling test-log-macros v0.2.20
  577. 429.48 s > Compiling test-log v0.2.20
  578. 429.48 s > Compiling alphal00p-docs-examples v0.1.0 (/build/source/crates/alphal00p-docs-examples)
  579. 429.48 s > Compiling pyo3-ffi v0.28.3
  580. 429.48 s > Compiling pyo3-macros-backend v0.28.3
  581. 429.48 s > Compiling pyo3 v0.28.3
  582. 429.48 s > Compiling numpy v0.28.0
  583. 429.48 s > Compiling gammaloop-api v0.1.0 (/build/source/crates/gammaloop-api)
  584. 429.48 s > Compiling gungraun v0.18.2
  585. 429.48 s > Compiling pyo3-macros v0.28.3
  586. 429.48 s > Compiling pyo3-stub-gen v0.17.2
  587. 429.48 s > Compiling numerica v2.2.0 (https://github.com/symbolica-dev/symbolica?branch=dev#0441bd7a)
  588. 429.48 s > Compiling graphica v2.1.0 (https://github.com/symbolica-dev/symbolica?branch=dev#0441bd7a)
  589. 429.48 s > Compiling symbolica-utils v0.1.0 (/build/source/crates/symbolica-utils)
  590. 429.48 s > Compiling gammaloop-workspace-hack v0.1.0 (/build/source/crates/gammaloop-workspace-hack)
  591. 429.48 s > Compiling spenso-macros v0.3.2 (/build/source/crates/spenso-macros)
  592. 429.48 s > Compiling linnet v0.17.0 (/build/source/crates/linnet)
  593. 429.48 s > Compiling spenso v0.6.0 (/build/source/crates/spenso)
  594. 429.48 s > Compiling idenso v0.3.0 (/build/source/crates/idenso)
  595. 429.48 s > Compiling gammaloop-tracing-filter v0.1.0 (/build/source/crates/gammaloop-tracing-filter)
  596. 429.48 s > Compiling spenso-hep-lib v0.1.7 (/build/source/crates/spenso-hep-lib)
  597. 429.48 s > Compiling spynso3 v0.1.2 (/build/source/crates/spynso3)
  598. 429.48 s > Compiling linnest v0.1.0 (/build/source/crates/linnest)
  599. 429.48 s > Compiling linnet-py v0.1.0 (/build/source/crates/linnet-py)
  600. 429.48 s > Finished `ci-optim` profile [optimized] target(s) in 6m 25s
  601. 429.48 s > warning: the following packages contain code that will be rejected by a future version of Rust: proc-macro-error2 v2.0.1
  602. 429.48 s > note: to see what the problems were, use the option `--future-incompat-report`, or run `cargo report future-incompatibilities --id 1`
  603. 429.48 s > Doc-tests alphal00p_docs_builder
  604. 429.48 s >
  605. 429.48 s > running 0 tests
  606. 429.48 s >
  607. 429.48 s > test result: ok. 0 passed; 0 failed; 0 ignored; 0 measured; 0 filtered out; finished in 0.00s
  608. 429.48 s >
  609. 429.48 s > Doc-tests alphal00p_docs_catalogs
  610. 429.48 s >
  611. 429.48 s > running 0 tests
  612. 429.48 s >
  613. 429.48 s > test result: ok. 0 passed; 0 failed; 0 ignored; 0 measured; 0 filtered out; finished in 0.00s
  614. 429.48 s >
  615. 429.48 s > Doc-tests alphal00p_docs_examples
  616. 429.48 s >
  617. 429.48 s > running 0 tests
  618. 429.48 s >
  619. 429.48 s > test result: ok. 0 passed; 0 failed; 0 ignored; 0 measured; 0 filtered out; finished in 0.00s
  620. 429.48 s >
  621. 429.48 s > Doc-tests alphal00p_docs
  622. 429.48 s >
  623. 429.48 s > running 0 tests
  624. 429.48 s >
  625. 429.48 s > test result: ok. 0 passed; 0 failed; 0 ignored; 0 measured; 0 filtered out; finished in 0.00s
  626. 429.48 s >
  627. 429.48 s > Doc-tests alphal00p_docs_schema
  628. 429.48 s >
  629. 429.48 s > running 0 tests
  630. 429.48 s >
  631. 429.48 s > test result: ok. 0 passed; 0 failed; 0 ignored; 0 measured; 0 filtered out; finished in 0.00s
  632. 429.48 s >
  633. 429.48 s > Doc-tests clinnet
  634. 429.48 s >
  635. 429.48 s > running 0 tests
  636. 429.48 s >
  637. 429.48 s > test result: ok. 0 passed; 0 failed; 0 ignored; 0 measured; 0 filtered out; finished in 0.00s
  638. 429.48 s >
  639. 429.48 s > Doc-tests gammaloop_api
  640. 429.48 s >
  641. 429.48 s > running 13 tests
  642. 429.48 s > test crates/gammaloop-api/src/python.rs - python::GammaLoopAPI::evaluate_sample (line 2926) ... FAILED
  643. 429.48 s > test crates/gammaloop-api/src/python.rs - python::GammaLoopAPI::get_integrand_settings (line 3539) ... FAILED
  644. 429.48 s > test crates/gammaloop-api/src/python.rs - python::GammaLoopAPI::get_default_runtime_settings (line 3688) ... FAILED
  645. 429.48 s > test crates/gammaloop-api/src/python.rs - python::GammaLoopAPI::get_integrand_info (line 3496) ... FAILED
  646. 429.48 s > test crates/gammaloop-api/src/python.rs - python::GammaLoopAPI::get_active_command_blocks (line 3652) ... FAILED
  647. 429.48 s > test crates/gammaloop-api/src/python.rs - python::GammaLoopAPI::evaluate_samples (line 3040) ... FAILED
  648. 429.48 s > test crates/gammaloop-api/src/python.rs - python::GammaLoopAPI::run_command (line 3793) ... FAILED
  649. 429.48 s > test crates/gammaloop-api/src/python.rs - python::GammaLoopAPI::get_run_history (line 3603) ... FAILED
  650. 429.48 s > test crates/gammaloop-api/src/python.rs - python::GammaLoopAPI::get_global_settings (line 3631) ... FAILED
  651. 429.48 s > test crates/gammaloop-api/src/python.rs - python::evaluate_graph_overall_factor (line 95) ... FAILED
  652. 429.48 s > test crates/gammaloop-api/src/python.rs - python::atom_to_canonical_string (line 128) ... FAILED
  653. 429.48 s > test crates/gammaloop-api/src/python.rs - python::atom_to_dots (line 157) ... FAILED
  654. 429.48 s > test crates/gammaloop-api/src/python.rs - python::GammaLoopAPI::new_python (line 2804) ... FAILED
  655. 429.48 s >
  656. 429.48 s > failures:
  657. 429.48 s >
  658. 429.48 s > ---- crates/gammaloop-api/src/python.rs - python::GammaLoopAPI::evaluate_sample (line 2926) stdout ----
  659. 429.48 s > error: expected one of `!` or `::`, found `=`
  660. 429.48 s > --> crates/gammaloop-api/src/python.rs:2927:8
  661. 429.48 s > |
  662. 429.48 s > 2927 | result = api.evaluate_sample(point, process_id=0, minimal_output=True)
  663. 429.48 s > | ^ expected one of `!` or `::`
  664. 429.48 s >
  665. 429.48 s > error: aborting due to 1 previous error
  666. 429.48 s >
  667. 429.48 s > Couldn't compile the test.
  668. 429.48 s > ---- crates/gammaloop-api/src/python.rs - python::GammaLoopAPI::get_integrand_settings (line 3539) stdout ----
  669. 429.48 s > error: expected one of `!` or `::`, found `=`
  670. 429.48 s > --> crates/gammaloop-api/src/python.rs:3540:10
  671. 429.48 s > |
  672. 429.48 s > 3540 | settings = api.get_integrand_settings(process_id=0)
  673. 429.48 s > | ^ expected one of `!` or `::`
  674. 429.48 s >
  675. 429.48 s > error: aborting due to 1 previous error
  676. 429.48 s >
  677. 429.48 s > Couldn't compile the test.
  678. 429.48 s > ---- crates/gammaloop-api/src/python.rs - python::GammaLoopAPI::get_default_runtime_settings (line 3688) stdout ----
  679. 429.48 s > error: expected one of `!` or `::`, found `=`
  680. 429.48 s > --> crates/gammaloop-api/src/python.rs:3689:9
  681. 429.48 s > |
  682. 429.48 s > 3689 | runtime = api.get_default_runtime_settings()
  683. 429.48 s > | ^ expected one of `!` or `::`
  684. 429.48 s >
  685. 429.48 s > error: aborting due to 1 previous error
  686. 429.48 s >
  687. 429.48 s > Couldn't compile the test.
  688. 429.48 s > ---- crates/gammaloop-api/src/python.rs - python::GammaLoopAPI::get_integrand_info (line 3496) stdout ----
  689. 429.48 s > error: expected one of `!` or `::`, found `=`
  690. 429.48 s > --> crates/gammaloop-api/src/python.rs:3497:6
  691. 429.48 s > |
  692. 429.48 s > 3497 | info = api.get_integrand_info(process_id=0)
  693. 429.48 s > | ^ expected one of `!` or `::`
  694. 429.48 s >
  695. 429.48 s > error: aborting due to 1 previous error
  696. 429.48 s >
  697. 429.48 s > Couldn't compile the test.
  698. 429.48 s > ---- crates/gammaloop-api/src/python.rs - python::GammaLoopAPI::get_active_command_blocks (line 3652) stdout ----
  699. 429.48 s > error: expected item, found keyword `for`
  700. 429.48 s > --> crates/gammaloop-api/src/python.rs:3653:1
  701. 429.48 s > |
  702. 429.48 s > 3653 | for name, commands in api.get_active_command_blocks().items():
  703. 429.48 s > | ^^^ expected item
  704. 429.48 s > |
  705. 429.48 s > = note: for a full list of items that can appear in modules, see <https://doc.rust-lang.org/reference/items.html>
  706. 429.48 s >
  707. 429.48 s > error: aborting due to 1 previous error
  708. 429.48 s >
  709. 429.48 s > Couldn't compile the test.
  710. 429.48 s > ---- crates/gammaloop-api/src/python.rs - python::GammaLoopAPI::evaluate_samples (line 3040) stdout ----
  711. 429.48 s > error: expected one of `!` or `::`, found `=`
  712. 429.48 s > --> crates/gammaloop-api/src/python.rs:3041:8
  713. 429.48 s > |
  714. 429.48 s > 3041 | points = numpy.asarray(points, dtype=numpy.float64)
  715. 429.48 s > | ^ expected one of `!` or `::`
  716. 429.48 s >
  717. 429.48 s > error: aborting due to 1 previous error
  718. 429.48 s >
  719. 429.48 s > Couldn't compile the test.
  720. 429.48 s > ---- crates/gammaloop-api/src/python.rs - python::GammaLoopAPI::run_command (line 3793) stdout ----
  721. 429.48 s > error[E0425]: cannot find value `api` in this scope
  722. 429.48 s > --> crates/gammaloop-api/src/python.rs:3794:1
  723. 429.48 s > |
  724. 429.48 s > 3794 | api.run("display processes")
  725. 429.48 s > | ^^^ not found in this scope
  726. 429.48 s >
  727. 429.48 s > error: aborting due to 1 previous error
  728. 429.48 s >
  729. 429.48 s > For more information about this error, try `rustc --explain E0425`.
  730. 429.48 s > Couldn't compile the test.
  731. 429.48 s > ---- crates/gammaloop-api/src/python.rs - python::GammaLoopAPI::get_run_history (line 3603) stdout ----
  732. 429.48 s > error[E0425]: cannot find value `run_card_toml` in this scope
  733. 429.48 s > --> crates/gammaloop-api/src/python.rs:3604:1
  734. 429.48 s > |
  735. 429.48 s > 3604 | run_card_toml = api.get_run_history()
  736. 429.48 s > | ^^^^^^^^^^^^^
  737. 429.48 s > |
  738. 429.48 s > help: you might have meant to introduce a new binding
  739. 429.48 s > |
  740. 429.48 s > 3604 | let run_card_toml = api.get_run_history()
  741. 429.48 s > | +++
  742. 429.48 s >
  743. 429.48 s > error[E0425]: cannot find value `api` in this scope
  744. 429.48 s > --> crates/gammaloop-api/src/python.rs:3604:17
  745. 429.48 s > |
  746. 429.48 s > 3604 | run_card_toml = api.get_run_history()
  747. 429.48 s > | ^^^ not found in this scope
  748. 429.48 s >
  749. 429.48 s > error: aborting due to 2 previous errors
  750. 429.48 s >
  751. 429.48 s > For more information about this error, try `rustc --explain E0425`.
  752. 429.48 s > Couldn't compile the test.
  753. 429.48 s > ---- crates/gammaloop-api/src/python.rs - python::GammaLoopAPI::get_global_settings (line 3631) stdout ----
  754. 429.48 s > error[E0425]: cannot find value `settings_toml` in this scope
  755. 429.48 s > --> crates/gammaloop-api/src/python.rs:3632:1
  756. 429.48 s > |
  757. 429.48 s > 3632 | settings_toml = api.get_global_settings()
  758. 429.48 s > | ^^^^^^^^^^^^^
  759. 429.48 s > |
  760. 429.48 s > help: you might have meant to introduce a new binding
  761. 429.48 s > |
  762. 429.48 s > 3632 | let settings_toml = api.get_global_settings()
  763. 429.48 s > | +++
  764. 429.48 s >
  765. 429.48 s > error[E0425]: cannot find value `api` in this scope
  766. 429.48 s > --> crates/gammaloop-api/src/python.rs:3632:17
  767. 429.48 s > |
  768. 429.48 s > 3632 | settings_toml = api.get_global_settings()
  769. 429.48 s > | ^^^ not found in this scope
  770. 429.48 s >
  771. 429.48 s > error: aborting due to 2 previous errors
  772. 429.48 s >
  773. 429.48 s > For more information about this error, try `rustc --explain E0425`.
  774. 429.48 s > Couldn't compile the test.
  775. 429.48 s > ---- crates/gammaloop-api/src/python.rs - python::evaluate_graph_overall_factor (line 95) stdout ----
  776. 429.48 s > error[E0425]: cannot find function `evaluate_graph_overall_factor` in this scope
  777. 429.48 s > --> crates/gammaloop-api/src/python.rs:96:1
  778. 429.48 s > |
  779. 429.48 s > 96 | evaluate_graph_overall_factor(
  780. 429.48 s > | ^^^^^^^^^^^^^^^^^^^^^^^^^^^^^ not found in this scope
  781. 429.48 s >
  782. 429.48 s > error: aborting due to 1 previous error
  783. 429.48 s >
  784. 429.48 s > For more information about this error, try `rustc --explain E0425`.
  785. 429.48 s > Couldn't compile the test.
  786. 429.48 s > ---- crates/gammaloop-api/src/python.rs - python::atom_to_canonical_string (line 128) stdout ----
  787. 429.48 s > error[E0425]: cannot find function `atom_to_canonical_string` in this scope
  788. 429.48 s > --> crates/gammaloop-api/src/python.rs:129:1
  789. 429.48 s > |
  790. 429.48 s > 129 | atom_to_canonical_string("x + x")
  791. 429.48 s > | ^^^^^^^^^^^^^^^^^^^^^^^^ not found in this scope
  792. 429.48 s >
  793. 429.48 s > error: aborting due to 1 previous error
  794. 429.48 s >
  795. 429.48 s > For more information about this error, try `rustc --explain E0425`.
  796. 429.48 s > Couldn't compile the test.
  797. 429.48 s > ---- crates/gammaloop-api/src/python.rs - python::atom_to_dots (line 157) stdout ----
  798. 429.48 s > error[E0425]: cannot find function `to_dots` in this scope
  799. 429.48 s > --> crates/gammaloop-api/src/python.rs:158:1
  800. 429.48 s > |
  801. 429.48 s > 158 | to_dots("p(mu) * q(mu)")
  802. 429.48 s > | ^^^^^^^ not found in this scope
  803. 429.48 s >
  804. 429.48 s > error: aborting due to 1 previous error
  805. 429.48 s >
  806. 429.48 s > For more information about this error, try `rustc --explain E0425`.
  807. 429.48 s > Couldn't compile the test.
  808. 429.48 s > ---- crates/gammaloop-api/src/python.rs - python::GammaLoopAPI::new_python (line 2804) stdout ----
  809. 429.48 s > error[E0425]: cannot find value `api` in this scope
  810. 429.48 s > --> crates/gammaloop-api/src/python.rs:2805:1
  811. 429.48 s > |
  812. 429.48 s > 2805 | api = GammaLoopAPI(state_folder="./state", read_only_state=True)
  813. 429.48 s > | ^^^
  814. 429.48 s > |
  815. 429.48 s > help: you might have meant to introduce a new binding
  816. 429.48 s > |
  817. 429.48 s > 2805 | let api = GammaLoopAPI(state_folder="./state", read_only_state=True)
  818. 429.48 s > | +++
  819. 429.48 s >
  820. 429.48 s > error[E0425]: cannot find value `state_folder` in this scope
  821. 429.48 s > --> crates/gammaloop-api/src/python.rs:2805:20
  822. 429.48 s > |
  823. 429.48 s > 2805 | api = GammaLoopAPI(state_folder="./state", read_only_state=True)
  824. 429.48 s > | ^^^^^^^^^^^^ not found in this scope
  825. 429.48 s >
  826. 429.48 s > error[E0425]: cannot find value `read_only_state` in this scope
  827. 429.48 s > --> crates/gammaloop-api/src/python.rs:2805:44
  828. 429.48 s > |
  829. 429.48 s > 2805 | api = GammaLoopAPI(state_folder="./state", read_only_state=True)
  830. 429.48 s > | ^^^^^^^^^^^^^^^ not found in this scope
  831. 429.48 s >
  832. 429.48 s > error[E0425]: cannot find value `True` in this scope
  833. 429.48 s > --> crates/gammaloop-api/src/python.rs:2805:60
  834. 429.48 s > |
  835. 429.48 s > 2805 | api = GammaLoopAPI(state_folder="./state", read_only_state=True)
  836. 429.48 s > | ^^^^ not found in this scope
  837. 429.48 s > |
  838. 429.48 s > help: you may want to use a bool value instead
  839. 429.48 s > |
  840. 429.48 s > 2805 - api = GammaLoopAPI(state_folder="./state", read_only_state=True)
  841. 429.48 s > 2805 + api = GammaLoopAPI(state_folder="./state", read_only_state=true)
  842. 429.48 s > |
  843. 429.48 s >
  844. 429.48 s > error[E0425]: cannot find function, tuple struct or tuple variant `GammaLoopAPI` in this scope
  845. 429.48 s > --> crates/gammaloop-api/src/python.rs:2805:7
  846. 429.48 s > |
  847. 429.48 s > 2805 | api = GammaLoopAPI(state_folder="./state", read_only_state=True)
  848. 429.48 s > | ^^^^^^^^^^^^ not found in this scope
  849. 429.48 s >
  850. 429.48 s > error: aborting due to 5 previous errors
  851. 429.48 s >
  852. 429.48 s > For more information about this error, try `rustc --explain E0425`.
  853. 429.48 s > Couldn't compile the test.
  854. 429.48 s >
  855. 429.48 s > failures:
  856. 429.48 s > crates/gammaloop-api/src/python.rs - python::GammaLoopAPI::evaluate_sample (line 2926)
  857. 429.48 s > crates/gammaloop-api/src/python.rs - python::GammaLoopAPI::evaluate_samples (line 3040)
  858. 429.48 s > crates/gammaloop-api/src/python.rs - python::GammaLoopAPI::get_active_command_blocks (line 3652)
  859. 429.48 s > crates/gammaloop-api/src/python.rs - python::GammaLoopAPI::get_default_runtime_settings (line 3688)
  860. 429.48 s > crates/gammaloop-api/src/python.rs - python::GammaLoopAPI::get_global_settings (line 3631)
  861. 429.48 s > crates/gammaloop-api/src/python.rs - python::GammaLoopAPI::get_integrand_info (line 3496)
  862. 429.48 s > crates/gammaloop-api/src/python.rs - python::GammaLoopAPI::get_integrand_settings (line 3539)
  863. 429.48 s > crates/gammaloop-api/src/python.rs - python::GammaLoopAPI::get_run_history (line 3603)
  864. 429.48 s > crates/gammaloop-api/src/python.rs - python::GammaLoopAPI::new_python (line 2804)
  865. 429.48 s > crates/gammaloop-api/src/python.rs - python::GammaLoopAPI::run_command (line 3793)
  866. 429.48 s > crates/gammaloop-api/src/python.rs - python::atom_to_canonical_string (line 128)
  867. 429.48 s > crates/gammaloop-api/src/python.rs - python::atom_to_dots (line 157)
  868. 429.48 s > crates/gammaloop-api/src/python.rs - python::evaluate_graph_overall_factor (line 95)
  869. 429.48 s >
  870. 429.48 s > test result: FAILED. 0 passed; 13 failed; 0 ignored; 0 measured; 0 filtered out; finished in 0.12s
  871. 429.48 s >
  872. 429.48 s > error: doctest failed, to rerun pass `-p gammaloop-api --doc`
  873. 429.48 s For full logs, run:
  874. 429.48 s nix log /nix/store/d7n0kzr0ab2qmzp3m3y3jhx03bbngjym-gammaloop-workspace-doctest-0.1.0.drv
  875. 429.56 s [0 built (1 failed), 0.0Run failed.