1. 1.30 s $ /nix/store/9ypz3flqsrl5xl495mm8h645gadjsxi1-coreutils-9.11/bin/timeout --kill-after=15s 7200s /nix/store/23zk8sgzamrbmj1fday15szf7f2279s8-nix-2.34.7/bin/nix --extra-experimental-features nix-command --extra-experimental-features flakes flake clone git+https://github.com/alphal00p/gammaloop --dest /tmp/nix-ci-worker/stable-pwd/repo/
  2. 2.35 s Cloning into '/tmp/nix-ci-worker/stable-pwd/repo'...
  3. 2.35 s remote: Enumerating objects: 65431, done.
  4. 2.35 s remote: Counting objects: 0% (1/8082) remote: Counting objects: 1% (81/8082) remote: Counting objects: 2% (162/8082) remote: Counting objects: 3% (243/8082) remote: Counting objects: 4% (324/8082) remote: Counting objects: 5% (405/8082) remote: Counting objects: 6% (485/8082) remote: Counting objects: 7% (566/8082) remote: Counting objects: 8% (647/8082) remote: Counting objects: 9% (728/8082) remote: Counting objects: 10% (809/8082) remote: Counting objects: 11% (890/8082) remote: Counting objects: 12% (970/8082) remote: Counting objects: 13% (1051/8082) remote: Counting objects: 14% (1132/8082) remote: Counting objects: 15% (1213/8082) remote: Counting objects: 16% (1294/8082) remote: Counting objects: 17% (1374/8082) remote: Counting objects: 18% (1455/8082) remote: Counting objects: 19% (1536/8082) remote: Counting objects: 20% (1617/8082) remote: Counting objects: 21% (1698/8082) remote: Counting objects: 22% (1779/8082) remote: Counting objects: 23% (1859/8082) remote: Counting objects: 24% (1940/8082) remote: Counting objects: 25% (2021/8082) remote: Counting objects: 26% (2102/8082) remote: Counting objects: 27% (2183/8082) remote: Counting objects: 28% (2263/8082) remote: Counting objects: 29% (2344/8082) remote: Counting objects: 30% (2425/8082) remote: Counting objects: 31% (2506/8082) remote: Counting objects: 32% (2587/8082) remote: Counting objects: 33% (2668/8082) remote: Counting objects: 34% (2748/8082) remote: Counting objects: 35% (2829/8082) remote: Counting objects: 36% (2910/8082) remote: Counting objects: 37% (2991/8082) remote: Counting objects: 38% (3072/8082) remote: Counting objects: 39% (3152/8082) remote: Counting objects: 40% (3233/8082) remote: Counting objects: 41% (3314/8082) remote: Counting objects: 42% (3395/8082) remote: Counting objects: 43% (3476/8082) remote: Counting objects: 44% (3557/8082) remote: Counting objects: 45% (3637/8082) remote: Counting objects: 46% (3718/8082) remote: Counting objects: 47% (3799/8082) remote: Counting objects: 48% (3880/8082) remote: Counting objects: 49% (3961/8082) remote: Counting objects: 50% (4041/8082) remote: Counting objects: 51% (4122/8082) remote: Counting objects: 52% (4203/8082) remote: Counting objects: 53% (4284/8082) remote: Counting objects: 54% (4365/8082) remote: Counting objects: 55% (4446/8082) remote: Counting objects: 56% (4526/8082) remote: Counting objects: 57% (4607/8082) remote: Counting objects: 58% (4688/8082) remote: Counting objects: 59% (4769/8082) remote: Counting objects: 60% (4850/8082) remote: Counting objects: 61% (4931/8082) remote: Counting objects: 62% (5011/8082) remote: Counting objects: 63% (5092/8082) remote: Counting objects: 64% (5173/8082) remote: Counting objects: 65% (5254/8082) remote: Counting objects: 66% (5335/8082) remote: Counting objects: 67% (5415/8082) remote: Counting objects: 68% (5496/8082) remote: Counting objects: 69% (5577/8082) remote: Counting objects: 70% (5658/8082) remote: Counting objects: 71% (5739/8082) remote: Counting objects: 72% (5820/8082) remote: Counting objects: 73% (5900/8082) remote: Counting objects: 74% (5981/8082) remote: Counting objects: 75% (6062/8082) remote: Counting objects: 76% (6143/8082) remote: Counting objects: 77% (6224/8082) remote: Counting objects: 78% (6304/8082) remote: Counting objects: 79% (6385/8082) remote: Counting objects: 80% (6466/8082) remote: Counting objects: 81% (6547/8082) remote: Counting objects: 82% (6628/8082) remote: Counting objects: 83% (6709/8082) remote: Counting objects: 84% (6789/8082) remote: Counting objects: 85% (6870/8082) remote: Counting objects: 86% (6951/8082) remote: Counting objects: 87% (7032/8082) remote: Counting objects: 88% (7113/8082) remote: Counting objects: 89% (7193/8082) remote: Counting objects: 90% (7274/8082) remote: Counting objects: 91% (7355/8082) remote: Counting objects: 92% (7436/8082) remote: Counting objects: 93% (7517/8082) remote: Counting objects: 94% (7598/8082) remote: Counting objects: 95% (7678/8082) remote: Counting objects: 96% (7759/8082) remote: Counting objects: 97% (7840/8082) remote: Counting objects: 98% (7921/8082) remote: Counting objects: 99% (8002/8082) remote: Counting objects: 100% (8082/8082) remote: Counting objects: 100% (8082/8082), done.
  5. 2.98 s remote: Compressing objects: 0% (1/1721) remote: Compressing objects: 1% (18/1721) remote: Compressing objects: 2% (35/1721) remote: Compressing objects: 3% (52/1721) remote: Compressing objects: 4% (69/1721) remote: Compressing objects: 5% (87/1721) remote: Compressing objects: 6% (104/1721) remote: Compressing objects: 7% (121/1721) remote: Compressing objects: 8% (138/1721) remote: Compressing objects: 9% (155/1721) remote: Compressing objects: 10% (173/1721) remote: Compressing objects: 11% (190/1721) remote: Compressing objects: 12% (207/1721) remote: Compressing objects: 13% (224/1721) remote: Compressing objects: 14% (241/1721) remote: Compressing objects: 15% (259/1721) remote: Compressing objects: 16% (276/1721) remote: Compressing objects: 17% (293/1721) remote: Compressing objects: 17% (305/1721) remote: Compressing objects: 18% (310/1721) remote: Compressing objects: 19% (327/1721) remote: Compressing objects: 20% (345/1721) remote: Compressing objects: 21% (362/1721) remote: Compressing objects: 22% (379/1721) remote: Compressing objects: 23% (396/1721) remote: Compressing objects: 24% (414/1721) remote: Compressing objects: 25% (431/1721) remote: Compressing objects: 26% (448/1721) remote: Compressing objects: 27% (465/1721) remote: Compressing objects: 28% (482/1721) remote: Compressing objects: 29% (500/1721) remote: Compressing objects: 30% (517/1721) remote: Compressing objects: 31% (534/1721) remote: Compressing objects: 32% (551/1721) remote: Compressing objects: 33% (568/1721) remote: Compressing objects: 34% (586/1721) remote: Compressing objects: 35% (603/1721) remote: Compressing objects: 36% (620/1721) remote: Compressing objects: 37% (637/1721) remote: Compressing objects: 38% (654/1721) remote: Compressing objects: 39% (672/1721) remote: Compressing objects: 40% (689/1721) remote: Compressing objects: 41% (706/1721) remote: Compressing objects: 42% (723/1721) remote: Compressing objects: 43% (741/1721) remote: Compressing objects: 44% (758/1721) remote: Compressing objects: 45% (775/1721) remote: Compressing objects: 46% (792/1721) remote: Compressing objects: 47% (809/1721) remote: Compressing objects: 48% (827/1721) remote: Compressing objects: 49% (844/1721) remote: Compressing objects: 50% (861/1721) remote: Compressing objects: 51% (878/1721) remote: Compressing objects: 52% (895/1721) remote: Compressing objects: 53% (913/1721) remote: Compressing objects: 54% (930/1721) remote: Compressing objects: 55% (947/1721) remote: Compressing objects: 56% (964/1721) remote: Compressing objects: 57% (981/1721) remote: Compressing objects: 58% (999/1721) remote: Compressing objects: 59% (1016/1721) remote: Compressing objects: 60% (1033/1721) remote: Compressing objects: 61% (1050/1721) remote: Compressing objects: 62% (1068/1721) remote: Compressing objects: 63% (1085/1721) remote: Compressing objects: 64% (1102/1721) remote: Compressing objects: 65% (1119/1721) remote: Compressing objects: 66% (1136/1721) remote: Compressing objects: 67% (1154/1721) remote: Compressing objects: 68% (1171/1721) remote: Compressing objects: 69% (1188/1721) remote: Compressing objects: 70% (1205/1721) remote: Compressing objects: 71% (1222/1721) remote: Compressing objects: 72% (1240/1721) remote: Compressing objects: 73% (1257/1721) remote: Compressing objects: 74% (1274/1721) remote: Compressing objects: 75% (1291/1721) remote: Compressing objects: 76% (1308/1721) remote: Compressing objects: 77% (1326/1721) remote: Compressing objects: 78% (1343/1721) remote: Compressing objects: 79% (1360/1721) remote: Compressing objects: 80% (1377/1721) remote: Compressing objects: 81% (1395/1721) remote: Compressing objects: 82% (1412/1721) remote: Compressing objects: 83% (1429/1721) remote: Compressing objects: 84% (1446/1721) remote: Compressing objects: 85% (1463/1721) remote: Compressing objects: 86% (1481/1721) remote: Compressing objects: 87% (1498/1721) remote: Compressing objects: 88% (1515/1721) remote: Compressing objects: 89% (1532/1721) remote: Compressing objects: 90% (1549/1721) remote: Compressing objects: 91% (1567/1721) remote: Compressing objects: 92% (1584/1721) remote: Compressing objects: 93% (1601/1721) remote: Compressing objects: 94% (1618/1721) remote: Compressing objects: 95% (1635/1721) remote: Compressing objects: 96% (1653/1721) remote: Compressing objects: 97% (1670/1721) remote: Compressing objects: 98% (1687/1721) remote: Compressing objects: 99% (1704/1721) remote: Compressing objects: 100% (1721/1721) remote: Compressing objects: 100% (1721/1721), done.
  6. 6.11 s Receiving objects: 0% (1/65431) Receiving objects: 1% (655/65431) Receiving objects: 2% (1309/65431) Receiving objects: 3% (1963/65431) Receiving objects: 4% (2618/65431) Receiving objects: 5% (3272/65431) Receiving objects: 6% (3926/65431) Receiving objects: 7% (4581/65431) Receiving objects: 8% (5235/65431), 9.04 MiB | 18.07 MiB/s Receiving objects: 9% (5889/65431), 9.04 MiB | 18.07 MiB/s Receiving objects: 10% (6544/65431), 9.04 MiB | 18.07 MiB/s Receiving objects: 11% (7198/65431), 9.04 MiB | 18.07 MiB/s Receiving objects: 12% (7852/65431), 9.04 MiB | 18.07 MiB/s Receiving objects: 13% (8507/65431), 9.04 MiB | 18.07 MiB/s Receiving objects: 14% (9161/65431), 9.04 MiB | 18.07 MiB/s Receiving objects: 15% (9815/65431), 9.04 MiB | 18.07 MiB/s Receiving objects: 16% (10469/65431), 9.04 MiB | 18.07 MiB/s Receiving objects: 17% (11124/65431), 9.04 MiB | 18.07 MiB/s Receiving objects: 18% (11778/65431), 9.04 MiB | 18.07 MiB/s Receiving objects: 19% (12432/65431), 9.04 MiB | 18.07 MiB/s Receiving objects: 20% (13087/65431), 9.04 MiB | 18.07 MiB/s Receiving objects: 21% (13741/65431), 9.04 MiB | 18.07 MiB/s Receiving objects: 22% (14395/65431), 9.04 MiB | 18.07 MiB/s Receiving objects: 23% (15050/65431), 9.04 MiB | 18.07 MiB/s Receiving objects: 24% (15704/65431), 9.04 MiB | 18.07 MiB/s Receiving objects: 25% (16358/65431), 9.04 MiB | 18.07 MiB/s Receiving objects: 26% (17013/65431), 9.04 MiB | 18.07 MiB/s Receiving objects: 27% (17667/65431), 9.04 MiB | 18.07 MiB/s Receiving objects: 28% (18321/65431), 9.04 MiB | 18.07 MiB/s Receiving objects: 29% (18975/65431), 9.04 MiB | 18.07 MiB/s Receiving objects: 30% (19630/65431), 9.04 MiB | 18.07 MiB/s Receiving objects: 31% (20284/65431), 9.04 MiB | 18.07 MiB/s Receiving objects: 32% (20938/65431), 9.04 MiB | 18.07 MiB/s Receiving objects: 33% (21593/65431), 9.04 MiB | 18.07 MiB/s Receiving objects: 34% (22247/65431), 9.04 MiB | 18.07 MiB/s Receiving objects: 34% (22716/65431), 9.04 MiB | 18.07 MiB/s Receiving objects: 35% (22901/65431), 24.23 MiB | 24.22 MiB/s Receiving objects: 36% (23556/65431), 24.23 MiB | 24.22 MiB/s Receiving objects: 37% (24210/65431), 24.23 MiB | 24.22 MiB/s Receiving objects: 38% (24864/65431), 24.23 MiB | 24.22 MiB/s Receiving objects: 39% (25519/65431), 24.23 MiB | 24.22 MiB/s Receiving objects: 40% (26173/65431), 24.23 MiB | 24.22 MiB/s Receiving objects: 41% (26827/65431), 24.23 MiB | 24.22 MiB/s Receiving objects: 42% (27482/65431), 24.23 MiB | 24.22 MiB/s Receiving objects: 43% (28136/65431), 24.23 MiB | 24.22 MiB/s Receiving objects: 44% (28790/65431), 24.23 MiB | 24.22 MiB/s Receiving objects: 45% (29444/65431), 24.23 MiB | 24.22 MiB/s Receiving objects: 46% (30099/65431), 24.23 MiB | 24.22 MiB/s Receiving objects: 47% (30753/65431), 24.23 MiB | 24.22 MiB/s Receiving objects: 48% (31407/65431), 24.23 MiB | 24.22 MiB/s Receiving objects: 49% (32062/65431), 24.23 MiB | 24.22 MiB/s Receiving objects: 50% (32716/65431), 24.23 MiB | 24.22 MiB/s Receiving objects: 51% (33370/65431), 24.23 MiB | 24.22 MiB/s Receiving objects: 52% (34025/65431), 24.23 MiB | 24.22 MiB/s Receiving objects: 53% (34679/65431), 24.23 MiB | 24.22 MiB/s Receiving objects: 54% (35333/65431), 24.23 MiB | 24.22 MiB/s Receiving objects: 55% (35988/65431), 24.23 MiB | 24.22 MiB/s Receiving objects: 56% (36642/65431), 24.23 MiB | 24.22 MiB/s Receiving objects: 57% (37296/65431), 38.94 MiB | 25.94 MiB/s Receiving objects: 58% (37950/65431), 38.94 MiB | 25.94 MiB/s Receiving objects: 59% (38605/65431), 38.94 MiB | 25.94 MiB/s Receiving objects: 60% (39259/65431), 38.94 MiB | 25.94 MiB/s Receiving objects: 61% (39913/65431), 38.94 MiB | 25.94 MiB/s Receiving objects: 62% (40568/65431), 38.94 MiB | 25.94 MiB/s Receiving objects: 63% (41222/65431), 38.94 MiB | 25.94 MiB/s Receiving objects: 64% (41876/65431), 38.94 MiB | 25.94 MiB/s Receiving objects: 65% (42531/65431), 38.94 MiB | 25.94 MiB/s Receiving objects: 66% (43185/65431), 38.94 MiB | 25.94 MiB/s Receiving objects: 67% (43839/65431), 38.94 MiB | 25.94 MiB/s Receiving objects: 68% (44494/65431), 38.94 MiB | 25.94 MiB/s Receiving objects: 68% (44849/65431), 38.94 MiB | 25.94 MiB/s Receiving objects: 69% (45148/65431), 54.12 MiB | 27.04 MiB/s Receiving objects: 70% (45802/65431), 54.12 MiB | 27.04 MiB/s Receiving objects: 71% (46457/65431), 54.12 MiB | 27.04 MiB/s Receiving objects: 72% (47111/65431), 54.12 MiB | 27.04 MiB/s Receiving objects: 73% (47765/65431), 54.12 MiB | 27.04 MiB/s Receiving objects: 74% (48419/65431), 54.12 MiB | 27.04 MiB/s Receiving objects: 75% (49074/65431), 54.12 MiB | 27.04 MiB/s Receiving objects: 76% (49728/65431), 54.12 MiB | 27.04 MiB/s Receiving objects: 77% (50382/65431), 69.54 MiB | 27.80 MiB/s Receiving objects: 78% (51037/65431), 69.54 MiB | 27.80 MiB/s Receiving objects: 79% (51691/65431), 69.54 MiB | 27.80 MiB/s Receiving objects: 80% (52345/65431), 69.54 MiB | 27.80 MiB/s Receiving objects: 81% (53000/65431), 69.54 MiB | 27.80 MiB/s Receiving objects: 82% (53654/65431), 69.54 MiB | 27.80 MiB/s Receiving objects: 83% (54308/65431), 69.54 MiB | 27.80 MiB/s Receiving objects: 84% (54963/65431), 69.54 MiB | 27.80 MiB/s Receiving objects: 85% (55617/65431), 69.54 MiB | 27.80 MiB/s Receiving objects: 86% (56271/65431), 69.54 MiB | 27.80 MiB/s Receiving objects: 87% (56925/65431), 69.54 MiB | 27.80 MiB/s Receiving objects: 88% (57580/65431), 69.54 MiB | 27.80 MiB/s Receiving objects: 89% (58234/65431), 69.54 MiB | 27.80 MiB/s Receiving objects: 90% (58888/65431), 69.54 MiB | 27.80 MiB/s Receiving objects: 91% (59543/65431), 69.54 MiB | 27.80 MiB/s Receiving objects: 92% (60197/65431), 69.54 MiB | 27.80 MiB/s Receiving objects: 93% (60851/65431), 69.54 MiB | 27.80 MiB/s Receiving objects: 94% (61506/65431), 69.54 MiB | 27.80 MiB/s Receiving objects: 95% (62160/65431), 69.54 MiB | 27.80 MiB/s Receiving objects: 96% (62814/65431), 69.54 MiB | 27.80 MiB/s Receiving objects: 96% (62906/65431), 69.54 MiB | 27.80 MiB/s Receiving objects: 97% (63469/65431), 85.39 MiB | 28.45 MiB/s Receiving objects: 98% (64123/65431), 85.39 MiB | 28.45 MiB/s Receiving objects: 99% (64777/65431), 85.39 MiB | 28.45 MiB/s remote: Total 65431 (delta 6911), reused 6518 (delta 6342), pack-reused 57349 (from 1)
  7. 6.11 s Receiving objects: 100% (65431/65431), 85.39 MiB | 28.45 MiB/s Receiving objects: 100% (65431/65431), 88.67 MiB | 28.52 MiB/s, done.
  8. 6.92 s Resolving deltas: 0% (0/46029) Resolving deltas: 1% (461/46029) Resolving deltas: 2% (921/46029) Resolving deltas: 3% (1384/46029) Resolving deltas: 4% (1842/46029) Resolving deltas: 5% (2302/46029) Resolving deltas: 6% (2766/46029) Resolving deltas: 7% (3223/46029) Resolving deltas: 8% (3684/46029) Resolving deltas: 9% (4143/46029) Resolving deltas: 10% (4603/46029) Resolving deltas: 11% (5064/46029) Resolving deltas: 12% (5524/46029) Resolving deltas: 13% (5984/46029) Resolving deltas: 14% (6445/46029) Resolving deltas: 15% (6905/46029) Resolving deltas: 16% (7365/46029) Resolving deltas: 17% (7825/46029) Resolving deltas: 18% (8287/46029) Resolving deltas: 19% (8746/46029) Resolving deltas: 20% (9206/46029) Resolving deltas: 21% (9667/46029) Resolving deltas: 22% (10127/46029) Resolving deltas: 23% (10588/46029) Resolving deltas: 24% (11047/46029) Resolving deltas: 25% (11508/46029) Resolving deltas: 26% (11968/46029) Resolving deltas: 27% (12429/46029) Resolving deltas: 28% (12889/46029) Resolving deltas: 29% (13349/46029) Resolving deltas: 30% (13810/46029) Resolving deltas: 31% (14269/46029) Resolving deltas: 32% (14731/46029) Resolving deltas: 33% (15190/46029) Resolving deltas: 34% (15650/46029) Resolving deltas: 35% (16111/46029) Resolving deltas: 36% (16571/46029) Resolving deltas: 37% (17034/46029) Resolving deltas: 38% (17492/46029) Resolving deltas: 39% (17952/46029) Resolving deltas: 40% (18413/46029) Resolving deltas: 41% (18873/46029) Resolving deltas: 42% (19333/46029) Resolving deltas: 43% (19793/46029) Resolving deltas: 44% (20254/46029) Resolving deltas: 45% (20714/46029) Resolving deltas: 46% (21174/46029) Resolving deltas: 47% (21636/46029) Resolving deltas: 48% (22096/46029) Resolving deltas: 49% (22556/46029) Resolving deltas: 50% (23015/46029) Resolving deltas: 51% (23475/46029) Resolving deltas: 52% (23936/46029) Resolving deltas: 53% (24396/46029) Resolving deltas: 54% (24857/46029) Resolving deltas: 55% (25316/46029) Resolving deltas: 56% (25777/46029) Resolving deltas: 57% (26237/46029) Resolving deltas: 58% (26699/46029) Resolving deltas: 59% (27158/46029) Resolving deltas: 60% (27620/46029) Resolving deltas: 61% (28079/46029) Resolving deltas: 62% (28539/46029) Resolving deltas: 63% (29001/46029) Resolving deltas: 64% (29459/46029) Resolving deltas: 65% (29919/46029) Resolving deltas: 66% (30380/46029) Resolving deltas: 67% (30840/46029) Resolving deltas: 68% (31300/46029) Resolving deltas: 69% (31761/46029) Resolving deltas: 70% (32221/46029) Resolving deltas: 71% (32681/46029) Resolving deltas: 72% (33141/46029) Resolving deltas: 73% (33602/46029) Resolving deltas: 74% (34063/46029) Resolving deltas: 75% (34522/46029) Resolving deltas: 76% (34983/46029) Resolving deltas: 77% (35443/46029) Resolving deltas: 78% (35903/46029) Resolving deltas: 79% (36363/46029) Resolving deltas: 80% (36824/46029) Resolving deltas: 81% (37284/46029) Resolving deltas: 82% (37744/46029) Resolving deltas: 83% (38205/46029) Resolving deltas: 84% (38665/46029) Resolving deltas: 85% (39125/46029) Resolving deltas: 86% (39585/46029) Resolving deltas: 87% (40046/46029) Resolving deltas: 88% (40506/46029) Resolving deltas: 89% (40966/46029) Resolving deltas: 90% (41427/46029) Resolving deltas: 91% (41888/46029) Resolving deltas: 92% (42347/46029) Resolving deltas: 93% (42807/46029) Resolving deltas: 94% (43268/46029) Resolving deltas: 95% (43728/46029) Resolving deltas: 96% (44188/46029) Resolving deltas: 97% (44649/46029) Resolving deltas: 98% (45109/46029) Resolving deltas: 99% (45571/46029) Resolving deltas: 100% (46029/46029) Resolving deltas: 100% (46029/46029), done.
  9. 7.22 s Fetching commit 300fe4656edc32971c94203965703aa5d19e5b73 for push-vrpyqyylypmw ...
  10. 7.22 s $ /nix/store/bcnisk3ydfgv26v2gw3zlky24g00yww2-git-2.54.0/bin/git fetch origin 300fe4656edc32971c94203965703aa5d19e5b73
  11. 7.69 s From https://github.com/alphal00p/gammaloop
  12. 7.69 s * branch 300fe4656edc32971c94203965703aa5d19e5b73 -> FETCH_HEAD
  13. 7.70 s $ /nix/store/9ypz3flqsrl5xl495mm8h645gadjsxi1-coreutils-9.11/bin/timeout --kill-after=15s 7200s /nix/store/bcnisk3ydfgv26v2gw3zlky24g00yww2-git-2.54.0/bin/git -c advice.detachedHead=false checkout 300fe4656edc32971c94203965703aa5d19e5b73
  14. 7.95 s HEAD is now at 300fe465 bundle standalone Linnest rendering in linnet-py
  15. 7.95 s $ /nix/store/9ypz3flqsrl5xl495mm8h645gadjsxi1-coreutils-9.11/bin/timeout --kill-after=15s 7200s /nix/store/23zk8sgzamrbmj1fday15szf7f2279s8-nix-2.34.7/bin/nix --extra-experimental-features nix-command --extra-experimental-features flakes --log-format internal-json run .#packages.x86_64-linux.nix-ci-check-gammaloop-nextest-python-api --print-build-logs
  16. 15.66 s
  17. 15.98 s Downloading cached gammaloop-nextest-binaries-python-api-gammaloop-integration-tests from https://cache.nix-ci.com
  18. 16.02 s Downloading cached gammaloop-python-module from https://cache.nix-ci.com
  19. 16.55 s Downloaded cached gammaloop-nextest-binaries-python-api-gammaloop-integration-tests (8.5 MiB) in 562ms
  20. 16.55 s Progress: 0 of 1 built, 1 of 4 downloaded from cache (1 downloading)
  21. 16.55 s Downloading cached gammaloop-nextest-binaries-python-api from https://cache.nix-ci.com
  22. 16.58 s Downloaded cached gammaloop-nextest-binaries-python-api (520 B) in 28ms
  23. 16.58 s Progress: 0 of 1 built, 2 of 4 downloaded from cache (1 downloading)
  24. 17.18 s Downloaded cached gammaloop-python-module (133.9 MiB) in 1.1s
  25. 17.18 s Progress: 0 of 1 built, 3 of 4 downloaded from cache
  26. 17.18 s Downloading cached nix-ci-check-gammaloop-nextest-python-api from https://cache.nix-ci.com
  27. 17.21 s Downloaded cached nix-ci-check-gammaloop-nextest-python-api (1104 B) in 28ms
  28. 17.21 s Progress: 0 of 1 built, 4 of 4 downloaded from cache
  29. 30.02 s evaluating derivation 'g copying '/nix/store/gi4f evaluating derivation 'g copying '/nix/store/gi4f evaluating derivation 'g copying '/nix/store/gi4f evaluating derivation 'g copying '/nix/store/gi4f evaluating derivation 'g copying '/nix/store/gi4f evaluating derivation 'g copying '/nix/store/gi4f evaluating derivation 'g copying '/nix/store/gi4f evaluating derivation 'g copying '/nix/store/gi4f evaluating derivation 'g copying '/nix/store/gi4f evaluating derivation 'g querying gammaloop-nexte [0.0 KiB DL] querying py [1.7 KiB DL] querying la [4.5 KiB DL] querying in [0/4 built, 3/0/8 copied [0/3 built, 2/1/8 copied [0/3 built, 2/3/8 copied [0/3 built, 2/4/8 copied [0/3 built, 1/5/8 copied [0/3 built, 1/6/8 copied [0/3 built, 1/7/8 copiedpython3> structuredAttrs is enabled
  30. 30.10 s [1/0/2 built, 8 copied (python3> created 227 symlinks in user environment
  31. 30.91 s python3 (post)> Uploading to the NixCI cache: /nix/store/3gi2x25n327sf3xma8b08jd57aqv69x5-python3-3.13.14-env
  32. 30.94 s python3 (post)> warning: 'warn-short-path-literals' is deprecated, use 'lint-short-path-literals = ignore' instead
  33. 31.04 s python3 (post)> copying 0 paths...
  34. 31.09 s python3 (post)> warning: 'warn-short-path-literals' is deprecated, use 'lint-short-path-literals = ignore' instead
  35. 31.27 s python3 (post)> copying 0 paths...
  36. 31.60 s [1/3 built, 8 copied (21 [1/1/2 built, 8 copied (gammaloop-nextest-python-api> Extracting 1 binary, 1 build script output directory, and 3 linked paths to /build/source
  37. 31.66 s gammaloop-nextest-python-api> Extracted 18 files to /build/source in 0.06s
  38. 31.67 s gammaloop-nextest-python-api> ------------
  39. 31.67 s gammaloop-nextest-python-api> Nextest run ID bf4a7ad7-4329-4022-bdbb-012181807175 with nextest profile: ci_gammaloop
  40. 31.67 s gammaloop-nextest-python-api> Starting 5 tests across 1 binary
  41. 31.79 s gammaloop-nextest-python-api> FAIL [ 0.119s] (2/5) gammaloop-integration-tests::test_python_api python_evaluate_samples_batch_and_momentum_space_have_expected_shape
  42. 31.79 s gammaloop-nextest-python-api> stdout ---
  43. 31.79 s gammaloop-nextest-python-api>
  44. 31.79 s gammaloop-nextest-python-api> running 1 test
  45. 31.79 s gammaloop-nextest-python-api> test python_evaluate_samples_batch_and_momentum_space_have_expected_shape ... FAILED
  46. 31.79 s gammaloop-nextest-python-api>
  47. 31.79 s gammaloop-nextest-python-api> failures:
  48. 31.79 s gammaloop-nextest-python-api>
  49. 31.79 s gammaloop-nextest-python-api> failures:
  50. 31.79 s gammaloop-nextest-python-api> python_evaluate_samples_batch_and_momentum_space_have_expected_shape
  51. 31.79 s gammaloop-nextest-python-api>
  52. 31.79 s gammaloop-nextest-python-api> test result: FAILED. 0 passed; 1 failed; 0 ignored; 0 measured; 4 filtered out; finished in 0.11s
  53. 31.79 s gammaloop-nextest-python-api>
  54. 31.79 s gammaloop-nextest-python-api> stderr ---
  55. 31.79 s gammaloop-nextest-python-api> Error: Python API test subprocess failed.
  56. 31.79 s gammaloop-nextest-python-api> stdout:
  57. 31.79 s gammaloop-nextest-python-api> ┌────────────────────────────────────────────────────────┐
  58. 31.79 s gammaloop-nextest-python-api> │ You are running a restricted Symbolica instance. │
  59. 31.79 s gammaloop-nextest-python-api> │ │
  60. 31.79 s gammaloop-nextest-python-api> │ This mode is only permitted for non-commercial use and │
  61. 31.79 s gammaloop-nextest-python-api> │ is limited to one instance and core per machine. │
  62. 31.79 s gammaloop-nextest-python-api> │ │
  63. 31.79 s gammaloop-nextest-python-api> │ Hobbyists can easily acquire a free license key │
  64. 31.79 s gammaloop-nextest-python-api> │ that unlocks all cores and removes this banner: │
  65. 31.79 s gammaloop-nextest-python-api> │ │
  66. 31.79 s gammaloop-nextest-python-api> │ from symbolica import * │
  67. 31.79 s gammaloop-nextest-python-api> │ request_hobbyist_license('YOUR_NAME', 'YOUR_EMAIL') │
  68. 31.79 s gammaloop-nextest-python-api> │ │
  69. 31.79 s gammaloop-nextest-python-api> │ All other users can obtain a free 30-day trial key: │
  70. 31.79 s gammaloop-nextest-python-api> │ │
  71. 31.79 s gammaloop-nextest-python-api> │ from symbolica import * │
  72. 31.79 s gammaloop-nextest-python-api> │ request_trial_license('NAME', 'EMAIL', 'EMPLOYER') │
  73. 31.79 s gammaloop-nextest-python-api> │ │
  74. 31.79 s gammaloop-nextest-python-api> │ See https://symbolica.io/docs/get_started.html#license │
  75. 31.79 s gammaloop-nextest-python-api> └────────────────────────────────────────────────────────┘
  76. 31.79 s gammaloop-nextest-python-api> ┌───────────────────────────────────────────────────────────────────────────────────────────────────────────┐
  77. 31.79 s gammaloop-nextest-python-api> │ Cannot start new unlicensed Symbolica instance since there is already another one running on the machine. │
  78. 31.79 s gammaloop-nextest-python-api> └───────────────────────────────────────────────────────────────────────────────────────────────────────────┘
  79. 31.79 s gammaloop-nextest-python-api>
  80. 31.79 s gammaloop-nextest-python-api> stderr:
  81. 31.79 s gammaloop-nextest-python-api> ┌───────────────────────────────────┐
  82. 31.79 s gammaloop-nextest-python-api> │ The Symbolica license has expired │
  83. 31.79 s gammaloop-nextest-python-api> └───────────────────────────────────┘
  84. 31.79 s gammaloop-nextest-python-api>
  85. 31.79 s gammaloop-nextest-python-api>
  86. 31.79 s gammaloop-nextest-python-api> Location:
  87. 31.79 s gammaloop-nextest-python-api> tests/tests/test_python_api.rs:156:20
  88. 31.79 s gammaloop-nextest-python-api>
  89. 31.79 s gammaloop-nextest-python-api> FAIL [ 0.119s] (3/5) gammaloop-integration-tests::test_python_api python_evaluate_sample_honors_generate_events_and_observable_snapshots
  90. 31.79 s gammaloop-nextest-python-api> stdout ---
  91. 31.79 s gammaloop-nextest-python-api>
  92. 31.79 s gammaloop-nextest-python-api> running 1 test
  93. 31.79 s gammaloop-nextest-python-api> test python_evaluate_sample_honors_generate_events_and_observable_snapshots ... FAILED
  94. 31.79 s gammaloop-nextest-python-api>
  95. 31.79 s gammaloop-nextest-python-api> failures:
  96. 31.79 s gammaloop-nextest-python-api>
  97. 31.79 s gammaloop-nextest-python-api> failures:
  98. 31.79 s gammaloop-nextest-python-api> python_evaluate_sample_honors_generate_events_and_observable_snapshots
  99. 31.79 s gammaloop-nextest-python-api>
  100. 31.79 s gammaloop-nextest-python-api> test result: FAILED. 0 passed; 1 failed; 0 ignored; 0 measured; 4 filtered out; finished in 0.11s
  101. 31.79 s gammaloop-nextest-python-api>
  102. 31.79 s gammaloop-nextest-python-api> stderr ---
  103. 31.79 s gammaloop-nextest-python-api> Error: Python API test subprocess failed.
  104. 31.79 s gammaloop-nextest-python-api> stdout:
  105. 31.79 s gammaloop-nextest-python-api> ┌────────────────────────────────────────────────────────┐
  106. 31.79 s gammaloop-nextest-python-api> │ You are running a restricted Symbolica instance. │
  107. 31.79 s gammaloop-nextest-python-api> │ │
  108. 31.79 s gammaloop-nextest-python-api> │ This mode is only permitted for non-commercial use and │
  109. 31.79 s gammaloop-nextest-python-api> │ is limited to one instance and core per machine. │
  110. 31.79 s gammaloop-nextest-python-api> │ │
  111. 31.79 s gammaloop-nextest-python-api> │ Hobbyists can easily acquire a free license key │
  112. 31.79 s gammaloop-nextest-python-api> │ that unlocks all cores and removes this banner: │
  113. 31.79 s gammaloop-nextest-python-api> │ │
  114. 31.79 s gammaloop-nextest-python-api> │ from symbolica import * │
  115. 31.79 s gammaloop-nextest-python-api> │ request_hobbyist_license('YOUR_NAME', 'YOUR_EMAIL') │
  116. 31.79 s gammaloop-nextest-python-api> │ │
  117. 31.79 s gammaloop-nextest-python-api> │ All other users can obtain a free 30-day trial key: │
  118. 31.79 s gammaloop-nextest-python-api> │ │
  119. 31.79 s gammaloop-nextest-python-api> │ from symbolica import * │
  120. 31.79 s gammaloop-nextest-python-api> │ request_trial_license('NAME', 'EMAIL', 'EMPLOYER') │
  121. 31.79 s gammaloop-nextest-python-api> │ │
  122. 31.79 s gammaloop-nextest-python-api> │ See https://symbolica.io/docs/get_started.html#license │
  123. 31.79 s gammaloop-nextest-python-api> └────────────────────────────────────────────────────────┘
  124. 31.79 s gammaloop-nextest-python-api> ┌───────────────────────────────────────────────────────────────────────────────────────────────────────────┐
  125. 31.79 s gammaloop-nextest-python-api> │ Cannot start new unlicensed Symbolica instance since there is already another one running on the machine. │
  126. 31.79 s gammaloop-nextest-python-api> └───────────────────────────────────────────────────────────────────────────────────────────────────────────┘
  127. 31.79 s gammaloop-nextest-python-api>
  128. 31.79 s gammaloop-nextest-python-api> stderr:
  129. 31.79 s gammaloop-nextest-python-api> ┌───────────────────────────────────┐
  130. 31.79 s gammaloop-nextest-python-api> │ The Symbolica license has expired │
  131. 31.79 s gammaloop-nextest-python-api> └───────────────────────────────────┘
  132. 31.79 s gammaloop-nextest-python-api>
  133. 31.79 s gammaloop-nextest-python-api>
  134. 31.79 s gammaloop-nextest-python-api> Location:
  135. 31.79 s gammaloop-nextest-python-api> tests/tests/test_python_api.rs:156:20
  136. 31.79 s gammaloop-nextest-python-api>
  137. 31.80 s gammaloop-nextest-python-api> FAIL [ 0.129s] (4/5) gammaloop-integration-tests::test_python_api python_evaluate_sample_preserves_graph_grouping_and_incoming_pdgs
  138. 31.80 s gammaloop-nextest-python-api> stdout ---
  139. 31.80 s gammaloop-nextest-python-api>
  140. 31.80 s gammaloop-nextest-python-api> running 1 test
  141. 31.80 s gammaloop-nextest-python-api> test python_evaluate_sample_preserves_graph_grouping_and_incoming_pdgs ... FAILED
  142. 31.80 s gammaloop-nextest-python-api>
  143. 31.80 s gammaloop-nextest-python-api> failures:
  144. 31.80 s gammaloop-nextest-python-api>
  145. 31.80 s gammaloop-nextest-python-api> failures:
  146. 31.80 s gammaloop-nextest-python-api> python_evaluate_sample_preserves_graph_grouping_and_incoming_pdgs
  147. 31.80 s gammaloop-nextest-python-api>
  148. 31.80 s gammaloop-nextest-python-api> test result: FAILED. 0 passed; 1 failed; 0 ignored; 0 measured; 4 filtered out; finished in 0.12s
  149. 31.80 s gammaloop-nextest-python-api>
  150. 31.80 s gammaloop-nextest-python-api> stderr ---
  151. 31.80 s gammaloop-nextest-python-api> Error: Python API test subprocess failed.
  152. 31.80 s gammaloop-nextest-python-api> stdout:
  153. 31.80 s gammaloop-nextest-python-api> ┌────────────────────────────────────────────────────────┐
  154. 31.80 s gammaloop-nextest-python-api> │ You are running a restricted Symbolica instance. │
  155. 31.80 s gammaloop-nextest-python-api> │ │
  156. 31.80 s gammaloop-nextest-python-api> │ This mode is only permitted for non-commercial use and │
  157. 31.80 s gammaloop-nextest-python-api> │ is limited to one instance and core per machine. │
  158. 31.80 s gammaloop-nextest-python-api> │ │
  159. 31.80 s gammaloop-nextest-python-api> │ Hobbyists can easily acquire a free license key │
  160. 31.80 s gammaloop-nextest-python-api> │ that unlocks all cores and removes this banner: │
  161. 31.80 s gammaloop-nextest-python-api> │ │
  162. 31.80 s gammaloop-nextest-python-api> │ from symbolica import * │
  163. 31.80 s gammaloop-nextest-python-api> │ request_hobbyist_license('YOUR_NAME', 'YOUR_EMAIL') │
  164. 31.80 s gammaloop-nextest-python-api> │ │
  165. 31.80 s gammaloop-nextest-python-api> │ All other users can obtain a free 30-day trial key: │
  166. 31.80 s gammaloop-nextest-python-api> │ │
  167. 31.80 s gammaloop-nextest-python-api> │ from symbolica import * │
  168. 31.80 s gammaloop-nextest-python-api> │ request_trial_license('NAME', 'EMAIL', 'EMPLOYER') │
  169. 31.80 s gammaloop-nextest-python-api> │ │
  170. 31.80 s gammaloop-nextest-python-api> │ See https://symbolica.io/docs/get_started.html#license │
  171. 31.80 s gammaloop-nextest-python-api> └────────────────────────────────────────────────────────┘
  172. 31.80 s gammaloop-nextest-python-api> ┌───────────────────────────────────────────────────────────────────────────────────────────────────────────┐
  173. 31.80 s gammaloop-nextest-python-api> │ Cannot start new unlicensed Symbolica instance since there is already another one running on the machine. │
  174. 31.80 s gammaloop-nextest-python-api> └───────────────────────────────────────────────────────────────────────────────────────────────────────────┘
  175. 31.80 s gammaloop-nextest-python-api>
  176. 31.80 s gammaloop-nextest-python-api> stderr:
  177. 31.80 s gammaloop-nextest-python-api> ┌───────────────────────────────────┐
  178. 31.80 s gammaloop-nextest-python-api> │ The Symbolica license has expired │
  179. 31.80 s gammaloop-nextest-python-api> └───────────────────────────────────┘
  180. 31.80 s gammaloop-nextest-python-api>
  181. 31.80 s gammaloop-nextest-python-api>
  182. 31.80 s gammaloop-nextest-python-api> Location:
  183. 31.80 s gammaloop-nextest-python-api> tests/tests/test_python_api.rs:156:20
  184. 31.80 s gammaloop-nextest-python-api>
  185. 31.87 s gammaloop-nextest-python-api> ------------
  186. 31.87 s gammaloop-nextest-python-api> Summary [ 0.200s] 5 tests run: 2 passed, 3 failed, 0 skipped
  187. 31.87 s gammaloop-nextest-python-api> FAIL [ 0.119s] (2/5) gammaloop-integration-tests::test_python_api python_evaluate_samples_batch_and_momentum_space_have_expected_shape
  188. 31.87 s gammaloop-nextest-python-api> stdout ---
  189. 31.87 s gammaloop-nextest-python-api>
  190. 31.87 s gammaloop-nextest-python-api> running 1 test
  191. 31.87 s gammaloop-nextest-python-api> test python_evaluate_samples_batch_and_momentum_space_have_expected_shape ... FAILED
  192. 31.87 s gammaloop-nextest-python-api>
  193. 31.87 s gammaloop-nextest-python-api> failures:
  194. 31.87 s gammaloop-nextest-python-api>
  195. 31.87 s gammaloop-nextest-python-api> failures:
  196. 31.87 s gammaloop-nextest-python-api> python_evaluate_samples_batch_and_momentum_space_have_expected_shape
  197. 31.87 s gammaloop-nextest-python-api>
  198. 31.87 s gammaloop-nextest-python-api> test result: FAILED. 0 passed; 1 failed; 0 ignored; 0 measured; 4 filtered out; finished in 0.11s
  199. 31.87 s gammaloop-nextest-python-api>
  200. 31.87 s gammaloop-nextest-python-api> stderr ---
  201. 31.87 s gammaloop-nextest-python-api> Error: Python API test subprocess failed.
  202. 31.87 s gammaloop-nextest-python-api> stdout:
  203. 31.87 s gammaloop-nextest-python-api> ┌────────────────────────────────────────────────────────┐
  204. 31.87 s gammaloop-nextest-python-api> │ You are running a restricted Symbolica instance. │
  205. 31.87 s gammaloop-nextest-python-api> │ │
  206. 31.87 s gammaloop-nextest-python-api> │ This mode is only permitted for non-commercial use and │
  207. 31.87 s gammaloop-nextest-python-api> │ is limited to one instance and core per machine. │
  208. 31.87 s gammaloop-nextest-python-api> │ │
  209. 31.87 s gammaloop-nextest-python-api> │ Hobbyists can easily acquire a free license key │
  210. 31.87 s gammaloop-nextest-python-api> │ that unlocks all cores and removes this banner: │
  211. 31.87 s gammaloop-nextest-python-api> │ │
  212. 31.87 s gammaloop-nextest-python-api> │ from symbolica import * │
  213. 31.87 s gammaloop-nextest-python-api> │ request_hobbyist_license('YOUR_NAME', 'YOUR_EMAIL') │
  214. 31.87 s gammaloop-nextest-python-api> │ │
  215. 31.87 s gammaloop-nextest-python-api> │ All other users can obtain a free 30-day trial key: │
  216. 31.87 s gammaloop-nextest-python-api> │ │
  217. 31.87 s gammaloop-nextest-python-api> │ from symbolica import * │
  218. 31.87 s gammaloop-nextest-python-api> │ request_trial_license('NAME', 'EMAIL', 'EMPLOYER') │
  219. 31.87 s gammaloop-nextest-python-api> │ │
  220. 31.87 s gammaloop-nextest-python-api> │ See https://symbolica.io/docs/get_started.html#license │
  221. 31.87 s gammaloop-nextest-python-api> └────────────────────────────────────────────────────────┘
  222. 31.87 s gammaloop-nextest-python-api> ┌───────────────────────────────────────────────────────────────────────────────────────────────────────────┐
  223. 31.87 s gammaloop-nextest-python-api> │ Cannot start new unlicensed Symbolica instance since there is already another one running on the machine. │
  224. 31.87 s gammaloop-nextest-python-api> └───────────────────────────────────────────────────────────────────────────────────────────────────────────┘
  225. 31.87 s gammaloop-nextest-python-api>
  226. 31.87 s gammaloop-nextest-python-api> stderr:
  227. 31.87 s gammaloop-nextest-python-api> ┌───────────────────────────────────┐
  228. 31.87 s gammaloop-nextest-python-api> │ The Symbolica license has expired │
  229. 31.87 s gammaloop-nextest-python-api> └───────────────────────────────────┘
  230. 31.87 s gammaloop-nextest-python-api>
  231. 31.87 s gammaloop-nextest-python-api>
  232. 31.87 s gammaloop-nextest-python-api> Location:
  233. 31.87 s gammaloop-nextest-python-api> tests/tests/test_python_api.rs:156:20
  234. 31.87 s gammaloop-nextest-python-api>
  235. 31.87 s gammaloop-nextest-python-api> FAIL [ 0.119s] (3/5) gammaloop-integration-tests::test_python_api python_evaluate_sample_honors_generate_events_and_observable_snapshots
  236. 31.87 s gammaloop-nextest-python-api> stdout ---
  237. 31.87 s gammaloop-nextest-python-api>
  238. 31.87 s gammaloop-nextest-python-api> running 1 test
  239. 31.87 s gammaloop-nextest-python-api> test python_evaluate_sample_honors_generate_events_and_observable_snapshots ... FAILED
  240. 31.87 s gammaloop-nextest-python-api>
  241. 31.87 s gammaloop-nextest-python-api> failures:
  242. 31.87 s gammaloop-nextest-python-api>
  243. 31.87 s gammaloop-nextest-python-api> failures:
  244. 31.87 s gammaloop-nextest-python-api> python_evaluate_sample_honors_generate_events_and_observable_snapshots
  245. 31.87 s gammaloop-nextest-python-api>
  246. 31.87 s gammaloop-nextest-python-api> test result: FAILED. 0 passed; 1 failed; 0 ignored; 0 measured; 4 filtered out; finished in 0.11s
  247. 31.87 s gammaloop-nextest-python-api>
  248. 31.87 s gammaloop-nextest-python-api> stderr ---
  249. 31.87 s gammaloop-nextest-python-api> Error: Python API test subprocess failed.
  250. 31.87 s gammaloop-nextest-python-api> stdout:
  251. 31.87 s gammaloop-nextest-python-api> ┌────────────────────────────────────────────────────────┐
  252. 31.87 s gammaloop-nextest-python-api> │ You are running a restricted Symbolica instance. │
  253. 31.87 s gammaloop-nextest-python-api> │ │
  254. 31.87 s gammaloop-nextest-python-api> │ This mode is only permitted for non-commercial use and │
  255. 31.87 s gammaloop-nextest-python-api> │ is limited to one instance and core per machine. │
  256. 31.87 s gammaloop-nextest-python-api> │ │
  257. 31.87 s gammaloop-nextest-python-api> │ Hobbyists can easily acquire a free license key │
  258. 31.87 s gammaloop-nextest-python-api> │ that unlocks all cores and removes this banner: │
  259. 31.87 s gammaloop-nextest-python-api> │ │
  260. 31.87 s gammaloop-nextest-python-api> │ from symbolica import * │
  261. 31.87 s gammaloop-nextest-python-api> │ request_hobbyist_license('YOUR_NAME', 'YOUR_EMAIL') │
  262. 31.87 s gammaloop-nextest-python-api> │ │
  263. 31.87 s gammaloop-nextest-python-api> │ All other users can obtain a free 30-day trial key: │
  264. 31.87 s gammaloop-nextest-python-api> │ │
  265. 31.87 s gammaloop-nextest-python-api> │ from symbolica import * │
  266. 31.87 s gammaloop-nextest-python-api> │ request_trial_license('NAME', 'EMAIL', 'EMPLOYER') │
  267. 31.87 s gammaloop-nextest-python-api> │ │
  268. 31.87 s gammaloop-nextest-python-api> │ See https://symbolica.io/docs/get_started.html#license │
  269. 31.87 s gammaloop-nextest-python-api> └────────────────────────────────────────────────────────┘
  270. 31.87 s gammaloop-nextest-python-api> ┌───────────────────────────────────────────────────────────────────────────────────────────────────────────┐
  271. 31.87 s gammaloop-nextest-python-api> │ Cannot start new unlicensed Symbolica instance since there is already another one running on the machine. │
  272. 31.87 s gammaloop-nextest-python-api> └───────────────────────────────────────────────────────────────────────────────────────────────────────────┘
  273. 31.87 s gammaloop-nextest-python-api>
  274. 31.87 s gammaloop-nextest-python-api> stderr:
  275. 31.87 s gammaloop-nextest-python-api> ┌───────────────────────────────────┐
  276. 31.87 s gammaloop-nextest-python-api> │ The Symbolica license has expired │
  277. 31.87 s gammaloop-nextest-python-api> └───────────────────────────────────┘
  278. 31.87 s gammaloop-nextest-python-api>
  279. 31.87 s gammaloop-nextest-python-api>
  280. 31.87 s gammaloop-nextest-python-api> Location:
  281. 31.87 s gammaloop-nextest-python-api> tests/tests/test_python_api.rs:156:20
  282. 31.87 s gammaloop-nextest-python-api>
  283. 31.87 s gammaloop-nextest-python-api> FAIL [ 0.129s] (4/5) gammaloop-integration-tests::test_python_api python_evaluate_sample_preserves_graph_grouping_and_incoming_pdgs
  284. 31.87 s gammaloop-nextest-python-api> stdout ---
  285. 31.87 s gammaloop-nextest-python-api>
  286. 31.87 s gammaloop-nextest-python-api> running 1 test
  287. 31.87 s gammaloop-nextest-python-api> test python_evaluate_sample_preserves_graph_grouping_and_incoming_pdgs ... FAILED
  288. 31.87 s gammaloop-nextest-python-api>
  289. 31.87 s gammaloop-nextest-python-api> failures:
  290. 31.87 s gammaloop-nextest-python-api>
  291. 31.87 s gammaloop-nextest-python-api> failures:
  292. 31.87 s gammaloop-nextest-python-api> python_evaluate_sample_preserves_graph_grouping_and_incoming_pdgs
  293. 31.87 s gammaloop-nextest-python-api>
  294. 31.87 s gammaloop-nextest-python-api> test result: FAILED. 0 passed; 1 failed; 0 ignored; 0 measured; 4 filtered out; finished in 0.12s
  295. 31.87 s gammaloop-nextest-python-api>
  296. 31.87 s gammaloop-nextest-python-api> stderr ---
  297. 31.87 s gammaloop-nextest-python-api> Error: Python API test subprocess failed.
  298. 31.87 s gammaloop-nextest-python-api> stdout:
  299. 31.87 s gammaloop-nextest-python-api> ┌────────────────────────────────────────────────────────┐
  300. 31.87 s gammaloop-nextest-python-api> │ You are running a restricted Symbolica instance. │
  301. 31.87 s gammaloop-nextest-python-api> │ │
  302. 31.87 s gammaloop-nextest-python-api> │ This mode is only permitted for non-commercial use and │
  303. 31.87 s gammaloop-nextest-python-api> │ is limited to one instance and core per machine. │
  304. 31.87 s gammaloop-nextest-python-api> │ │
  305. 31.87 s gammaloop-nextest-python-api> │ Hobbyists can easily acquire a free license key │
  306. 31.87 s gammaloop-nextest-python-api> │ that unlocks all cores and removes this banner: │
  307. 31.87 s gammaloop-nextest-python-api> │ │
  308. 31.87 s gammaloop-nextest-python-api> │ from symbolica import * │
  309. 31.87 s gammaloop-nextest-python-api> │ request_hobbyist_license('YOUR_NAME', 'YOUR_EMAIL') │
  310. 31.87 s gammaloop-nextest-python-api> │ │
  311. 31.87 s gammaloop-nextest-python-api> │ All other users can obtain a free 30-day trial key: │
  312. 31.87 s gammaloop-nextest-python-api> │ │
  313. 31.87 s gammaloop-nextest-python-api> │ from symbolica import * │
  314. 31.87 s gammaloop-nextest-python-api> │ request_trial_license('NAME', 'EMAIL', 'EMPLOYER') │
  315. 31.87 s gammaloop-nextest-python-api> │ │
  316. 31.87 s gammaloop-nextest-python-api> │ See https://symbolica.io/docs/get_started.html#license │
  317. 31.87 s gammaloop-nextest-python-api> └────────────────────────────────────────────────────────┘
  318. 31.87 s gammaloop-nextest-python-api> ┌───────────────────────────────────────────────────────────────────────────────────────────────────────────┐
  319. 31.87 s gammaloop-nextest-python-api> │ Cannot start new unlicensed Symbolica instance since there is already another one running on the machine. │
  320. 31.87 s gammaloop-nextest-python-api> └───────────────────────────────────────────────────────────────────────────────────────────────────────────┘
  321. 31.87 s gammaloop-nextest-python-api>
  322. 31.87 s gammaloop-nextest-python-api> stderr:
  323. 31.87 s gammaloop-nextest-python-api> ┌───────────────────────────────────┐
  324. 31.87 s gammaloop-nextest-python-api> │ The Symbolica license has expired │
  325. 31.87 s gammaloop-nextest-python-api> └───────────────────────────────────┘
  326. 31.87 s gammaloop-nextest-python-api>
  327. 31.87 s gammaloop-nextest-python-api>
  328. 31.87 s gammaloop-nextest-python-api> Location:
  329. 31.87 s gammaloop-nextest-python-api> tests/tests/test_python_api.rs:156:20
  330. 31.87 s gammaloop-nextest-python-api>
  331. 31.87 s gammaloop-nextest-python-api> error: test run failed
  332. 31.90 s gammaloop-nextest-python-api>
  333. 31.90 s gammaloop-nextest-python-api> ========== nextest test summary ==========
  334. 31.90 s gammaloop-nextest-python-api> report: target/nextest/ci_gammaloop/junit.xml
  335. 31.90 s gammaloop-nextest-python-api> tests: 5, failures: 3, errors: 0
  336. 31.90 s gammaloop-nextest-python-api>
  337. 31.90 s gammaloop-nextest-python-api> 1. gammaloop-integration-tests::test_python_api::python_evaluate_samples_batch_and_momentum_space_have_expected_shape
  338. 31.90 s gammaloop-nextest-python-api> failure: test failure with exit code 101
  339. 31.90 s gammaloop-nextest-python-api> Error: Python API test subprocess failed.
  340. 31.90 s gammaloop-nextest-python-api> stdout:
  341. 31.90 s gammaloop-nextest-python-api> ┌────────────────────────────────────────────────────────┐
  342. 31.90 s gammaloop-nextest-python-api> │ You are running a restricted Symbolica instance. │
  343. 31.90 s gammaloop-nextest-python-api> │ │
  344. 31.90 s gammaloop-nextest-python-api> │ This mode is only permitted for non-commercial use and │
  345. 31.90 s gammaloop-nextest-python-api> │ is limited to one instance and core per machine. │
  346. 31.90 s gammaloop-nextest-python-api> │ │
  347. 31.90 s gammaloop-nextest-python-api> │ Hobbyists can easily acquire a free license key │
  348. 31.90 s gammaloop-nextest-python-api> │ that unlocks all cores and removes this banner: │
  349. 31.90 s gammaloop-nextest-python-api> │ │
  350. 31.90 s gammaloop-nextest-python-api> │ from symbolica import * │
  351. 31.90 s gammaloop-nextest-python-api> │ request_hobbyist_license('YOUR_NAME', 'YOUR_EMAIL') │
  352. 31.90 s gammaloop-nextest-python-api> │ │
  353. 31.90 s gammaloop-nextest-python-api> │ All other users can obtain a free 30-day trial key: │
  354. 31.90 s gammaloop-nextest-python-api> │ │
  355. 31.90 s gammaloop-nextest-python-api> │ from symbolica import * │
  356. 31.90 s gammaloop-nextest-python-api> │ request_trial_license('NAME', 'EMAIL', 'EMPLOYER') │
  357. 31.90 s gammaloop-nextest-python-api> │ │
  358. 31.90 s gammaloop-nextest-python-api> │ See https://symbolica.io/docs/get_started.html#license │
  359. 31.90 s gammaloop-nextest-python-api> └────────────────────────────────────────────────────────┘
  360. 31.90 s gammaloop-nextest-python-api> ┌───────────────────────────────────────────────────────────────────────────────────────────────────────────┐
  361. 31.90 s gammaloop-nextest-python-api> │ Cannot start new unlicensed Symbolica instance since there is already another one running on the machine. │
  362. 31.90 s gammaloop-nextest-python-api> └───────────────────────────────────────────────────────────────────────────────────────────────────────────┘
  363. 31.90 s gammaloop-nextest-python-api>
  364. 31.90 s gammaloop-nextest-python-api> stderr:
  365. 31.90 s gammaloop-nextest-python-api> ┌───────────────────────────────────┐
  366. 31.90 s gammaloop-nextest-python-api> │ The Symbolica license has expired │
  367. 31.90 s gammaloop-nextest-python-api> └───────────────────────────────────┘
  368. 31.90 s gammaloop-nextest-python-api>
  369. 31.90 s gammaloop-nextest-python-api>
  370. 31.90 s gammaloop-nextest-python-api> Location:
  371. 31.90 s gammaloop-nextest-python-api> tests/tests/test_python_api.rs:156:20
  372. 31.90 s gammaloop-nextest-python-api> system-out
  373. 31.90 s gammaloop-nextest-python-api> running 1 test
  374. 31.90 s gammaloop-nextest-python-api> test python_evaluate_samples_batch_and_momentum_space_have_expected_shape ... FAILED
  375. 31.90 s gammaloop-nextest-python-api>
  376. 31.90 s gammaloop-nextest-python-api> failures:
  377. 31.90 s gammaloop-nextest-python-api>
  378. 31.90 s gammaloop-nextest-python-api> failures:
  379. 31.90 s gammaloop-nextest-python-api> python_evaluate_samples_batch_and_momentum_space_have_expected_shape
  380. 31.90 s gammaloop-nextest-python-api>
  381. 31.90 s gammaloop-nextest-python-api> test result: FAILED. 0 passed; 1 failed; 0 ignored; 0 measured; 4 filtered out; finished in 0.11s
  382. 31.90 s gammaloop-nextest-python-api> system-err
  383. 31.90 s gammaloop-nextest-python-api> Error: Python API test subprocess failed.
  384. 31.90 s gammaloop-nextest-python-api> stdout:
  385. 31.90 s gammaloop-nextest-python-api> ┌────────────────────────────────────────────────────────┐
  386. 31.90 s gammaloop-nextest-python-api> │ You are running a restricted Symbolica instance. │
  387. 31.90 s gammaloop-nextest-python-api> │ │
  388. 31.90 s gammaloop-nextest-python-api> │ This mode is only permitted for non-commercial use and │
  389. 31.90 s gammaloop-nextest-python-api> │ is limited to one instance and core per machine. │
  390. 31.90 s gammaloop-nextest-python-api> │ │
  391. 31.90 s gammaloop-nextest-python-api> │ Hobbyists can easily acquire a free license key │
  392. 31.90 s gammaloop-nextest-python-api> │ that unlocks all cores and removes this banner: │
  393. 31.90 s gammaloop-nextest-python-api> │ │
  394. 31.90 s gammaloop-nextest-python-api> │ from symbolica import * │
  395. 31.91 s gammaloop-nextest-python-api> │ request_hobbyist_license('YOUR_NAME', 'YOUR_EMAIL') │
  396. 31.91 s gammaloop-nextest-python-api> │ │
  397. 31.91 s gammaloop-nextest-python-api> │ All other users can obtain a free 30-day trial key: │
  398. 31.91 s gammaloop-nextest-python-api> │ │
  399. 31.91 s gammaloop-nextest-python-api> │ from symbolica import * │
  400. 31.91 s gammaloop-nextest-python-api> │ request_trial_license('NAME', 'EMAIL', 'EMPLOYER') │
  401. 31.91 s gammaloop-nextest-python-api> │ │
  402. 31.91 s gammaloop-nextest-python-api> │ See https://symbolica.io/docs/get_started.html#license │
  403. 31.91 s gammaloop-nextest-python-api> └────────────────────────────────────────────────────────┘
  404. 31.91 s gammaloop-nextest-python-api> ┌───────────────────────────────────────────────────────────────────────────────────────────────────────────┐
  405. 31.91 s gammaloop-nextest-python-api> │ Cannot start new unlicensed Symbolica instance since there is already another one running on the machine. │
  406. 31.91 s gammaloop-nextest-python-api> └───────────────────────────────────────────────────────────────────────────────────────────────────────────┘
  407. 31.91 s gammaloop-nextest-python-api>
  408. 31.91 s gammaloop-nextest-python-api> stderr:
  409. 31.91 s gammaloop-nextest-python-api> ┌───────────────────────────────────┐
  410. 31.91 s gammaloop-nextest-python-api> │ The Symbolica license has expired │
  411. 31.91 s gammaloop-nextest-python-api> └───────────────────────────────────┘
  412. 31.91 s gammaloop-nextest-python-api>
  413. 31.91 s gammaloop-nextest-python-api>
  414. 31.91 s gammaloop-nextest-python-api> Location:
  415. 31.91 s gammaloop-nextest-python-api> tests/tests/test_python_api.rs:156:20
  416. 31.91 s gammaloop-nextest-python-api>
  417. 31.91 s gammaloop-nextest-python-api> 2. gammaloop-integration-tests::test_python_api::python_evaluate_sample_honors_generate_events_and_observable_snapshots
  418. 31.91 s gammaloop-nextest-python-api> failure: test failure with exit code 101
  419. 31.91 s gammaloop-nextest-python-api> Error: Python API test subprocess failed.
  420. 31.91 s gammaloop-nextest-python-api> stdout:
  421. 31.91 s gammaloop-nextest-python-api> ┌────────────────────────────────────────────────────────┐
  422. 31.91 s gammaloop-nextest-python-api> │ You are running a restricted Symbolica instance. │
  423. 31.91 s gammaloop-nextest-python-api> │ │
  424. 31.91 s gammaloop-nextest-python-api> │ This mode is only permitted for non-commercial use and │
  425. 31.91 s gammaloop-nextest-python-api> │ is limited to one instance and core per machine. │
  426. 31.91 s gammaloop-nextest-python-api> │ │
  427. 31.91 s gammaloop-nextest-python-api> │ Hobbyists can easily acquire a free license key │
  428. 31.91 s gammaloop-nextest-python-api> │ that unlocks all cores and removes this banner: │
  429. 31.91 s gammaloop-nextest-python-api> │ │
  430. 31.91 s gammaloop-nextest-python-api> │ from symbolica import * │
  431. 31.91 s gammaloop-nextest-python-api> │ request_hobbyist_license('YOUR_NAME', 'YOUR_EMAIL') │
  432. 31.91 s gammaloop-nextest-python-api> │ │
  433. 31.91 s gammaloop-nextest-python-api> │ All other users can obtain a free 30-day trial key: │
  434. 31.91 s gammaloop-nextest-python-api> │ │
  435. 31.91 s gammaloop-nextest-python-api> │ from symbolica import * │
  436. 31.91 s gammaloop-nextest-python-api> │ request_trial_license('NAME', 'EMAIL', 'EMPLOYER') │
  437. 31.91 s gammaloop-nextest-python-api> │ │
  438. 31.91 s gammaloop-nextest-python-api> │ See https://symbolica.io/docs/get_started.html#license │
  439. 31.91 s gammaloop-nextest-python-api> └────────────────────────────────────────────────────────┘
  440. 31.91 s gammaloop-nextest-python-api> ┌───────────────────────────────────────────────────────────────────────────────────────────────────────────┐
  441. 31.91 s gammaloop-nextest-python-api> │ Cannot start new unlicensed Symbolica instance since there is already another one running on the machine. │
  442. 31.91 s gammaloop-nextest-python-api> └───────────────────────────────────────────────────────────────────────────────────────────────────────────┘
  443. 31.91 s gammaloop-nextest-python-api>
  444. 31.91 s gammaloop-nextest-python-api> stderr:
  445. 31.91 s gammaloop-nextest-python-api> ┌───────────────────────────────────┐
  446. 31.91 s gammaloop-nextest-python-api> │ The Symbolica license has expired │
  447. 31.91 s gammaloop-nextest-python-api> └───────────────────────────────────┘
  448. 31.91 s gammaloop-nextest-python-api>
  449. 31.91 s gammaloop-nextest-python-api>
  450. 31.91 s gammaloop-nextest-python-api> Location:
  451. 31.91 s gammaloop-nextest-python-api> tests/tests/test_python_api.rs:156:20
  452. 31.91 s gammaloop-nextest-python-api> system-out
  453. 31.91 s gammaloop-nextest-python-api> running 1 test
  454. 31.91 s gammaloop-nextest-python-api> test python_evaluate_sample_honors_generate_events_and_observable_snapshots ... FAILED
  455. 31.91 s gammaloop-nextest-python-api>
  456. 31.91 s gammaloop-nextest-python-api> failures:
  457. 31.91 s gammaloop-nextest-python-api>
  458. 31.91 s gammaloop-nextest-python-api> failures:
  459. 31.91 s gammaloop-nextest-python-api> python_evaluate_sample_honors_generate_events_and_observable_snapshots
  460. 31.91 s gammaloop-nextest-python-api>
  461. 31.91 s gammaloop-nextest-python-api> test result: FAILED. 0 passed; 1 failed; 0 ignored; 0 measured; 4 filtered out; finished in 0.11s
  462. 31.91 s gammaloop-nextest-python-api> system-err
  463. 31.91 s gammaloop-nextest-python-api> Error: Python API test subprocess failed.
  464. 31.91 s gammaloop-nextest-python-api> stdout:
  465. 31.91 s gammaloop-nextest-python-api> ┌────────────────────────────────────────────────────────┐
  466. 31.91 s gammaloop-nextest-python-api> │ You are running a restricted Symbolica instance. │
  467. 31.91 s gammaloop-nextest-python-api> │ │
  468. 31.91 s gammaloop-nextest-python-api> │ This mode is only permitted for non-commercial use and │
  469. 31.91 s gammaloop-nextest-python-api> │ is limited to one instance and core per machine. │
  470. 31.91 s gammaloop-nextest-python-api> │ │
  471. 31.91 s gammaloop-nextest-python-api> │ Hobbyists can easily acquire a free license key │
  472. 31.91 s gammaloop-nextest-python-api> │ that unlocks all cores and removes this banner: │
  473. 31.91 s gammaloop-nextest-python-api> │ │
  474. 31.91 s gammaloop-nextest-python-api> │ from symbolica import * │
  475. 31.91 s gammaloop-nextest-python-api> │ request_hobbyist_license('YOUR_NAME', 'YOUR_EMAIL') │
  476. 31.91 s gammaloop-nextest-python-api> │ │
  477. 31.91 s gammaloop-nextest-python-api> │ All other users can obtain a free 30-day trial key: │
  478. 31.91 s gammaloop-nextest-python-api> │ │
  479. 31.91 s gammaloop-nextest-python-api> │ from symbolica import * │
  480. 31.91 s gammaloop-nextest-python-api> │ request_trial_license('NAME', 'EMAIL', 'EMPLOYER') │
  481. 31.91 s gammaloop-nextest-python-api> │ │
  482. 31.91 s gammaloop-nextest-python-api> │ See https://symbolica.io/docs/get_started.html#license │
  483. 31.91 s gammaloop-nextest-python-api> └────────────────────────────────────────────────────────┘
  484. 31.91 s gammaloop-nextest-python-api> ┌───────────────────────────────────────────────────────────────────────────────────────────────────────────┐
  485. 31.91 s gammaloop-nextest-python-api> │ Cannot start new unlicensed Symbolica instance since there is already another one running on the machine. │
  486. 31.91 s gammaloop-nextest-python-api> └───────────────────────────────────────────────────────────────────────────────────────────────────────────┘
  487. 31.91 s gammaloop-nextest-python-api>
  488. 31.91 s gammaloop-nextest-python-api> stderr:
  489. 31.91 s gammaloop-nextest-python-api> ┌───────────────────────────────────┐
  490. 31.91 s gammaloop-nextest-python-api> │ The Symbolica license has expired │
  491. 31.91 s gammaloop-nextest-python-api> └───────────────────────────────────┘
  492. 31.91 s gammaloop-nextest-python-api>
  493. 31.91 s gammaloop-nextest-python-api>
  494. 31.91 s gammaloop-nextest-python-api> Location:
  495. 31.91 s gammaloop-nextest-python-api> tests/tests/test_python_api.rs:156:20
  496. 31.91 s gammaloop-nextest-python-api>
  497. 31.91 s gammaloop-nextest-python-api> 3. gammaloop-integration-tests::test_python_api::python_evaluate_sample_preserves_graph_grouping_and_incoming_pdgs
  498. 31.91 s gammaloop-nextest-python-api> failure: test failure with exit code 101
  499. 31.91 s gammaloop-nextest-python-api> Error: Python API test subprocess failed.
  500. 31.91 s gammaloop-nextest-python-api> stdout:
  501. 31.91 s gammaloop-nextest-python-api> ┌────────────────────────────────────────────────────────┐
  502. 31.91 s gammaloop-nextest-python-api> │ You are running a restricted Symbolica instance. │
  503. 31.91 s gammaloop-nextest-python-api> │ │
  504. 31.91 s gammaloop-nextest-python-api> │ This mode is only permitted for non-commercial use and │
  505. 31.91 s gammaloop-nextest-python-api> │ is limited to one instance and core per machine. │
  506. 31.91 s gammaloop-nextest-python-api> │ │
  507. 31.91 s gammaloop-nextest-python-api> │ Hobbyists can easily acquire a free license key │
  508. 31.91 s gammaloop-nextest-python-api> │ that unlocks all cores and removes this banner: │
  509. 31.91 s gammaloop-nextest-python-api> │ │
  510. 31.91 s gammaloop-nextest-python-api> │ from symbolica import * │
  511. 31.91 s gammaloop-nextest-python-api> │ request_hobbyist_license('YOUR_NAME', 'YOUR_EMAIL') │
  512. 31.91 s gammaloop-nextest-python-api> │ │
  513. 31.91 s gammaloop-nextest-python-api> │ All other users can obtain a free 30-day trial key: │
  514. 31.91 s gammaloop-nextest-python-api> │ │
  515. 31.91 s gammaloop-nextest-python-api> │ from symbolica import * │
  516. 31.91 s gammaloop-nextest-python-api> │ request_trial_license('NAME', 'EMAIL', 'EMPLOYER') │
  517. 31.91 s gammaloop-nextest-python-api> │ │
  518. 31.91 s gammaloop-nextest-python-api> │ See https://symbolica.io/docs/get_started.html#license │
  519. 31.91 s gammaloop-nextest-python-api> └────────────────────────────────────────────────────────┘
  520. 31.91 s gammaloop-nextest-python-api> ┌───────────────────────────────────────────────────────────────────────────────────────────────────────────┐
  521. 31.91 s gammaloop-nextest-python-api> │ Cannot start new unlicensed Symbolica instance since there is already another one running on the machine. │
  522. 31.91 s gammaloop-nextest-python-api> └───────────────────────────────────────────────────────────────────────────────────────────────────────────┘
  523. 31.91 s gammaloop-nextest-python-api>
  524. 31.91 s gammaloop-nextest-python-api> stderr:
  525. 31.91 s gammaloop-nextest-python-api> ┌───────────────────────────────────┐
  526. 31.91 s gammaloop-nextest-python-api> │ The Symbolica license has expired │
  527. 31.91 s gammaloop-nextest-python-api> └───────────────────────────────────┘
  528. 31.91 s gammaloop-nextest-python-api>
  529. 31.91 s gammaloop-nextest-python-api>
  530. 31.91 s gammaloop-nextest-python-api> Location:
  531. 31.91 s gammaloop-nextest-python-api> tests/tests/test_python_api.rs:156:20
  532. 31.91 s gammaloop-nextest-python-api> system-out
  533. 31.91 s gammaloop-nextest-python-api> running 1 test
  534. 31.91 s gammaloop-nextest-python-api> test python_evaluate_sample_preserves_graph_grouping_and_incoming_pdgs ... FAILED
  535. 31.91 s gammaloop-nextest-python-api>
  536. 31.91 s gammaloop-nextest-python-api> failures:
  537. 31.91 s gammaloop-nextest-python-api>
  538. 31.91 s gammaloop-nextest-python-api> failures:
  539. 31.91 s gammaloop-nextest-python-api> python_evaluate_sample_preserves_graph_grouping_and_incoming_pdgs
  540. 31.91 s gammaloop-nextest-python-api>
  541. 31.91 s gammaloop-nextest-python-api> test result: FAILED. 0 passed; 1 failed; 0 ignored; 0 measured; 4 filtered out; finished in 0.12s
  542. 31.91 s gammaloop-nextest-python-api> system-err
  543. 31.91 s gammaloop-nextest-python-api> Error: Python API test subprocess failed.
  544. 31.91 s gammaloop-nextest-python-api> stdout:
  545. 31.91 s gammaloop-nextest-python-api> ┌────────────────────────────────────────────────────────┐
  546. 31.91 s gammaloop-nextest-python-api> │ You are running a restricted Symbolica instance. │
  547. 31.91 s gammaloop-nextest-python-api> │ │
  548. 31.91 s gammaloop-nextest-python-api> │ This mode is only permitted for non-commercial use and │
  549. 31.91 s gammaloop-nextest-python-api> │ is limited to one instance and core per machine. │
  550. 31.91 s gammaloop-nextest-python-api> │ │
  551. 31.91 s gammaloop-nextest-python-api> │ Hobbyists can easily acquire a free license key │
  552. 31.91 s gammaloop-nextest-python-api> │ that unlocks all cores and removes this banner: │
  553. 31.91 s gammaloop-nextest-python-api> │ │
  554. 31.91 s gammaloop-nextest-python-api> │ from symbolica import * │
  555. 31.91 s gammaloop-nextest-python-api> │ request_hobbyist_license('YOUR_NAME', 'YOUR_EMAIL') │
  556. 31.91 s gammaloop-nextest-python-api> │ │
  557. 31.91 s gammaloop-nextest-python-api> │ All other users can obtain a free 30-day trial key: │
  558. 31.91 s gammaloop-nextest-python-api> │ │
  559. 31.91 s gammaloop-nextest-python-api> │ from symbolica import * │
  560. 31.91 s gammaloop-nextest-python-api> │ request_trial_license('NAME', 'EMAIL', 'EMPLOYER') │
  561. 31.91 s gammaloop-nextest-python-api> │ │
  562. 31.91 s gammaloop-nextest-python-api> │ See https://symbolica.io/docs/get_started.html#license │
  563. 31.91 s gammaloop-nextest-python-api> └────────────────────────────────────────────────────────┘
  564. 31.91 s gammaloop-nextest-python-api> ┌───────────────────────────────────────────────────────────────────────────────────────────────────────────┐
  565. 31.91 s gammaloop-nextest-python-api> │ Cannot start new unlicensed Symbolica instance since there is already another one running on the machine. │
  566. 31.91 s gammaloop-nextest-python-api> └───────────────────────────────────────────────────────────────────────────────────────────────────────────┘
  567. 31.91 s gammaloop-nextest-python-api>
  568. 31.91 s gammaloop-nextest-python-api> stderr:
  569. 31.91 s gammaloop-nextest-python-api> ┌───────────────────────────────────┐
  570. 31.91 s gammaloop-nextest-python-api> │ The Symbolica license has expired │
  571. 31.91 s gammaloop-nextest-python-api> └───────────────────────────────────┘
  572. 31.91 s gammaloop-nextest-python-api>
  573. 31.91 s gammaloop-nextest-python-api>
  574. 31.91 s gammaloop-nextest-python-api> Location:
  575. 31.91 s gammaloop-nextest-python-api> tests/tests/test_python_api.rs:156:20
  576. 31.91 s gammaloop-nextest-python-api> =========================================
  577. 31.97 s error: Cannot build '/nix/store/4kzj98b1f7qqfwnhzqhxbvk8wv98rki0-gammaloop-nextest-python-api.drv'.
  578. 31.97 s Reason: builder failed with exit code 100.
  579. 31.97 s Output paths:
  580. 31.97 s /nix/store/zfhrsd28wys0w08nx237s3nizrjwhwhz-gammaloop-nextest-python-api
  581. 31.97 s Last 541 log lines:
  582. 31.97 s > Extracting 1 binary, 1 build script output directory, and 3 linked paths to /build/source
  583. 31.97 s > Extracted 18 files to /build/source in 0.06s
  584. 31.97 s > ------------
  585. 31.97 s > Nextest run ID bf4a7ad7-4329-4022-bdbb-012181807175 with nextest profile: ci_gammaloop
  586. 31.97 s > Starting 5 tests across 1 binary
  587. 31.97 s > FAIL [ 0.119s] (2/5) gammaloop-integration-tests::test_python_api python_evaluate_samples_batch_and_momentum_space_have_expected_shape
  588. 31.97 s > stdout ---
  589. 31.97 s >
  590. 31.97 s > running 1 test
  591. 31.97 s > test python_evaluate_samples_batch_and_momentum_space_have_expected_shape ... FAILED
  592. 31.97 s >
  593. 31.97 s > failures:
  594. 31.97 s >
  595. 31.97 s > failures:
  596. 31.97 s > python_evaluate_samples_batch_and_momentum_space_have_expected_shape
  597. 31.97 s >
  598. 31.97 s > test result: FAILED. 0 passed; 1 failed; 0 ignored; 0 measured; 4 filtered out; finished in 0.11s
  599. 31.97 s >
  600. 31.97 s > stderr ---
  601. 31.97 s > Error: Python API test subprocess failed.
  602. 31.97 s > stdout:
  603. 31.97 s > ┌────────────────────────────────────────────────────────┐
  604. 31.97 s > │ You are running a restricted Symbolica instance. │
  605. 31.97 s > │ │
  606. 31.97 s > │ This mode is only permitted for non-commercial use and │
  607. 31.97 s > │ is limited to one instance and core per machine. │
  608. 31.97 s > │ │
  609. 31.97 s > │ Hobbyists can easily acquire a free license key │
  610. 31.97 s > │ that unlocks all cores and removes this banner: │
  611. 31.97 s > │ │
  612. 31.97 s > │ from symbolica import * │
  613. 31.97 s > │ request_hobbyist_license('YOUR_NAME', 'YOUR_EMAIL') │
  614. 31.97 s > │ │
  615. 31.97 s > │ All other users can obtain a free 30-day trial key: │
  616. 31.97 s > │ │
  617. 31.97 s > │ from symbolica import * │
  618. 31.97 s > │ request_trial_license('NAME', 'EMAIL', 'EMPLOYER') │
  619. 31.97 s > │ │
  620. 31.97 s > │ See https://symbolica.io/docs/get_started.html#license │
  621. 31.97 s > └────────────────────────────────────────────────────────┘
  622. 31.97 s > ┌───────────────────────────────────────────────────────────────────────────────────────────────────────────┐
  623. 31.97 s > │ Cannot start new unlicensed Symbolica instance since there is already another one running on the machine. │
  624. 31.97 s > └───────────────────────────────────────────────────────────────────────────────────────────────────────────┘
  625. 31.97 s >
  626. 31.97 s > stderr:
  627. 31.97 s > ┌───────────────────────────────────┐
  628. 31.97 s > │ The Symbolica license has expired │
  629. 31.97 s > └───────────────────────────────────┘
  630. 31.97 s >
  631. 31.97 s >
  632. 31.97 s > Location:
  633. 31.97 s > tests/tests/test_python_api.rs:156:20
  634. 31.97 s >
  635. 31.97 s > FAIL [ 0.119s] (3/5) gammaloop-integration-tests::test_python_api python_evaluate_sample_honors_generate_events_and_observable_snapshots
  636. 31.97 s > stdout ---
  637. 31.97 s >
  638. 31.97 s > running 1 test
  639. 31.97 s > test python_evaluate_sample_honors_generate_events_and_observable_snapshots ... FAILED
  640. 31.97 s >
  641. 31.97 s > failures:
  642. 31.97 s >
  643. 31.97 s > failures:
  644. 31.97 s > python_evaluate_sample_honors_generate_events_and_observable_snapshots
  645. 31.97 s >
  646. 31.97 s > test result: FAILED. 0 passed; 1 failed; 0 ignored; 0 measured; 4 filtered out; finished in 0.11s
  647. 31.97 s >
  648. 31.97 s > stderr ---
  649. 31.97 s > Error: Python API test subprocess failed.
  650. 31.97 s > stdout:
  651. 31.97 s > ┌────────────────────────────────────────────────────────┐
  652. 31.97 s > │ You are running a restricted Symbolica instance. │
  653. 31.97 s > │ │
  654. 31.97 s > │ This mode is only permitted for non-commercial use and │
  655. 31.97 s > │ is limited to one instance and core per machine. │
  656. 31.97 s > │ │
  657. 31.97 s > │ Hobbyists can easily acquire a free license key │
  658. 31.97 s > │ that unlocks all cores and removes this banner: │
  659. 31.97 s > │ │
  660. 31.97 s > │ from symbolica import * │
  661. 31.97 s > │ request_hobbyist_license('YOUR_NAME', 'YOUR_EMAIL') │
  662. 31.97 s > │ │
  663. 31.97 s > │ All other users can obtain a free 30-day trial key: │
  664. 31.97 s > │ │
  665. 31.97 s > │ from symbolica import * │
  666. 31.97 s > │ request_trial_license('NAME', 'EMAIL', 'EMPLOYER') │
  667. 31.97 s > │ │
  668. 31.97 s > │ See https://symbolica.io/docs/get_started.html#license │
  669. 31.97 s > └────────────────────────────────────────────────────────┘
  670. 31.97 s > ┌───────────────────────────────────────────────────────────────────────────────────────────────────────────┐
  671. 31.97 s > │ Cannot start new unlicensed Symbolica instance since there is already another one running on the machine. │
  672. 31.97 s > └───────────────────────────────────────────────────────────────────────────────────────────────────────────┘
  673. 31.97 s >
  674. 31.97 s > stderr:
  675. 31.97 s > ┌───────────────────────────────────┐
  676. 31.97 s > │ The Symbolica license has expired │
  677. 31.97 s > └───────────────────────────────────┘
  678. 31.97 s >
  679. 31.97 s >
  680. 31.97 s > Location:
  681. 31.97 s > tests/tests/test_python_api.rs:156:20
  682. 31.97 s >
  683. 31.97 s > FAIL [ 0.129s] (4/5) gammaloop-integration-tests::test_python_api python_evaluate_sample_preserves_graph_grouping_and_incoming_pdgs
  684. 31.97 s > stdout ---
  685. 31.97 s >
  686. 31.97 s > running 1 test
  687. 31.97 s > test python_evaluate_sample_preserves_graph_grouping_and_incoming_pdgs ... FAILED
  688. 31.97 s >
  689. 31.97 s > failures:
  690. 31.97 s >
  691. 31.97 s > failures:
  692. 31.97 s > python_evaluate_sample_preserves_graph_grouping_and_incoming_pdgs
  693. 31.97 s >
  694. 31.97 s > test result: FAILED. 0 passed; 1 failed; 0 ignored; 0 measured; 4 filtered out; finished in 0.12s
  695. 31.97 s >
  696. 31.97 s > stderr ---
  697. 31.97 s > Error: Python API test subprocess failed.
  698. 31.97 s > stdout:
  699. 31.97 s > ┌────────────────────────────────────────────────────────┐
  700. 31.97 s > │ You are running a restricted Symbolica instance. │
  701. 31.97 s > │ │
  702. 31.97 s > │ This mode is only permitted for non-commercial use and │
  703. 31.97 s > │ is limited to one instance and core per machine. │
  704. 31.97 s > │ │
  705. 31.97 s > │ Hobbyists can easily acquire a free license key │
  706. 31.97 s > │ that unlocks all cores and removes this banner: │
  707. 31.97 s > │ │
  708. 31.97 s > │ from symbolica import * │
  709. 31.97 s > │ request_hobbyist_license('YOUR_NAME', 'YOUR_EMAIL') │
  710. 31.97 s > │ │
  711. 31.97 s > │ All other users can obtain a free 30-day trial key: │
  712. 31.97 s > │ │
  713. 31.97 s > │ from symbolica import * │
  714. 31.97 s > │ request_trial_license('NAME', 'EMAIL', 'EMPLOYER') │
  715. 31.97 s > │ │
  716. 31.97 s > │ See https://symbolica.io/docs/get_started.html#license │
  717. 31.97 s > └────────────────────────────────────────────────────────┘
  718. 31.97 s > ┌───────────────────────────────────────────────────────────────────────────────────────────────────────────┐
  719. 31.97 s > │ Cannot start new unlicensed Symbolica instance since there is already another one running on the machine. │
  720. 31.97 s > └───────────────────────────────────────────────────────────────────────────────────────────────────────────┘
  721. 31.97 s >
  722. 31.97 s > stderr:
  723. 31.97 s > ┌───────────────────────────────────┐
  724. 31.97 s > │ The Symbolica license has expired │
  725. 31.97 s > └───────────────────────────────────┘
  726. 31.97 s >
  727. 31.97 s >
  728. 31.97 s > Location:
  729. 31.97 s > tests/tests/test_python_api.rs:156:20
  730. 31.97 s >
  731. 31.97 s > ------------
  732. 31.97 s > Summary [ 0.200s] 5 tests run: 2 passed, 3 failed, 0 skipped
  733. 31.97 s > FAIL [ 0.119s] (2/5) gammaloop-integration-tests::test_python_api python_evaluate_samples_batch_and_momentum_space_have_expected_shape
  734. 31.97 s > stdout ---
  735. 31.97 s >
  736. 31.97 s > running 1 test
  737. 31.97 s > test python_evaluate_samples_batch_and_momentum_space_have_expected_shape ... FAILED
  738. 31.97 s >
  739. 31.97 s > failures:
  740. 31.97 s >
  741. 31.97 s > failures:
  742. 31.97 s > python_evaluate_samples_batch_and_momentum_space_have_expected_shape
  743. 31.97 s >
  744. 31.97 s > test result: FAILED. 0 passed; 1 failed; 0 ignored; 0 measured; 4 filtered out; finished in 0.11s
  745. 31.97 s >
  746. 31.97 s > stderr ---
  747. 31.97 s > Error: Python API test subprocess failed.
  748. 31.97 s > stdout:
  749. 31.97 s > ┌────────────────────────────────────────────────────────┐
  750. 31.97 s > │ You are running a restricted Symbolica instance. │
  751. 31.97 s > │ │
  752. 31.97 s > │ This mode is only permitted for non-commercial use and │
  753. 31.97 s > │ is limited to one instance and core per machine. │
  754. 31.97 s > │ │
  755. 31.97 s > │ Hobbyists can easily acquire a free license key │
  756. 31.97 s > │ that unlocks all cores and removes this banner: │
  757. 31.97 s > │ │
  758. 31.97 s > │ from symbolica import * │
  759. 31.97 s > │ request_hobbyist_license('YOUR_NAME', 'YOUR_EMAIL') │
  760. 31.97 s > │ │
  761. 31.97 s > │ All other users can obtain a free 30-day trial key: │
  762. 31.97 s > │ │
  763. 31.97 s > │ from symbolica import * │
  764. 31.97 s > │ request_trial_license('NAME', 'EMAIL', 'EMPLOYER') │
  765. 31.97 s > │ │
  766. 31.97 s > │ See https://symbolica.io/docs/get_started.html#license │
  767. 31.97 s > └────────────────────────────────────────────────────────┘
  768. 31.97 s > ┌───────────────────────────────────────────────────────────────────────────────────────────────────────────┐
  769. 31.97 s > │ Cannot start new unlicensed Symbolica instance since there is already another one running on the machine. │
  770. 31.97 s > └───────────────────────────────────────────────────────────────────────────────────────────────────────────┘
  771. 31.97 s >
  772. 31.97 s > stderr:
  773. 31.97 s > ┌───────────────────────────────────┐
  774. 31.97 s > │ The Symbolica license has expired │
  775. 31.97 s > └───────────────────────────────────┘
  776. 31.97 s >
  777. 31.97 s >
  778. 31.97 s > Location:
  779. 31.97 s > tests/tests/test_python_api.rs:156:20
  780. 31.97 s >
  781. 31.97 s > FAIL [ 0.119s] (3/5) gammaloop-integration-tests::test_python_api python_evaluate_sample_honors_generate_events_and_observable_snapshots
  782. 31.97 s > stdout ---
  783. 31.97 s >
  784. 31.97 s > running 1 test
  785. 31.97 s > test python_evaluate_sample_honors_generate_events_and_observable_snapshots ... FAILED
  786. 31.97 s >
  787. 31.97 s > failures:
  788. 31.97 s >
  789. 31.97 s > failures:
  790. 31.97 s > python_evaluate_sample_honors_generate_events_and_observable_snapshots
  791. 31.97 s >
  792. 31.97 s > test result: FAILED. 0 passed; 1 failed; 0 ignored; 0 measured; 4 filtered out; finished in 0.11s
  793. 31.97 s >
  794. 31.97 s > stderr ---
  795. 31.97 s > Error: Python API test subprocess failed.
  796. 31.97 s > stdout:
  797. 31.97 s > ┌────────────────────────────────────────────────────────┐
  798. 31.97 s > │ You are running a restricted Symbolica instance. │
  799. 31.97 s > │ │
  800. 31.97 s > │ This mode is only permitted for non-commercial use and │
  801. 31.97 s > │ is limited to one instance and core per machine. │
  802. 31.97 s > │ │
  803. 31.97 s > │ Hobbyists can easily acquire a free license key │
  804. 31.97 s > │ that unlocks all cores and removes this banner: │
  805. 31.97 s > │ │
  806. 31.97 s > │ from symbolica import * │
  807. 31.97 s > │ request_hobbyist_license('YOUR_NAME', 'YOUR_EMAIL') │
  808. 31.97 s > │ │
  809. 31.97 s > │ All other users can obtain a free 30-day trial key: │
  810. 31.97 s > │ │
  811. 31.97 s > │ from symbolica import * │
  812. 31.97 s > │ request_trial_license('NAME', 'EMAIL', 'EMPLOYER') │
  813. 31.97 s > │ │
  814. 31.97 s > │ See https://symbolica.io/docs/get_started.html#license │
  815. 31.97 s > └────────────────────────────────────────────────────────┘
  816. 31.97 s > ┌───────────────────────────────────────────────────────────────────────────────────────────────────────────┐
  817. 31.97 s > │ Cannot start new unlicensed Symbolica instance since there is already another one running on the machine. │
  818. 31.97 s > └───────────────────────────────────────────────────────────────────────────────────────────────────────────┘
  819. 31.97 s >
  820. 31.97 s > stderr:
  821. 31.97 s > ┌───────────────────────────────────┐
  822. 31.97 s > │ The Symbolica license has expired │
  823. 31.97 s > └───────────────────────────────────┘
  824. 31.97 s >
  825. 31.97 s >
  826. 31.97 s > Location:
  827. 31.97 s > tests/tests/test_python_api.rs:156:20
  828. 31.97 s >
  829. 31.97 s > FAIL [ 0.129s] (4/5) gammaloop-integration-tests::test_python_api python_evaluate_sample_preserves_graph_grouping_and_incoming_pdgs
  830. 31.97 s > stdout ---
  831. 31.97 s >
  832. 31.97 s > running 1 test
  833. 31.97 s > test python_evaluate_sample_preserves_graph_grouping_and_incoming_pdgs ... FAILED
  834. 31.97 s >
  835. 31.97 s > failures:
  836. 31.97 s >
  837. 31.97 s > failures:
  838. 31.97 s > python_evaluate_sample_preserves_graph_grouping_and_incoming_pdgs
  839. 31.97 s >
  840. 31.97 s > test result: FAILED. 0 passed; 1 failed; 0 ignored; 0 measured; 4 filtered out; finished in 0.12s
  841. 31.97 s >
  842. 31.97 s > stderr ---
  843. 31.97 s > Error: Python API test subprocess failed.
  844. 31.97 s > stdout:
  845. 31.97 s > ┌────────────────────────────────────────────────────────┐
  846. 31.97 s > │ You are running a restricted Symbolica instance. │
  847. 31.97 s > │ │
  848. 31.97 s > │ This mode is only permitted for non-commercial use and │
  849. 31.97 s > │ is limited to one instance and core per machine. │
  850. 31.97 s > │ │
  851. 31.97 s > │ Hobbyists can easily acquire a free license key │
  852. 31.97 s > │ that unlocks all cores and removes this banner: │
  853. 31.97 s > │ │
  854. 31.97 s > │ from symbolica import * │
  855. 31.97 s > │ request_hobbyist_license('YOUR_NAME', 'YOUR_EMAIL') │
  856. 31.97 s > │ │
  857. 31.97 s > │ All other users can obtain a free 30-day trial key: │
  858. 31.97 s > │ │
  859. 31.97 s > │ from symbolica import * │
  860. 31.97 s > │ request_trial_license('NAME', 'EMAIL', 'EMPLOYER') │
  861. 31.97 s > │ │
  862. 31.97 s > │ See https://symbolica.io/docs/get_started.html#license │
  863. 31.97 s > └────────────────────────────────────────────────────────┘
  864. 31.97 s > ┌───────────────────────────────────────────────────────────────────────────────────────────────────────────┐
  865. 31.97 s > │ Cannot start new unlicensed Symbolica instance since there is already another one running on the machine. │
  866. 31.97 s > └───────────────────────────────────────────────────────────────────────────────────────────────────────────┘
  867. 31.97 s >
  868. 31.97 s > stderr:
  869. 31.97 s > ┌───────────────────────────────────┐
  870. 31.97 s > │ The Symbolica license has expired │
  871. 31.97 s > └───────────────────────────────────┘
  872. 31.97 s >
  873. 31.97 s >
  874. 31.97 s > Location:
  875. 31.97 s > tests/tests/test_python_api.rs:156:20
  876. 31.97 s >
  877. 31.97 s > error: test run failed
  878. 31.97 s >
  879. 31.97 s > ========== nextest test summary ==========
  880. 31.97 s > report: target/nextest/ci_gammaloop/junit.xml
  881. 31.97 s > tests: 5, failures: 3, errors: 0
  882. 31.97 s >
  883. 31.97 s > 1. gammaloop-integration-tests::test_python_api::python_evaluate_samples_batch_and_momentum_space_have_expected_shape
  884. 31.97 s > failure: test failure with exit code 101
  885. 31.97 s > Error: Python API test subprocess failed.
  886. 31.97 s > stdout:
  887. 31.97 s > ┌────────────────────────────────────────────────────────┐
  888. 31.97 s > │ You are running a restricted Symbolica instance. │
  889. 31.97 s > │ │
  890. 31.97 s > │ This mode is only permitted for non-commercial use and │
  891. 31.97 s > │ is limited to one instance and core per machine. │
  892. 31.97 s > │ │
  893. 31.97 s > │ Hobbyists can easily acquire a free license key │
  894. 31.97 s > │ that unlocks all cores and removes this banner: │
  895. 31.97 s > │ │
  896. 31.97 s > │ from symbolica import * │
  897. 31.97 s > │ request_hobbyist_license('YOUR_NAME', 'YOUR_EMAIL') │
  898. 31.97 s > │ │
  899. 31.97 s > │ All other users can obtain a free 30-day trial key: │
  900. 31.97 s > │ │
  901. 31.97 s > │ from symbolica import * │
  902. 31.97 s > │ request_trial_license('NAME', 'EMAIL', 'EMPLOYER') │
  903. 31.97 s > │ │
  904. 31.97 s > │ See https://symbolica.io/docs/get_started.html#license │
  905. 31.97 s > └────────────────────────────────────────────────────────┘
  906. 31.97 s > ┌───────────────────────────────────────────────────────────────────────────────────────────────────────────┐
  907. 31.97 s > │ Cannot start new unlicensed Symbolica instance since there is already another one running on the machine. │
  908. 31.97 s > └───────────────────────────────────────────────────────────────────────────────────────────────────────────┘
  909. 31.97 s >
  910. 31.97 s > stderr:
  911. 31.97 s > ┌───────────────────────────────────┐
  912. 31.97 s > │ The Symbolica license has expired │
  913. 31.97 s > └───────────────────────────────────┘
  914. 31.97 s >
  915. 31.97 s >
  916. 31.97 s > Location:
  917. 31.97 s > tests/tests/test_python_api.rs:156:20
  918. 31.97 s > system-out
  919. 31.97 s > running 1 test
  920. 31.97 s > test python_evaluate_samples_batch_and_momentum_space_have_expected_shape ... FAILED
  921. 31.97 s >
  922. 31.97 s > failures:
  923. 31.97 s >
  924. 31.97 s > failures:
  925. 31.97 s > python_evaluate_samples_batch_and_momentum_space_have_expected_shape
  926. 31.97 s >
  927. 31.97 s > test result: FAILED. 0 passed; 1 failed; 0 ignored; 0 measured; 4 filtered out; finished in 0.11s
  928. 31.97 s > system-err
  929. 31.97 s > Error: Python API test subprocess failed.
  930. 31.97 s > stdout:
  931. 31.97 s > ┌────────────────────────────────────────────────────────┐
  932. 31.97 s > │ You are running a restricted Symbolica instance. │
  933. 31.97 s > │ │
  934. 31.97 s > │ This mode is only permitted for non-commercial use and │
  935. 31.97 s > │ is limited to one instance and core per machine. │
  936. 31.97 s > │ │
  937. 31.97 s > │ Hobbyists can easily acquire a free license key │
  938. 31.97 s > │ that unlocks all cores and removes this banner: │
  939. 31.97 s > │ │
  940. 31.97 s > │ from symbolica import * │
  941. 31.97 s > │ request_hobbyist_license('YOUR_NAME', 'YOUR_EMAIL') │
  942. 31.97 s > │ │
  943. 31.97 s > │ All other users can obtain a free 30-day trial key: │
  944. 31.97 s > │ │
  945. 31.97 s > │ from symbolica import * │
  946. 31.97 s > │ request_trial_license('NAME', 'EMAIL', 'EMPLOYER') │
  947. 31.97 s > │ │
  948. 31.97 s > │ See https://symbolica.io/docs/get_started.html#license │
  949. 31.97 s > └────────────────────────────────────────────────────────┘
  950. 31.97 s > ┌───────────────────────────────────────────────────────────────────────────────────────────────────────────┐
  951. 31.97 s > │ Cannot start new unlicensed Symbolica instance since there is already another one running on the machine. │
  952. 31.97 s > └───────────────────────────────────────────────────────────────────────────────────────────────────────────┘
  953. 31.97 s >
  954. 31.97 s > stderr:
  955. 31.97 s > ┌───────────────────────────────────┐
  956. 31.97 s > │ The Symbolica license has expired │
  957. 31.97 s > └───────────────────────────────────┘
  958. 31.97 s >
  959. 31.97 s >
  960. 31.97 s > Location:
  961. 31.97 s > tests/tests/test_python_api.rs:156:20
  962. 31.97 s >
  963. 31.97 s > 2. gammaloop-integration-tests::test_python_api::python_evaluate_sample_honors_generate_events_and_observable_snapshots
  964. 31.97 s > failure: test failure with exit code 101
  965. 31.97 s > Error: Python API test subprocess failed.
  966. 31.97 s > stdout:
  967. 31.97 s > ┌────────────────────────────────────────────────────────┐
  968. 31.97 s > │ You are running a restricted Symbolica instance. │
  969. 31.97 s > │ │
  970. 31.97 s > │ This mode is only permitted for non-commercial use and │
  971. 31.97 s > │ is limited to one instance and core per machine. │
  972. 31.97 s > │ │
  973. 31.97 s > │ Hobbyists can easily acquire a free license key │
  974. 31.97 s > │ that unlocks all cores and removes this banner: │
  975. 31.97 s > │ │
  976. 31.97 s > │ from symbolica import * │
  977. 31.97 s > │ request_hobbyist_license('YOUR_NAME', 'YOUR_EMAIL') │
  978. 31.97 s > │ │
  979. 31.97 s > │ All other users can obtain a free 30-day trial key: │
  980. 31.97 s > │ │
  981. 31.97 s > │ from symbolica import * │
  982. 31.97 s > │ request_trial_license('NAME', 'EMAIL', 'EMPLOYER') │
  983. 31.97 s > │ │
  984. 31.97 s > │ See https://symbolica.io/docs/get_started.html#license │
  985. 31.97 s > └────────────────────────────────────────────────────────┘
  986. 31.97 s > ┌───────────────────────────────────────────────────────────────────────────────────────────────────────────┐
  987. 31.97 s > │ Cannot start new unlicensed Symbolica instance since there is already another one running on the machine. │
  988. 31.97 s > └───────────────────────────────────────────────────────────────────────────────────────────────────────────┘
  989. 31.97 s >
  990. 31.97 s > stderr:
  991. 31.97 s > ┌───────────────────────────────────┐
  992. 31.97 s > │ The Symbolica license has expired │
  993. 31.97 s > └───────────────────────────────────┘
  994. 31.97 s >
  995. 31.97 s >
  996. 31.97 s > Location:
  997. 31.97 s > tests/tests/test_python_api.rs:156:20
  998. 31.97 s > system-out
  999. 31.97 s > running 1 test
  1000. 31.97 s > test python_evaluate_sample_honors_generate_events_and_observable_snapshots ... FAILED
  1001. 31.97 s >
  1002. 31.97 s > failures:
  1003. 31.97 s >
  1004. 31.97 s > failures:
  1005. 31.97 s > python_evaluate_sample_honors_generate_events_and_observable_snapshots
  1006. 31.97 s >
  1007. 31.97 s > test result: FAILED. 0 passed; 1 failed; 0 ignored; 0 measured; 4 filtered out; finished in 0.11s
  1008. 31.97 s > system-err
  1009. 31.97 s > Error: Python API test subprocess failed.
  1010. 31.97 s > stdout:
  1011. 31.97 s > ┌────────────────────────────────────────────────────────┐
  1012. 31.97 s > │ You are running a restricted Symbolica instance. │
  1013. 31.97 s > │ │
  1014. 31.97 s > │ This mode is only permitted for non-commercial use and │
  1015. 31.97 s > │ is limited to one instance and core per machine. │
  1016. 31.97 s > │ │
  1017. 31.97 s > │ Hobbyists can easily acquire a free license key │
  1018. 31.97 s > │ that unlocks all cores and removes this banner: │
  1019. 31.97 s > │ │
  1020. 31.97 s > │ from symbolica import * │
  1021. 31.97 s > │ request_hobbyist_license('YOUR_NAME', 'YOUR_EMAIL') │
  1022. 31.97 s > │ │
  1023. 31.97 s > │ All other users can obtain a free 30-day trial key: │
  1024. 31.97 s > │ │
  1025. 31.97 s > │ from symbolica import * │
  1026. 31.97 s > │ request_trial_license('NAME', 'EMAIL', 'EMPLOYER') │
  1027. 31.97 s > │ │
  1028. 31.97 s > │ See https://symbolica.io/docs/get_started.html#license │
  1029. 31.97 s > └────────────────────────────────────────────────────────┘
  1030. 31.97 s > ┌───────────────────────────────────────────────────────────────────────────────────────────────────────────┐
  1031. 31.97 s > │ Cannot start new unlicensed Symbolica instance since there is already another one running on the machine. │
  1032. 31.97 s > └───────────────────────────────────────────────────────────────────────────────────────────────────────────┘
  1033. 31.97 s >
  1034. 31.97 s > stderr:
  1035. 31.97 s > ┌───────────────────────────────────┐
  1036. 31.97 s > │ The Symbolica license has expired │
  1037. 31.97 s > └───────────────────────────────────┘
  1038. 31.97 s >
  1039. 31.97 s >
  1040. 31.97 s > Location:
  1041. 31.97 s > tests/tests/test_python_api.rs:156:20
  1042. 31.97 s >
  1043. 31.97 s > 3. gammaloop-integration-tests::test_python_api::python_evaluate_sample_preserves_graph_grouping_and_incoming_pdgs
  1044. 31.97 s > failure: test failure with exit code 101
  1045. 31.97 s > Error: Python API test subprocess failed.
  1046. 31.97 s > stdout:
  1047. 31.97 s > ┌────────────────────────────────────────────────────────┐
  1048. 31.97 s > │ You are running a restricted Symbolica instance. │
  1049. 31.97 s > │ │
  1050. 31.97 s > │ This mode is only permitted for non-commercial use and │
  1051. 31.97 s > │ is limited to one instance and core per machine. │
  1052. 31.97 s > │ │
  1053. 31.97 s > │ Hobbyists can easily acquire a free license key │
  1054. 31.97 s > │ that unlocks all cores and removes this banner: │
  1055. 31.97 s > │ │
  1056. 31.97 s > │ from symbolica import * │
  1057. 31.97 s > │ request_hobbyist_license('YOUR_NAME', 'YOUR_EMAIL') │
  1058. 31.97 s > │ │
  1059. 31.97 s > │ All other users can obtain a free 30-day trial key: │
  1060. 31.97 s > │ │
  1061. 31.97 s > │ from symbolica import * │
  1062. 31.97 s > │ request_trial_license('NAME', 'EMAIL', 'EMPLOYER') │
  1063. 31.97 s > │ │
  1064. 31.97 s > │ See https://symbolica.io/docs/get_started.html#license │
  1065. 31.97 s > └────────────────────────────────────────────────────────┘
  1066. 31.97 s > ┌───────────────────────────────────────────────────────────────────────────────────────────────────────────┐
  1067. 31.97 s > │ Cannot start new unlicensed Symbolica instance since there is already another one running on the machine. │
  1068. 31.97 s > └───────────────────────────────────────────────────────────────────────────────────────────────────────────┘
  1069. 31.97 s >
  1070. 31.97 s > stderr:
  1071. 31.97 s > ┌───────────────────────────────────┐
  1072. 31.97 s > │ The Symbolica license has expired │
  1073. 31.97 s > └───────────────────────────────────┘
  1074. 31.97 s >
  1075. 31.97 s >
  1076. 31.97 s > Location:
  1077. 31.97 s > tests/tests/test_python_api.rs:156:20
  1078. 31.97 s > system-out
  1079. 31.97 s > running 1 test
  1080. 31.97 s > test python_evaluate_sample_preserves_graph_grouping_and_incoming_pdgs ... FAILED
  1081. 31.97 s >
  1082. 31.97 s > failures:
  1083. 31.97 s >
  1084. 31.97 s > failures:
  1085. 31.97 s > python_evaluate_sample_preserves_graph_grouping_and_incoming_pdgs
  1086. 31.97 s >
  1087. 31.97 s > test result: FAILED. 0 passed; 1 failed; 0 ignored; 0 measured; 4 filtered out; finished in 0.12s
  1088. 31.97 s > system-err
  1089. 31.97 s > Error: Python API test subprocess failed.
  1090. 31.97 s > stdout:
  1091. 31.97 s > ┌────────────────────────────────────────────────────────┐
  1092. 31.97 s > │ You are running a restricted Symbolica instance. │
  1093. 31.97 s > │ │
  1094. 31.97 s > │ This mode is only permitted for non-commercial use and │
  1095. 31.97 s > │ is limited to one instance and core per machine. │
  1096. 31.97 s > │ │
  1097. 31.97 s > │ Hobbyists can easily acquire a free license key │
  1098. 31.97 s > │ that unlocks all cores and removes this banner: │
  1099. 31.97 s > │ │
  1100. 31.97 s > │ from symbolica import * │
  1101. 31.97 s > │ request_hobbyist_license('YOUR_NAME', 'YOUR_EMAIL') │
  1102. 31.97 s > │ │
  1103. 31.97 s > │ All other users can obtain a free 30-day trial key: │
  1104. 31.97 s > │ │
  1105. 31.97 s > │ from symbolica import * │
  1106. 31.97 s > │ request_trial_license('NAME', 'EMAIL', 'EMPLOYER') │
  1107. 31.97 s > │ │
  1108. 31.97 s > │ See https://symbolica.io/docs/get_started.html#license │
  1109. 31.97 s > └────────────────────────────────────────────────────────┘
  1110. 31.97 s > ┌───────────────────────────────────────────────────────────────────────────────────────────────────────────┐
  1111. 31.97 s > │ Cannot start new unlicensed Symbolica instance since there is already another one running on the machine. │
  1112. 31.97 s > └───────────────────────────────────────────────────────────────────────────────────────────────────────────┘
  1113. 31.97 s >
  1114. 31.97 s > stderr:
  1115. 31.97 s > ┌───────────────────────────────────┐
  1116. 31.97 s > │ The Symbolica license has expired │
  1117. 31.97 s > └───────────────────────────────────┘
  1118. 31.97 s >
  1119. 31.97 s >
  1120. 31.97 s > Location:
  1121. 31.97 s > tests/tests/test_python_api.rs:156:20
  1122. 31.97 s > =========================================
  1123. 31.97 s For full logs, run:
  1124. 31.97 s nix log /nix/store/4kzj98b1f7qqfwnhzqhxbvk8wv98rki0-gammaloop-nextest-python-api.drv
  1125. 32.08 s [1 built (1 failed), 8 cRun failed.