test packages.x86_64-linux.nix-ci-check-gammaloop-nextest-integration

Reproduce this run
Original Run
  1. 200.44 s gammaloop-nextest-integration> | dod2_bubble | rls.integrated | GL0 | pass | 0.0sigma | compatible within 2sigma | - |
  2. 200.44 s gammaloop-nextest-integration> +-------------+-----------------+---------+--------+----------+-----------------------------------------------------------------------------------------------------------------------+-------+
  3. 200.44 s gammaloop-nextest-integration> | dod2_bubble | mu_r.inspect | inspect | pass | - | best inspect relative delta 6.951e-1 >= 1000*accuracy 1.000e-7 (accuracy=1.000e-10, exponent=+0.0, seed=0, probes=10) | - |
  4. 200.44 s gammaloop-nextest-integration> +-------------+-----------------+---------+--------+----------+-----------------------------------------------------------------------------------------------------------------------+-------+
  5. 200.44 s gammaloop-nextest-integration> | dod2_bubble | target | - | pass | - | 2sigma | - |
  6. 200.44 s gammaloop-nextest-integration> +-------------+-----------------+---------+--------+----------+-----------------------------------------------------------------------------------------------------------------------+-------+
  7. 200.44 s gammaloop-nextest-integration> test dod2_bubble_uv ... FAILED
  8. 200.44 s gammaloop-nextest-integration>
  9. 200.44 s gammaloop-nextest-integration> failures:
  10. 200.44 s gammaloop-nextest-integration>
  11. 200.44 s gammaloop-nextest-integration> failures:
  12. 200.44 s gammaloop-nextest-integration> dod2_bubble_uv
  13. 200.44 s gammaloop-nextest-integration>
  14. 200.44 s gammaloop-nextest-integration> test result: FAILED. 0 passed; 1 failed; 0 ignored; 0 measured; 24 filtered out; finished in 84.95s
  15. 200.44 s gammaloop-nextest-integration> system-err
  16. 200.44 s gammaloop-nextest-integration> [2026-08-28 16:18:37.735] @gammaloop_api::se... INFO : Running command run generate
  17. 200.44 s gammaloop-nextest-integration> [2026-08-28 16:18:37.735] @gammaloop_api::se... INFO : Starting command block generate
  18. 200.44 s gammaloop-nextest-integration> [2026-08-28 16:18:37.736] @gammaloop_api::se... INFO : Running command import model scalars-default.json
  19. 200.44 s gammaloop-nextest-integration> [2026-08-28 16:18:37.736] @import::model INFO : Loading built-in JSON model scalars-default
  20. 200.44 s gammaloop-nextest-integration> [2026-08-28 16:18:37.740] @gammalooprs::model INFO : The following 2 external parameters were forced to zero by the restriction card:
  21. 200.44 s gammaloop-nextest-integration> width_scalar_1, width_scalar_2
  22. 200.44 s gammaloop-nextest-integration> [2026-08-28 16:18:37.740] @gammaloop_api::se... INFO : Running command remove processes
  23. 200.44 s gammaloop-nextest-integration> [2026-08-28 16:18:37.740] @gammaloop_api::se... INFO : Running command set global kv global.generation.uv.generate_integrated=true
  24. 200.44 s gammaloop-nextest-integration> [2026-08-28 16:18:37.741] @gammaloop_api::se... INFO : Running command import graphs ./tests/resources/graphs/scalar/dod2_bubble.dot -p bubble_dod2 -i scalar_bubble_below_thres
  25. 200.44 s gammaloop-nextest-integration> [2026-08-28 16:18:37.741] @commands::import INFO : Loading graphs from '/build/source/tests/resources/graphs/scalar/dod2_bubble.dot'
  26. 200.44 s gammaloop-nextest-integration> [2026-08-28 16:18:37.746] @gammaloop_api::se... INFO : Running command generate existing -p bubble_dod2 -i scalar_bubble_below_thres
  27. 200.44 s gammaloop-nextest-integration> [2026-08-28 16:18:37.747] @approx::local_4d [{#uv, #inspect, #integrated}] DEBUG : Rescaled momenta expanded
  28. 200.44 s gammaloop-nextest-integration> field value
  29. 200.44 s gammaloop-nextest-integration> res n-terms: 1, byte size: 3,expr:
  30. 200.44 s gammaloop-nextest-integration> 1
  31. 200.44 s gammaloop-nextest-integration> [2026-08-28 16:18:37.750] @approx::local_4d [{#uv, #inspect, #integrated}] DEBUG : Rescaled momenta expanded
  32. 200.44 s gammaloop-nextest-integration> field value
  33. 200.44 s gammaloop-nextest-integration> res n-terms: 1, byte size: 585,expr:
  34. 200.44 s gammaloop-nextest-integration> -SCALAR_COUPLING²·q₀(αᵉ².¹)·q₀(αᵉ³.¹)·q₂(αᵉ².¹)·q₂(αᵉ³.¹)
  35. 200.44 s gammaloop-nextest-integration> /(t²·denom(3,-q₀-q₂/t,mass_scalar_2²,-mass_scalar_2²+2·(q₀.q₂)/t+(q₂.q₂)/t²+(q₀.q₀))
  36. 200.44 s gammaloop-nextest-integration> ·denom(2,q₂/t,mass_scalar_2²,-mass_scalar_2²+(q₂.q₂)/t²))
  37. 200.44 s gammaloop-nextest-integration> [2026-08-28 16:18:37.751] @approx::final_integrand[{#generation, #profile, #uv, #graph, #summary}] DEBUG : Computed global numerator
  38. 200.44 s gammaloop-nextest-integration> field value
  39. 200.44 s gammaloop-nextest-integration> global_num n-terms: 1, byte size: 4,expr:
  40. 200.44 s gammaloop-nextest-integration> 1/2
  41. 200.44 s gammaloop-nextest-integration> span build_3d{span_context=true graph=GL0 current=subgraph=0, topo_order=0, dod=0}
  42. 200.44 s gammaloop-nextest-integration> [2026-08-28 16:18:37.753] @uv::approx [{#generation, #uv, #fourd}] DEBUG : Computing 4D
  43. 200.44 s gammaloop-nextest-integration> field value
  44. 200.44 s gammaloop-nextest-integration> simple subgraph(S_11,S_y)*Approx(subgraph(S_y,0)) of GL0
  45. 200.44 s gammaloop-nextest-integration> span compute_4d{span_context=true graph=GL0 current=subgraph=y, topo_order=1, dod=2 given=subgraph=0, topo_order=0, dod=0 reduced=SubSet { set: BitVec<usize, bitvec::order::Lsb0> { addr: 0x7fffec018010, head: 000000, bits: 6, capacity: 64 } [0, 0, 1, 1, 1, 1], id: PhantomData<linnet::half_edge::involution::Hedge> }}
  46. 200.44 s gammaloop-nextest-integration> [2026-08-28 16:18:37.754] @approx::local_4d [{#uv, #algebra, #integrated, #start}] DEBUG :
  47. 200.44 s gammaloop-nextest-integration> field value
  48. 200.44 s gammaloop-nextest-integration> integrand n-terms: 1, byte size: 409,expr:
  49. 200.44 s gammaloop-nextest-integration> SCALAR_COUPLING²·(q₀(αᵉ³.¹)+q₃(αᵉ³.¹))·q₀(αᵉ².¹)·q₀(αᵉ³.¹)·q₂(αᵉ².¹)
  50. 200.44 s gammaloop-nextest-integration> /(denom(2,q₂,mass_scalar_2²,-mass_scalar_2²+(q₂.q₂))·denom(3,q₃,mass_scalar_2²,-mass_scalar_2²+(q₃.q₃)))
  51. 200.44 s gammaloop-nextest-integration> reduced y
  52. 200.44 s gammaloop-nextest-integration> span grow{span_context=true current=subgraph=y, topo_order=1, dod=2 given=subgraph=0, topo_order=0, dod=0}
  53. 200.44 s gammaloop-nextest-integration> [2026-08-28 16:18:37.754] @approx::local_4d [{#uv, #inspect, #integrated}] DEBUG : Rescaled momenta expanded
  54. 200.44 s gammaloop-nextest-integration> field value
  55. 200.44 s gammaloop-nextest-integration> res n-terms: 1, byte size: 585,expr:
  56. 200.44 s gammaloop-nextest-integration> -SCALAR_COUPLING²·q₀(αᵉ².¹)·q₀(αᵉ³.¹)·q₂(αᵉ².¹)·q₂(αᵉ³.¹)
  57. 200.44 s gammaloop-nextest-integration> /(t²·denom(3,-q₀-q₂/t,mass_scalar_2²,-mass_scalar_2²+2·(q₀.q₂)/t+(q₂.q₂)/t²+(q₀.q₀))
  58. 200.44 s gammaloop-nextest-integration> ·denom(2,q₂/t,mass_scalar_2²,-mass_scalar_2²+(q₂.q₂)/t²))
  59. 200.44 s gammaloop-nextest-integration> span t{span_context=true current=subgraph=y, topo_order=1, dod=2 given=subgraph=0, topo_order=0, dod=0}
  60. 200.44 s gammaloop-nextest-integration> [2026-08-28 16:18:37.757] @approx::local_4d [{#uv, #integrated, #rescaled}] DEBUG : Rescaled expanded
  61. 200.44 s gammaloop-nextest-integration> field value
  62. 200.44 s gammaloop-nextest-integration> n_loops 1
  63. 200.44 s gammaloop-nextest-integration> res n-terms: 1, byte size: 707,expr:
  64. 200.44 s gammaloop-nextest-integration> -SCALAR_COUPLING²·q₀(αᵉ².¹)·q₀(αᵉ³.¹)·q₂(αᵉ².¹)·q₂(αᵉ³.¹)
  65. 200.44 s gammaloop-nextest-integration> /(t²·denom(3,-q₂,mUVexp²+t²·mass_scalar_2²,-mUV²+t²·(-mass_scalar_2²+2·(q₀.q₂)/t+(q₂.q₂)/t²+(q₀.q₀))+t²·mUVexp²)
  66. 200.44 s gammaloop-nextest-integration> ·denom(2,q₂,mUVexp²+t²·mass_scalar_2²,-mUV²+t²·(-mass_scalar_2²+(q₂.q₂)/t²)+t²·mUVexp²))
  67. 200.44 s gammaloop-nextest-integration> span t{span_context=true current=subgraph=y, topo_order=1, dod=2 given=subgraph=0, topo_order=0, dod=0}
  68. 200.44 s gammaloop-nextest-integration> [2026-08-28 16:18:37.758] @approx::local_4d [{#uv, #integrated, #series}] DEBUG : Series expanded
  69. 200.44 s gammaloop-nextest-integration> field value
  70. 200.44 s gammaloop-nextest-integration> res n-terms: 3, byte size: 1896,expr:
  71. 200.44 s gammaloop-nextest-integration> (1/2·SCALAR_COUPLING²·(2·mUVexp²-2·mass_scalar_2²)/(denom(2,q₂,mUVexp²,-mUV²+(q₂.q₂))²·denom(3,-q₂,mUVexp²,-mUV²+(q₂.q₂)))
  72. 200.44 s gammaloop-nextest-integration> -SCALAR_COUPLING²
  73. 200.44 s gammaloop-nextest-integration> ·(-1/2·(2·mUVexp²-2·mass_scalar_2²+2·(q₀.q₀))/denom(3,-q₂,mUVexp²,-mUV²+(q₂.q₂))
  74. 200.44 s gammaloop-nextest-integration> +4·(q₀.q₂)²/denom(3,-q₂,mUVexp²,-mUV²+(q₂.q₂))²
  75. 200.44 s gammaloop-nextest-integration> )/(denom(2,q₂,mUVexp²,-mUV²+(q₂.q₂))·denom(3,-q₂,mUVexp²,-mUV²+(q₂.q₂)))
  76. 200.44 s gammaloop-nextest-integration> )·q₀(αᵉ².¹)·q₀(αᵉ³.¹)·q₂(αᵉ².¹)·q₂(αᵉ³.¹)
  77. 200.44 s gammaloop-nextest-integration> +2·SCALAR_COUPLING²·(q₀.q₂)·q₀(αᵉ².¹)·q₀(αᵉ³.¹)·q₂(αᵉ².¹)·q₂(αᵉ³.¹)
  78. 200.44 s gammaloop-nextest-integration> /(t·denom(2,q₂,mUVexp²,-mUV²+(q₂.q₂))·denom(3,-q₂,mUVexp²,-mUV²+(q₂.q₂))²)
  79. 200.44 s gammaloop-nextest-integration> -SCALAR_COUPLING²·q₀(αᵉ².¹)·q₀(αᵉ³.¹)·q₂(αᵉ².¹)·q₂(αᵉ³.¹)
  80. 200.44 s gammaloop-nextest-integration> /(t²·denom(2,q₂,mUVexp²,-mUV²+(q₂.q₂))·denom(3,-q₂,mUVexp²,-mUV²+(q₂.q₂)))
  81. 200.44 s gammaloop-nextest-integration> span t{span_context=true current=subgraph=y, topo_order=1, dod=2 given=subgraph=0, topo_order=0, dod=0}
  82. 200.44 s gammaloop-nextest-integration> [2026-08-28 16:18:37.759] @approx::local_4d [{#uv, #integrated, #series}] DEBUG : Evaluated at t = 1
  83. 200.44 s gammaloop-nextest-integration> field value
  84. 200.44 s gammaloop-nextest-integration> res n-terms: 3, byte size: 1880,expr:
  85. 200.44 s gammaloop-nextest-integration> (1/2·SCALAR_COUPLING²·(2·mUVexp²-2·mass_scalar_2²)/(denom(2,q₂,mUVexp²,-mUV²+(q₂.q₂))²·denom(3,-q₂,mUVexp²,-mUV²+(q₂.q₂)))
  86. 200.44 s gammaloop-nextest-integration> -SCALAR_COUPLING²
  87. 200.44 s gammaloop-nextest-integration> ·(-1/2·(2·mUVexp²-2·mass_scalar_2²+2·(q₀.q₀))/denom(3,-q₂,mUVexp²,-mUV²+(q₂.q₂))
  88. 200.44 s gammaloop-nextest-integration> +4·(q₀.q₂)²/denom(3,-q₂,mUVexp²,-mUV²+(q₂.q₂))²
  89. 200.44 s gammaloop-nextest-integration> )/(denom(2,q₂,mUVexp²,-mUV²+(q₂.q₂))·denom(3,-q₂,mUVexp²,-mUV²+(q₂.q₂)))
  90. 200.44 s gammaloop-nextest-integration> )·q₀(αᵉ².¹)·q₀(αᵉ³.¹)·q₂(αᵉ².¹)·q₂(αᵉ³.¹)
  91. 200.44 s gammaloop-nextest-integration> -SCALAR_COUPLING²·q₀(αᵉ².¹)·q₀(αᵉ³.¹)·q₂(αᵉ².¹)·q₂(αᵉ³.¹)
  92. 200.44 s gammaloop-nextest-integration> /(denom(2,q₂,mUVexp²,-mUV²+(q₂.q₂))·denom(3,-q₂,mUVexp²,-mUV²+(q₂.q₂)))
  93. 200.44 s gammaloop-nextest-integration> +2·SCALAR_COUPLING²·(q₀.q₂)·q₀(αᵉ².¹)·q₀(αᵉ³.¹)·q₂(αᵉ².¹)·q₂(αᵉ³.¹)
  94. 200.44 s gammaloop-nextest-integration> /(denom(2,q₂,mUVexp²,-mUV²+(q₂.q₂))·denom(3,-q₂,mUVexp²,-mUV²+(q₂.q₂))²)
  95. 200.44 s gammaloop-nextest-integration> span t{span_context=true current=subgraph=y, topo_order=1, dod=2 given=subgraph=0, topo_order=0, dod=0}
  96. 200.44 s gammaloop-nextest-integration> [2026-08-28 16:18:37.764] @approx::local_4d [{#uv, #collect, #integrated}] DEBUG : After gamma chain collection
  97. 200.44 s gammaloop-nextest-integration> field value
  98. 200.44 s gammaloop-nextest-integration> expr n-terms: 3, byte size: 1880,expr:
  99. 200.44 s gammaloop-nextest-integration> (1/2·SCALAR_COUPLING²·(2·mUVexp²-2·mass_scalar_2²)/(denom(2,q₂,mUVexp²,-mUV²+(q₂.q₂))²·denom(3,-q₂,mUVexp²,-mUV²+(q₂.q₂)))
  100. 200.44 s gammaloop-nextest-integration> -SCALAR_COUPLING²
  101. 200.44 s gammaloop-nextest-integration> ·(-1/2·(2·mUVexp²-2·mass_scalar_2²+2·(q₀.q₀))/denom(3,-q₂,mUVexp²,-mUV²+(q₂.q₂))
  102. 200.44 s gammaloop-nextest-integration> +4·(q₀.q₂)²/denom(3,-q₂,mUVexp²,-mUV²+(q₂.q₂))²
  103. 200.44 s gammaloop-nextest-integration> )/(denom(2,q₂,mUVexp²,-mUV²+(q₂.q₂))·denom(3,-q₂,mUVexp²,-mUV²+(q₂.q₂)))
  104. 200.44 s gammaloop-nextest-integration> )·q₀(αᵉ².¹)·q₀(αᵉ³.¹)·q₂(αᵉ².¹)·q₂(αᵉ³.¹)
  105. 200.44 s gammaloop-nextest-integration> -SCALAR_COUPLING²·q₀(αᵉ².¹)·q₀(αᵉ³.¹)·q₂(αᵉ².¹)·q₂(αᵉ³.¹)
  106. 200.44 s gammaloop-nextest-integration> /(denom(2,q₂,mUVexp²,-mUV²+(q₂.q₂))·denom(3,-q₂,mUVexp²,-mUV²+(q₂.q₂)))
  107. 200.44 s gammaloop-nextest-integration> +2·SCALAR_COUPLING²·(q₀.q₂)·q₀(αᵉ².¹)·q₀(αᵉ³.¹)·q₂(αᵉ².¹)·q₂(αᵉ³.¹)
  108. 200.44 s gammaloop-nextest-integration> /(denom(2,q₂,mUVexp²,-mUV²+(q₂.q₂))·denom(3,-q₂,mUVexp²,-mUV²+(q₂.q₂))²)
  109. 200.44 s gammaloop-nextest-integration> span t{span_context=true current=subgraph=y, topo_order=1, dod=2 given=subgraph=0, topo_order=0, dod=0}
  110. 200.45 s gammaloop-nextest-integration> [2026-08-28 16:18:37.769] @approx::local_4d [{#profile, #uv, #collect, #integrated, #start, #trace}] DEBUG : After gamma schoonschip
  111. 200.45 s gammaloop-nextest-integration> field value
  112. 200.45 s gammaloop-nextest-integration> expr n-terms: 3, byte size: 1631,expr:
  113. 200.45 s gammaloop-nextest-integration> (1/2·SCALAR_COUPLING²·(2·mUVexp²-2·mass_scalar_2²)/(denom(2,q₂,mUVexp²,-mUV²+(q₂.q₂))²·denom(3,-q₂,mUVexp²,-mUV²+(q₂.q₂)))
  114. 200.45 s gammaloop-nextest-integration> -SCALAR_COUPLING²
  115. 200.45 s gammaloop-nextest-integration> ·(-1/2·(2·mUVexp²-2·mass_scalar_2²+2·(q₀.q₀))/denom(3,-q₂,mUVexp²,-mUV²+(q₂.q₂))
  116. 200.45 s gammaloop-nextest-integration> +4·(q₀.q₂)²/denom(3,-q₂,mUVexp²,-mUV²+(q₂.q₂))²
  117. 200.45 s gammaloop-nextest-integration> )/(denom(2,q₂,mUVexp²,-mUV²+(q₂.q₂))·denom(3,-q₂,mUVexp²,-mUV²+(q₂.q₂)))
  118. 200.45 s gammaloop-nextest-integration> )·(q₀.q₂)²
  119. 200.45 s gammaloop-nextest-integration> -SCALAR_COUPLING²·(q₀.q₂)²/(denom(2,q₂,mUVexp²,-mUV²+(q₂.q₂))·denom(3,-q₂,mUVexp²,-mUV²+(q₂.q₂)))
  120. 200.45 s gammaloop-nextest-integration> +2·SCALAR_COUPLING²·(q₀.q₂)·(q₀.q₂)²
  121. 200.45 s gammaloop-nextest-integration> /(denom(2,q₂,mUVexp²,-mUV²+(q₂.q₂))·denom(3,-q₂,mUVexp²,-mUV²+(q₂.q₂))²)
  122. 200.45 s gammaloop-nextest-integration> span t{span_context=true current=subgraph=y, topo_order=1, dod=2 given=subgraph=0, topo_order=0, dod=0}
  123. 200.45 s gammaloop-nextest-integration> [2026-08-28 16:18:37.771] @approx::local_4d [{#profile, #uv, #collect, #integrated, #start, #trace}] DEBUG : After gamma collection
  124. 200.45 s gammaloop-nextest-integration> field value
  125. 200.45 s gammaloop-nextest-integration> expr n-terms: 1, byte size: 1347,expr:
  126. 200.45 s gammaloop-nextest-integration> SCALAR_COUPLING²
  127. 200.45 s gammaloop-nextest-integration> ·(-denom(2,q₂,mUVexp²,-mUV²+(q₂.q₂))·denom(3,-q₂,mUVexp²,-mUV²+(q₂.q₂))²
  128. 200.45 s gammaloop-nextest-integration> +1/2·(2·mUVexp²-2·mass_scalar_2²)·denom(3,-q₂,mUVexp²,-mUV²+(q₂.q₂))²
  129. 200.45 s gammaloop-nextest-integration> -(-1/2·(2·mUVexp²-2·mass_scalar_2²+2·(q₀.q₀))·denom(3,-q₂,mUVexp²,-mUV²+(q₂.q₂))+4·(q₀.q₂)²)
  130. 200.45 s gammaloop-nextest-integration> ·denom(2,q₂,mUVexp²,-mUV²+(q₂.q₂))
  131. 200.45 s gammaloop-nextest-integration> +2·(q₀.q₂)·denom(2,q₂,mUVexp²,-mUV²+(q₂.q₂))·denom(3,-q₂,mUVexp²,-mUV²+(q₂.q₂))
  132. 200.45 s gammaloop-nextest-integration> )·(q₀.q₂)²/(denom(2,q₂,mUVexp²,-mUV²+(q₂.q₂))²·denom(3,-q₂,mUVexp²,-mUV²+(q₂.q₂))³)
  133. 200.45 s gammaloop-nextest-integration> span t{span_context=true current=subgraph=y, topo_order=1, dod=2 given=subgraph=0, topo_order=0, dod=0}
  134. 200.45 s gammaloop-nextest-integration> [2026-08-28 16:18:37.776] @approx::local_4d [{#profile, #uv, #gamma, #integrated, #start, #trace, #vakint}] DEBUG : After gamma simplification
  135. 200.45 s gammaloop-nextest-integration> ... omitted 3263 more lines; see full nextest output above
  136. 200.45 s gammaloop-nextest-integration>
  137. 200.45 s gammaloop-nextest-integration> 8. gammaloop-integration-tests::uv::sunrise_scalar_1_uv
  138. 200.48 s gammaloop-nextest-integration> failure: test failure with exit code 101
  139. 200.48 s gammaloop-nextest-integration> system-out
  140. 200.48 s gammaloop-nextest-integration> running 1 test
  141. 200.48 s gammaloop-nextest-integration> test sunrise_scalar_1_uv has been running for over 60 seconds
  142. 200.48 s gammaloop-nextest-integration> +------------------+------------------------+--------------+--------+----------+----------------------------------------------------------------------------------------------------------------------+-------+
  143. 200.48 s gammaloop-nextest-integration> | case | check | graph | status | sigma | threshold | error |
  144. 200.48 s gammaloop-nextest-integration> +------------------+------------------------+--------------+--------+----------+----------------------------------------------------------------------------------------------------------------------+-------+
  145. 200.48 s gammaloop-nextest-integration> | sunrise_scalar_1 | uv_profile | - | FAIL | - | - | - |
  146. 200.48 s gammaloop-nextest-integration> +------------------+------------------------+--------------+--------+----------+----------------------------------------------------------------------------------------------------------------------+-------+
  147. 200.48 s gammaloop-nextest-integration> | sunrise_scalar_1 | m_uv.inspect | inspect | pass | - | best inspect relative delta 1.624e0 >= 1000*accuracy 1.000e-3 (accuracy=1.000e-6, exponent=+1.0, seed=1, probes=10) | - |
  148. 200.48 s gammaloop-nextest-integration> +------------------+------------------------+--------------+--------+----------+----------------------------------------------------------------------------------------------------------------------+-------+
  149. 200.48 s gammaloop-nextest-integration> | sunrise_scalar_1 | m_uv.integrated | sunrise | pass | 0.1sigma | compatible within 2sigma | - |
  150. 200.48 s gammaloop-nextest-integration> +------------------+------------------------+--------------+--------+----------+----------------------------------------------------------------------------------------------------------------------+-------+
  151. 200.48 s gammaloop-nextest-integration> | sunrise_scalar_1 | rls.inspect | inspect | pass | - | best inspect relative delta 8.682e-1 >= 1000*accuracy 1.000e-3 (accuracy=1.000e-6, exponent=+1.0, seed=1, probes=10) | - |
  152. 200.48 s gammaloop-nextest-integration> +------------------+------------------------+--------------+--------+----------+----------------------------------------------------------------------------------------------------------------------+-------+
  153. 200.48 s gammaloop-nextest-integration> | sunrise_scalar_1 | rls.integrated | sunrise | pass | 0.0sigma | compatible within 2sigma | - |
  154. 200.48 s gammaloop-nextest-integration> +------------------+------------------------+--------------+--------+----------+----------------------------------------------------------------------------------------------------------------------+-------+
  155. 200.48 s gammaloop-nextest-integration> | sunrise_scalar_1 | mu_r.inspect | inspect | pass | - | best inspect relative delta 1.752e0 >= 1000*accuracy 1.000e-3 (accuracy=1.000e-6, exponent=+1.0, seed=1, probes=10) | - |
  156. 200.48 s gammaloop-nextest-integration> +------------------+------------------------+--------------+--------+----------+----------------------------------------------------------------------------------------------------------------------+-------+
  157. 200.48 s gammaloop-nextest-integration> | sunrise_scalar_1 | integrated.relerr | integrated | pass | - | relative error 9.20% <= 10.00% | - |
  158. 200.48 s gammaloop-nextest-integration> +------------------+------------------------+--------------+--------+----------+----------------------------------------------------------------------------------------------------------------------+-------+
  159. 200.48 s gammaloop-nextest-integration> | sunrise_scalar_1 | m_uv.integrated.relerr | m_uv-shifted | pass | - | relative error 5.89% <= 10.00% | - |
  160. 200.48 s gammaloop-nextest-integration> +------------------+------------------------+--------------+--------+----------+----------------------------------------------------------------------------------------------------------------------+-------+
  161. 200.48 s gammaloop-nextest-integration> | sunrise_scalar_1 | target | - | pass | - | 2sigma | - |
  162. 200.48 s gammaloop-nextest-integration> +------------------+------------------------+--------------+--------+----------+----------------------------------------------------------------------------------------------------------------------+-------+
  163. 200.48 s gammaloop-nextest-integration> test sunrise_scalar_1_uv ... FAILED
  164. 200.48 s gammaloop-nextest-integration>
  165. 200.48 s gammaloop-nextest-integration> failures:
  166. 200.48 s gammaloop-nextest-integration>
  167. 200.48 s gammaloop-nextest-integration> failures:
  168. 200.48 s gammaloop-nextest-integration> sunrise_scalar_1_uv
  169. 200.48 s gammaloop-nextest-integration>
  170. 200.48 s gammaloop-nextest-integration> test result: FAILED. 0 passed; 1 failed; 0 ignored; 0 measured; 24 filtered out; finished in 140.84s
  171. 200.48 s gammaloop-nextest-integration> system-err
  172. 200.48 s gammaloop-nextest-integration> [2026-08-28 16:18:51.934] @gammaloop_api::se... INFO : Running command run generate
  173. 200.48 s gammaloop-nextest-integration> [2026-08-28 16:18:51.934] @gammaloop_api::se... INFO : Starting command block generate
  174. 200.48 s gammaloop-nextest-integration> [2026-08-28 16:18:51.934] @gammaloop_api::se... INFO : Running command import model scalars-default.json
  175. 200.48 s gammaloop-nextest-integration> [2026-08-28 16:18:51.934] @import::model INFO : Loading built-in JSON model scalars-default
  176. 200.48 s gammaloop-nextest-integration> [2026-08-28 16:18:51.939] @gammalooprs::model INFO : The following 2 external parameters were forced to zero by the restriction card:
  177. 200.48 s gammaloop-nextest-integration> width_scalar_1, width_scalar_2
  178. 200.48 s gammaloop-nextest-integration> [2026-08-28 16:18:51.940] @gammaloop_api::se... INFO : Running command remove processes
  179. 200.48 s gammaloop-nextest-integration> [2026-08-28 16:18:51.940] @gammaloop_api::se... INFO : Running command set global kv global.generation.uv.generate_integrated=true
  180. 200.48 s gammaloop-nextest-integration> [2026-08-28 16:18:51.941] @gammaloop_api::se... INFO : Running command import graphs ./tests/resources/graphs/scalar_sunrise.dot -p sunrise_scalar_1 -i scalar_sunrise
  181. 200.48 s gammaloop-nextest-integration> [2026-08-28 16:18:51.941] @commands::import INFO : Loading graphs from '/build/source/tests/resources/graphs/scalar_sunrise.dot'
  182. 200.48 s gammaloop-nextest-integration> [2026-08-28 16:18:51.944] @gammaloop_api::se... INFO : Running command generate existing -p sunrise_scalar_1 -i scalar_sunrise
  183. 200.48 s gammaloop-nextest-integration> [2026-08-28 16:18:51.950] @approx::local_4d [{#uv, #inspect, #integrated}] DEBUG : Rescaled momenta expanded
  184. 200.48 s gammaloop-nextest-integration> field value
  185. 200.48 s gammaloop-nextest-integration> res n-terms: 1, byte size: 611,expr:
  186. 200.48 s gammaloop-nextest-integration> 1/(denom(0,q₀/t,mass_scalar_1²,-mass_scalar_1²+(q₀.q₀)/t²)
  187. 200.48 s gammaloop-nextest-integration> ·denom(2,-q₁+q₃-q₀/t,mass_scalar_1²,
  188. 200.48 s gammaloop-nextest-integration> -mass_scalar_1²+2·(q₀.q₁)/t-2·(q₀.q₃)/t+(q₀.q₀)/t²+(q₁.q₁)
  189. 200.48 s gammaloop-nextest-integration> -2·(q₁.q₃)+(q₃.q₃)
  190. 200.48 s gammaloop-nextest-integration> ))
  191. 200.48 s gammaloop-nextest-integration> [2026-08-28 16:18:51.952] @approx::local_4d [{#uv, #inspect, #integrated}] DEBUG : Rescaled momenta expanded
  192. 200.48 s gammaloop-nextest-integration> field value
  193. 200.48 s gammaloop-nextest-integration> res n-terms: 1, byte size: 611,expr:
  194. 200.48 s gammaloop-nextest-integration> 1/(denom(1,q₁/t,mass_scalar_1²,-mass_scalar_1²+(q₁.q₁)/t²)
  195. 200.48 s gammaloop-nextest-integration> ·denom(2,-q₀+q₃-q₁/t,mass_scalar_1²,
  196. 200.48 s gammaloop-nextest-integration> -mass_scalar_1²+2·(q₀.q₁)/t-2·(q₁.q₃)/t+(q₁.q₁)/t²+(q₀.q₀)
  197. 200.48 s gammaloop-nextest-integration> -2·(q₀.q₃)+(q₃.q₃)
  198. 200.48 s gammaloop-nextest-integration> ))
  199. 200.48 s gammaloop-nextest-integration> [2026-08-28 16:18:51.957] @approx::local_4d [{#uv, #inspect, #integrated}] DEBUG : Rescaled momenta expanded
  200. 200.48 s gammaloop-nextest-integration> field value
  201. 200.48 s gammaloop-nextest-integration> res n-terms: 1, byte size: 611,expr:
  202. 200.48 s gammaloop-nextest-integration> 1/(denom(0,q₀/t,mass_scalar_1²,-mass_scalar_1²+(q₀.q₀)/t²)
  203. 200.48 s gammaloop-nextest-integration> ·denom(1,-q₂+q₃-q₀/t,mass_scalar_1²,
  204. 200.48 s gammaloop-nextest-integration> -mass_scalar_1²+2·(q₀.q₂)/t-2·(q₀.q₃)/t+(q₀.q₀)/t²+(q₂.q₂)
  205. 200.48 s gammaloop-nextest-integration> -2·(q₂.q₃)+(q₃.q₃)
  206. 200.48 s gammaloop-nextest-integration> ))
  207. 200.48 s gammaloop-nextest-integration> [2026-08-28 16:18:51.958] @approx::local_4d [{#uv, #inspect, #integrated}] DEBUG : Rescaled momenta expanded
  208. 200.48 s gammaloop-nextest-integration> field value
  209. 200.48 s gammaloop-nextest-integration> res n-terms: 1, byte size: 3,expr:
  210. 200.48 s gammaloop-nextest-integration> 1
  211. 200.48 s gammaloop-nextest-integration> [2026-08-28 16:18:51.963] @approx::local_4d [{#uv, #inspect, #integrated}] DEBUG : Rescaled momenta expanded
  212. 200.48 s gammaloop-nextest-integration> field value
  213. 200.48 s gammaloop-nextest-integration> res n-terms: 1, byte size: 777,expr:
  214. 200.48 s gammaloop-nextest-integration> 1/(denom(0,q₀/t,mass_scalar_1²,-mass_scalar_1²+(q₀.q₀)/t²)·denom(1,q₁/t,mass_scalar_1²,-mass_scalar_1²+(q₁.q₁)/t²)
  215. 200.48 s gammaloop-nextest-integration> ·denom(2,q₄-q₀/t-q₁/t,mass_scalar_1²,
  216. 200.48 s gammaloop-nextest-integration> -mass_scalar_1²-2·(q₀.q₄)/t-2·(q₁.q₄)/t+(q₀.q₀)/t²+2·(q₀.q₁)/t²
  217. 200.48 s gammaloop-nextest-integration> +(q₁.q₁)/t²+(q₄.q₄)
  218. 200.48 s gammaloop-nextest-integration> ))
  219. 200.48 s gammaloop-nextest-integration> [2026-08-28 16:18:51.969] @approx::final_integrand[{#generation, #profile, #uv, #graph, #summary}] DEBUG : Computed global numerator
  220. 200.48 s gammaloop-nextest-integration> field value
  221. 200.48 s gammaloop-nextest-integration> global_num n-terms: 1, byte size: 3,expr:
  222. 200.48 s gammaloop-nextest-integration> 1
  223. 200.48 s gammaloop-nextest-integration> span build_3d{span_context=true graph=sunrise current=subgraph=0, topo_order=0, dod=0}
  224. 200.48 s gammaloop-nextest-integration> [2026-08-28 16:18:51.975] @uv::approx [{#generation, #uv, #fourd}] DEBUG : Computing 4D
  225. 200.48 s gammaloop-nextest-integration> field value
  226. 200.48 s gammaloop-nextest-integration> simple subgraph(S_47,S_3I)*Approx(subgraph(S_3I,0)) of sunrise
  227. 200.48 s gammaloop-nextest-integration> span compute_4d{span_context=true graph=sunrise current=subgraph=3I, topo_order=1, dod=0 given=subgraph=0, topo_order=0, dod=0 reduced=SubSet { set: BitVec<usize, bitvec::order::Lsb0> { addr: 0x7fffec02bbd0, head: 000000, bits: 8, capacity: 64 } [0, 0, 1, 1, 0, 0, 1, 1], id: PhantomData<linnet::half_edge::involution::Hedge> }}
  228. 200.48 s gammaloop-nextest-integration> [2026-08-28 16:18:51.976] @approx::local_4d [{#uv, #algebra, #integrated, #start}] DEBUG :
  229. 200.48 s gammaloop-nextest-integration> field value
  230. 200.48 s gammaloop-nextest-integration> integrand n-terms: 1, byte size: 217,expr:
  231. 200.48 s gammaloop-nextest-integration> 1/(denom(0,q₀,mass_scalar_1²,-mass_scalar_1²+(q₀.q₀))·denom(2,q₂,mass_scalar_1²,-mass_scalar_1²+(q₂.q₂)))
  232. 200.48 s gammaloop-nextest-integration> reduced 3I
  233. 200.48 s gammaloop-nextest-integration> span grow{span_context=true current=subgraph=3I, topo_order=1, dod=0 given=subgraph=0, topo_order=0, dod=0}
  234. 200.48 s gammaloop-nextest-integration> [2026-08-28 16:18:51.976] @approx::local_4d [{#uv, #inspect, #integrated}] DEBUG : Rescaled momenta expanded
  235. 200.48 s gammaloop-nextest-integration> field value
  236. 200.48 s gammaloop-nextest-integration> res n-terms: 1, byte size: 611,expr:
  237. 200.48 s gammaloop-nextest-integration> 1/(denom(0,q₀/t,mass_scalar_1²,-mass_scalar_1²+(q₀.q₀)/t²)
  238. 200.48 s gammaloop-nextest-integration> ·denom(2,-q₁+q₃-q₀/t,mass_scalar_1²,
  239. 200.48 s gammaloop-nextest-integration> -mass_scalar_1²+2·(q₀.q₁)/t-2·(q₀.q₃)/t+(q₀.q₀)/t²+(q₁.q₁)
  240. 200.48 s gammaloop-nextest-integration> -2·(q₁.q₃)+(q₃.q₃)
  241. 200.48 s gammaloop-nextest-integration> ))
  242. 200.48 s gammaloop-nextest-integration> span t{span_context=true current=subgraph=3I, topo_order=1, dod=0 given=subgraph=0, topo_order=0, dod=0}
  243. 200.48 s gammaloop-nextest-integration> [2026-08-28 16:18:51.976] @approx::local_4d [{#uv, #integrated, #rescaled}] DEBUG : Rescaled expanded
  244. 200.48 s gammaloop-nextest-integration> field value
  245. 200.48 s gammaloop-nextest-integration> n_loops 1
  246. 200.48 s gammaloop-nextest-integration> res n-terms: 1, byte size: 723,expr:
  247. 200.48 s gammaloop-nextest-integration> 1/(denom(0,q₀,mUVexp²+t²·mass_scalar_1²,-mUV²+t²·(-mass_scalar_1²+(q₀.q₀)/t²)+t²·mUVexp²)
  248. 200.48 s gammaloop-nextest-integration> ·denom(2,-q₀,mUVexp²+t²·mass_scalar_1²,
  249. 200.48 s gammaloop-nextest-integration> -mUV²
  250. 200.48 s gammaloop-nextest-integration> +t²
  251. 200.48 s gammaloop-nextest-integration> ·(-mass_scalar_1²+2·(q₀.q₁)/t-2·(q₀.q₃)/t+(q₀.q₀)/t²+(q₁.q₁)
  252. 200.48 s gammaloop-nextest-integration> -2·(q₁.q₃)+(q₃.q₃)
  253. 200.48 s gammaloop-nextest-integration> )
  254. 200.48 s gammaloop-nextest-integration> +t²·mUVexp²
  255. 200.48 s gammaloop-nextest-integration> ))
  256. 200.48 s gammaloop-nextest-integration> span t{span_context=true current=subgraph=3I, topo_order=1, dod=0 given=subgraph=0, topo_order=0, dod=0}
  257. 200.48 s gammaloop-nextest-integration> [2026-08-28 16:18:51.980] @approx::local_4d [{#uv, #integrated, #series}] DEBUG : Series expanded
  258. 200.48 s gammaloop-nextest-integration> field value
  259. 200.48 s gammaloop-nextest-integration> res n-terms: 1, byte size: 223,expr:
  260. 200.48 s gammaloop-nextest-integration> 1/(denom(0,q₀,mUVexp²,-mUV²+(q₀.q₀))·denom(2,-q₀,mUVexp²,-mUV²+(q₀.q₀)))
  261. 200.48 s gammaloop-nextest-integration> span t{span_context=true current=subgraph=3I, topo_order=1, dod=0 given=subgraph=0, topo_order=0, dod=0}
  262. 200.48 s gammaloop-nextest-integration> [2026-08-28 16:18:51.980] @approx::local_4d [{#uv, #integrated, #series}] DEBUG : Evaluated at t = 1
  263. 200.48 s gammaloop-nextest-integration> field value
  264. 200.48 s gammaloop-nextest-integration> res n-terms: 1, byte size: 223,expr:
  265. 200.48 s gammaloop-nextest-integration> 1/(denom(0,q₀,mUVexp²,-mUV²+(q₀.q₀))·denom(2,-q₀,mUVexp²,-mUV²+(q₀.q₀)))
  266. 200.48 s gammaloop-nextest-integration> span t{span_context=true current=subgraph=3I, topo_order=1, dod=0 given=subgraph=0, topo_order=0, dod=0}
  267. 200.48 s gammaloop-nextest-integration> [2026-08-28 16:18:51.980] @approx::local_4d [{#uv, #collect, #integrated}] DEBUG : After gamma chain collection
  268. 200.48 s gammaloop-nextest-integration> field value
  269. 200.48 s gammaloop-nextest-integration> expr n-terms: 1, byte size: 223,expr:
  270. 200.48 s gammaloop-nextest-integration> 1/(denom(0,q₀,mUVexp²,-mUV²+(q₀.q₀))·denom(2,-q₀,mUVexp²,-mUV²+(q₀.q₀)))
  271. 200.48 s gammaloop-nextest-integration> span t{span_context=true current=subgraph=3I, topo_order=1, dod=0 given=subgraph=0, topo_order=0, dod=0}
  272. 200.48 s gammaloop-nextest-integration> [2026-08-28 16:18:51.981] @approx::local_4d [{#profile, #uv, #collect, #integrated, #start, #trace}] DEBUG : After gamma schoonschip
  273. 200.48 s gammaloop-nextest-integration> field value
  274. 200.48 s gammaloop-nextest-integration> expr n-terms: 1, byte size: 223,expr:
  275. 200.48 s gammaloop-nextest-integration> 1/(denom(0,q₀,mUVexp²,-mUV²+(q₀.q₀))·denom(2,-q₀,mUVexp²,-mUV²+(q₀.q₀)))
  276. 200.48 s gammaloop-nextest-integration> span t{span_context=true current=subgraph=3I, topo_order=1, dod=0 given=subgraph=0, topo_order=0, dod=0}
  277. 200.48 s gammaloop-nextest-integration> [2026-08-28 16:18:51.981] @approx::local_4d [{#profile, #uv, #collect, #integrated, #start, #trace}] DEBUG : After gamma collection
  278. 200.48 s gammaloop-nextest-integration> field value
  279. 200.48 s gammaloop-nextest-integration> expr n-terms: 1, byte size: 223,expr:
  280. 200.48 s gammaloop-nextest-integration> 1/(denom(0,q₀,mUVexp²,-mUV²+(q₀.q₀))·denom(2,-q₀,mUVexp²,-mUV²+(q₀.q₀)))
  281. 200.48 s gammaloop-nextest-integration> span t{span_context=true current=subgraph=3I, topo_order=1, dod=0 given=subgraph=0, topo_order=0, dod=0}
  282. 200.48 s gammaloop-nextest-integration> [2026-08-28 16:18:51.981] @approx::local_4d [{#profile, #uv, #gamma, #integrated, #start, #trace, #vakint}] DEBUG : After gamma simplification
  283. 200.48 s gammaloop-nextest-integration> field value
  284. 200.48 s gammaloop-nextest-integration> expr n-terms: 1, byte size: 223,expr:
  285. 200.48 s gammaloop-nextest-integration> 1/(denom(0,q₀,mUVexp²,-mUV²+(q₀.q₀))·denom(2,-q₀,mUVexp²,-mUV²+(q₀.q₀)))
  286. 200.48 s gammaloop-nextest-integration> span t{span_context=true current=subgraph=3I, topo_order=1, dod=0 given=subgraph=0, topo_order=0, dod=0}
  287. 200.48 s gammaloop-nextest-integration> [2026-08-28 16:18:51.982] @approx::local_4d [{#profile, #uv, #integrated, #schoonschip, #start, #trace, #vakint}] DEBUG : After Schoonschip net
  288. 200.48 s gammaloop-nextest-integration> field value
  289. 200.48 s gammaloop-nextest-integration> expr n-terms: 1, byte size: 223,expr:
  290. 200.48 s gammaloop-nextest-integration> 1/(denom(0,q₀,mUVexp²,-mUV²+(q₀.q₀))·denom(2,-q₀,mUVexp²,-mUV²+(q₀.q₀)))
  291. 200.48 s gammaloop-nextest-integration> ... omitted 20090 more lines; see full nextest output above
  292. 200.48 s gammaloop-nextest-integration>
  293. 200.48 s gammaloop-nextest-integration> 9. gammaloop-integration-tests::uv::se1l_uv
  294. 200.48 s gammaloop-nextest-integration> failure: test failure with exit code 101
  295. 200.48 s gammaloop-nextest-integration> system-out
  296. 200.48 s gammaloop-nextest-integration> running 1 test
  297. 200.48 s gammaloop-nextest-integration> test se1l_uv has been running for over 60 seconds
  298. 200.48 s gammaloop-nextest-integration> +------+-----------------+---------+--------+----------+-----------------------------------------------------------------------------------------------------------------------+-------+
  299. 200.48 s gammaloop-nextest-integration> | case | check | graph | status | sigma | threshold | error |
  300. 200.48 s gammaloop-nextest-integration> +------+-----------------+---------+--------+----------+-----------------------------------------------------------------------------------------------------------------------+-------+
  301. 200.48 s gammaloop-nextest-integration> | se1l | uv_profile | - | FAIL | - | - | - |
  302. 200.48 s gammaloop-nextest-integration> +------+-----------------+---------+--------+----------+-----------------------------------------------------------------------------------------------------------------------+-------+
  303. 200.48 s gammaloop-nextest-integration> | se1l | m_uv.inspect | inspect | pass | - | best inspect relative delta 1.097e-1 >= 1000*accuracy 1.000e-7 (accuracy=1.000e-10, exponent=+2.0, seed=1, probes=10) | - |
  304. 200.48 s gammaloop-nextest-integration> +------+-----------------+---------+--------+----------+-----------------------------------------------------------------------------------------------------------------------+-------+
  305. 200.49 s gammaloop-nextest-integration> | se1l | m_uv.integrated | se1l | pass | 0.1sigma | compatible within 2sigma | - |
  306. 200.49 s gammaloop-nextest-integration> +------+-----------------+---------+--------+----------+-----------------------------------------------------------------------------------------------------------------------+-------+
  307. 200.49 s gammaloop-nextest-integration> | se1l | rls.inspect | inspect | pass | - | best inspect relative delta 4.499e-2 >= 1000*accuracy 1.000e-7 (accuracy=1.000e-10, exponent=+2.0, seed=1, probes=10) | - |
  308. 200.49 s gammaloop-nextest-integration> +------+-----------------+---------+--------+----------+-----------------------------------------------------------------------------------------------------------------------+-------+
  309. 200.49 s gammaloop-nextest-integration> | se1l | rls.integrated | se1l | pass | 0.0sigma | compatible within 2sigma | - |
  310. 200.49 s gammaloop-nextest-integration> +------+-----------------+---------+--------+----------+-----------------------------------------------------------------------------------------------------------------------+-------+
  311. 200.49 s gammaloop-nextest-integration> | se1l | mu_r.inspect | inspect | pass | - | best inspect relative delta 1.424e-1 >= 1000*accuracy 1.000e-7 (accuracy=1.000e-10, exponent=+2.0, seed=1, probes=10) | - |
  312. 200.49 s gammaloop-nextest-integration> +------+-----------------+---------+--------+----------+-----------------------------------------------------------------------------------------------------------------------+-------+
  313. 200.49 s gammaloop-nextest-integration> | se1l | target | - | pass | - | 2sigma | - |
  314. 200.49 s gammaloop-nextest-integration> +------+-----------------+---------+--------+----------+-----------------------------------------------------------------------------------------------------------------------+-------+
  315. 200.49 s gammaloop-nextest-integration> test se1l_uv ... FAILED
  316. 200.49 s gammaloop-nextest-integration>
  317. 200.49 s gammaloop-nextest-integration> failures:
  318. 200.49 s gammaloop-nextest-integration>
  319. 200.49 s gammaloop-nextest-integration> failures:
  320. 200.49 s gammaloop-nextest-integration> se1l_uv
  321. 200.49 s gammaloop-nextest-integration>
  322. 200.49 s gammaloop-nextest-integration> test result: FAILED. 0 passed; 1 failed; 0 ignored; 0 measured; 24 filtered out; finished in 149.15s
  323. 200.49 s gammaloop-nextest-integration> system-err
  324. 200.49 s gammaloop-nextest-integration> [2026-08-28 16:18:51.925] @gammaloop_api::se... INFO : Running command run generate
  325. 200.49 s gammaloop-nextest-integration> [2026-08-28 16:18:51.925] @gammaloop_api::se... INFO : Starting command block generate
  326. 200.49 s gammaloop-nextest-integration> [2026-08-28 16:18:51.925] @gammaloop_api::se... INFO : Running command import model sm-default
  327. 200.49 s gammaloop-nextest-integration> [2026-08-28 16:18:51.925] @import::model INFO : Loading built-in JSON model sm-default
  328. 200.49 s gammaloop-nextest-integration> [2026-08-28 16:18:52.011] @gammalooprs::model INFO : The following 11 external parameters were forced to zero by the restriction card:
  329. 200.49 s gammaloop-nextest-integration> lamWS, AWS, rhoWS, etaWS, ymc, yme, ymm, MC, Me, MM, WTau
  330. 200.49 s gammaloop-nextest-integration> [2026-08-28 16:18:52.011] @gammalooprs::model INFO : The following 34 vertex rules were removed by the restriction card:
  331. 200.49 s gammaloop-nextest-integration> V_82 -> (c~, d, G+) | V_83 -> (t~, d, G+) | V_84 -> (c~, s, G+) | V_85 -> (t~, s, G+) | V_86 -> (u~, b, G+) | V_87 -> (c~, b, G+) | V_90 -> (c~, d, W+) | V_91 -> (t~, d, W+) | V_92 -> (u~, s, W+) | V_94 -> (t~, s, W+) | V_95 -> (u~, b, W+) | V_96 -> (c~, b, W+) | V_101 -> (e+, e-, G0) | V_102 -> (mu+, mu-, G0) | V_104 -> (e+, e-, H) | V_105 -> (mu+, mu-, H) | V_110 -> (ve~, e-, G+) | V_111 -> (vm~, mu-, G+) | V_116 -> (b~, u, G-) | V_117 -> (d~, c, G-) | V_118 -> (s~, c, G-) | V_119 -> (b~, c, G-) | V_120 -> (d~, t, G-) | V_121 -> (s~, t, G-) | V_124 -> (s~, u, W-) | V_125 -> (b~, u, W-) | V_126 -> (d~, c, W-) | V_128 -> (b~, c, W-) | V_129 -> (d~, t, W-) | V_130 -> (s~, t, W-) | V_138 -> (c~, c, G0) | V_140 -> (c~, c, H) | V_145 -> (e+, ve, G-) | V_146 -> (mu+, vm, G-)
  332. 200.49 s gammaloop-nextest-integration> [2026-08-28 16:18:52.011] @gammalooprs::model INFO : The following 36 couplings were removed by the restriction card:
  333. 200.49 s gammaloop-nextest-integration> GC_13, GC_14, GC_16, GC_17, GC_18, GC_19, GC_20, GC_22, GC_23, GC_24, GC_25, GC_26, GC_28, GC_29, GC_42, GC_43, GC_44, GC_46, GC_47, GC_48, GC_84, GC_85, GC_86, GC_87, GC_88, GC_89, GC_90, GC_91, GC_92, GC_93, GC_101, GC_102, GC_103, GC_105, GC_106, GC_107
  334. 200.49 s gammaloop-nextest-integration> [2026-08-28 16:18:52.011] @gammaloop_api::se... INFO : Running command remove processes
  335. 200.49 s gammaloop-nextest-integration> [2026-08-28 16:18:52.014] @gammaloop_api::se... INFO : Running command set global kv global.generation.uv.generate_integrated=true
  336. 200.49 s gammaloop-nextest-integration> [2026-08-28 16:18:52.014] @gammaloop_api::se... INFO : Running command import graphs ./tests/resources/graphs/uv_tests/se1l.dot -p se1l -i se1l
  337. 200.49 s gammaloop-nextest-integration> [2026-08-28 16:18:52.014] @commands::import INFO : Loading graphs from '/build/source/tests/resources/graphs/uv_tests/se1l.dot'
  338. 200.49 s gammaloop-nextest-integration> [2026-08-28 16:18:52.023] @gammaloop_api::se... INFO : Running command generate existing -p se1l -i se1l
  339. 200.49 s gammaloop-nextest-integration> [2026-08-28 16:18:53.829] @commands::generate INFO :
  340. 200.49 s gammaloop-nextest-integration> Integrand generation summary
  341. 200.49 s gammaloop-nextest-integration> peak RAM 90.56 MiB | cores 1
  342. 200.49 s gammaloop-nextest-integration> ╭───────────┬───────┬─────────┬─────────────┬─────────────┬────────────────┬─────────────╮
  343. 200.49 s gammaloop-nextest-integration> │ integrand │ graph │ # evals │ expr build │ spenso │ symbolica eval │ compile │
  344. 200.49 s gammaloop-nextest-integration> ├───────────┼───────┼─────────┼─────────────┼─────────────┼────────────────┼─────────────┤
  345. 200.49 s gammaloop-nextest-integration> │ se1l │ se1l │ 5 │ 1.50s (88%) │ 81ms (4.7%) │ 131ms (7.7%) │ 0ms (0.00%) │
  346. 200.49 s gammaloop-nextest-integration> ├───────────┼───────┼─────────┼─────────────┼─────────────┼────────────────┼─────────────┤
  347. 200.49 s gammaloop-nextest-integration> │ Total │ │ 5 │ 1.50s (88%) │ 81ms (4.7%) │ 131ms (7.7%) │ 0ms (0.00%) │
  348. 200.49 s gammaloop-nextest-integration> ╰───────────┴───────┴─────────┴─────────────┴─────────────┴────────────────┴─────────────╯
  349. 200.49 s gammaloop-nextest-integration> [2026-08-28 16:18:53.830] @gammaloop_api::se... INFO : Running command set process -p se1l -i se1l kv general.m_uv=0.2
  350. 200.49 s gammaloop-nextest-integration> [2026-08-28 16:18:53.831] @gammaloop_api::se... INFO : Running command set process -p se1l -i se1l kv general.mu_r=0.2
  351. 200.49 s gammaloop-nextest-integration> [2026-08-28 16:18:53.831] @gammaloop_api::se... INFO : Running command set process -p se1l -i se1l kv general.renormalization_localization_scale=0.2
  352. 200.49 s gammaloop-nextest-integration> [2026-08-28 16:18:53.836] @gammaloop_api::se... INFO : Running command duplicate integrand -p se1l -i se1l --output_process_name se1l --output_integrand_name se1l_muv_shifted
  353. 200.49 s gammaloop-nextest-integration> [2026-08-28 16:18:53.837] @gammaloop_api::se... INFO : Running command set process -p se1l -i se1l_muv_shifted kv general.m_uv=0.5
  354. 200.49 s gammaloop-nextest-integration> [2026-08-28 16:18:53.844] @gammaloop_api::se... INFO : Running command duplicate integrand -p se1l -i se1l --output_process_name se1l --output_integrand_name se1l_rls_shifted
  355. 200.49 s gammaloop-nextest-integration> [2026-08-28 16:18:53.846] @gammaloop_api::se... INFO : Running command set process -p se1l -i se1l_rls_shifted kv general.renormalization_localization_scale=1
  356. 200.49 s gammaloop-nextest-integration> [2026-08-28 16:18:53.854] @gammaloop_api::se... INFO : Running command duplicate integrand -p se1l -i se1l --output_process_name se1l --output_integrand_name se1l_mur_shifted
  357. 200.49 s gammaloop-nextest-integration> [2026-08-28 16:18:53.863] @gammaloop_api::se... INFO : Running command set process -p se1l -i se1l_mur_shifted kv general.mu_r=0.8
  358. 200.49 s gammaloop-nextest-integration> [2026-08-28 16:18:53.881] @process::amplitude WARNING : External state 0 ('g', PDG 21, helicity +) is off shell: p^2 = +2.5e5, expected m^2 = +0e0 (|Δ| = +2.5e5). Fixed-helicity spinor/vector/tensor external states may be ill-defined at this kinematic point.
  359. 200.49 s gammaloop-nextest-integration> field value
  360. 200.49 s gammaloop-nextest-integration> span warm_up{integrand.name=se1l}
  361. 200.49 s gammaloop-nextest-integration> [2026-08-28 16:18:53.881] @process::amplitude WARNING : External state 1 ('g', PDG 21, helicity -) is off shell: p^2 = +2.5e5, expected m^2 = +0e0 (|Δ| = +2.5e5). Fixed-helicity spinor/vector/tensor external states may be ill-defined at this kinematic point.
  362. 200.49 s gammaloop-nextest-integration> field value
  363. 200.49 s gammaloop-nextest-integration> span warm_up{integrand.name=se1l}
  364. 200.49 s gammaloop-nextest-integration> [2026-08-28 16:18:53.882] @process::amplitude INFO : Input is above threshold: 1 existing threshold E-surfaces across 1/1 graph groups
  365. 200.49 s gammaloop-nextest-integration> field value
  366. 200.49 s gammaloop-nextest-integration> existing_esurfaces 1
  367. 200.49 s gammaloop-nextest-integration> group_count 1
  368. 200.49 s gammaloop-nextest-integration> groups_above_threshold 1
  369. 200.49 s gammaloop-nextest-integration> integrand se1l
  370. 200.49 s gammaloop-nextest-integration> span warm_up{integrand.name=se1l}
  371. 200.49 s gammaloop-nextest-integration> threshold_status above threshold
  372. 200.49 s gammaloop-nextest-integration> [2026-08-28 16:18:53.882] @process::amplitude INFO : overlap structure of group 0: [1: [0(2,3)]]
  373. 200.49 s gammaloop-nextest-integration> field value
  374. 200.49 s gammaloop-nextest-integration> span warm_up{integrand.name=se1l}
  375. 200.49 s gammaloop-nextest-integration> [2026-08-28 16:18:54.715] @commands::profile INFO :
  376. 200.49 s gammaloop-nextest-integration> ╭───────┬──────┬──────────┬───────┬─────┬──────────┬───────────╮
  377. 200.49 s gammaloop-nextest-integration> │ fixed │ → ∞ │ slope │ r2 │ DOD │ bare DOD │ inspect │
  378. 200.49 s gammaloop-nextest-integration> ├───────┼──────┼──────────┼───────┼─────┼──────────┼───────────┤
  379. 200.49 s gammaloop-nextest-integration> │ {} │ {e3} │ 1.639236 │ 0.904 │ 2 │ 2 │ arb retry │
  380. 200.49 s gammaloop-nextest-integration> │ {} │ {e2} │ 1.698834 │ 0.902 │ 2 │ 2 │ arb retry │
  381. 200.49 s gammaloop-nextest-integration> ╰───────┴──────┴──────────┴───────┴─────┴──────────┴───────────╯
  382. 200.49 s gammaloop-nextest-integration> [2026-08-28 16:18:54.715] @commands::profile INFO :
  383. 200.49 s gammaloop-nextest-integration> ╭───────┬──────┬─────────────┬──────────┬───────┬─────┬──────────┬───────────╮
  384. 200.49 s gammaloop-nextest-integration> │ fixed │ → ∞ │ orientation │ slope │ r2 │ DOD │ bare DOD │ inspect │
  385. 200.49 s gammaloop-nextest-integration> ├───────┼──────┼─────────────┼──────────┼───────┼─────┼──────────┼───────────┤
  386. 200.49 s gammaloop-nextest-integration> │ {} │ {e3} │ 00-+ │ 0.343429 │ 0.145 │ 0 │ 2 │ arb retry │
  387. 200.49 s gammaloop-nextest-integration> │ {} │ {e3} │ 00+- │ 0.342577 │ 0.135 │ 0 │ 2 │ arb retry │
  388. 200.49 s gammaloop-nextest-integration> │ {} │ {e2} │ 00-+ │ 0.385975 │ 0.161 │ 0 │ 2 │ arb retry │
  389. 200.49 s gammaloop-nextest-integration> │ {} │ {e2} │ 00+- │ 0.384920 │ 0.192 │ 0 │ 2 │ arb retry │
  390. 200.49 s gammaloop-nextest-integration> ╰───────┴──────┴─────────────┴──────────┴───────┴─────┴──────────┴───────────╯
  391. 200.49 s gammaloop-nextest-integration> [2026-08-28 16:18:54.717] @gammaloop_api::se... INFO : Running command set process kv integrator.target_relative_accuracy=0.001 integrator.n_increase=0 integrator.n_start=50000 integrator.n_max=400000 integrator.seed=1337
  392. 200.49 s gammaloop-nextest-integration> [2026-08-28 16:18:54.718] @commands::integrate INFO : Created workspace directory at /build/source/tests/artifacts/se1l/integration_workspace_se1l
  393. 200.49 s gammaloop-nextest-integration> [2026-08-28 16:18:54.911] @commands::integrate INFO : No integration state found, starting new integration
  394. 200.49 s gammaloop-nextest-integration> [2026-08-28 16:18:54.911] @commands::integrate INFO : Gammaloop now integrates se1l@se1l, se1l@se1l_muv_shifted, se1l@se1l_rls_shifted
  395. 200.49 s gammaloop-nextest-integration> [2026-08-28 16:18:54.911] @process::amplitude WARNING : External state 0 ('g', PDG 21, helicity +) is off shell: p^2 = +2.5e5, expected m^2 = +0e0 (|Δ| = +2.5e5). Fixed-helicity spinor/vector/tensor external states may be ill-defined at this kinematic point.
  396. 200.49 s gammaloop-nextest-integration> field value
  397. 200.49 s gammaloop-nextest-integration> span warm_up{integrand.name=se1l}
  398. 200.49 s gammaloop-nextest-integration> [2026-08-28 16:18:54.911] @process::amplitude WARNING : External state 1 ('g', PDG 21, helicity -) is off shell: p^2 = +2.5e5, expected m^2 = +0e0 (|Δ| = +2.5e5). Fixed-helicity spinor/vector/tensor external states may be ill-defined at this kinematic point.
  399. 200.49 s gammaloop-nextest-integration> field value
  400. 200.49 s gammaloop-nextest-integration> span warm_up{integrand.name=se1l}
  401. 200.49 s gammaloop-nextest-integration> [2026-08-28 16:18:54.916] @process::amplitude INFO : Input is above threshold: 1 existing threshold E-surfaces across 1/1 graph groups
  402. 200.49 s gammaloop-nextest-integration> field value
  403. 200.49 s gammaloop-nextest-integration> existing_esurfaces 1
  404. 200.49 s gammaloop-nextest-integration> group_count 1
  405. 200.49 s gammaloop-nextest-integration> groups_above_threshold 1
  406. 200.49 s gammaloop-nextest-integration> integrand se1l
  407. 200.49 s gammaloop-nextest-integration> span warm_up{integrand.name=se1l}
  408. 200.49 s gammaloop-nextest-integration> threshold_status above threshold
  409. 200.49 s gammaloop-nextest-integration> [2026-08-28 16:18:54.916] @process::amplitude INFO : overlap structure of group 0: [1: [0(2,3)]]
  410. 200.49 s gammaloop-nextest-integration> field value
  411. 200.49 s gammaloop-nextest-integration> span warm_up{integrand.name=se1l}
  412. 200.49 s gammaloop-nextest-integration> [2026-08-28 16:18:54.951] @process::amplitude WARNING : External state 0 ('g', PDG 21, helicity +) is off shell: p^2 = +2.5e5, expected m^2 = +0e0 (|Δ| = +2.5e5). Fixed-helicity spinor/vector/tensor external states may be ill-defined at this kinematic point.
  413. 200.49 s gammaloop-nextest-integration> field value
  414. 200.49 s gammaloop-nextest-integration> span warm_up{integrand.name=se1l_muv_shifted}
  415. 200.49 s gammaloop-nextest-integration> [2026-08-28 16:18:54.951] @process::amplitude WARNING : External state 1 ('g', PDG 21, helicity -) is off shell: p^2 = +2.5e5, expected m^2 = +0e0 (|Δ| = +2.5e5). Fixed-helicity spinor/vector/tensor external states may be ill-defined at this kinematic point.
  416. 200.49 s gammaloop-nextest-integration> field value
  417. 200.49 s gammaloop-nextest-integration> span warm_up{integrand.name=se1l_muv_shifted}
  418. 200.49 s gammaloop-nextest-integration> [2026-08-28 16:18:54.951] @process::amplitude INFO : Input is above threshold: 1 existing threshold E-surfaces across 1/1 graph groups
  419. 200.49 s gammaloop-nextest-integration> field value
  420. 200.49 s gammaloop-nextest-integration> existing_esurfaces 1
  421. 200.49 s gammaloop-nextest-integration> group_count 1
  422. 200.49 s gammaloop-nextest-integration> groups_above_threshold 1
  423. 200.49 s gammaloop-nextest-integration> integrand se1l_muv_shifted
  424. 200.49 s gammaloop-nextest-integration> span warm_up{integrand.name=se1l_muv_shifted}
  425. 200.49 s gammaloop-nextest-integration> threshold_status above threshold
  426. 200.49 s gammaloop-nextest-integration> [2026-08-28 16:18:54.951] @process::amplitude INFO : overlap structure of group 0: [1: [0(2,3)]]
  427. 200.49 s gammaloop-nextest-integration> field value
  428. 200.49 s gammaloop-nextest-integration> span warm_up{integrand.name=se1l_muv_shifted}
  429. 200.49 s gammaloop-nextest-integration> [2026-08-28 16:18:54.967] @process::amplitude WARNING : External state 0 ('g', PDG 21, helicity +) is off shell: p^2 = +2.5e5, expected m^2 = +0e0 (|Δ| = +2.5e5). Fixed-helicity spinor/vector/tensor external states may be ill-defined at this kinematic point.
  430. 200.49 s gammaloop-nextest-integration> field value
  431. 200.49 s gammaloop-nextest-integration> span warm_up{integrand.name=se1l_rls_shifted}
  432. 200.49 s gammaloop-nextest-integration> [2026-08-28 16:18:54.967] @process::amplitude WARNING : External state 1 ('g', PDG 21, helicity -) is off shell: p^2 = +2.5e5, expected m^2 = +0e0 (|Δ| = +2.5e5). Fixed-helicity spinor/vector/tensor external states may be ill-defined at this kinematic point.
  433. 200.49 s gammaloop-nextest-integration> field value
  434. 200.49 s gammaloop-nextest-integration> span warm_up{integrand.name=se1l_rls_shifted}
  435. 200.49 s gammaloop-nextest-integration> [2026-08-28 16:18:54.969] @process::amplitude INFO : Input is above threshold: 1 existing threshold E-surfaces across 1/1 graph groups
  436. 200.49 s gammaloop-nextest-integration> field value
  437. 200.49 s gammaloop-nextest-integration> existing_esurfaces 1
  438. 200.49 s gammaloop-nextest-integration> group_count 1
  439. 200.49 s gammaloop-nextest-integration> groups_above_threshold 1
  440. 200.49 s gammaloop-nextest-integration> integrand se1l_rls_shifted
  441. 200.49 s gammaloop-nextest-integration> span warm_up{integrand.name=se1l_rls_shifted}
  442. 200.49 s gammaloop-nextest-integration> threshold_status above threshold
  443. 200.49 s gammaloop-nextest-integration> ... omitted 1410 more lines; see full nextest output above
  444. 200.49 s gammaloop-nextest-integration> =========================================
  445. 200.96 s error: Cannot build '/nix/store/5lvckp7qh3dqs2nqf61qj4kz6kj46p4q-gammaloop-nextest-integration.drv'.
  446. 200.96 s Reason: builder failed with exit code 100.
  447. 200.96 s Output paths:
  448. 200.96 s /nix/store/q9ndadp0vb7l2ihf07rjiriv26fb03g2-gammaloop-nextest-integration
  449. 200.96 s Last 2048 log lines:
  450. 200.96 s > threshold_status above threshold
  451. 200.96 s > [2026-08-28 16:21:20.097] @process::amplitude INFO : overlap structure of group 0: [1: [0(2,3)]]
  452. 200.96 s > field value
  453. 200.96 s > span warm_up{integrand.name=se1l_muv_shifted}
  454. 200.96 s > [2026-08-28 16:21:20.102] @process::amplitude WARNING : External state 0 ('g', PDG 21, helicity +) is off shell: p^2 = +2.5e5, expected m^2 = +0e0 (|Δ| = +2.5e5). Fixed-helicity spinor/vector/tensor external states may be ill-defined at this kinematic point.
  455. 200.96 s > field value
  456. 200.96 s > span warm_up{integrand.name=se1l}
  457. 200.96 s > [2026-08-28 16:21:20.102] @process::amplitude WARNING : External state 1 ('g', PDG 21, helicity -) is off shell: p^2 = +2.5e5, expected m^2 = +0e0 (|Δ| = +2.5e5). Fixed-helicity spinor/vector/tensor external states may be ill-defined at this kinematic point.
  458. 200.96 s > field value
  459. 200.96 s > span warm_up{integrand.name=se1l}
  460. 200.96 s > [2026-08-28 16:21:20.102] @process::amplitude INFO : Input is above threshold: 1 existing threshold E-surfaces across 1/1 graph groups
  461. 200.96 s > field value
  462. 200.96 s > existing_esurfaces 1
  463. 200.96 s > group_count 1
  464. 200.96 s > groups_above_threshold 1
  465. 200.96 s > integrand se1l
  466. 200.96 s > span warm_up{integrand.name=se1l}
  467. 200.96 s > threshold_status above threshold
  468. 200.96 s > [2026-08-28 16:21:20.102] @process::amplitude INFO : overlap structure of group 0: [1: [0(2,3)]]
  469. 200.96 s > field value
  470. 200.96 s > span warm_up{integrand.name=se1l}
  471. 200.96 s > [2026-08-28 16:21:20.106] @process::amplitude WARNING : External state 0 ('g', PDG 21, helicity +) is off shell: p^2 = +2.5e5, expected m^2 = +0e0 (|Δ| = +2.5e5). Fixed-helicity spinor/vector/tensor external states may be ill-defined at this kinematic point.
  472. 200.96 s > field value
  473. 200.96 s > span warm_up{integrand.name=se1l_muv_shifted}
  474. 200.96 s > [2026-08-28 16:21:20.106] @process::amplitude WARNING : External state 1 ('g', PDG 21, helicity -) is off shell: p^2 = +2.5e5, expected m^2 = +0e0 (|Δ| = +2.5e5). Fixed-helicity spinor/vector/tensor external states may be ill-defined at this kinematic point.
  475. 200.96 s > field value
  476. 200.96 s > span warm_up{integrand.name=se1l_muv_shifted}
  477. 200.96 s > [2026-08-28 16:21:20.106] @process::amplitude INFO : Input is above threshold: 1 existing threshold E-surfaces across 1/1 graph groups
  478. 200.96 s > field value
  479. 200.96 s > existing_esurfaces 1
  480. 200.96 s > group_count 1
  481. 200.96 s > groups_above_threshold 1
  482. 200.96 s > integrand se1l_muv_shifted
  483. 200.96 s > span warm_up{integrand.name=se1l_muv_shifted}
  484. 200.96 s > threshold_status above threshold
  485. 200.96 s > [2026-08-28 16:21:20.106] @process::amplitude INFO : overlap structure of group 0: [1: [0(2,3)]]
  486. 200.96 s > field value
  487. 200.96 s > span warm_up{integrand.name=se1l_muv_shifted}
  488. 200.96 s > [2026-08-28 16:21:20.110] @process::amplitude WARNING : External state 0 ('g', PDG 21, helicity +) is off shell: p^2 = +2.5e5, expected m^2 = +0e0 (|Δ| = +2.5e5). Fixed-helicity spinor/vector/tensor external states may be ill-defined at this kinematic point.
  489. 200.96 s > field value
  490. 200.96 s > span warm_up{integrand.name=se1l}
  491. 200.96 s > [2026-08-28 16:21:20.110] @process::amplitude WARNING : External state 1 ('g', PDG 21, helicity -) is off shell: p^2 = +2.5e5, expected m^2 = +0e0 (|Δ| = +2.5e5). Fixed-helicity spinor/vector/tensor external states may be ill-defined at this kinematic point.
  492. 200.96 s > field value
  493. 200.96 s > span warm_up{integrand.name=se1l}
  494. 200.96 s > [2026-08-28 16:21:20.111] @process::amplitude INFO : Input is above threshold: 1 existing threshold E-surfaces across 1/1 graph groups
  495. 200.96 s > field value
  496. 200.96 s > existing_esurfaces 1
  497. 200.96 s > group_count 1
  498. 200.96 s > groups_above_threshold 1
  499. 200.96 s > integrand se1l
  500. 200.96 s > span warm_up{integrand.name=se1l}
  501. 200.96 s > threshold_status above threshold
  502. 200.96 s > [2026-08-28 16:21:20.111] @process::amplitude INFO : overlap structure of group 0: [1: [0(2,3)]]
  503. 200.96 s > field value
  504. 200.96 s > span warm_up{integrand.name=se1l}
  505. 200.96 s > [2026-08-28 16:21:20.115] @process::amplitude WARNING : External state 0 ('g', PDG 21, helicity +) is off shell: p^2 = +2.5e5, expected m^2 = +0e0 (|Δ| = +2.5e5). Fixed-helicity spinor/vector/tensor external states may be ill-defined at this kinematic point.
  506. 200.96 s > field value
  507. 200.96 s > span warm_up{integrand.name=se1l_muv_shifted}
  508. 200.96 s > [2026-08-28 16:21:20.115] @process::amplitude WARNING : External state 1 ('g', PDG 21, helicity -) is off shell: p^2 = +2.5e5, expected m^2 = +0e0 (|Δ| = +2.5e5). Fixed-helicity spinor/vector/tensor external states may be ill-defined at this kinematic point.
  509. 200.96 s > field value
  510. 200.96 s > span warm_up{integrand.name=se1l_muv_shifted}
  511. 200.96 s > [2026-08-28 16:21:20.115] @process::amplitude INFO : Input is above threshold: 1 existing threshold E-surfaces across 1/1 graph groups
  512. 200.96 s > field value
  513. 200.96 s > existing_esurfaces 1
  514. 200.96 s > group_count 1
  515. 200.96 s > groups_above_threshold 1
  516. 200.96 s > integrand se1l_muv_shifted
  517. 200.96 s > span warm_up{integrand.name=se1l_muv_shifted}
  518. 200.96 s > threshold_status above threshold
  519. 200.96 s > [2026-08-28 16:21:20.115] @process::amplitude INFO : overlap structure of group 0: [1: [0(2,3)]]
  520. 200.96 s > field value
  521. 200.96 s > span warm_up{integrand.name=se1l_muv_shifted}
  522. 200.96 s > [2026-08-28 16:21:20.119] @process::amplitude WARNING : External state 0 ('g', PDG 21, helicity +) is off shell: p^2 = +2.5e5, expected m^2 = +0e0 (|Δ| = +2.5e5). Fixed-helicity spinor/vector/tensor external states may be ill-defined at this kinematic point.
  523. 200.96 s > field value
  524. 200.96 s > span warm_up{integrand.name=se1l}
  525. 200.96 s > [2026-08-28 16:21:20.119] @process::amplitude WARNING : External state 1 ('g', PDG 21, helicity -) is off shell: p^2 = +2.5e5, expected m^2 = +0e0 (|Δ| = +2.5e5). Fixed-helicity spinor/vector/tensor external states may be ill-defined at this kinematic point.
  526. 200.96 s > field value
  527. 200.96 s > span warm_up{integrand.name=se1l}
  528. 200.96 s > [2026-08-28 16:21:20.120] @process::amplitude INFO : Input is above threshold: 1 existing threshold E-surfaces across 1/1 graph groups
  529. 200.96 s > field value
  530. 200.96 s > existing_esurfaces 1
  531. 200.96 s > group_count 1
  532. 200.96 s > groups_above_threshold 1
  533. 200.96 s > integrand se1l
  534. 200.96 s > span warm_up{integrand.name=se1l}
  535. 200.96 s > threshold_status above threshold
  536. 200.96 s > [2026-08-28 16:21:20.120] @process::amplitude INFO : overlap structure of group 0: [1: [0(2,3)]]
  537. 200.96 s > field value
  538. 200.96 s > span warm_up{integrand.name=se1l}
  539. 200.96 s > [2026-08-28 16:21:20.124] @process::amplitude WARNING : External state 0 ('g', PDG 21, helicity +) is off shell: p^2 = +2.5e5, expected m^2 = +0e0 (|Δ| = +2.5e5). Fixed-helicity spinor/vector/tensor external states may be ill-defined at this kinematic point.
  540. 200.96 s > field value
  541. 200.96 s > span warm_up{integrand.name=se1l_muv_shifted}
  542. 200.96 s > [2026-08-28 16:21:20.124] @process::amplitude WARNING : External state 1 ('g', PDG 21, helicity -) is off shell: p^2 = +2.5e5, expected m^2 = +0e0 (|Δ| = +2.5e5). Fixed-helicity spinor/vector/tensor external states may be ill-defined at this kinematic point.
  543. 200.96 s > field value
  544. 200.96 s > span warm_up{integrand.name=se1l_muv_shifted}
  545. 200.96 s > [2026-08-28 16:21:20.124] @process::amplitude INFO : Input is above threshold: 1 existing threshold E-surfaces across 1/1 graph groups
  546. 200.96 s > field value
  547. 200.96 s > existing_esurfaces 1
  548. 200.96 s > group_count 1
  549. 200.96 s > groups_above_threshold 1
  550. 200.96 s > integrand se1l_muv_shifted
  551. 200.96 s > span warm_up{integrand.name=se1l_muv_shifted}
  552. 200.96 s > threshold_status above threshold
  553. 200.96 s > [2026-08-28 16:21:20.124] @process::amplitude INFO : overlap structure of group 0: [1: [0(2,3)]]
  554. 200.96 s > field value
  555. 200.96 s > span warm_up{integrand.name=se1l_muv_shifted}
  556. 200.96 s > [2026-08-28 16:21:20.128] @process::amplitude WARNING : External state 0 ('g', PDG 21, helicity +) is off shell: p^2 = +2.5e5, expected m^2 = +0e0 (|Δ| = +2.5e5). Fixed-helicity spinor/vector/tensor external states may be ill-defined at this kinematic point.
  557. 200.96 s > field value
  558. 200.96 s > span warm_up{integrand.name=se1l}
  559. 200.96 s > [2026-08-28 16:21:20.128] @process::amplitude WARNING : External state 1 ('g', PDG 21, helicity -) is off shell: p^2 = +2.5e5, expected m^2 = +0e0 (|Δ| = +2.5e5). Fixed-helicity spinor/vector/tensor external states may be ill-defined at this kinematic point.
  560. 200.96 s > field value
  561. 200.96 s > span warm_up{integrand.name=se1l}
  562. 200.96 s > [2026-08-28 16:21:20.128] @process::amplitude INFO : Input is above threshold: 1 existing threshold E-surfaces across 1/1 graph groups
  563. 200.96 s > field value
  564. 200.96 s > existing_esurfaces 1
  565. 200.96 s > group_count 1
  566. 200.96 s > groups_above_threshold 1
  567. 200.96 s > integrand se1l
  568. 200.96 s > span warm_up{integrand.name=se1l}
  569. 200.96 s > threshold_status above threshold
  570. 200.96 s > [2026-08-28 16:21:20.128] @process::amplitude INFO : overlap structure of group 0: [1: [0(2,3)]]
  571. 200.96 s > field value
  572. 200.96 s > span warm_up{integrand.name=se1l}
  573. 200.96 s > [2026-08-28 16:21:20.133] @process::amplitude WARNING : External state 0 ('g', PDG 21, helicity +) is off shell: p^2 = +2.5e5, expected m^2 = +0e0 (|Δ| = +2.5e5). Fixed-helicity spinor/vector/tensor external states may be ill-defined at this kinematic point.
  574. 200.96 s > field value
  575. 200.96 s > span warm_up{integrand.name=se1l_rls_shifted}
  576. 200.96 s > [2026-08-28 16:21:20.133] @process::amplitude WARNING : External state 1 ('g', PDG 21, helicity -) is off shell: p^2 = +2.5e5, expected m^2 = +0e0 (|Δ| = +2.5e5). Fixed-helicity spinor/vector/tensor external states may be ill-defined at this kinematic point.
  577. 200.96 s > field value
  578. 200.96 s > span warm_up{integrand.name=se1l_rls_shifted}
  579. 200.96 s > [2026-08-28 16:21:20.133] @process::amplitude INFO : Input is above threshold: 1 existing threshold E-surfaces across 1/1 graph groups
  580. 200.96 s > field value
  581. 200.96 s > existing_esurfaces 1
  582. 200.96 s > group_count 1
  583. 200.96 s > groups_above_threshold 1
  584. 200.96 s > integrand se1l_rls_shifted
  585. 200.96 s > span warm_up{integrand.name=se1l_rls_shifted}
  586. 200.96 s > threshold_status above threshold
  587. 200.96 s > [2026-08-28 16:21:20.133] @process::amplitude INFO : overlap structure of group 0: [1: [0(2,3)]]
  588. 200.96 s > field value
  589. 200.96 s > span warm_up{integrand.name=se1l_rls_shifted}
  590. 200.96 s > [2026-08-28 16:21:20.137] @process::amplitude WARNING : External state 0 ('g', PDG 21, helicity +) is off shell: p^2 = +2.5e5, expected m^2 = +0e0 (|Δ| = +2.5e5). Fixed-helicity spinor/vector/tensor external states may be ill-defined at this kinematic point.
  591. 200.96 s > field value
  592. 200.96 s > span warm_up{integrand.name=se1l}
  593. 200.96 s > [2026-08-28 16:21:20.137] @process::amplitude WARNING : External state 1 ('g', PDG 21, helicity -) is off shell: p^2 = +2.5e5, expected m^2 = +0e0 (|Δ| = +2.5e5). Fixed-helicity spinor/vector/tensor external states may be ill-defined at this kinematic point.
  594. 200.96 s > field value
  595. 200.96 s > span warm_up{integrand.name=se1l}
  596. 200.96 s > [2026-08-28 16:21:20.138] @process::amplitude INFO : Input is above threshold: 1 existing threshold E-surfaces across 1/1 graph groups
  597. 200.96 s > field value
  598. 200.96 s > existing_esurfaces 1
  599. 200.96 s > group_count 1
  600. 200.96 s > groups_above_threshold 1
  601. 200.96 s > integrand se1l
  602. 200.96 s > span warm_up{integrand.name=se1l}
  603. 200.96 s > threshold_status above threshold
  604. 200.96 s > [2026-08-28 16:21:20.138] @process::amplitude INFO : overlap structure of group 0: [1: [0(2,3)]]
  605. 200.96 s > field value
  606. 200.96 s > span warm_up{integrand.name=se1l}
  607. 200.96 s > [2026-08-28 16:21:20.143] @process::amplitude WARNING : External state 0 ('g', PDG 21, helicity +) is off shell: p^2 = +2.5e5, expected m^2 = +0e0 (|Δ| = +2.5e5). Fixed-helicity spinor/vector/tensor external states may be ill-defined at this kinematic point.
  608. 200.96 s > field value
  609. 200.96 s > span warm_up{integrand.name=se1l_rls_shifted}
  610. 200.96 s > [2026-08-28 16:21:20.143] @process::amplitude WARNING : External state 1 ('g', PDG 21, helicity -) is off shell: p^2 = +2.5e5, expected m^2 = +0e0 (|Δ| = +2.5e5). Fixed-helicity spinor/vector/tensor external states may be ill-defined at this kinematic point.
  611. 200.96 s > field value
  612. 200.96 s > span warm_up{integrand.name=se1l_rls_shifted}
  613. 200.96 s > [2026-08-28 16:21:20.143] @process::amplitude INFO : Input is above threshold: 1 existing threshold E-surfaces across 1/1 graph groups
  614. 200.96 s > field value
  615. 200.96 s > existing_esurfaces 1
  616. 200.96 s > group_count 1
  617. 200.96 s > groups_above_threshold 1
  618. 200.96 s > integrand se1l_rls_shifted
  619. 200.96 s > span warm_up{integrand.name=se1l_rls_shifted}
  620. 200.96 s > threshold_status above threshold
  621. 200.96 s > [2026-08-28 16:21:20.143] @process::amplitude INFO : overlap structure of group 0: [1: [0(2,3)]]
  622. 200.96 s > field value
  623. 200.96 s > span warm_up{integrand.name=se1l_rls_shifted}
  624. 200.96 s > [2026-08-28 16:21:20.147] @process::amplitude WARNING : External state 0 ('g', PDG 21, helicity +) is off shell: p^2 = +2.5e5, expected m^2 = +0e0 (|Δ| = +2.5e5). Fixed-helicity spinor/vector/tensor external states may be ill-defined at this kinematic point.
  625. 200.96 s > field value
  626. 200.96 s > span warm_up{integrand.name=se1l}
  627. 200.96 s > [2026-08-28 16:21:20.147] @process::amplitude WARNING : External state 1 ('g', PDG 21, helicity -) is off shell: p^2 = +2.5e5, expected m^2 = +0e0 (|Δ| = +2.5e5). Fixed-helicity spinor/vector/tensor external states may be ill-defined at this kinematic point.
  628. 200.96 s > field value
  629. 200.96 s > span warm_up{integrand.name=se1l}
  630. 200.96 s > [2026-08-28 16:21:20.148] @process::amplitude INFO : Input is above threshold: 1 existing threshold E-surfaces across 1/1 graph groups
  631. 200.96 s > field value
  632. 200.96 s > existing_esurfaces 1
  633. 200.96 s > group_count 1
  634. 200.96 s > groups_above_threshold 1
  635. 200.96 s > integrand se1l
  636. 200.96 s > span warm_up{integrand.name=se1l}
  637. 200.96 s > threshold_status above threshold
  638. 200.96 s > [2026-08-28 16:21:20.148] @process::amplitude INFO : overlap structure of group 0: [1: [0(2,3)]]
  639. 200.96 s > field value
  640. 200.96 s > span warm_up{integrand.name=se1l}
  641. 200.96 s > [2026-08-28 16:21:20.152] @process::amplitude WARNING : External state 0 ('g', PDG 21, helicity +) is off shell: p^2 = +2.5e5, expected m^2 = +0e0 (|Δ| = +2.5e5). Fixed-helicity spinor/vector/tensor external states may be ill-defined at this kinematic point.
  642. 200.96 s > field value
  643. 200.96 s > span warm_up{integrand.name=se1l_rls_shifted}
  644. 200.96 s > [2026-08-28 16:21:20.152] @process::amplitude WARNING : External state 1 ('g', PDG 21, helicity -) is off shell: p^2 = +2.5e5, expected m^2 = +0e0 (|Δ| = +2.5e5). Fixed-helicity spinor/vector/tensor external states may be ill-defined at this kinematic point.
  645. 200.96 s > field value
  646. 200.96 s > span warm_up{integrand.name=se1l_rls_shifted}
  647. 200.96 s > [2026-08-28 16:21:20.152] @process::amplitude INFO : Input is above threshold: 1 existing threshold E-surfaces across 1/1 graph groups
  648. 200.96 s > field value
  649. 200.96 s > existing_esurfaces 1
  650. 200.96 s > group_count 1
  651. 200.96 s > groups_above_threshold 1
  652. 200.96 s > integrand se1l_rls_shifted
  653. 200.96 s > span warm_up{integrand.name=se1l_rls_shifted}
  654. 200.96 s > threshold_status above threshold
  655. 200.96 s > [2026-08-28 16:21:20.152] @process::amplitude INFO : overlap structure of group 0: [1: [0(2,3)]]
  656. 200.96 s > field value
  657. 200.96 s > span warm_up{integrand.name=se1l_rls_shifted}
  658. 200.96 s > [2026-08-28 16:21:20.156] @process::amplitude WARNING : External state 0 ('g', PDG 21, helicity +) is off shell: p^2 = +2.5e5, expected m^2 = +0e0 (|Δ| = +2.5e5). Fixed-helicity spinor/vector/tensor external states may be ill-defined at this kinematic point.
  659. 200.96 s > field value
  660. 200.96 s > span warm_up{integrand.name=se1l}
  661. 200.96 s > [2026-08-28 16:21:20.156] @process::amplitude WARNING : External state 1 ('g', PDG 21, helicity -) is off shell: p^2 = +2.5e5, expected m^2 = +0e0 (|Δ| = +2.5e5). Fixed-helicity spinor/vector/tensor external states may be ill-defined at this kinematic point.
  662. 200.96 s > field value
  663. 200.96 s > span warm_up{integrand.name=se1l}
  664. 200.96 s > [2026-08-28 16:21:20.157] @process::amplitude INFO : Input is above threshold: 1 existing threshold E-surfaces across 1/1 graph groups
  665. 200.96 s > field value
  666. 200.96 s > existing_esurfaces 1
  667. 200.96 s > group_count 1
  668. 200.96 s > groups_above_threshold 1
  669. 200.96 s > integrand se1l
  670. 200.96 s > span warm_up{integrand.name=se1l}
  671. 200.96 s > threshold_status above threshold
  672. 200.96 s > [2026-08-28 16:21:20.157] @process::amplitude INFO : overlap structure of group 0: [1: [0(2,3)]]
  673. 200.96 s > field value
  674. 200.96 s > span warm_up{integrand.name=se1l}
  675. 200.96 s > [2026-08-28 16:21:20.161] @process::amplitude WARNING : External state 0 ('g', PDG 21, helicity +) is off shell: p^2 = +2.5e5, expected m^2 = +0e0 (|Δ| = +2.5e5). Fixed-helicity spinor/vector/tensor external states may be ill-defined at this kinematic point.
  676. 200.96 s > field value
  677. 200.96 s > span warm_up{integrand.name=se1l_rls_shifted}
  678. 200.96 s > [2026-08-28 16:21:20.161] @process::amplitude WARNING : External state 1 ('g', PDG 21, helicity -) is off shell: p^2 = +2.5e5, expected m^2 = +0e0 (|Δ| = +2.5e5). Fixed-helicity spinor/vector/tensor external states may be ill-defined at this kinematic point.
  679. 200.96 s > field value
  680. 200.96 s > span warm_up{integrand.name=se1l_rls_shifted}
  681. 200.96 s > [2026-08-28 16:21:20.161] @process::amplitude INFO : Input is above threshold: 1 existing threshold E-surfaces across 1/1 graph groups
  682. 200.96 s > field value
  683. 200.96 s > existing_esurfaces 1
  684. 200.96 s > group_count 1
  685. 200.96 s > groups_above_threshold 1
  686. 200.96 s > integrand se1l_rls_shifted
  687. 200.96 s > span warm_up{integrand.name=se1l_rls_shifted}
  688. 200.96 s > threshold_status above threshold
  689. 200.96 s > [2026-08-28 16:21:20.161] @process::amplitude INFO : overlap structure of group 0: [1: [0(2,3)]]
  690. 200.96 s > field value
  691. 200.96 s > span warm_up{integrand.name=se1l_rls_shifted}
  692. 200.96 s > [2026-08-28 16:21:20.165] @process::amplitude WARNING : External state 0 ('g', PDG 21, helicity +) is off shell: p^2 = +2.5e5, expected m^2 = +0e0 (|Δ| = +2.5e5). Fixed-helicity spinor/vector/tensor external states may be ill-defined at this kinematic point.
  693. 200.96 s > field value
  694. 200.96 s > span warm_up{integrand.name=se1l}
  695. 200.96 s > [2026-08-28 16:21:20.165] @process::amplitude WARNING : External state 1 ('g', PDG 21, helicity -) is off shell: p^2 = +2.5e5, expected m^2 = +0e0 (|Δ| = +2.5e5). Fixed-helicity spinor/vector/tensor external states may be ill-defined at this kinematic point.
  696. 200.96 s > field value
  697. 200.96 s > span warm_up{integrand.name=se1l}
  698. 200.96 s > [2026-08-28 16:21:20.165] @process::amplitude INFO : Input is above threshold: 1 existing threshold E-surfaces across 1/1 graph groups
  699. 200.96 s > field value
  700. 200.96 s > existing_esurfaces 1
  701. 200.96 s > group_count 1
  702. 200.96 s > groups_above_threshold 1
  703. 200.96 s > integrand se1l
  704. 200.96 s > span warm_up{integrand.name=se1l}
  705. 200.96 s > threshold_status above threshold
  706. 200.96 s > [2026-08-28 16:21:20.166] @process::amplitude INFO : overlap structure of group 0: [1: [0(2,3)]]
  707. 200.96 s > field value
  708. 200.96 s > span warm_up{integrand.name=se1l}
  709. 200.96 s > [2026-08-28 16:21:20.170] @process::amplitude WARNING : External state 0 ('g', PDG 21, helicity +) is off shell: p^2 = +2.5e5, expected m^2 = +0e0 (|Δ| = +2.5e5). Fixed-helicity spinor/vector/tensor external states may be ill-defined at this kinematic point.
  710. 200.96 s > field value
  711. 200.96 s > span warm_up{integrand.name=se1l_rls_shifted}
  712. 200.96 s > [2026-08-28 16:21:20.170] @process::amplitude WARNING : External state 1 ('g', PDG 21, helicity -) is off shell: p^2 = +2.5e5, expected m^2 = +0e0 (|Δ| = +2.5e5). Fixed-helicity spinor/vector/tensor external states may be ill-defined at this kinematic point.
  713. 200.96 s > field value
  714. 200.96 s > span warm_up{integrand.name=se1l_rls_shifted}
  715. 200.96 s > [2026-08-28 16:21:20.170] @process::amplitude INFO : Input is above threshold: 1 existing threshold E-surfaces across 1/1 graph groups
  716. 200.96 s > field value
  717. 200.96 s > existing_esurfaces 1
  718. 200.96 s > group_count 1
  719. 200.96 s > groups_above_threshold 1
  720. 200.96 s > integrand se1l_rls_shifted
  721. 200.96 s > span warm_up{integrand.name=se1l_rls_shifted}
  722. 200.96 s > threshold_status above threshold
  723. 200.96 s > [2026-08-28 16:21:20.170] @process::amplitude INFO : overlap structure of group 0: [1: [0(2,3)]]
  724. 200.96 s > field value
  725. 200.96 s > span warm_up{integrand.name=se1l_rls_shifted}
  726. 200.96 s > [2026-08-28 16:21:20.174] @process::amplitude WARNING : External state 0 ('g', PDG 21, helicity +) is off shell: p^2 = +2.5e5, expected m^2 = +0e0 (|Δ| = +2.5e5). Fixed-helicity spinor/vector/tensor external states may be ill-defined at this kinematic point.
  727. 200.96 s > field value
  728. 200.96 s > span warm_up{integrand.name=se1l}
  729. 200.96 s > [2026-08-28 16:21:20.174] @process::amplitude WARNING : External state 1 ('g', PDG 21, helicity -) is off shell: p^2 = +2.5e5, expected m^2 = +0e0 (|Δ| = +2.5e5). Fixed-helicity spinor/vector/tensor external states may be ill-defined at this kinematic point.
  730. 200.96 s > field value
  731. 200.96 s > span warm_up{integrand.name=se1l}
  732. 200.96 s > [2026-08-28 16:21:20.174] @process::amplitude INFO : Input is above threshold: 1 existing threshold E-surfaces across 1/1 graph groups
  733. 200.96 s > field value
  734. 200.96 s > existing_esurfaces 1
  735. 200.96 s > group_count 1
  736. 200.96 s > groups_above_threshold 1
  737. 200.96 s > integrand se1l
  738. 200.96 s > span warm_up{integrand.name=se1l}
  739. 200.96 s > threshold_status above threshold
  740. 200.96 s > [2026-08-28 16:21:20.174] @process::amplitude INFO : overlap structure of group 0: [1: [0(2,3)]]
  741. 200.96 s > field value
  742. 200.96 s > span warm_up{integrand.name=se1l}
  743. 200.96 s > [2026-08-28 16:21:20.178] @process::amplitude WARNING : External state 0 ('g', PDG 21, helicity +) is off shell: p^2 = +2.5e5, expected m^2 = +0e0 (|Δ| = +2.5e5). Fixed-helicity spinor/vector/tensor external states may be ill-defined at this kinematic point.
  744. 200.96 s > field value
  745. 200.96 s > span warm_up{integrand.name=se1l_rls_shifted}
  746. 200.96 s > [2026-08-28 16:21:20.178] @process::amplitude WARNING : External state 1 ('g', PDG 21, helicity -) is off shell: p^2 = +2.5e5, expected m^2 = +0e0 (|Δ| = +2.5e5). Fixed-helicity spinor/vector/tensor external states may be ill-defined at this kinematic point.
  747. 200.96 s > field value
  748. 200.96 s > span warm_up{integrand.name=se1l_rls_shifted}
  749. 200.96 s > [2026-08-28 16:21:20.179] @process::amplitude INFO : Input is above threshold: 1 existing threshold E-surfaces across 1/1 graph groups
  750. 200.96 s > field value
  751. 200.96 s > existing_esurfaces 1
  752. 200.96 s > group_count 1
  753. 200.96 s > groups_above_threshold 1
  754. 200.96 s > integrand se1l_rls_shifted
  755. 200.96 s > span warm_up{integrand.name=se1l_rls_shifted}
  756. 200.96 s > threshold_status above threshold
  757. 200.96 s > [2026-08-28 16:21:20.179] @process::amplitude INFO : overlap structure of group 0: [1: [0(2,3)]]
  758. 200.96 s > field value
  759. 200.96 s > span warm_up{integrand.name=se1l_rls_shifted}
  760. 200.96 s > [2026-08-28 16:21:20.183] @process::amplitude WARNING : External state 0 ('g', PDG 21, helicity +) is off shell: p^2 = +2.5e5, expected m^2 = +0e0 (|Δ| = +2.5e5). Fixed-helicity spinor/vector/tensor external states may be ill-defined at this kinematic point.
  761. 200.96 s > field value
  762. 200.96 s > span warm_up{integrand.name=se1l}
  763. 200.96 s > [2026-08-28 16:21:20.183] @process::amplitude WARNING : External state 1 ('g', PDG 21, helicity -) is off shell: p^2 = +2.5e5, expected m^2 = +0e0 (|Δ| = +2.5e5). Fixed-helicity spinor/vector/tensor external states may be ill-defined at this kinematic point.
  764. 200.96 s > field value
  765. 200.96 s > span warm_up{integrand.name=se1l}
  766. 200.96 s > [2026-08-28 16:21:20.183] @process::amplitude INFO : Input is above threshold: 1 existing threshold E-surfaces across 1/1 graph groups
  767. 200.96 s > field value
  768. 200.96 s > existing_esurfaces 1
  769. 200.96 s > group_count 1
  770. 200.96 s > groups_above_threshold 1
  771. 200.96 s > integrand se1l
  772. 200.96 s > span warm_up{integrand.name=se1l}
  773. 200.96 s > threshold_status above threshold
  774. 200.96 s > [2026-08-28 16:21:20.183] @process::amplitude INFO : overlap structure of group 0: [1: [0(2,3)]]
  775. 200.96 s > field value
  776. 200.96 s > span warm_up{integrand.name=se1l}
  777. 200.96 s > [2026-08-28 16:21:20.187] @process::amplitude WARNING : External state 0 ('g', PDG 21, helicity +) is off shell: p^2 = +2.5e5, expected m^2 = +0e0 (|Δ| = +2.5e5). Fixed-helicity spinor/vector/tensor external states may be ill-defined at this kinematic point.
  778. 200.96 s > field value
  779. 200.96 s > span warm_up{integrand.name=se1l_rls_shifted}
  780. 200.96 s > [2026-08-28 16:21:20.187] @process::amplitude WARNING : External state 1 ('g', PDG 21, helicity -) is off shell: p^2 = +2.5e5, expected m^2 = +0e0 (|Δ| = +2.5e5). Fixed-helicity spinor/vector/tensor external states may be ill-defined at this kinematic point.
  781. 200.96 s > field value
  782. 200.96 s > span warm_up{integrand.name=se1l_rls_shifted}
  783. 200.96 s > [2026-08-28 16:21:20.188] @process::amplitude INFO : Input is above threshold: 1 existing threshold E-surfaces across 1/1 graph groups
  784. 200.96 s > field value
  785. 200.96 s > existing_esurfaces 1
  786. 200.96 s > group_count 1
  787. 200.96 s > groups_above_threshold 1
  788. 200.96 s > integrand se1l_rls_shifted
  789. 200.96 s > span warm_up{integrand.name=se1l_rls_shifted}
  790. 200.96 s > threshold_status above threshold
  791. 200.96 s > [2026-08-28 16:21:20.188] @process::amplitude INFO : overlap structure of group 0: [1: [0(2,3)]]
  792. 200.96 s > field value
  793. 200.96 s > span warm_up{integrand.name=se1l_rls_shifted}
  794. 200.96 s > [2026-08-28 16:21:20.192] @process::amplitude WARNING : External state 0 ('g', PDG 21, helicity +) is off shell: p^2 = +2.5e5, expected m^2 = +0e0 (|Δ| = +2.5e5). Fixed-helicity spinor/vector/tensor external states may be ill-defined at this kinematic point.
  795. 200.96 s > field value
  796. 200.96 s > span warm_up{integrand.name=se1l}
  797. 200.96 s > [2026-08-28 16:21:20.192] @process::amplitude WARNING : External state 1 ('g', PDG 21, helicity -) is off shell: p^2 = +2.5e5, expected m^2 = +0e0 (|Δ| = +2.5e5). Fixed-helicity spinor/vector/tensor external states may be ill-defined at this kinematic point.
  798. 200.96 s > field value
  799. 200.96 s > span warm_up{integrand.name=se1l}
  800. 200.96 s > [2026-08-28 16:21:20.192] @process::amplitude INFO : Input is above threshold: 1 existing threshold E-surfaces across 1/1 graph groups
  801. 200.96 s > field value
  802. 200.96 s > existing_esurfaces 1
  803. 200.96 s > group_count 1
  804. 200.96 s > groups_above_threshold 1
  805. 200.96 s > integrand se1l
  806. 200.96 s > span warm_up{integrand.name=se1l}
  807. 200.96 s > threshold_status above threshold
  808. 200.96 s > [2026-08-28 16:21:20.192] @process::amplitude INFO : overlap structure of group 0: [1: [0(2,3)]]
  809. 200.96 s > field value
  810. 200.96 s > span warm_up{integrand.name=se1l}
  811. 200.96 s > [2026-08-28 16:21:20.196] @process::amplitude WARNING : External state 0 ('g', PDG 21, helicity +) is off shell: p^2 = +2.5e5, expected m^2 = +0e0 (|Δ| = +2.5e5). Fixed-helicity spinor/vector/tensor external states may be ill-defined at this kinematic point.
  812. 200.96 s > field value
  813. 200.96 s > span warm_up{integrand.name=se1l_rls_shifted}
  814. 200.96 s > [2026-08-28 16:21:20.197] @process::amplitude WARNING : External state 1 ('g', PDG 21, helicity -) is off shell: p^2 = +2.5e5, expected m^2 = +0e0 (|Δ| = +2.5e5). Fixed-helicity spinor/vector/tensor external states may be ill-defined at this kinematic point.
  815. 200.96 s > field value
  816. 200.96 s > span warm_up{integrand.name=se1l_rls_shifted}
  817. 200.96 s > [2026-08-28 16:21:20.197] @process::amplitude INFO : Input is above threshold: 1 existing threshold E-surfaces across 1/1 graph groups
  818. 200.96 s > field value
  819. 200.96 s > existing_esurfaces 1
  820. 200.96 s > group_count 1
  821. 200.96 s > groups_above_threshold 1
  822. 200.96 s > integrand se1l_rls_shifted
  823. 200.96 s > span warm_up{integrand.name=se1l_rls_shifted}
  824. 200.96 s > threshold_status above threshold
  825. 200.96 s > [2026-08-28 16:21:20.197] @process::amplitude INFO : overlap structure of group 0: [1: [0(2,3)]]
  826. 200.96 s > field value
  827. 200.96 s > span warm_up{integrand.name=se1l_rls_shifted}
  828. 200.96 s > [2026-08-28 16:21:20.201] @process::amplitude WARNING : External state 0 ('g', PDG 21, helicity +) is off shell: p^2 = +2.5e5, expected m^2 = +0e0 (|Δ| = +2.5e5). Fixed-helicity spinor/vector/tensor external states may be ill-defined at this kinematic point.
  829. 200.96 s > field value
  830. 200.96 s > span warm_up{integrand.name=se1l}
  831. 200.96 s > [2026-08-28 16:21:20.201] @process::amplitude WARNING : External state 1 ('g', PDG 21, helicity -) is off shell: p^2 = +2.5e5, expected m^2 = +0e0 (|Δ| = +2.5e5). Fixed-helicity spinor/vector/tensor external states may be ill-defined at this kinematic point.
  832. 200.96 s > field value
  833. 200.96 s > span warm_up{integrand.name=se1l}
  834. 200.96 s > [2026-08-28 16:21:20.201] @process::amplitude INFO : Input is above threshold: 1 existing threshold E-surfaces across 1/1 graph groups
  835. 200.96 s > field value
  836. 200.96 s > existing_esurfaces 1
  837. 200.96 s > group_count 1
  838. 200.96 s > groups_above_threshold 1
  839. 200.96 s > integrand se1l
  840. 200.96 s > span warm_up{integrand.name=se1l}
  841. 200.97 s > threshold_status above threshold
  842. 200.97 s > [2026-08-28 16:21:20.201] @process::amplitude INFO : overlap structure of group 0: [1: [0(2,3)]]
  843. 200.97 s > field value
  844. 200.97 s > span warm_up{integrand.name=se1l}
  845. 200.97 s > [2026-08-28 16:21:20.206] @process::amplitude WARNING : External state 0 ('g', PDG 21, helicity +) is off shell: p^2 = +2.5e5, expected m^2 = +0e0 (|Δ| = +2.5e5). Fixed-helicity spinor/vector/tensor external states may be ill-defined at this kinematic point.
  846. 200.97 s > field value
  847. 200.97 s > span warm_up{integrand.name=se1l_rls_shifted}
  848. 200.97 s > [2026-08-28 16:21:20.206] @process::amplitude WARNING : External state 1 ('g', PDG 21, helicity -) is off shell: p^2 = +2.5e5, expected m^2 = +0e0 (|Δ| = +2.5e5). Fixed-helicity spinor/vector/tensor external states may be ill-defined at this kinematic point.
  849. 200.97 s > field value
  850. 200.97 s > span warm_up{integrand.name=se1l_rls_shifted}
  851. 200.97 s > [2026-08-28 16:21:20.206] @process::amplitude INFO : Input is above threshold: 1 existing threshold E-surfaces across 1/1 graph groups
  852. 200.97 s > field value
  853. 200.97 s > existing_esurfaces 1
  854. 200.97 s > group_count 1
  855. 200.97 s > groups_above_threshold 1
  856. 200.97 s > integrand se1l_rls_shifted
  857. 200.97 s > span warm_up{integrand.name=se1l_rls_shifted}
  858. 200.97 s > threshold_status above threshold
  859. 200.97 s > [2026-08-28 16:21:20.206] @process::amplitude INFO : overlap structure of group 0: [1: [0(2,3)]]
  860. 200.97 s > field value
  861. 200.97 s > span warm_up{integrand.name=se1l_rls_shifted}
  862. 200.97 s > [2026-08-28 16:21:20.210] @process::amplitude WARNING : External state 0 ('g', PDG 21, helicity +) is off shell: p^2 = +2.5e5, expected m^2 = +0e0 (|Δ| = +2.5e5). Fixed-helicity spinor/vector/tensor external states may be ill-defined at this kinematic point.
  863. 200.97 s > field value
  864. 200.97 s > span warm_up{integrand.name=se1l}
  865. 200.97 s > [2026-08-28 16:21:20.211] @process::amplitude WARNING : External state 1 ('g', PDG 21, helicity -) is off shell: p^2 = +2.5e5, expected m^2 = +0e0 (|Δ| = +2.5e5). Fixed-helicity spinor/vector/tensor external states may be ill-defined at this kinematic point.
  866. 200.97 s > field value
  867. 200.97 s > span warm_up{integrand.name=se1l}
  868. 200.97 s > [2026-08-28 16:21:20.211] @process::amplitude INFO : Input is above threshold: 1 existing threshold E-surfaces across 1/1 graph groups
  869. 200.97 s > field value
  870. 200.97 s > existing_esurfaces 1
  871. 200.97 s > group_count 1
  872. 200.97 s > groups_above_threshold 1
  873. 200.97 s > integrand se1l
  874. 200.97 s > span warm_up{integrand.name=se1l}
  875. 200.97 s > threshold_status above threshold
  876. 200.97 s > [2026-08-28 16:21:20.211] @process::amplitude INFO : overlap structure of group 0: [1: [0(2,3)]]
  877. 200.97 s > field value
  878. 200.97 s > span warm_up{integrand.name=se1l}
  879. 200.97 s > [2026-08-28 16:21:20.215] @process::amplitude WARNING : External state 0 ('g', PDG 21, helicity +) is off shell: p^2 = +2.5e5, expected m^2 = +0e0 (|Δ| = +2.5e5). Fixed-helicity spinor/vector/tensor external states may be ill-defined at this kinematic point.
  880. 200.97 s > field value
  881. 200.97 s > span warm_up{integrand.name=se1l_rls_shifted}
  882. 200.97 s > [2026-08-28 16:21:20.215] @process::amplitude WARNING : External state 1 ('g', PDG 21, helicity -) is off shell: p^2 = +2.5e5, expected m^2 = +0e0 (|Δ| = +2.5e5). Fixed-helicity spinor/vector/tensor external states may be ill-defined at this kinematic point.
  883. 200.97 s > field value
  884. 200.97 s > span warm_up{integrand.name=se1l_rls_shifted}
  885. 200.97 s > [2026-08-28 16:21:20.215] @process::amplitude INFO : Input is above threshold: 1 existing threshold E-surfaces across 1/1 graph groups
  886. 200.97 s > field value
  887. 200.97 s > existing_esurfaces 1
  888. 200.97 s > group_count 1
  889. 200.97 s > groups_above_threshold 1
  890. 200.97 s > integrand se1l_rls_shifted
  891. 200.97 s > span warm_up{integrand.name=se1l_rls_shifted}
  892. 200.97 s > threshold_status above threshold
  893. 200.97 s > [2026-08-28 16:21:20.215] @process::amplitude INFO : overlap structure of group 0: [1: [0(2,3)]]
  894. 200.97 s > field value
  895. 200.97 s > span warm_up{integrand.name=se1l_rls_shifted}
  896. 200.97 s > [2026-08-28 16:21:20.220] @process::amplitude WARNING : External state 0 ('g', PDG 21, helicity +) is off shell: p^2 = +2.5e5, expected m^2 = +0e0 (|Δ| = +2.5e5). Fixed-helicity spinor/vector/tensor external states may be ill-defined at this kinematic point.
  897. 200.97 s > field value
  898. 200.97 s > span warm_up{integrand.name=se1l}
  899. 200.97 s > [2026-08-28 16:21:20.220] @process::amplitude WARNING : External state 1 ('g', PDG 21, helicity -) is off shell: p^2 = +2.5e5, expected m^2 = +0e0 (|Δ| = +2.5e5). Fixed-helicity spinor/vector/tensor external states may be ill-defined at this kinematic point.
  900. 200.97 s > field value
  901. 200.97 s > span warm_up{integrand.name=se1l}
  902. 200.97 s > [2026-08-28 16:21:20.220] @process::amplitude INFO : Input is above threshold: 1 existing threshold E-surfaces across 1/1 graph groups
  903. 200.97 s > field value
  904. 200.97 s > existing_esurfaces 1
  905. 200.97 s > group_count 1
  906. 200.97 s > groups_above_threshold 1
  907. 200.97 s > integrand se1l
  908. 200.97 s > span warm_up{integrand.name=se1l}
  909. 200.97 s > threshold_status above threshold
  910. 200.97 s > [2026-08-28 16:21:20.220] @process::amplitude INFO : overlap structure of group 0: [1: [0(2,3)]]
  911. 200.97 s > field value
  912. 200.97 s > span warm_up{integrand.name=se1l}
  913. 200.97 s > [2026-08-28 16:21:20.224] @process::amplitude WARNING : External state 0 ('g', PDG 21, helicity +) is off shell: p^2 = +2.5e5, expected m^2 = +0e0 (|Δ| = +2.5e5). Fixed-helicity spinor/vector/tensor external states may be ill-defined at this kinematic point.
  914. 200.97 s > field value
  915. 200.97 s > span warm_up{integrand.name=se1l_mur_shifted}
  916. 200.97 s > [2026-08-28 16:21:20.225] @process::amplitude WARNING : External state 1 ('g', PDG 21, helicity -) is off shell: p^2 = +2.5e5, expected m^2 = +0e0 (|Δ| = +2.5e5). Fixed-helicity spinor/vector/tensor external states may be ill-defined at this kinematic point.
  917. 200.97 s > field value
  918. 200.97 s > span warm_up{integrand.name=se1l_mur_shifted}
  919. 200.97 s > [2026-08-28 16:21:20.225] @process::amplitude INFO : Input is above threshold: 1 existing threshold E-surfaces across 1/1 graph groups
  920. 200.97 s > field value
  921. 200.97 s > existing_esurfaces 1
  922. 200.97 s > group_count 1
  923. 200.97 s > groups_above_threshold 1
  924. 200.97 s > integrand se1l_mur_shifted
  925. 200.97 s > span warm_up{integrand.name=se1l_mur_shifted}
  926. 200.97 s > threshold_status above threshold
  927. 200.97 s > [2026-08-28 16:21:20.225] @process::amplitude INFO : overlap structure of group 0: [1: [0(2,3)]]
  928. 200.97 s > field value
  929. 200.97 s > span warm_up{integrand.name=se1l_mur_shifted}
  930. 200.97 s > [2026-08-28 16:21:20.229] @process::amplitude WARNING : External state 0 ('g', PDG 21, helicity +) is off shell: p^2 = +2.5e5, expected m^2 = +0e0 (|Δ| = +2.5e5). Fixed-helicity spinor/vector/tensor external states may be ill-defined at this kinematic point.
  931. 200.97 s > field value
  932. 200.97 s > span warm_up{integrand.name=se1l}
  933. 200.97 s > [2026-08-28 16:21:20.229] @process::amplitude WARNING : External state 1 ('g', PDG 21, helicity -) is off shell: p^2 = +2.5e5, expected m^2 = +0e0 (|Δ| = +2.5e5). Fixed-helicity spinor/vector/tensor external states may be ill-defined at this kinematic point.
  934. 200.97 s > field value
  935. 200.97 s > span warm_up{integrand.name=se1l}
  936. 200.97 s > [2026-08-28 16:21:20.229] @process::amplitude INFO : Input is above threshold: 1 existing threshold E-surfaces across 1/1 graph groups
  937. 200.97 s > field value
  938. 200.97 s > existing_esurfaces 1
  939. 200.97 s > group_count 1
  940. 200.97 s > groups_above_threshold 1
  941. 200.97 s > integrand se1l
  942. 200.97 s > span warm_up{integrand.name=se1l}
  943. 200.97 s > threshold_status above threshold
  944. 200.97 s > [2026-08-28 16:21:20.229] @process::amplitude INFO : overlap structure of group 0: [1: [0(2,3)]]
  945. 200.97 s > field value
  946. 200.97 s > span warm_up{integrand.name=se1l}
  947. 200.97 s > [2026-08-28 16:21:20.234] @process::amplitude WARNING : External state 0 ('g', PDG 21, helicity +) is off shell: p^2 = +2.5e5, expected m^2 = +0e0 (|Δ| = +2.5e5). Fixed-helicity spinor/vector/tensor external states may be ill-defined at this kinematic point.
  948. 200.97 s > field value
  949. 200.97 s > span warm_up{integrand.name=se1l_mur_shifted}
  950. 200.97 s > [2026-08-28 16:21:20.234] @process::amplitude WARNING : External state 1 ('g', PDG 21, helicity -) is off shell: p^2 = +2.5e5, expected m^2 = +0e0 (|Δ| = +2.5e5). Fixed-helicity spinor/vector/tensor external states may be ill-defined at this kinematic point.
  951. 200.97 s > field value
  952. 200.97 s > span warm_up{integrand.name=se1l_mur_shifted}
  953. 200.97 s > [2026-08-28 16:21:20.234] @process::amplitude INFO : Input is above threshold: 1 existing threshold E-surfaces across 1/1 graph groups
  954. 200.97 s > field value
  955. 200.97 s > existing_esurfaces 1
  956. 200.97 s > group_count 1
  957. 200.97 s > groups_above_threshold 1
  958. 200.97 s > integrand se1l_mur_shifted
  959. 200.97 s > span warm_up{integrand.name=se1l_mur_shifted}
  960. 200.97 s > threshold_status above threshold
  961. 200.97 s > [2026-08-28 16:21:20.234] @process::amplitude INFO : overlap structure of group 0: [1: [0(2,3)]]
  962. 200.97 s > field value
  963. 200.97 s > span warm_up{integrand.name=se1l_mur_shifted}
  964. 200.97 s > [2026-08-28 16:21:20.238] @process::amplitude WARNING : External state 0 ('g', PDG 21, helicity +) is off shell: p^2 = +2.5e5, expected m^2 = +0e0 (|Δ| = +2.5e5). Fixed-helicity spinor/vector/tensor external states may be ill-defined at this kinematic point.
  965. 200.97 s > field value
  966. 200.97 s > span warm_up{integrand.name=se1l}
  967. 200.97 s > [2026-08-28 16:21:20.238] @process::amplitude WARNING : External state 1 ('g', PDG 21, helicity -) is off shell: p^2 = +2.5e5, expected m^2 = +0e0 (|Δ| = +2.5e5). Fixed-helicity spinor/vector/tensor external states may be ill-defined at this kinematic point.
  968. 200.97 s > field value
  969. 200.97 s > span warm_up{integrand.name=se1l}
  970. 200.97 s > [2026-08-28 16:21:20.239] @process::amplitude INFO : Input is above threshold: 1 existing threshold E-surfaces across 1/1 graph groups
  971. 200.97 s > field value
  972. 200.97 s > existing_esurfaces 1
  973. 200.97 s > group_count 1
  974. 200.97 s > groups_above_threshold 1
  975. 200.97 s > integrand se1l
  976. 200.97 s > span warm_up{integrand.name=se1l}
  977. 200.97 s > threshold_status above threshold
  978. 200.97 s > [2026-08-28 16:21:20.239] @process::amplitude INFO : overlap structure of group 0: [1: [0(2,3)]]
  979. 200.97 s > field value
  980. 200.97 s > span warm_up{integrand.name=se1l}
  981. 200.97 s > [2026-08-28 16:21:20.243] @process::amplitude WARNING : External state 0 ('g', PDG 21, helicity +) is off shell: p^2 = +2.5e5, expected m^2 = +0e0 (|Δ| = +2.5e5). Fixed-helicity spinor/vector/tensor external states may be ill-defined at this kinematic point.
  982. 200.97 s > field value
  983. 200.97 s > span warm_up{integrand.name=se1l_mur_shifted}
  984. 200.97 s > [2026-08-28 16:21:20.243] @process::amplitude WARNING : External state 1 ('g', PDG 21, helicity -) is off shell: p^2 = +2.5e5, expected m^2 = +0e0 (|Δ| = +2.5e5). Fixed-helicity spinor/vector/tensor external states may be ill-defined at this kinematic point.
  985. 200.97 s > field value
  986. 200.97 s > span warm_up{integrand.name=se1l_mur_shifted}
  987. 200.97 s > [2026-08-28 16:21:20.243] @process::amplitude INFO : Input is above threshold: 1 existing threshold E-surfaces across 1/1 graph groups
  988. 200.97 s > field value
  989. 200.97 s > existing_esurfaces 1
  990. 200.97 s > group_count 1
  991. 200.97 s > groups_above_threshold 1
  992. 200.97 s > integrand se1l_mur_shifted
  993. 200.97 s > span warm_up{integrand.name=se1l_mur_shifted}
  994. 200.97 s > threshold_status above threshold
  995. 200.97 s > [2026-08-28 16:21:20.244] @process::amplitude INFO : overlap structure of group 0: [1: [0(2,3)]]
  996. 200.97 s > field value
  997. 200.97 s > span warm_up{integrand.name=se1l_mur_shifted}
  998. 200.97 s > [2026-08-28 16:21:20.248] @process::amplitude WARNING : External state 0 ('g', PDG 21, helicity +) is off shell: p^2 = +2.5e5, expected m^2 = +0e0 (|Δ| = +2.5e5). Fixed-helicity spinor/vector/tensor external states may be ill-defined at this kinematic point.
  999. 200.97 s > field value
  1000. 200.97 s > span warm_up{integrand.name=se1l}
  1001. 200.97 s > [2026-08-28 16:21:20.248] @process::amplitude WARNING : External state 1 ('g', PDG 21, helicity -) is off shell: p^2 = +2.5e5, expected m^2 = +0e0 (|Δ| = +2.5e5). Fixed-helicity spinor/vector/tensor external states may be ill-defined at this kinematic point.
  1002. 200.97 s > field value
  1003. 200.97 s > span warm_up{integrand.name=se1l}
  1004. 200.97 s > [2026-08-28 16:21:20.248] @process::amplitude INFO : Input is above threshold: 1 existing threshold E-surfaces across 1/1 graph groups
  1005. 200.97 s > field value
  1006. 200.97 s > existing_esurfaces 1
  1007. 200.97 s > group_count 1
  1008. 200.97 s > groups_above_threshold 1
  1009. 200.97 s > integrand se1l
  1010. 200.97 s > span warm_up{integrand.name=se1l}
  1011. 200.97 s > threshold_status above threshold
  1012. 200.97 s > [2026-08-28 16:21:20.248] @process::amplitude INFO : overlap structure of group 0: [1: [0(2,3)]]
  1013. 200.97 s > field value
  1014. 200.97 s > span warm_up{integrand.name=se1l}
  1015. 200.97 s > [2026-08-28 16:21:20.253] @process::amplitude WARNING : External state 0 ('g', PDG 21, helicity +) is off shell: p^2 = +2.5e5, expected m^2 = +0e0 (|Δ| = +2.5e5). Fixed-helicity spinor/vector/tensor external states may be ill-defined at this kinematic point.
  1016. 200.97 s > field value
  1017. 200.97 s > span warm_up{integrand.name=se1l_mur_shifted}
  1018. 200.97 s > [2026-08-28 16:21:20.253] @process::amplitude WARNING : External state 1 ('g', PDG 21, helicity -) is off shell: p^2 = +2.5e5, expected m^2 = +0e0 (|Δ| = +2.5e5). Fixed-helicity spinor/vector/tensor external states may be ill-defined at this kinematic point.
  1019. 200.97 s > field value
  1020. 200.97 s > span warm_up{integrand.name=se1l_mur_shifted}
  1021. 200.97 s > [2026-08-28 16:21:20.253] @process::amplitude INFO : Input is above threshold: 1 existing threshold E-surfaces across 1/1 graph groups
  1022. 200.97 s > field value
  1023. 200.97 s > existing_esurfaces 1
  1024. 200.97 s > group_count 1
  1025. 200.97 s > groups_above_threshold 1
  1026. 200.97 s > integrand se1l_mur_shifted
  1027. 200.97 s > span warm_up{integrand.name=se1l_mur_shifted}
  1028. 200.97 s > threshold_status above threshold
  1029. 200.97 s > [2026-08-28 16:21:20.253] @process::amplitude INFO : overlap structure of group 0: [1: [0(2,3)]]
  1030. 200.97 s > field value
  1031. 200.97 s > span warm_up{integrand.name=se1l_mur_shifted}
  1032. 200.97 s > [2026-08-28 16:21:20.257] @process::amplitude WARNING : External state 0 ('g', PDG 21, helicity +) is off shell: p^2 = +2.5e5, expected m^2 = +0e0 (|Δ| = +2.5e5). Fixed-helicity spinor/vector/tensor external states may be ill-defined at this kinematic point.
  1033. 200.97 s > field value
  1034. 200.97 s > span warm_up{integrand.name=se1l}
  1035. 200.97 s > [2026-08-28 16:21:20.257] @process::amplitude WARNING : External state 1 ('g', PDG 21, helicity -) is off shell: p^2 = +2.5e5, expected m^2 = +0e0 (|Δ| = +2.5e5). Fixed-helicity spinor/vector/tensor external states may be ill-defined at this kinematic point.
  1036. 200.97 s > field value
  1037. 200.97 s > span warm_up{integrand.name=se1l}
  1038. 200.97 s > [2026-08-28 16:21:20.257] @process::amplitude INFO : Input is above threshold: 1 existing threshold E-surfaces across 1/1 graph groups
  1039. 200.97 s > field value
  1040. 200.97 s > existing_esurfaces 1
  1041. 200.97 s > group_count 1
  1042. 200.97 s > groups_above_threshold 1
  1043. 200.97 s > integrand se1l
  1044. 200.97 s > span warm_up{integrand.name=se1l}
  1045. 200.97 s > threshold_status above threshold
  1046. 200.97 s > [2026-08-28 16:21:20.257] @process::amplitude INFO : overlap structure of group 0: [1: [0(2,3)]]
  1047. 200.97 s > field value
  1048. 200.97 s > span warm_up{integrand.name=se1l}
  1049. 200.97 s > [2026-08-28 16:21:20.262] @process::amplitude WARNING : External state 0 ('g', PDG 21, helicity +) is off shell: p^2 = +2.5e5, expected m^2 = +0e0 (|Δ| = +2.5e5). Fixed-helicity spinor/vector/tensor external states may be ill-defined at this kinematic point.
  1050. 200.97 s > field value
  1051. 200.97 s > span warm_up{integrand.name=se1l_mur_shifted}
  1052. 200.97 s > [2026-08-28 16:21:20.262] @process::amplitude WARNING : External state 1 ('g', PDG 21, helicity -) is off shell: p^2 = +2.5e5, expected m^2 = +0e0 (|Δ| = +2.5e5). Fixed-helicity spinor/vector/tensor external states may be ill-defined at this kinematic point.
  1053. 200.97 s > field value
  1054. 200.97 s > span warm_up{integrand.name=se1l_mur_shifted}
  1055. 200.97 s > [2026-08-28 16:21:20.262] @process::amplitude INFO : Input is above threshold: 1 existing threshold E-surfaces across 1/1 graph groups
  1056. 200.97 s > field value
  1057. 200.97 s > existing_esurfaces 1
  1058. 200.97 s > group_count 1
  1059. 200.97 s > groups_above_threshold 1
  1060. 200.97 s > integrand se1l_mur_shifted
  1061. 200.97 s > span warm_up{integrand.name=se1l_mur_shifted}
  1062. 200.97 s > threshold_status above threshold
  1063. 200.97 s > [2026-08-28 16:21:20.262] @process::amplitude INFO : overlap structure of group 0: [1: [0(2,3)]]
  1064. 200.97 s > field value
  1065. 200.97 s > span warm_up{integrand.name=se1l_mur_shifted}
  1066. 200.97 s > [2026-08-28 16:21:20.266] @process::amplitude WARNING : External state 0 ('g', PDG 21, helicity +) is off shell: p^2 = +2.5e5, expected m^2 = +0e0 (|Δ| = +2.5e5). Fixed-helicity spinor/vector/tensor external states may be ill-defined at this kinematic point.
  1067. 200.97 s > field value
  1068. 200.97 s > span warm_up{integrand.name=se1l}
  1069. 200.97 s > [2026-08-28 16:21:20.267] @process::amplitude WARNING : External state 1 ('g', PDG 21, helicity -) is off shell: p^2 = +2.5e5, expected m^2 = +0e0 (|Δ| = +2.5e5). Fixed-helicity spinor/vector/tensor external states may be ill-defined at this kinematic point.
  1070. 200.97 s > field value
  1071. 200.97 s > span warm_up{integrand.name=se1l}
  1072. 200.97 s > [2026-08-28 16:21:20.267] @process::amplitude INFO : Input is above threshold: 1 existing threshold E-surfaces across 1/1 graph groups
  1073. 200.97 s > field value
  1074. 200.97 s > existing_esurfaces 1
  1075. 200.97 s > group_count 1
  1076. 200.97 s > groups_above_threshold 1
  1077. 200.97 s > integrand se1l
  1078. 200.97 s > span warm_up{integrand.name=se1l}
  1079. 200.97 s > threshold_status above threshold
  1080. 200.97 s > [2026-08-28 16:21:20.267] @process::amplitude INFO : overlap structure of group 0: [1: [0(2,3)]]
  1081. 200.97 s > field value
  1082. 200.97 s > span warm_up{integrand.name=se1l}
  1083. 200.97 s > [2026-08-28 16:21:20.271] @process::amplitude WARNING : External state 0 ('g', PDG 21, helicity +) is off shell: p^2 = +2.5e5, expected m^2 = +0e0 (|Δ| = +2.5e5). Fixed-helicity spinor/vector/tensor external states may be ill-defined at this kinematic point.
  1084. 200.97 s > field value
  1085. 200.97 s > span warm_up{integrand.name=se1l_mur_shifted}
  1086. 200.97 s > [2026-08-28 16:21:20.271] @process::amplitude WARNING : External state 1 ('g', PDG 21, helicity -) is off shell: p^2 = +2.5e5, expected m^2 = +0e0 (|Δ| = +2.5e5). Fixed-helicity spinor/vector/tensor external states may be ill-defined at this kinematic point.
  1087. 200.97 s > field value
  1088. 200.97 s > span warm_up{integrand.name=se1l_mur_shifted}
  1089. 200.97 s > [2026-08-28 16:21:20.271] @process::amplitude INFO : Input is above threshold: 1 existing threshold E-surfaces across 1/1 graph groups
  1090. 200.97 s > field value
  1091. 200.97 s > existing_esurfaces 1
  1092. 200.97 s > group_count 1
  1093. 200.97 s > groups_above_threshold 1
  1094. 200.97 s > integrand se1l_mur_shifted
  1095. 200.97 s > span warm_up{integrand.name=se1l_mur_shifted}
  1096. 200.97 s > threshold_status above threshold
  1097. 200.97 s > [2026-08-28 16:21:20.271] @process::amplitude INFO : overlap structure of group 0: [1: [0(2,3)]]
  1098. 200.97 s > field value
  1099. 200.97 s > span warm_up{integrand.name=se1l_mur_shifted}
  1100. 200.97 s > [2026-08-28 16:21:20.276] @process::amplitude WARNING : External state 0 ('g', PDG 21, helicity +) is off shell: p^2 = +2.5e5, expected m^2 = +0e0 (|Δ| = +2.5e5). Fixed-helicity spinor/vector/tensor external states may be ill-defined at this kinematic point.
  1101. 200.97 s > field value
  1102. 200.97 s > span warm_up{integrand.name=se1l}
  1103. 200.97 s > [2026-08-28 16:21:20.276] @process::amplitude WARNING : External state 1 ('g', PDG 21, helicity -) is off shell: p^2 = +2.5e5, expected m^2 = +0e0 (|Δ| = +2.5e5). Fixed-helicity spinor/vector/tensor external states may be ill-defined at this kinematic point.
  1104. 200.97 s > field value
  1105. 200.97 s > span warm_up{integrand.name=se1l}
  1106. 200.97 s > [2026-08-28 16:21:20.276] @process::amplitude INFO : Input is above threshold: 1 existing threshold E-surfaces across 1/1 graph groups
  1107. 200.97 s > field value
  1108. 200.97 s > existing_esurfaces 1
  1109. 200.97 s > group_count 1
  1110. 200.97 s > groups_above_threshold 1
  1111. 200.97 s > integrand se1l
  1112. 200.97 s > span warm_up{integrand.name=se1l}
  1113. 200.97 s > threshold_status above threshold
  1114. 200.97 s > [2026-08-28 16:21:20.276] @process::amplitude INFO : overlap structure of group 0: [1: [0(2,3)]]
  1115. 200.97 s > field value
  1116. 200.97 s > span warm_up{integrand.name=se1l}
  1117. 200.97 s > [2026-08-28 16:21:20.280] @process::amplitude WARNING : External state 0 ('g', PDG 21, helicity +) is off shell: p^2 = +2.5e5, expected m^2 = +0e0 (|Δ| = +2.5e5). Fixed-helicity spinor/vector/tensor external states may be ill-defined at this kinematic point.
  1118. 200.97 s > field value
  1119. 200.97 s > span warm_up{integrand.name=se1l_mur_shifted}
  1120. 200.97 s > [2026-08-28 16:21:20.280] @process::amplitude WARNING : External state 1 ('g', PDG 21, helicity -) is off shell: p^2 = +2.5e5, expected m^2 = +0e0 (|Δ| = +2.5e5). Fixed-helicity spinor/vector/tensor external states may be ill-defined at this kinematic point.
  1121. 200.97 s > field value
  1122. 200.97 s > span warm_up{integrand.name=se1l_mur_shifted}
  1123. 200.97 s > [2026-08-28 16:21:20.281] @process::amplitude INFO : Input is above threshold: 1 existing threshold E-surfaces across 1/1 graph groups
  1124. 200.97 s > field value
  1125. 200.97 s > existing_esurfaces 1
  1126. 200.97 s > group_count 1
  1127. 200.97 s > groups_above_threshold 1
  1128. 200.97 s > integrand se1l_mur_shifted
  1129. 200.97 s > span warm_up{integrand.name=se1l_mur_shifted}
  1130. 200.97 s > threshold_status above threshold
  1131. 200.97 s > [2026-08-28 16:21:20.281] @process::amplitude INFO : overlap structure of group 0: [1: [0(2,3)]]
  1132. 200.97 s > field value
  1133. 200.97 s > span warm_up{integrand.name=se1l_mur_shifted}
  1134. 200.97 s > [2026-08-28 16:21:20.285] @process::amplitude WARNING : External state 0 ('g', PDG 21, helicity +) is off shell: p^2 = +2.5e5, expected m^2 = +0e0 (|Δ| = +2.5e5). Fixed-helicity spinor/vector/tensor external states may be ill-defined at this kinematic point.
  1135. 200.97 s > field value
  1136. 200.97 s > span warm_up{integrand.name=se1l}
  1137. 200.97 s > [2026-08-28 16:21:20.285] @process::amplitude WARNING : External state 1 ('g', PDG 21, helicity -) is off shell: p^2 = +2.5e5, expected m^2 = +0e0 (|Δ| = +2.5e5). Fixed-helicity spinor/vector/tensor external states may be ill-defined at this kinematic point.
  1138. 200.97 s > field value
  1139. 200.97 s > span warm_up{integrand.name=se1l}
  1140. 200.97 s > [2026-08-28 16:21:20.285] @process::amplitude INFO : Input is above threshold: 1 existing threshold E-surfaces across 1/1 graph groups
  1141. 200.97 s > field value
  1142. 200.97 s > existing_esurfaces 1
  1143. 200.97 s > group_count 1
  1144. 200.97 s > groups_above_threshold 1
  1145. 200.97 s > integrand se1l
  1146. 200.97 s > span warm_up{integrand.name=se1l}
  1147. 200.97 s > threshold_status above threshold
  1148. 200.97 s > [2026-08-28 16:21:20.285] @process::amplitude INFO : overlap structure of group 0: [1: [0(2,3)]]
  1149. 200.97 s > field value
  1150. 200.97 s > span warm_up{integrand.name=se1l}
  1151. 200.97 s > [2026-08-28 16:21:20.290] @process::amplitude WARNING : External state 0 ('g', PDG 21, helicity +) is off shell: p^2 = +2.5e5, expected m^2 = +0e0 (|Δ| = +2.5e5). Fixed-helicity spinor/vector/tensor external states may be ill-defined at this kinematic point.
  1152. 200.97 s > field value
  1153. 200.97 s > span warm_up{integrand.name=se1l_mur_shifted}
  1154. 200.97 s > [2026-08-28 16:21:20.290] @process::amplitude WARNING : External state 1 ('g', PDG 21, helicity -) is off shell: p^2 = +2.5e5, expected m^2 = +0e0 (|Δ| = +2.5e5). Fixed-helicity spinor/vector/tensor external states may be ill-defined at this kinematic point.
  1155. 200.97 s > field value
  1156. 200.97 s > span warm_up{integrand.name=se1l_mur_shifted}
  1157. 200.97 s > [2026-08-28 16:21:20.290] @process::amplitude INFO : Input is above threshold: 1 existing threshold E-surfaces across 1/1 graph groups
  1158. 200.97 s > field value
  1159. 200.97 s > existing_esurfaces 1
  1160. 200.97 s > group_count 1
  1161. 200.97 s > groups_above_threshold 1
  1162. 200.97 s > integrand se1l_mur_shifted
  1163. 200.97 s > span warm_up{integrand.name=se1l_mur_shifted}
  1164. 200.97 s > threshold_status above threshold
  1165. 200.97 s > [2026-08-28 16:21:20.290] @process::amplitude INFO : overlap structure of group 0: [1: [0(2,3)]]
  1166. 200.97 s > field value
  1167. 200.97 s > span warm_up{integrand.name=se1l_mur_shifted}
  1168. 200.97 s > [2026-08-28 16:21:20.294] @process::amplitude WARNING : External state 0 ('g', PDG 21, helicity +) is off shell: p^2 = +2.5e5, expected m^2 = +0e0 (|Δ| = +2.5e5). Fixed-helicity spinor/vector/tensor external states may be ill-defined at this kinematic point.
  1169. 200.97 s > field value
  1170. 200.97 s > span warm_up{integrand.name=se1l}
  1171. 200.97 s > [2026-08-28 16:21:20.294] @process::amplitude WARNING : External state 1 ('g', PDG 21, helicity -) is off shell: p^2 = +2.5e5, expected m^2 = +0e0 (|Δ| = +2.5e5). Fixed-helicity spinor/vector/tensor external states may be ill-defined at this kinematic point.
  1172. 200.97 s > field value
  1173. 200.97 s > span warm_up{integrand.name=se1l}
  1174. 200.97 s > [2026-08-28 16:21:20.295] @process::amplitude INFO : Input is above threshold: 1 existing threshold E-surfaces across 1/1 graph groups
  1175. 200.97 s > field value
  1176. 200.97 s > existing_esurfaces 1
  1177. 200.97 s > group_count 1
  1178. 200.97 s > groups_above_threshold 1
  1179. 200.97 s > integrand se1l
  1180. 200.97 s > span warm_up{integrand.name=se1l}
  1181. 200.97 s > threshold_status above threshold
  1182. 200.97 s > [2026-08-28 16:21:20.295] @process::amplitude INFO : overlap structure of group 0: [1: [0(2,3)]]
  1183. 200.97 s > field value
  1184. 200.97 s > span warm_up{integrand.name=se1l}
  1185. 200.97 s > [2026-08-28 16:21:20.299] @process::amplitude WARNING : External state 0 ('g', PDG 21, helicity +) is off shell: p^2 = +2.5e5, expected m^2 = +0e0 (|Δ| = +2.5e5). Fixed-helicity spinor/vector/tensor external states may be ill-defined at this kinematic point.
  1186. 200.97 s > field value
  1187. 200.97 s > span warm_up{integrand.name=se1l_mur_shifted}
  1188. 200.97 s > [2026-08-28 16:21:20.299] @process::amplitude WARNING : External state 1 ('g', PDG 21, helicity -) is off shell: p^2 = +2.5e5, expected m^2 = +0e0 (|Δ| = +2.5e5). Fixed-helicity spinor/vector/tensor external states may be ill-defined at this kinematic point.
  1189. 200.97 s > field value
  1190. 200.97 s > span warm_up{integrand.name=se1l_mur_shifted}
  1191. 200.97 s > [2026-08-28 16:21:20.299] @process::amplitude INFO : Input is above threshold: 1 existing threshold E-surfaces across 1/1 graph groups
  1192. 200.97 s > field value
  1193. 200.97 s > existing_esurfaces 1
  1194. 200.97 s > group_count 1
  1195. 200.97 s > groups_above_threshold 1
  1196. 200.97 s > integrand se1l_mur_shifted
  1197. 200.97 s > span warm_up{integrand.name=se1l_mur_shifted}
  1198. 200.97 s > threshold_status above threshold
  1199. 200.97 s > [2026-08-28 16:21:20.299] @process::amplitude INFO : overlap structure of group 0: [1: [0(2,3)]]
  1200. 200.97 s > field value
  1201. 200.97 s > span warm_up{integrand.name=se1l_mur_shifted}
  1202. 200.97 s > [2026-08-28 16:21:20.304] @process::amplitude WARNING : External state 0 ('g', PDG 21, helicity +) is off shell: p^2 = +2.5e5, expected m^2 = +0e0 (|Δ| = +2.5e5). Fixed-helicity spinor/vector/tensor external states may be ill-defined at this kinematic point.
  1203. 200.97 s > field value
  1204. 200.97 s > span warm_up{integrand.name=se1l}
  1205. 200.97 s > [2026-08-28 16:21:20.304] @process::amplitude WARNING : External state 1 ('g', PDG 21, helicity -) is off shell: p^2 = +2.5e5, expected m^2 = +0e0 (|Δ| = +2.5e5). Fixed-helicity spinor/vector/tensor external states may be ill-defined at this kinematic point.
  1206. 200.97 s > field value
  1207. 200.97 s > span warm_up{integrand.name=se1l}
  1208. 200.97 s > [2026-08-28 16:21:20.304] @process::amplitude INFO : Input is above threshold: 1 existing threshold E-surfaces across 1/1 graph groups
  1209. 200.97 s > field value
  1210. 200.97 s > existing_esurfaces 1
  1211. 200.97 s > group_count 1
  1212. 200.97 s > groups_above_threshold 1
  1213. 200.97 s > integrand se1l
  1214. 200.97 s > span warm_up{integrand.name=se1l}
  1215. 200.97 s > threshold_status above threshold
  1216. 200.97 s > [2026-08-28 16:21:20.304] @process::amplitude INFO : overlap structure of group 0: [1: [0(2,3)]]
  1217. 200.97 s > field value
  1218. 200.97 s > span warm_up{integrand.name=se1l}
  1219. 200.97 s > [2026-08-28 16:21:20.308] @process::amplitude WARNING : External state 0 ('g', PDG 21, helicity +) is off shell: p^2 = +2.5e5, expected m^2 = +0e0 (|Δ| = +2.5e5). Fixed-helicity spinor/vector/tensor external states may be ill-defined at this kinematic point.
  1220. 200.97 s > field value
  1221. 200.97 s > span warm_up{integrand.name=se1l_mur_shifted}
  1222. 200.97 s > [2026-08-28 16:21:20.308] @process::amplitude WARNING : External state 1 ('g', PDG 21, helicity -) is off shell: p^2 = +2.5e5, expected m^2 = +0e0 (|Δ| = +2.5e5). Fixed-helicity spinor/vector/tensor external states may be ill-defined at this kinematic point.
  1223. 200.97 s > field value
  1224. 200.97 s > span warm_up{integrand.name=se1l_mur_shifted}
  1225. 200.97 s > [2026-08-28 16:21:20.309] @process::amplitude INFO : Input is above threshold: 1 existing threshold E-surfaces across 1/1 graph groups
  1226. 200.97 s > field value
  1227. 200.97 s > existing_esurfaces 1
  1228. 200.97 s > group_count 1
  1229. 200.97 s > groups_above_threshold 1
  1230. 200.97 s > integrand se1l_mur_shifted
  1231. 200.97 s > span warm_up{integrand.name=se1l_mur_shifted}
  1232. 200.97 s > threshold_status above threshold
  1233. 200.97 s > [2026-08-28 16:21:20.309] @process::amplitude INFO : overlap structure of group 0: [1: [0(2,3)]]
  1234. 200.97 s > field value
  1235. 200.97 s > span warm_up{integrand.name=se1l_mur_shifted}
  1236. 200.97 s > The application panicked (crashed).
  1237. 200.97 s > Message: Integrated UV case failed: se1l
  1238. 200.97 s > Location: tests/tests/uv.rs:1068
  1239. 200.97 s >
  1240. 200.97 s > ━━━━━━━━━━━━━━━━━━━━━━━━━━━━━━━━━━ BACKTRACE ━━━━━━━━━━━━━━━━━━━━━━━━━━━━━━━━━━━
  1241. 200.97 s > 1: <color_eyre[51793ea62743adbd]::config::PanicHook>::panic_report<unknown>
  1242. 200.97 s > at <unknown source file>:<unknown line>
  1243. 200.97 s > 2: <color_eyre[51793ea62743adbd]::config::PanicHook>::into_panic_hook::{closure#0}<unknown>
  1244. 200.97 s > at <unknown source file>:<unknown line>
  1245. 200.97 s > 3: std[bcb96dfbba0ab899]::panicking::panic_with_hook<unknown>
  1246. 200.97 s > at <unknown source file>:<unknown line>
  1247. 200.97 s > 4: std[bcb96dfbba0ab899]::panicking::panic_handler::{closure#0}<unknown>
  1248. 200.97 s > at <unknown source file>:<unknown line>
  1249. 200.97 s > 5: std[bcb96dfbba0ab899]::sys::backtrace::__rust_end_short_backtrace::<std[bcb96dfbba0ab899]::panicking::panic_handler::{closure#0}, !><unknown>
  1250. 200.97 s > at <unknown source file>:<unknown line>
  1251. 200.97 s > 6: __rustc[6c289b9f9c454d21]::rust_begin_unwind<unknown>
  1252. 200.97 s > at <unknown source file>:<unknown line>
  1253. 200.97 s > 7: core[940e698046960fd5]::panicking::panic_fmt<unknown>
  1254. 200.97 s > at <unknown source file>:<unknown line>
  1255. 200.97 s > 8: uv[52cf2b63f0104e31]::run_single_integrated_uv_case<unknown>
  1256. 200.97 s > at <unknown source file>:<unknown line>
  1257. 200.97 s > 9: <uv[52cf2b63f0104e31]::se1l_uv::{closure#0} as core[940e698046960fd5]::ops::function::FnOnce<()>>::call_once<unknown>
  1258. 200.97 s > at <unknown source file>:<unknown line>
  1259. 200.97 s > 10: test[75d6903177b1d7e9]::__rust_begin_short_backtrace::<core[940e698046960fd5]::result::Result<(), alloc[2ea6bcb46fca0c42]::string::String>, fn() -> core[940e698046960fd5]::result::Result<(), alloc[2ea6bcb46fca0c42]::string::String>><unknown>
  1260. 200.97 s > at <unknown source file>:<unknown line>
  1261. 200.97 s > 11: test[75d6903177b1d7e9]::run_test::{closure#0}<unknown>
  1262. 200.97 s > at <unknown source file>:<unknown line>
  1263. 200.97 s > 12: std[bcb96dfbba0ab899]::sys::backtrace::__rust_begin_short_backtrace::<test[75d6903177b1d7e9]::run_test::{closure#1}, ()><unknown>
  1264. 200.97 s > at <unknown source file>:<unknown line>
  1265. 200.97 s > 13: <std[bcb96dfbba0ab899]::thread::lifecycle::spawn_unchecked<test[75d6903177b1d7e9]::run_test::{closure#1}, ()>::{closure#1} as core[940e698046960fd5]::ops::function::FnOnce<()>>::call_once::{shim:vtable#0}<unknown>
  1266. 200.97 s > at <unknown source file>:<unknown line>
  1267. 200.97 s > 14: <std[bcb96dfbba0ab899]::sys::thread::unix::Thread>::new::thread_start<unknown>
  1268. 200.97 s > at <unknown source file>:<unknown line>
  1269. 200.97 s > 15: start_thread<unknown>
  1270. 200.97 s > at <unknown source file>:<unknown line>
  1271. 200.97 s > 16: __clone3<unknown>
  1272. 200.97 s > at <unknown source file>:<unknown line>
  1273. 200.97 s >
  1274. 200.97 s > Run with COLORBT_SHOW_HIDDEN=1 environment variable to disable frame filtering.
  1275. 200.97 s > Run with RUST_BACKTRACE=full to include source snippets.
  1276. 200.97 s >
  1277. 200.97 s > error: test run failed
  1278. 200.97 s >
  1279. 200.97 s > ========== nextest test summary ==========
  1280. 200.97 s > report: target/nextest/ci_gammaloop/junit.xml
  1281. 200.97 s > tests: 106, failures: 9, errors: 0
  1282. 200.97 s >
  1283. 200.97 s > 1. gammaloop-integration-tests::test_runs::approach::approach_momentum_space_reports_incomplete_triplet_cleanly
  1284. 200.97 s > failure: test failure with exit code 101
  1285. 200.97 s > system-out
  1286. 200.97 s > running 1 test
  1287. 200.97 s > test approach::approach_momentum_space_reports_incomplete_triplet_cleanly ... FAILED
  1288. 200.97 s >
  1289. 200.97 s > failures:
  1290. 200.97 s >
  1291. 200.97 s > failures:
  1292. 200.97 s > approach::approach_momentum_space_reports_incomplete_triplet_cleanly
  1293. 200.97 s >
  1294. 200.97 s > test result: FAILED. 0 passed; 1 failed; 0 ignored; 0 measured; 82 filtered out; finished in 1.35s
  1295. 200.97 s > system-err
  1296. 200.97 s > [2026-08-28 16:18:29.951] @gammaloop_api::se... INFO : Running command import model scalars-default.json
  1297. 200.97 s > [2026-08-28 16:18:29.951] @import::model INFO : Loading built-in JSON model scalars-default
  1298. 200.97 s > [2026-08-28 16:18:29.957] @gammalooprs::model INFO : The following 2 external parameters were forced to zero by the restriction card:
  1299. 200.97 s > width_scalar_1, width_scalar_2
  1300. 200.97 s > [2026-08-28 16:18:29.958] @gammaloop_api::se... INFO : Running command remove processes
  1301. 200.97 s > [2026-08-28 16:18:29.962] @gammaloop_api::se... INFO : Running command generate amp scalar_1 > scalar_0 scalar_0 [{1}] --allowed-vertex-interactions V_3_SCALAR_022 V_3_SCALAR_122 -p triangle -i scalar_tri
  1302. 200.97 s > [2026-08-28 16:18:29.963] @feyngen::diagram_... INFO : 0s | Δ=0s | Starting Feynman graph generation with Symbolica...
  1303. 200.97 s > [2026-08-28 16:18:29.963] @feyngen::diagram_... INFO : 0s | Δ=0s | Number of graphs resulting from Symbolica generation: 1
  1304. 200.97 s > [2026-08-28 16:18:29.965] @feyngen::diagram_... INFO : 0s | Δ=0s | Number of graphs retained after removal of vetoed topologies: 1
  1305. 200.97 s > [2026-08-28 16:18:29.968] @feyngen::diagram_... INFO : 0s | Δ=0s | Number of graphs after vertex info assignment: 1
  1306. 200.97 s > [2026-08-28 16:18:29.968] @feyngen::diagram_... INFO : 0s | Δ=0s | Number of graphs after all complete graphs filters are applied: 1
  1307. 200.97 s > [2026-08-28 16:18:29.970] @feyngen::diagram_... INFO : 0s | Δ=0s | Number of graphs after closed fermion chains analysis: 1
  1308. 200.97 s > [2026-08-28 16:18:29.970] @feyngen::diagram_... INFO : 0s | Δ=0s | Number of graphs after symmetrization of external states: 1
  1309. 200.97 s > [2026-08-28 16:18:29.970] @feyngen::diagram_... INFO : 0s | Δ=0s | Number of graphs after canonization of vertices, edges and flows (graph labels assigned here): 1
  1310. 200.97 s > [2026-08-28 16:18:29.976] @feyngen::diagram_... INFO : 0s | Δ=0s | Number of graphs after numerator-aware grouping with strategy 'up to a scalar rescaling': 1 (1 isomorphically unique graph, 0 color zero, 0 lorentz zero, 0 grouped and 0 cancellation)
  1311. 200.97 s > [2026-08-28 16:18:29.976] @feyngen::diagram_... INFO : ( Sum of the symmetry factors from each graph generated = 1 )
  1312. 200.97 s > [2026-08-28 16:18:29.976] @commands::generate INFO : Generated amplitude 1 graphs.
  1313. 200.97 s > [2026-08-28 16:18:30.086] @settings::runtime WARNING : No external kinematics were provided; using default-generated external momenta and helicities.
  1314. 200.97 s > [2026-08-28 16:18:30.110] @commands::generate INFO :
  1315. 200.97 s > Integrand generation summary
  1316. 200.97 s > peak RAM 65.27 MiB | cores 1
  1317. 200.97 s > ╭────────────┬───────┬─────────┬────────────┬────────────┬────────────────┬─────────────╮
  1318. 200.97 s > │ integrand │ graph │ # evals │ expr build │ spenso │ symbolica eval │ compile │
  1319. 200.97 s > ├────────────┼───────┼─────────┼────────────┼────────────┼────────────────┼─────────────┤
  1320. 200.97 s > │ scalar_tri │ GL0 │ 9 │ 91ms (85%) │ 3ms (3.5%) │ 12ms (11%) │ 0ms (0.00%) │
  1321. 200.97 s > ├────────────┼───────┼─────────┼────────────┼────────────┼────────────────┼─────────────┤
  1322. 200.97 s > │ Total │ │ 9 │ 91ms (85%) │ 3ms (3.5%) │ 12ms (11%) │ 0ms (0.00%) │
  1323. 200.97 s > ╰────────────┴───────┴─────────┴────────────┴────────────┴────────────────┴─────────────╯
  1324. 200.97 s > [2026-08-28 16:18:30.111] @gammaloop_api::se... INFO : Running command generate amp scalar_0 scalar_0 > scalar_0 scalar_0 [{1}] --allowed-vertex-interactions V_3_SCALAR_022 -p box -i scalar_box --select-graphs GL0
  1325. 200.97 s > [2026-08-28 16:18:30.117] @feyngen::diagram_... INFO : 0s | Δ=0s | Starting Feynman graph generation with Symbolica...
  1326. 200.97 s > [2026-08-28 16:18:30.117] @feyngen::diagram_... INFO : 0s | Δ=0s | Number of graphs resulting from Symbolica generation: 3
  1327. 200.97 s > [2026-08-28 16:18:30.121] @feyngen::diagram_... INFO : 0s | Δ=0s | Number of graphs retained after removal of vetoed topologies: 3
  1328. 200.97 s > [2026-08-28 16:18:30.125] @feyngen::diagram_... INFO : 0s | Δ=0s | Number of graphs after vertex info assignment: 3
  1329. 200.97 s > [2026-08-28 16:18:30.125] @feyngen::diagram_... INFO : 0s | Δ=0s | Number of graphs after all complete graphs filters are applied: 3
  1330. 200.97 s > [2026-08-28 16:18:30.129] @feyngen::diagram_... INFO : 0s | Δ=0s | Number of graphs after closed fermion chains analysis: 3
  1331. 200.97 s > [2026-08-28 16:18:30.129] @feyngen::diagram_... INFO : 0s | Δ=0s | Number of graphs after symmetrization of external states: 3
  1332. 200.97 s > [2026-08-28 16:18:30.133] @feyngen::diagram_... INFO : 0s | Δ=0s | Number of graphs after canonization of vertices, edges and flows (graph labels assigned here): 3
  1333. 200.97 s > [2026-08-28 16:18:30.158] @feyngen::diagram_... INFO : 0s | Δ=0s | Number of graphs after numerator-aware grouping with strategy 'up to a scalar rescaling': 1 (1 isomorphically unique graph, 0 color zero, 0 lorentz zero, 0 grouped and 0 cancellation)
  1334. 200.97 s > [2026-08-28 16:18:30.158] @feyngen::diagram_... INFO : ( Sum of the symmetry factors from each graph generated = 1 )
  1335. 200.97 s > [2026-08-28 16:18:30.158] @commands::generate INFO : Generated amplitude 1 graphs.
  1336. 200.97 s > [2026-08-28 16:18:30.382] @settings::runtime WARNING : No external kinematics were provided; using default-generated external momenta and helicities.
  1337. 200.97 s > [2026-08-28 16:18:30.480] @commands::generate INFO :
  1338. 200.97 s > Integrand generation summary
  1339. 200.97 s > peak RAM 69.62 MiB | cores 1
  1340. 200.97 s > ╭────────────┬───────┬─────────┬─────────────┬─────────────┬────────────────┬─────────────╮
  1341. 200.97 s > │ integrand │ graph │ # evals │ expr build │ spenso │ symbolica eval │ compile │
  1342. 200.97 s > ├────────────┼───────┼─────────┼─────────────┼─────────────┼────────────────┼─────────────┤
  1343. 200.97 s > │ scalar_box │ GL0 │ 13 │ 159ms (73%) │ 11ms (5.5%) │ 46ms (22%) │ 0ms (0.00%) │
  1344. 200.97 s > ├────────────┼───────┼─────────┼─────────────┼─────────────┼────────────────┼─────────────┤
  1345. 200.97 s > │ Total │ │ 13 │ 159ms (73%) │ 11ms (5.5%) │ 46ms (22%) │ 0ms (0.00%) │
  1346. 200.97 s > ╰────────────┴───────┴─────────┴─────────────┴─────────────┴────────────────┴─────────────╯
  1347. 200.97 s > [2026-08-28 16:18:30.481] @gammaloop_api::se... INFO : Running command generate
  1348. 200.97 s > [2026-08-28 16:18:30.682] @settings::runtime WARNING : No external kinematics were provided; using default-generated external momenta and helicities.
  1349. 200.97 s > [2026-08-28 16:18:30.859] @settings::runtime WARNING : No external kinematics were provided; using default-generated external momenta and helicities.
  1350. 200.97 s > [2026-08-28 16:18:30.909] @commands::generate INFO :
  1351. 200.97 s > Integrand generation summary
  1352. 200.97 s > peak RAM 71.96 MiB | cores 1
  1353. 200.97 s > ╭────────────┬───────┬─────────┬─────────────┬────────────┬────────────────┬─────────────╮
  1354. 200.97 s > │ integrand │ graph │ # evals │ expr build │ spenso │ symbolica eval │ compile │
  1355. 200.97 s > ├────────────┼───────┼─────────┼─────────────┼────────────┼────────────────┼─────────────┤
  1356. 200.97 s > │ scalar_tri │ GL0 │ 9 │ 24ms (50%) │ 3ms (6.5%) │ 21ms (44%) │ 0ms (0.00%) │
  1357. 200.97 s > │ scalar_box │ GL0 │ 13 │ 147ms (46%) │ 45ms (14%) │ 127ms (40%) │ 0ms (0.00%) │
  1358. 200.97 s > ├────────────┼───────┼─────────┼─────────────┼────────────┼────────────────┼─────────────┤
  1359. 200.97 s > │ Total │ │ 22 │ 172ms (47%) │ 48ms (13%) │ 148ms (40%) │ 0ms (0.00%) │
  1360. 200.97 s > ╰────────────┴───────┴─────────┴─────────────┴────────────┴────────────────┴─────────────╯
  1361. 200.97 s > [2026-08-28 16:18:30.910] @gammaloop_api::se... INFO : Running command set model mass_scalar_2=2.0
  1362. 200.97 s > [2026-08-28 16:18:30.911] @gammaloop_api::se... INFO : Running command set model mass_scalar_1=1.0
  1363. 200.97 s > [2026-08-28 16:18:30.917] @gammaloop_api::se... INFO : Running command set process -p triangle -i scalar_tri string '
  1364. 200.97 s > [kinematics.externals]
  1365. 200.97 s > type = "constant"
  1366. 200.97 s >
  1367. 200.97 s > [kinematics.externals.data]
  1368. 200.97 s > [...]
  1369. 200.97 s > [2026-08-28 16:18:30.918] @gammaloop_api::se... INFO : Running command set process -p box -i scalar_box string '
  1370. 200.97 s > [kinematics.externals]
  1371. 200.97 s > type = "constant"
  1372. 200.97 s >
  1373. 200.97 s > [kinematics.externals.data]
  1374. 200.97 s > [...]
  1375. 200.97 s > [2026-08-28 16:18:30.923] @gammaloop_api::se... INFO : Running command approach -x 1.0000000000000001e-1,2.0000000000000001e-1,2.9999999999999999e-1,4.0000000000000002e-1 --approach-axis 1.0000000000000000e-3,0.0000000000000000e0,0.0000000000000000e0,0.0000000000000000e0 --n-points 1 --n-cores 1 --output-results /build/source/tests/artifacts/scalar_box_invalid_momentum_approach/approach_momentum.json --momentum-space --graph-id 0
  1376. 200.97 s > The application panicked (crashed).
  1377. 200.97 s > Message: There are 2 processes available. Please specify a process.
  1378. 200.97 s > Location: tests/tests/test_runs/approach.rs:332
  1379. 200.97 s >
  1380. 200.97 s > ━━━━━━━━━━━━━━━━━━━━━━━━━━━━━━━━━━ BACKTRACE ━━━━━━━━━━━━━━━━━━━━━━━━━━━━━━━━━━━
  1381. 200.97 s > 1: <color_eyre[51793ea62743adbd]::config::PanicHook>::panic_report<unknown>
  1382. 200.97 s > at <unknown source file>:<unknown line>
  1383. 200.97 s > 2: <color_eyre[51793ea62743adbd]::config::PanicHook>::into_panic_hook::{closure#0}<unknown>
  1384. 200.97 s > at <unknown source file>:<unknown line>
  1385. 200.97 s > 3: std[bcb96dfbba0ab899]::panicking::panic_with_hook<unknown>
  1386. 200.97 s > at <unknown source file>:<unknown line>
  1387. 200.97 s > 4: std[bcb96dfbba0ab899]::panicking::panic_handler::{closure#0}<unknown>
  1388. 200.97 s > at <unknown source file>:<unknown line>
  1389. 200.97 s > 5: std[bcb96dfbba0ab899]::sys::backtrace::__rust_end_short_backtrace::<std[bcb96dfbba0ab899]::panicking::panic_handler::{closure#0}, !><unknown>
  1390. 200.97 s > at <unknown source file>:<unknown line>
  1391. 200.97 s > 6: __rustc[6c289b9f9c454d21]::rust_begin_unwind<unknown>
  1392. 200.97 s > at <unknown source file>:<unknown line>
  1393. 200.97 s > 7: core[940e698046960fd5]::panicking::panic_fmt<unknown>
  1394. 200.97 s > at <unknown source file>:<unknown line>
  1395. 200.97 s > 8: test_runs[3e7a390caee4e338]::approach::approach_momentum_space_reports_incomplete_triplet_cleanly<unknown>
  1396. 200.97 s > at <unknown source file>:<unknown line>
  1397. 200.97 s > 9: <test_runs[3e7a390caee4e338]::approach::approach_momentum_space_reports_incomplete_triplet_cleanly::{closure#0} as core[940e698046960fd5]::ops::function::FnOnce<()>>::call_once<unknown>
  1398. 200.97 s > at <unknown source file>:<unknown line>
  1399. 200.97 s > 10: test[75d6903177b1d7e9]::__rust_begin_short_backtrace::<core[940e698046960fd5]::result::Result<(), alloc[2ea6bcb46fca0c42]::string::String>, fn() -> core[940e698046960fd5]::result::Result<(), alloc[2ea6bcb46fca0c42]::string::String>><unknown>
  1400. 200.97 s > at <unknown source file>:<unknown line>
  1401. 200.97 s > 11: test[75d6903177b1d7e9]::run_test::{closure#0}<unknown>
  1402. 200.97 s > at <unknown source file>:<unknown line>
  1403. 200.97 s > 12: std[bcb96dfbba0ab899]::sys::backtrace::__rust_begin_short_backtrace::<test[75d6903177b1d7e9]::run_test::{closure#1}, ()><unknown>
  1404. 200.97 s > at <unknown source file>:<unknown line>
  1405. 200.97 s > 13: <std[bcb96dfbba0ab899]::thread::lifecycle::spawn_unchecked<test[75d6903177b1d7e9]::run_test::{closure#1}, ()>::{closure#1} as core[940e698046960fd5]::ops::function::FnOnce<()>>::call_once::{shim:vtable#0}<unknown>
  1406. 200.97 s > at <unknown source file>:<unknown line>
  1407. 200.97 s > 14: <std[bcb96dfbba0ab899]::sys::thread::unix::Thread>::new::thread_start<unknown>
  1408. 200.97 s > at <unknown source file>:<unknown line>
  1409. 200.97 s > 15: start_thread<unknown>
  1410. 200.97 s > at <unknown source file>:<unknown line>
  1411. 200.97 s > 16: __clone3<unknown>
  1412. 200.97 s > at <unknown source file>:<unknown line>
  1413. 200.97 s >
  1414. 200.97 s > Run with COLORBT_SHOW_HIDDEN=1 environment variable to disable frame filtering.
  1415. 200.97 s > ... omitted 1 more lines; see full nextest output above
  1416. 200.97 s >
  1417. 200.97 s > 2. gammaloop-integration-tests::test_runs::profile_bulk::box_4e_bulk_profile_passes
  1418. 200.97 s > failure: test failure with exit code 101
  1419. 200.97 s > Error:
  1420. 200.97 s > 0: IR profiling requested arbitrary precision but received a quad-precision result
  1421. 200.97 s >
  1422. 200.97 s > Location:
  1423. 200.97 s > crates/gammalooprs/src/integrands/process/ir.rs:2123
  1424. 200.97 s >
  1425. 200.97 s > ━━━━━━━━━━━━━━━━━━━━━━━━━━━━━━━━━━ BACKTRACE ━━━━━━━━━━━━━━━━━━━━━━━━━━━━━━━━━━━
  1426. 200.97 s > 1: <color_eyre[51793ea62743adbd]::config::EyreHook>::into_eyre_hook::{closure#0}<unknown>
  1427. 200.97 s > at <unknown source file>:<unknown line>
  1428. 200.97 s > 2: eyre[cb2fd339c0c40fca]::capture_handler<unknown>
  1429. 200.97 s > at <unknown source file>:<unknown line>
  1430. 200.97 s > 3: eyre[cb2fd339c0c40fca]::private::format_err<unknown>
  1431. 200.97 s > at <unknown source file>:<unknown line>
  1432. 200.97 s > 4: gammalooprs[d7a7c067ebd19583]::integrands::process::ir::evaluate_profile_momentum_point_arb::<gammalooprs[d7a7c067ebd19583]::integrands::process::amplitude::AmplitudeIntegrand><unknown>
  1433. 200.97 s > at <unknown source file>:<unknown line>
  1434. 200.97 s > 5: <gammalooprs[d7a7c067ebd19583]::integrands::process::amplitude::AmplitudeIntegrand>::test_single_ir_limit_impl<unknown>
  1435. 200.97 s > at <unknown source file>:<unknown line>
  1436. 200.97 s > 6: gammalooprs[d7a7c067ebd19583]::integrands::process::ir::run_ir_profile::<gammalooprs[d7a7c067ebd19583]::integrands::process::amplitude::AmplitudeIntegrand, <gammalooprs[d7a7c067ebd19583]::integrands::process::amplitude::AmplitudeIntegrand>::enumerate_ir_limits, <gammalooprs[d7a7c067ebd19583]::integrands::process::amplitude::AmplitudeIntegrand>::graph_cut_definitions, <gammalooprs[d7a7c067ebd19583]::integrands::process::amplitude::AmplitudeIntegrand>::test_single_ir_limit_impl><unknown>
  1437. 200.97 s > at <unknown source file>:<unknown line>
  1438. 200.97 s > 7: <gammalooprs[d7a7c067ebd19583]::integrands::process::amplitude::AmplitudeIntegrand>::test_ir<unknown>
  1439. 200.97 s > at <unknown source file>:<unknown line>
  1440. 200.97 s > 8: <gammaloop_api[92ae732909e47e14]::commands::profile::Profile>::run<unknown>
  1441. 200.97 s > at <unknown source file>:<unknown line>
  1442. 200.97 s > 9: test_runs[3e7a390caee4e338]::profile_bulk::box_4e_bulk_profile_passes<unknown>
  1443. 200.97 s > at <unknown source file>:<unknown line>
  1444. 200.97 s > 10: <test_runs[3e7a390caee4e338]::profile_bulk::box_4e_bulk_profile_passes::{closure#0} as core[940e698046960fd5]::ops::function::FnOnce<()>>::call_once<unknown>
  1445. 200.97 s > at <unknown source file>:<unknown line>
  1446. 200.97 s > 11: test[75d6903177b1d7e9]::__rust_begin_short_backtrace::<core[940e698046960fd5]::result::Result<(), alloc[2ea6bcb46fca0c42]::string::String>, fn() -> core[940e698046960fd5]::result::Result<(), alloc[2ea6bcb46fca0c42]::string::String>><unknown>
  1447. 200.97 s > at <unknown source file>:<unknown line>
  1448. 200.97 s > 12: test[75d6903177b1d7e9]::run_test::{closure#0}<unknown>
  1449. 200.97 s > at <unknown source file>:<unknown line>
  1450. 200.97 s > 13: std[bcb96dfbba0ab899]::sys::backtrace::__rust_begin_short_backtrace::<test[75d6903177b1d7e9]::run_test::{closure#1}, ()><unknown>
  1451. 200.97 s > at <unknown source file>:<unknown line>
  1452. 200.97 s > 14: <std[bcb96dfbba0ab899]::thread::lifecycle::spawn_unchecked<test[75d6903177b1d7e9]::run_test::{closure#1}, ()>::{closure#1} as core[940e698046960fd5]::ops::function::FnOnce<()>>::call_once::{shim:vtable#0}<unknown>
  1453. 200.97 s > at <unknown source file>:<unknown line>
  1454. 200.97 s > 15: <std[bcb96dfbba0ab899]::sys::thread::unix::Thread>::new::thread_start<unknown>
  1455. 200.97 s > at <unknown source file>:<unknown line>
  1456. 200.97 s > 16: start_thread<unknown>
  1457. 200.97 s > at <unknown source file>:<unknown line>
  1458. 200.97 s > 17: __clone3<unknown>
  1459. 200.97 s > at <unknown source file>:<unknown line>
  1460. 200.97 s >
  1461. 200.97 s > Run with COLORBT_SHOW_HIDDEN=1 environment variable to disable frame filtering.
  1462. 200.97 s > Run with RUST_BACKTRACE=full to include source snippets.
  1463. 200.97 s > Warning: SpanTrace capture is Unsupported.
  1464. 200.97 s > Ensure that you've setup a tracing-error ErrorLayer and the semver versions are compatible
  1465. 200.97 s > system-out
  1466. 200.97 s > running 1 test
  1467. 200.97 s > test profile_bulk::box_4e_bulk_profile_passes ... FAILED
  1468. 200.97 s >
  1469. 200.97 s > failures:
  1470. 200.97 s >
  1471. 200.97 s > failures:
  1472. 200.97 s > profile_bulk::box_4e_bulk_profile_passes
  1473. 200.97 s >
  1474. 200.97 s > test result: FAILED. 0 passed; 1 failed; 0 ignored; 0 measured; 82 filtered out; finished in 0.72s
  1475. 200.97 s > system-err
  1476. 200.97 s > [2026-08-28 16:18:32.896] @gammaloop_api::se... INFO : Running command import model ./assets/models/json/scalars/scalars.json
  1477. 200.97 s > [2026-08-28 16:18:32.896] @import::model INFO : Loading JSON model scalars-default from /build/source/assets/models/json/scalars/scalars
  1478. 200.97 s > [2026-08-28 16:18:32.899] @gammalooprs::model INFO : The following 2 external parameters were forced to zero by the restriction card:
  1479. 200.97 s > width_scalar_1, width_scalar_2
  1480. 200.97 s > [2026-08-28 16:18:32.900] @gammaloop_api::se... INFO : Running command import graphs ./tests/resources/graphs/massless_box.dot
  1481. 200.97 s > [2026-08-28 16:18:32.900] @commands::import INFO : Loading graphs from '/build/source/tests/resources/graphs/massless_box.dot'
  1482. 200.97 s > [2026-08-28 16:18:32.909] @gammaloop_api::se... INFO : Running command generate
  1483. 200.97 s > [2026-08-28 16:18:33.360] @commands::generate INFO :
  1484. 200.97 s > Integrand generation summary
  1485. 200.97 s > peak RAM 67.68 MiB | cores 1
  1486. 200.97 s > ╭───────────┬────────────────┬─────────┬─────────────┬────────────┬────────────────┬─────────────╮
  1487. 200.97 s > │ integrand │ graph │ # evals │ expr build │ spenso │ symbolica eval │ compile │
  1488. 200.97 s > ├───────────┼────────────────┼─────────┼─────────────┼────────────┼────────────────┼─────────────┤
  1489. 200.97 s > │ default │ massless_box_0 │ 14 │ 316ms (83%) │ 42ms (11%) │ 21ms (5.6%) │ 0ms (0.00%) │
  1490. 200.97 s > ├───────────┼────────────────┼─────────┼─────────────┼────────────┼────────────────┼─────────────┤
  1491. 200.97 s > │ Total │ │ 14 │ 316ms (83%) │ 42ms (11%) │ 21ms (5.6%) │ 0ms (0.00%) │
  1492. 200.97 s > ╰───────────┴────────────────┴─────────┴─────────────┴────────────┴────────────────┴─────────────╯
  1493. 200.97 s > [2026-08-28 16:18:33.367] @process::amplitude INFO : Input is above threshold: 4 existing threshold E-surfaces across 1/1 graph groups
  1494. 200.97 s > [2026-08-28 16:18:33.373] @process::amplitude INFO : overlap structure of group 0: [2: [4(3,4), 8(4,6)], 2: [4(3,4), 9(3,5)], 2: [8(4,6), 11(5,6)], 2: [9(3,5), 11(5,6)]]
  1495. 200.97 s > Error:
  1496. 200.97 s > 0: IR profiling requested arbitrary precision but received a quad-precision result
  1497. 200.97 s >
  1498. 200.97 s > Location:
  1499. 200.97 s > crates/gammalooprs/src/integrands/process/ir.rs:2123
  1500. 200.97 s >
  1501. 200.97 s > ━━━━━━━━━━━━━━━━━━━━━━━━━━━━━━━━━━ BACKTRACE ━━━━━━━━━━━━━━━━━━━━━━━━━━━━━━━━━━━
  1502. 200.97 s > 1: <color_eyre[51793ea62743adbd]::config::EyreHook>::into_eyre_hook::{closure#0}<unknown>
  1503. 200.97 s > at <unknown source file>:<unknown line>
  1504. 200.97 s > 2: eyre[cb2fd339c0c40fca]::capture_handler<unknown>
  1505. 200.97 s > at <unknown source file>:<unknown line>
  1506. 200.97 s > 3: eyre[cb2fd339c0c40fca]::private::format_err<unknown>
  1507. 200.97 s > at <unknown source file>:<unknown line>
  1508. 200.97 s > 4: gammalooprs[d7a7c067ebd19583]::integrands::process::ir::evaluate_profile_momentum_point_arb::<gammalooprs[d7a7c067ebd19583]::integrands::process::amplitude::AmplitudeIntegrand><unknown>
  1509. 200.97 s > at <unknown source file>:<unknown line>
  1510. 200.97 s > 5: <gammalooprs[d7a7c067ebd19583]::integrands::process::amplitude::AmplitudeIntegrand>::test_single_ir_limit_impl<unknown>
  1511. 200.97 s > at <unknown source file>:<unknown line>
  1512. 200.97 s > 6: gammalooprs[d7a7c067ebd19583]::integrands::process::ir::run_ir_profile::<gammalooprs[d7a7c067ebd19583]::integrands::process::amplitude::AmplitudeIntegrand, <gammalooprs[d7a7c067ebd19583]::integrands::process::amplitude::AmplitudeIntegrand>::enumerate_ir_limits, <gammalooprs[d7a7c067ebd19583]::integrands::process::amplitude::AmplitudeIntegrand>::graph_cut_definitions, <gammalooprs[d7a7c067ebd19583]::integrands::process::amplitude::AmplitudeIntegrand>::test_single_ir_limit_impl><unknown>
  1513. 200.97 s > at <unknown source file>:<unknown line>
  1514. 200.97 s > 7: <gammalooprs[d7a7c067ebd19583]::integrands::process::amplitude::AmplitudeIntegrand>::test_ir<unknown>
  1515. 200.97 s > at <unknown source file>:<unknown line>
  1516. 200.97 s > 8: <gammaloop_api[92ae732909e47e14]::commands::profile::Profile>::run<unknown>
  1517. 200.97 s > at <unknown source file>:<unknown line>
  1518. 200.97 s > 9: test_runs[3e7a390caee4e338]::profile_bulk::box_4e_bulk_profile_passes<unknown>
  1519. 200.97 s > at <unknown source file>:<unknown line>
  1520. 200.97 s > 10: <test_runs[3e7a390caee4e338]::profile_bulk::box_4e_bulk_profile_passes::{closure#0} as core[940e698046960fd5]::ops::function::FnOnce<()>>::call_once<unknown>
  1521. 200.97 s > at <unknown source file>:<unknown line>
  1522. 200.97 s > 11: test[75d6903177b1d7e9]::__rust_begin_short_backtrace::<core[940e698046960fd5]::result::Result<(), alloc[2ea6bcb46fca0c42]::string::String>, fn() -> core[940e698046960fd5]::result::Result<(), alloc[2ea6bcb46fca0c42]::string::String>><unknown>
  1523. 200.97 s > at <unknown source file>:<unknown line>
  1524. 200.97 s > 12: test[75d6903177b1d7e9]::run_test::{closure#0}<unknown>
  1525. 200.97 s > at <unknown source file>:<unknown line>
  1526. 200.97 s > 13: std[bcb96dfbba0ab899]::sys::backtrace::__rust_begin_short_backtrace::<test[75d6903177b1d7e9]::run_test::{closure#1}, ()><unknown>
  1527. 200.97 s > at <unknown source file>:<unknown line>
  1528. 200.97 s > 14: <std[bcb96dfbba0ab899]::thread::lifecycle::spawn_unchecked<test[75d6903177b1d7e9]::run_test::{closure#1}, ()>::{closure#1} as core[940e698046960fd5]::ops::function::FnOnce<()>>::call_once::{shim:vtable#0}<unknown>
  1529. 200.97 s > at <unknown source file>:<unknown line>
  1530. 200.97 s > 15: <std[bcb96dfbba0ab899]::sys::thread::unix::Thread>::new::thread_start<unknown>
  1531. 200.97 s > at <unknown source file>:<unknown line>
  1532. 200.97 s > 16: start_thread<unknown>
  1533. 200.97 s > at <unknown source file>:<unknown line>
  1534. 200.97 s > 17: __clone3<unknown>
  1535. 200.97 s > at <unknown source file>:<unknown line>
  1536. 200.97 s >
  1537. 200.97 s > Run with COLORBT_SHOW_HIDDEN=1 environment variable to disable frame filtering.
  1538. 200.97 s > Run with RUST_BACKTRACE=full to include source snippets.
  1539. 200.97 s > Warning: SpanTrace capture is Unsupported.
  1540. 200.97 s > Ensure that you've setup a tracing-error ErrorLayer and the semver versions are compatible
  1541. 200.97 s >
  1542. 200.97 s > 3. gammaloop-integration-tests::test_runs::profile_bulk::dotted_bubble_amp_bulk_profile_passes
  1543. 200.97 s > failure: test failure with exit code 101
  1544. 200.97 s > Error:
  1545. 200.97 s > 0: IR profiling requested arbitrary precision but received a quad-precision result
  1546. 200.97 s >
  1547. 200.97 s > Location:
  1548. 200.97 s > crates/gammalooprs/src/integrands/process/ir.rs:2123
  1549. 200.97 s >
  1550. 200.97 s > ━━━━━━━━━━━━━━━━━━━━━━━━━━━━━━━━━━ BACKTRACE ━━━━━━━━━━━━━━━━━━━━━━━━━━━━━━━━━━━
  1551. 200.97 s > 1: <color_eyre[51793ea62743adbd]::config::EyreHook>::into_eyre_hook::{closure#0}<unknown>
  1552. 200.97 s > at <unknown source file>:<unknown line>
  1553. 200.97 s > 2: eyre[cb2fd339c0c40fca]::capture_handler<unknown>
  1554. 200.97 s > at <unknown source file>:<unknown line>
  1555. 200.97 s > 3: eyre[cb2fd339c0c40fca]::private::format_err<unknown>
  1556. 200.97 s > at <unknown source file>:<unknown line>
  1557. 200.97 s > 4: gammalooprs[d7a7c067ebd19583]::integrands::process::ir::evaluate_profile_momentum_point_arb::<gammalooprs[d7a7c067ebd19583]::integrands::process::amplitude::AmplitudeIntegrand><unknown>
  1558. 200.97 s > at <unknown source file>:<unknown line>
  1559. 200.97 s > 5: <gammalooprs[d7a7c067ebd19583]::integrands::process::amplitude::AmplitudeIntegrand>::test_single_ir_limit_impl<unknown>
  1560. 200.97 s > at <unknown source file>:<unknown line>
  1561. 200.97 s > 6: gammalooprs[d7a7c067ebd19583]::integrands::process::ir::run_ir_profile::<gammalooprs[d7a7c067ebd19583]::integrands::process::amplitude::AmplitudeIntegrand, <gammalooprs[d7a7c067ebd19583]::integrands::process::amplitude::AmplitudeIntegrand>::enumerate_ir_limits, <gammalooprs[d7a7c067ebd19583]::integrands::process::amplitude::AmplitudeIntegrand>::graph_cut_definitions, <gammalooprs[d7a7c067ebd19583]::integrands::process::amplitude::AmplitudeIntegrand>::test_single_ir_limit_impl><unknown>
  1562. 200.97 s > at <unknown source file>:<unknown line>
  1563. 200.97 s > 7: <gammalooprs[d7a7c067ebd19583]::integrands::process::amplitude::AmplitudeIntegrand>::test_ir<unknown>
  1564. 200.97 s > at <unknown source file>:<unknown line>
  1565. 200.97 s > 8: <gammaloop_api[92ae732909e47e14]::commands::profile::Profile>::run<unknown>
  1566. 200.97 s > at <unknown source file>:<unknown line>
  1567. 200.97 s > 9: test_runs[3e7a390caee4e338]::profile_bulk::dotted_bubble_amp_bulk_profile_passes<unknown>
  1568. 200.97 s > at <unknown source file>:<unknown line>
  1569. 200.97 s > 10: <test_runs[3e7a390caee4e338]::profile_bulk::dotted_bubble_amp_bulk_profile_passes::{closure#0} as core[940e698046960fd5]::ops::function::FnOnce<()>>::call_once<unknown>
  1570. 200.97 s > at <unknown source file>:<unknown line>
  1571. 200.97 s > 11: test[75d6903177b1d7e9]::__rust_begin_short_backtrace::<core[940e698046960fd5]::result::Result<(), alloc[2ea6bcb46fca0c42]::string::String>, fn() -> core[940e698046960fd5]::result::Result<(), alloc[2ea6bcb46fca0c42]::string::String>><unknown>
  1572. 200.97 s > at <unknown source file>:<unknown line>
  1573. 200.97 s > 12: test[75d6903177b1d7e9]::run_test::{closure#0}<unknown>
  1574. 200.97 s > at <unknown source file>:<unknown line>
  1575. 200.97 s > 13: std[bcb96dfbba0ab899]::sys::backtrace::__rust_begin_short_backtrace::<test[75d6903177b1d7e9]::run_test::{closure#1}, ()><unknown>
  1576. 200.97 s > at <unknown source file>:<unknown line>
  1577. 200.97 s > 14: <std[bcb96dfbba0ab899]::thread::lifecycle::spawn_unchecked<test[75d6903177b1d7e9]::run_test::{closure#1}, ()>::{closure#1} as core[940e698046960fd5]::ops::function::FnOnce<()>>::call_once::{shim:vtable#0}<unknown>
  1578. 200.97 s > at <unknown source file>:<unknown line>
  1579. 200.97 s > 15: <std[bcb96dfbba0ab899]::sys::thread::unix::Thread>::new::thread_start<unknown>
  1580. 200.97 s > at <unknown source file>:<unknown line>
  1581. 200.97 s > 16: start_thread<unknown>
  1582. 200.97 s > at <unknown source file>:<unknown line>
  1583. 200.97 s > 17: __clone3<unknown>
  1584. 200.97 s > at <unknown source file>:<unknown line>
  1585. 200.97 s >
  1586. 200.97 s > Run with COLORBT_SHOW_HIDDEN=1 environment variable to disable frame filtering.
  1587. 200.97 s > Run with RUST_BACKTRACE=full to include source snippets.
  1588. 200.97 s > Warning: SpanTrace capture is Unsupported.
  1589. 200.97 s > Ensure that you've setup a tracing-error ErrorLayer and the semver versions are compatible
  1590. 200.97 s > system-out
  1591. 200.97 s > running 1 test
  1592. 200.97 s > test profile_bulk::dotted_bubble_amp_bulk_profile_passes ... FAILED
  1593. 200.97 s >
  1594. 200.97 s > failures:
  1595. 200.97 s >
  1596. 200.97 s > failures:
  1597. 200.97 s > profile_bulk::dotted_bubble_amp_bulk_profile_passes
  1598. 200.97 s >
  1599. 200.97 s > test result: FAILED. 0 passed; 1 failed; 0 ignored; 0 measured; 82 filtered out; finished in 0.68s
  1600. 200.97 s > system-err
  1601. 200.97 s > [2026-08-28 16:18:33.396] @gammaloop_api::se... INFO : Running command import model ./assets/models/json/scalars/scalars_2p_3p.json
  1602. 200.97 s > [2026-08-28 16:18:33.396] @import::model INFO : Loading JSON model scalars_2p_3p-default from /build/source/assets/models/json/scalars/scalars_2p_3p
  1603. 200.97 s > [2026-08-28 16:18:33.399] @gammaloop_api::se... INFO : Running command import graphs ./tests/resources/graphs/dotted_bubble_amp.dot
  1604. 200.97 s > [2026-08-28 16:18:33.399] @commands::import INFO : Loading graphs from '/build/source/tests/resources/graphs/dotted_bubble_amp.dot'
  1605. 200.97 s > [2026-08-28 16:18:33.403] @gammaloop_api::se... INFO : Running command generate
  1606. 200.97 s > [2026-08-28 16:18:33.523] @commands::generate INFO :
  1607. 200.97 s > Integrand generation summary
  1608. 200.97 s > peak RAM 65.67 MiB | cores 1
  1609. 200.97 s > ╭───────────┬───────────────────┬─────────┬────────────┬────────────┬────────────────┬─────────────╮
  1610. 200.97 s > │ integrand │ graph │ # evals │ expr build │ spenso │ symbolica eval │ compile │
  1611. 200.97 s > ├───────────┼───────────────────┼─────────┼────────────┼────────────┼────────────────┼─────────────┤
  1612. 200.97 s > │ default │ dotted_bubble_amp │ 8 │ 49ms (66%) │ 1ms (2.2%) │ 23ms (32%) │ 0ms (0.00%) │
  1613. 200.97 s > ├───────────┼───────────────────┼─────────┼────────────┼────────────┼────────────────┼─────────────┤
  1614. 200.97 s > │ Total │ │ 8 │ 49ms (66%) │ 1ms (2.2%) │ 23ms (32%) │ 0ms (0.00%) │
  1615. 200.97 s > ╰───────────┴───────────────────┴─────────┴────────────┴────────────┴────────────────┴─────────────╯
  1616. 200.97 s > [2026-08-28 16:18:33.525] @process::amplitude INFO : Input is above threshold: 1 existing threshold E-surfaces across 1/1 graph groups
  1617. 200.97 s > [2026-08-28 16:18:33.525] @process::amplitude INFO : overlap structure of group 0: [1: [1(1,3)]]
  1618. 200.97 s > Error:
  1619. 200.97 s > 0: IR profiling requested arbitrary precision but received a quad-precision result
  1620. 200.97 s >
  1621. 200.97 s > Location:
  1622. 200.97 s > crates/gammalooprs/src/integrands/process/ir.rs:2123
  1623. 200.97 s >
  1624. 200.97 s > ━━━━━━━━━━━━━━━━━━━━━━━━━━━━━━━━━━ BACKTRACE ━━━━━━━━━━━━━━━━━━━━━━━━━━━━━━━━━━━
  1625. 200.97 s > 1: <color_eyre[51793ea62743adbd]::config::EyreHook>::into_eyre_hook::{closure#0}<unknown>
  1626. 200.97 s > at <unknown source file>:<unknown line>
  1627. 200.97 s > 2: eyre[cb2fd339c0c40fca]::capture_handler<unknown>
  1628. 200.97 s > at <unknown source file>:<unknown line>
  1629. 200.97 s > 3: eyre[cb2fd339c0c40fca]::private::format_err<unknown>
  1630. 200.97 s > at <unknown source file>:<unknown line>
  1631. 200.97 s > 4: gammalooprs[d7a7c067ebd19583]::integrands::process::ir::evaluate_profile_momentum_point_arb::<gammalooprs[d7a7c067ebd19583]::integrands::process::amplitude::AmplitudeIntegrand><unknown>
  1632. 200.97 s > at <unknown source file>:<unknown line>
  1633. 200.97 s > 5: <gammalooprs[d7a7c067ebd19583]::integrands::process::amplitude::AmplitudeIntegrand>::test_single_ir_limit_impl<unknown>
  1634. 200.97 s > at <unknown source file>:<unknown line>
  1635. 200.97 s > 6: gammalooprs[d7a7c067ebd19583]::integrands::process::ir::run_ir_profile::<gammalooprs[d7a7c067ebd19583]::integrands::process::amplitude::AmplitudeIntegrand, <gammalooprs[d7a7c067ebd19583]::integrands::process::amplitude::AmplitudeIntegrand>::enumerate_ir_limits, <gammalooprs[d7a7c067ebd19583]::integrands::process::amplitude::AmplitudeIntegrand>::graph_cut_definitions, <gammalooprs[d7a7c067ebd19583]::integrands::process::amplitude::AmplitudeIntegrand>::test_single_ir_limit_impl><unknown>
  1636. 200.97 s > at <unknown source file>:<unknown line>
  1637. 200.97 s > 7: <gammalooprs[d7a7c067ebd19583]::integrands::process::amplitude::AmplitudeIntegrand>::test_ir<unknown>
  1638. 200.97 s > at <unknown source file>:<unknown line>
  1639. 200.97 s > 8: <gammaloop_api[92ae732909e47e14]::commands::profile::Profile>::run<unknown>
  1640. 200.97 s > at <unknown source file>:<unknown line>
  1641. 200.97 s > 9: test_runs[3e7a390caee4e338]::profile_bulk::dotted_bubble_amp_bulk_profile_passes<unknown>
  1642. 200.97 s > at <unknown source file>:<unknown line>
  1643. 200.97 s > 10: <test_runs[3e7a390caee4e338]::profile_bulk::dotted_bubble_amp_bulk_profile_passes::{closure#0} as core[940e698046960fd5]::ops::function::FnOnce<()>>::call_once<unknown>
  1644. 200.97 s > at <unknown source file>:<unknown line>
  1645. 200.97 s > 11: test[75d6903177b1d7e9]::__rust_begin_short_backtrace::<core[940e698046960fd5]::result::Result<(), alloc[2ea6bcb46fca0c42]::string::String>, fn() -> core[940e698046960fd5]::result::Result<(), alloc[2ea6bcb46fca0c42]::string::String>><unknown>
  1646. 200.97 s > at <unknown source file>:<unknown line>
  1647. 200.97 s > 12: test[75d6903177b1d7e9]::run_test::{closure#0}<unknown>
  1648. 200.97 s > at <unknown source file>:<unknown line>
  1649. 200.97 s > 13: std[bcb96dfbba0ab899]::sys::backtrace::__rust_begin_short_backtrace::<test[75d6903177b1d7e9]::run_test::{closure#1}, ()><unknown>
  1650. 200.97 s > at <unknown source file>:<unknown line>
  1651. 200.97 s > 14: <std[bcb96dfbba0ab899]::thread::lifecycle::spawn_unchecked<test[75d6903177b1d7e9]::run_test::{closure#1}, ()>::{closure#1} as core[940e698046960fd5]::ops::function::FnOnce<()>>::call_once::{shim:vtable#0}<unknown>
  1652. 200.97 s > at <unknown source file>:<unknown line>
  1653. 200.97 s > 15: <std[bcb96dfbba0ab899]::sys::thread::unix::Thread>::new::thread_start<unknown>
  1654. 200.97 s > at <unknown source file>:<unknown line>
  1655. 200.97 s > 16: start_thread<unknown>
  1656. 200.97 s > at <unknown source file>:<unknown line>
  1657. 200.97 s > 17: __clone3<unknown>
  1658. 200.97 s > at <unknown source file>:<unknown line>
  1659. 200.97 s >
  1660. 200.97 s > Run with COLORBT_SHOW_HIDDEN=1 environment variable to disable frame filtering.
  1661. 200.97 s > Run with RUST_BACKTRACE=full to include source snippets.
  1662. 200.97 s > Warning: SpanTrace capture is Unsupported.
  1663. 200.97 s > Ensure that you've setup a tracing-error ErrorLayer and the semver versions are compatible
  1664. 200.97 s >
  1665. 200.97 s > 4. gammaloop-integration-tests::test_runs::profile_bulk::double_dotted_bubble_amp_bulk_profile_passes
  1666. 200.97 s > failure: test failure with exit code 101
  1667. 200.97 s > Error:
  1668. 200.97 s > 0: IR profiling requested arbitrary precision but received a quad-precision result
  1669. 200.97 s >
  1670. 200.97 s > Location:
  1671. 200.97 s > crates/gammalooprs/src/integrands/process/ir.rs:2123
  1672. 200.97 s >
  1673. 200.97 s > ━━━━━━━━━━━━━━━━━━━━━━━━━━━━━━━━━━ BACKTRACE ━━━━━━━━━━━━━━━━━━━━━━━━━━━━━━━━━━━
  1674. 200.97 s > 1: <color_eyre[51793ea62743adbd]::config::EyreHook>::into_eyre_hook::{closure#0}<unknown>
  1675. 200.97 s > at <unknown source file>:<unknown line>
  1676. 200.97 s > 2: eyre[cb2fd339c0c40fca]::capture_handler<unknown>
  1677. 200.97 s > at <unknown source file>:<unknown line>
  1678. 200.97 s > 3: eyre[cb2fd339c0c40fca]::private::format_err<unknown>
  1679. 200.97 s > at <unknown source file>:<unknown line>
  1680. 200.97 s > 4: gammalooprs[d7a7c067ebd19583]::integrands::process::ir::evaluate_profile_momentum_point_arb::<gammalooprs[d7a7c067ebd19583]::integrands::process::amplitude::AmplitudeIntegrand><unknown>
  1681. 200.97 s > at <unknown source file>:<unknown line>
  1682. 200.97 s > 5: <gammalooprs[d7a7c067ebd19583]::integrands::process::amplitude::AmplitudeIntegrand>::test_single_ir_limit_impl<unknown>
  1683. 200.97 s > at <unknown source file>:<unknown line>
  1684. 200.97 s > 6: gammalooprs[d7a7c067ebd19583]::integrands::process::ir::run_ir_profile::<gammalooprs[d7a7c067ebd19583]::integrands::process::amplitude::AmplitudeIntegrand, <gammalooprs[d7a7c067ebd19583]::integrands::process::amplitude::AmplitudeIntegrand>::enumerate_ir_limits, <gammalooprs[d7a7c067ebd19583]::integrands::process::amplitude::AmplitudeIntegrand>::graph_cut_definitions, <gammalooprs[d7a7c067ebd19583]::integrands::process::amplitude::AmplitudeIntegrand>::test_single_ir_limit_impl><unknown>
  1685. 200.97 s > at <unknown source file>:<unknown line>
  1686. 200.97 s > 7: <gammalooprs[d7a7c067ebd19583]::integrands::process::amplitude::AmplitudeIntegrand>::test_ir<unknown>
  1687. 200.97 s > at <unknown source file>:<unknown line>
  1688. 200.97 s > 8: <gammaloop_api[92ae732909e47e14]::commands::profile::Profile>::run<unknown>
  1689. 200.97 s > at <unknown source file>:<unknown line>
  1690. 200.97 s > 9: test_runs[3e7a390caee4e338]::profile_bulk::double_dotted_bubble_amp_bulk_profile_passes<unknown>
  1691. 200.97 s > at <unknown source file>:<unknown line>
  1692. 200.97 s > 10: <test_runs[3e7a390caee4e338]::profile_bulk::double_dotted_bubble_amp_bulk_profile_passes::{closure#0} as core[940e698046960fd5]::ops::function::FnOnce<()>>::call_once<unknown>
  1693. 200.97 s > at <unknown source file>:<unknown line>
  1694. 200.97 s > 11: test[75d6903177b1d7e9]::__rust_begin_short_backtrace::<core[940e698046960fd5]::result::Result<(), alloc[2ea6bcb46fca0c42]::string::String>, fn() -> core[940e698046960fd5]::result::Result<(), alloc[2ea6bcb46fca0c42]::string::String>><unknown>
  1695. 200.97 s > at <unknown source file>:<unknown line>
  1696. 200.97 s > 12: test[75d6903177b1d7e9]::run_test::{closure#0}<unknown>
  1697. 200.97 s > at <unknown source file>:<unknown line>
  1698. 200.97 s > 13: std[bcb96dfbba0ab899]::sys::backtrace::__rust_begin_short_backtrace::<test[75d6903177b1d7e9]::run_test::{closure#1}, ()><unknown>
  1699. 200.97 s > at <unknown source file>:<unknown line>
  1700. 200.97 s > 14: <std[bcb96dfbba0ab899]::thread::lifecycle::spawn_unchecked<test[75d6903177b1d7e9]::run_test::{closure#1}, ()>::{closure#1} as core[940e698046960fd5]::ops::function::FnOnce<()>>::call_once::{shim:vtable#0}<unknown>
  1701. 200.97 s > at <unknown source file>:<unknown line>
  1702. 200.97 s > 15: <std[bcb96dfbba0ab899]::sys::thread::unix::Thread>::new::thread_start<unknown>
  1703. 200.97 s > at <unknown source file>:<unknown line>
  1704. 200.97 s > 16: start_thread<unknown>
  1705. 200.97 s > at <unknown source file>:<unknown line>
  1706. 200.97 s > 17: __clone3<unknown>
  1707. 200.97 s > at <unknown source file>:<unknown line>
  1708. 200.97 s >
  1709. 200.97 s > Run with COLORBT_SHOW_HIDDEN=1 environment variable to disable frame filtering.
  1710. 200.97 s > Run with RUST_BACKTRACE=full to include source snippets.
  1711. 200.97 s > Warning: SpanTrace capture is Unsupported.
  1712. 200.97 s > Ensure that you've setup a tracing-error ErrorLayer and the semver versions are compatible
  1713. 200.97 s > system-out
  1714. 200.97 s > running 1 test
  1715. 200.97 s > test profile_bulk::double_dotted_bubble_amp_bulk_profile_passes ... FAILED
  1716. 200.97 s >
  1717. 200.97 s > failures:
  1718. 200.97 s >
  1719. 200.97 s > failures:
  1720. 200.97 s > profile_bulk::double_dotted_bubble_amp_bulk_profile_passes
  1721. 200.97 s >
  1722. 200.97 s > test result: FAILED. 0 passed; 1 failed; 0 ignored; 0 measured; 82 filtered out; finished in 0.59s
  1723. 200.97 s > system-err
  1724. 200.97 s > [2026-08-28 16:18:33.365] @gammaloop_api::se... INFO : Running command import model ./assets/models/json/scalars/scalars_2p_3p.json
  1725. 200.97 s > [2026-08-28 16:18:33.365] @import::model INFO : Loading JSON model scalars_2p_3p-default from /build/source/assets/models/json/scalars/scalars_2p_3p
  1726. 200.97 s > [2026-08-28 16:18:33.369] @gammaloop_api::se... INFO : Running command import graphs ./tests/resources/graphs/double_dotted_bubble_amp.dot
  1727. 200.97 s > [2026-08-28 16:18:33.369] @commands::import INFO : Loading graphs from '/build/source/tests/resources/graphs/double_dotted_bubble_amp.dot'
  1728. 200.97 s > [2026-08-28 16:18:33.382] @gammaloop_api::se... INFO : Running command generate
  1729. 200.97 s > [2026-08-28 16:18:33.619] @commands::generate INFO :
  1730. 200.97 s > Integrand generation summary
  1731. 200.97 s > peak RAM 66.35 MiB | cores 1
  1732. 200.97 s > ╭───────────┬──────────────────────────┬─────────┬─────────────┬─────────────┬────────────────┬─────────────╮
  1733. 200.97 s > │ integrand │ graph │ # evals │ expr build │ spenso │ symbolica eval │ compile │
  1734. 200.97 s > ├───────────┼──────────────────────────┼─────────┼─────────────┼─────────────┼────────────────┼─────────────┤
  1735. 200.97 s > │ default │ double_dotted_bubble_amp │ 11 │ 141ms (66%) │ 14ms (6.7%) │ 58ms (27%) │ 0ms (0.00%) │
  1736. 200.97 s > ├───────────┼──────────────────────────┼─────────┼─────────────┼─────────────┼────────────────┼─────────────┤
  1737. 200.97 s > │ Total │ │ 11 │ 141ms (66%) │ 14ms (6.7%) │ 58ms (27%) │ 0ms (0.00%) │
  1738. 200.97 s > ╰───────────┴──────────────────────────┴─────────┴─────────────┴─────────────┴────────────────┴─────────────╯
  1739. 200.97 s > [2026-08-28 16:18:33.625] @process::amplitude INFO : Input is above threshold: 1 existing threshold E-surfaces across 1/1 graph groups
  1740. 200.97 s > [2026-08-28 16:18:33.625] @process::amplitude INFO : overlap structure of group 0: [1: [1(1,4)]]
  1741. 200.97 s > Error:
  1742. 200.97 s > 0: IR profiling requested arbitrary precision but received a quad-precision result
  1743. 200.97 s >
  1744. 200.97 s > Location:
  1745. 200.97 s > crates/gammalooprs/src/integrands/process/ir.rs:2123
  1746. 200.97 s >
  1747. 200.97 s > ━━━━━━━━━━━━━━━━━━━━━━━━━━━━━━━━━━ BACKTRACE ━━━━━━━━━━━━━━━━━━━━━━━━━━━━━━━━━━━
  1748. 200.97 s > 1: <color_eyre[51793ea62743adbd]::config::EyreHook>::into_eyre_hook::{closure#0}<unknown>
  1749. 200.97 s > at <unknown source file>:<unknown line>
  1750. 200.97 s > 2: eyre[cb2fd339c0c40fca]::capture_handler<unknown>
  1751. 200.97 s > at <unknown source file>:<unknown line>
  1752. 200.97 s > 3: eyre[cb2fd339c0c40fca]::private::format_err<unknown>
  1753. 200.97 s > at <unknown source file>:<unknown line>
  1754. 200.97 s > 4: gammalooprs[d7a7c067ebd19583]::integrands::process::ir::evaluate_profile_momentum_point_arb::<gammalooprs[d7a7c067ebd19583]::integrands::process::amplitude::AmplitudeIntegrand><unknown>
  1755. 200.97 s > at <unknown source file>:<unknown line>
  1756. 200.97 s > 5: <gammalooprs[d7a7c067ebd19583]::integrands::process::amplitude::AmplitudeIntegrand>::test_single_ir_limit_impl<unknown>
  1757. 200.97 s > at <unknown source file>:<unknown line>
  1758. 200.97 s > 6: gammalooprs[d7a7c067ebd19583]::integrands::process::ir::run_ir_profile::<gammalooprs[d7a7c067ebd19583]::integrands::process::amplitude::AmplitudeIntegrand, <gammalooprs[d7a7c067ebd19583]::integrands::process::amplitude::AmplitudeIntegrand>::enumerate_ir_limits, <gammalooprs[d7a7c067ebd19583]::integrands::process::amplitude::AmplitudeIntegrand>::graph_cut_definitions, <gammalooprs[d7a7c067ebd19583]::integrands::process::amplitude::AmplitudeIntegrand>::test_single_ir_limit_impl><unknown>
  1759. 200.97 s > at <unknown source file>:<unknown line>
  1760. 200.97 s > 7: <gammalooprs[d7a7c067ebd19583]::integrands::process::amplitude::AmplitudeIntegrand>::test_ir<unknown>
  1761. 200.97 s > at <unknown source file>:<unknown line>
  1762. 200.97 s > 8: <gammaloop_api[92ae732909e47e14]::commands::profile::Profile>::run<unknown>
  1763. 200.97 s > at <unknown source file>:<unknown line>
  1764. 200.97 s > 9: test_runs[3e7a390caee4e338]::profile_bulk::double_dotted_bubble_amp_bulk_profile_passes<unknown>
  1765. 200.97 s > at <unknown source file>:<unknown line>
  1766. 200.97 s > 10: <test_runs[3e7a390caee4e338]::profile_bulk::double_dotted_bubble_amp_bulk_profile_passes::{closure#0} as core[940e698046960fd5]::ops::function::FnOnce<()>>::call_once<unknown>
  1767. 200.97 s > at <unknown source file>:<unknown line>
  1768. 200.97 s > 11: test[75d6903177b1d7e9]::__rust_begin_short_backtrace::<core[940e698046960fd5]::result::Result<(), alloc[2ea6bcb46fca0c42]::string::String>, fn() -> core[940e698046960fd5]::result::Result<(), alloc[2ea6bcb46fca0c42]::string::String>><unknown>
  1769. 200.97 s > at <unknown source file>:<unknown line>
  1770. 200.97 s > 12: test[75d6903177b1d7e9]::run_test::{closure#0}<unknown>
  1771. 200.97 s > at <unknown source file>:<unknown line>
  1772. 200.97 s > 13: std[bcb96dfbba0ab899]::sys::backtrace::__rust_begin_short_backtrace::<test[75d6903177b1d7e9]::run_test::{closure#1}, ()><unknown>
  1773. 200.97 s > at <unknown source file>:<unknown line>
  1774. 200.97 s > 14: <std[bcb96dfbba0ab899]::thread::lifecycle::spawn_unchecked<test[75d6903177b1d7e9]::run_test::{closure#1}, ()>::{closure#1} as core[940e698046960fd5]::ops::function::FnOnce<()>>::call_once::{shim:vtable#0}<unknown>
  1775. 200.97 s > at <unknown source file>:<unknown line>
  1776. 200.97 s > 15: <std[bcb96dfbba0ab899]::sys::thread::unix::Thread>::new::thread_start<unknown>
  1777. 200.97 s > at <unknown source file>:<unknown line>
  1778. 200.97 s > 16: start_thread<unknown>
  1779. 200.97 s > at <unknown source file>:<unknown line>
  1780. 200.97 s > 17: __clone3<unknown>
  1781. 200.97 s > at <unknown source file>:<unknown line>
  1782. 200.97 s >
  1783. 200.97 s > Run with COLORBT_SHOW_HIDDEN=1 environment variable to disable frame filtering.
  1784. 200.97 s > Run with RUST_BACKTRACE=full to include source snippets.
  1785. 200.97 s > Warning: SpanTrace capture is Unsupported.
  1786. 200.97 s > Ensure that you've setup a tracing-error ErrorLayer and the semver versions are compatible
  1787. 200.97 s >
  1788. 200.97 s > 5. gammaloop-integration-tests::test_runs::profile_bulk::massless_triangle_bulk_profile_passes
  1789. 200.97 s > failure: test failure with exit code 101
  1790. 200.97 s > Error:
  1791. 200.97 s > 0: IR profiling requested arbitrary precision but received a quad-precision result
  1792. 200.97 s >
  1793. 200.97 s > Location:
  1794. 200.97 s > crates/gammalooprs/src/integrands/process/ir.rs:2123
  1795. 200.97 s >
  1796. 200.97 s > ━━━━━━━━━━━━━━━━━━━━━━━━━━━━━━━━━━ BACKTRACE ━━━━━━━━━━━━━━━━━━━━━━━━━━━━━━━━━━━
  1797. 200.97 s > 1: <color_eyre[51793ea62743adbd]::config::EyreHook>::into_eyre_hook::{closure#0}<unknown>
  1798. 200.97 s > at <unknown source file>:<unknown line>
  1799. 200.97 s > 2: eyre[cb2fd339c0c40fca]::capture_handler<unknown>
  1800. 200.97 s > at <unknown source file>:<unknown line>
  1801. 200.97 s > 3: eyre[cb2fd339c0c40fca]::private::format_err<unknown>
  1802. 200.97 s > at <unknown source file>:<unknown line>
  1803. 200.97 s > 4: gammalooprs[d7a7c067ebd19583]::integrands::process::ir::evaluate_profile_momentum_point_arb::<gammalooprs[d7a7c067ebd19583]::integrands::process::amplitude::AmplitudeIntegrand><unknown>
  1804. 200.97 s > at <unknown source file>:<unknown line>
  1805. 200.97 s > 5: <gammalooprs[d7a7c067ebd19583]::integrands::process::amplitude::AmplitudeIntegrand>::test_single_ir_limit_impl<unknown>
  1806. 200.97 s > at <unknown source file>:<unknown line>
  1807. 200.97 s > 6: gammalooprs[d7a7c067ebd19583]::integrands::process::ir::run_ir_profile::<gammalooprs[d7a7c067ebd19583]::integrands::process::amplitude::AmplitudeIntegrand, <gammalooprs[d7a7c067ebd19583]::integrands::process::amplitude::AmplitudeIntegrand>::enumerate_ir_limits, <gammalooprs[d7a7c067ebd19583]::integrands::process::amplitude::AmplitudeIntegrand>::graph_cut_definitions, <gammalooprs[d7a7c067ebd19583]::integrands::process::amplitude::AmplitudeIntegrand>::test_single_ir_limit_impl><unknown>
  1808. 200.97 s > at <unknown source file>:<unknown line>
  1809. 200.97 s > 7: <gammalooprs[d7a7c067ebd19583]::integrands::process::amplitude::AmplitudeIntegrand>::test_ir<unknown>
  1810. 200.97 s > at <unknown source file>:<unknown line>
  1811. 200.97 s > 8: <gammaloop_api[92ae732909e47e14]::commands::profile::Profile>::run<unknown>
  1812. 200.97 s > at <unknown source file>:<unknown line>
  1813. 200.97 s > 9: test_runs[3e7a390caee4e338]::profile_bulk::massless_triangle_bulk_profile_passes<unknown>
  1814. 200.97 s > at <unknown source file>:<unknown line>
  1815. 200.97 s > 10: <test_runs[3e7a390caee4e338]::profile_bulk::massless_triangle_bulk_profile_passes::{closure#0} as core[940e698046960fd5]::ops::function::FnOnce<()>>::call_once<unknown>
  1816. 200.97 s > at <unknown source file>:<unknown line>
  1817. 200.97 s > 11: test[75d6903177b1d7e9]::__rust_begin_short_backtrace::<core[940e698046960fd5]::result::Result<(), alloc[2ea6bcb46fca0c42]::string::String>, fn() -> core[940e698046960fd5]::result::Result<(), alloc[2ea6bcb46fca0c42]::string::String>><unknown>
  1818. 200.97 s > at <unknown source file>:<unknown line>
  1819. 200.97 s > 12: test[75d6903177b1d7e9]::run_test::{closure#0}<unknown>
  1820. 200.97 s > at <unknown source file>:<unknown line>
  1821. 200.97 s > 13: std[bcb96dfbba0ab899]::sys::backtrace::__rust_begin_short_backtrace::<test[75d6903177b1d7e9]::run_test::{closure#1}, ()><unknown>
  1822. 200.97 s > at <unknown source file>:<unknown line>
  1823. 200.97 s > 14: <std[bcb96dfbba0ab899]::thread::lifecycle::spawn_unchecked<test[75d6903177b1d7e9]::run_test::{closure#1}, ()>::{closure#1} as core[940e698046960fd5]::ops::function::FnOnce<()>>::call_once::{shim:vtable#0}<unknown>
  1824. 200.97 s > at <unknown source file>:<unknown line>
  1825. 200.97 s > 15: <std[bcb96dfbba0ab899]::sys::thread::unix::Thread>::new::thread_start<unknown>
  1826. 200.97 s > at <unknown source file>:<unknown line>
  1827. 200.97 s > 16: start_thread<unknown>
  1828. 200.97 s > at <unknown source file>:<unknown line>
  1829. 200.97 s > 17: __clone3<unknown>
  1830. 200.97 s > at <unknown source file>:<unknown line>
  1831. 200.97 s >
  1832. 200.97 s > Run with COLORBT_SHOW_HIDDEN=1 environment variable to disable frame filtering.
  1833. 200.97 s > Run with RUST_BACKTRACE=full to include source snippets.
  1834. 200.97 s > Warning: SpanTrace capture is Unsupported.
  1835. 200.97 s > Ensure that you've setup a tracing-error ErrorLayer and the semver versions are compatible
  1836. 200.97 s > system-out
  1837. 200.97 s > running 1 test
  1838. 200.97 s > test profile_bulk::massless_triangle_bulk_profile_passes ... FAILED
  1839. 200.97 s >
  1840. 200.97 s > failures:
  1841. 200.97 s >
  1842. 200.97 s > failures:
  1843. 200.97 s > profile_bulk::massless_triangle_bulk_profile_passes
  1844. 200.97 s >
  1845. 200.97 s > test result: FAILED. 0 passed; 1 failed; 0 ignored; 0 measured; 82 filtered out; finished in 0.83s
  1846. 200.97 s > system-err
  1847. 200.97 s > [2026-08-28 16:18:33.552] @gammaloop_api::se... INFO : Running command import model scalars
  1848. 200.97 s > [2026-08-28 16:18:33.552] @import::model INFO : Loading built-in JSON model scalars-default
  1849. 200.97 s > [2026-08-28 16:18:33.556] @gammalooprs::model INFO : The following 2 external parameters were forced to zero by the restriction card:
  1850. 200.97 s > width_scalar_1, width_scalar_2
  1851. 200.97 s > [2026-08-28 16:18:33.556] @gammaloop_api::se... INFO : Running command import graphs ./tests/resources/graphs/massless_triangle.dot
  1852. 200.97 s > [2026-08-28 16:18:33.560] @commands::import INFO : Loading graphs from '/build/source/tests/resources/graphs/massless_triangle.dot'
  1853. 200.97 s > [2026-08-28 16:18:33.565] @gammaloop_api::se... INFO : Running command generate
  1854. 200.97 s > [2026-08-28 16:18:33.718] @commands::generate INFO :
  1855. 200.97 s > Integrand generation summary
  1856. 200.97 s > peak RAM 63.78 MiB | cores 1
  1857. 200.97 s > ╭───────────┬─────────────────────┬─────────┬─────────────┬─────────────┬────────────────┬─────────────╮
  1858. 200.97 s > │ integrand │ graph │ # evals │ expr build │ spenso │ symbolica eval │ compile │
  1859. 200.97 s > ├───────────┼─────────────────────┼─────────┼─────────────┼─────────────┼────────────────┼─────────────┤
  1860. 200.97 s > │ default │ massless_triangle_0 │ 9 │ 100ms (73%) │ 10ms (7.6%) │ 26ms (19%) │ 0ms (0.00%) │
  1861. 200.97 s > ├───────────┼─────────────────────┼─────────┼─────────────┼─────────────┼────────────────┼─────────────┤
  1862. 200.97 s > │ Total │ │ 9 │ 100ms (73%) │ 10ms (7.6%) │ 26ms (19%) │ 0ms (0.00%) │
  1863. 200.97 s > ╰───────────┴─────────────────────┴─────────┴─────────────┴─────────────┴────────────────┴─────────────╯
  1864. 200.97 s > [2026-08-28 16:18:33.719] @process::amplitude INFO : Input is above threshold: 2 existing threshold E-surfaces across 1/1 graph groups
  1865. 200.97 s > [2026-08-28 16:18:33.720] @process::amplitude INFO : overlap structure of group 0: [2: [0(1,5), 1(1,3)]]
  1866. 200.97 s > Error:
  1867. 200.97 s > 0: IR profiling requested arbitrary precision but received a quad-precision result
  1868. 200.97 s >
  1869. 200.97 s > Location:
  1870. 200.97 s > crates/gammalooprs/src/integrands/process/ir.rs:2123
  1871. 200.97 s >
  1872. 200.97 s > ━━━━━━━━━━━━━━━━━━━━━━━━━━━━━━━━━━ BACKTRACE ━━━━━━━━━━━━━━━━━━━━━━━━━━━━━━━━━━━
  1873. 200.97 s > 1: <color_eyre[51793ea62743adbd]::config::EyreHook>::into_eyre_hook::{closure#0}<unknown>
  1874. 200.97 s > at <unknown source file>:<unknown line>
  1875. 200.97 s > 2: eyre[cb2fd339c0c40fca]::capture_handler<unknown>
  1876. 200.97 s > at <unknown source file>:<unknown line>
  1877. 200.97 s > 3: eyre[cb2fd339c0c40fca]::private::format_err<unknown>
  1878. 200.97 s > at <unknown source file>:<unknown line>
  1879. 200.97 s > 4: gammalooprs[d7a7c067ebd19583]::integrands::process::ir::evaluate_profile_momentum_point_arb::<gammalooprs[d7a7c067ebd19583]::integrands::process::amplitude::AmplitudeIntegrand><unknown>
  1880. 200.97 s > at <unknown source file>:<unknown line>
  1881. 200.97 s > 5: <gammalooprs[d7a7c067ebd19583]::integrands::process::amplitude::AmplitudeIntegrand>::test_single_ir_limit_impl<unknown>
  1882. 200.97 s > at <unknown source file>:<unknown line>
  1883. 200.97 s > 6: gammalooprs[d7a7c067ebd19583]::integrands::process::ir::run_ir_profile::<gammalooprs[d7a7c067ebd19583]::integrands::process::amplitude::AmplitudeIntegrand, <gammalooprs[d7a7c067ebd19583]::integrands::process::amplitude::AmplitudeIntegrand>::enumerate_ir_limits, <gammalooprs[d7a7c067ebd19583]::integrands::process::amplitude::AmplitudeIntegrand>::graph_cut_definitions, <gammalooprs[d7a7c067ebd19583]::integrands::process::amplitude::AmplitudeIntegrand>::test_single_ir_limit_impl><unknown>
  1884. 200.97 s > at <unknown source file>:<unknown line>
  1885. 200.97 s > 7: <gammalooprs[d7a7c067ebd19583]::integrands::process::amplitude::AmplitudeIntegrand>::test_ir<unknown>
  1886. 200.97 s > at <unknown source file>:<unknown line>
  1887. 200.97 s > 8: <gammaloop_api[92ae732909e47e14]::commands::profile::Profile>::run<unknown>
  1888. 200.97 s > at <unknown source file>:<unknown line>
  1889. 200.97 s > 9: test_runs[3e7a390caee4e338]::profile_bulk::massless_triangle_bulk_profile_passes<unknown>
  1890. 200.97 s > at <unknown source file>:<unknown line>
  1891. 200.97 s > 10: <test_runs[3e7a390caee4e338]::profile_bulk::massless_triangle_bulk_profile_passes::{closure#0} as core[940e698046960fd5]::ops::function::FnOnce<()>>::call_once<unknown>
  1892. 200.97 s > at <unknown source file>:<unknown line>
  1893. 200.97 s > 11: test[75d6903177b1d7e9]::__rust_begin_short_backtrace::<core[940e698046960fd5]::result::Result<(), alloc[2ea6bcb46fca0c42]::string::String>, fn() -> core[940e698046960fd5]::result::Result<(), alloc[2ea6bcb46fca0c42]::string::String>><unknown>
  1894. 200.97 s > at <unknown source file>:<unknown line>
  1895. 200.97 s > 12: test[75d6903177b1d7e9]::run_test::{closure#0}<unknown>
  1896. 200.97 s > at <unknown source file>:<unknown line>
  1897. 200.97 s > 13: std[bcb96dfbba0ab899]::sys::backtrace::__rust_begin_short_backtrace::<test[75d6903177b1d7e9]::run_test::{closure#1}, ()><unknown>
  1898. 200.97 s > at <unknown source file>:<unknown line>
  1899. 200.97 s > 14: <std[bcb96dfbba0ab899]::thread::lifecycle::spawn_unchecked<test[75d6903177b1d7e9]::run_test::{closure#1}, ()>::{closure#1} as core[940e698046960fd5]::ops::function::FnOnce<()>>::call_once::{shim:vtable#0}<unknown>
  1900. 200.97 s > at <unknown source file>:<unknown line>
  1901. 200.97 s > 15: <std[bcb96dfbba0ab899]::sys::thread::unix::Thread>::new::thread_start<unknown>
  1902. 200.97 s > at <unknown source file>:<unknown line>
  1903. 200.97 s > 16: start_thread<unknown>
  1904. 200.97 s > at <unknown source file>:<unknown line>
  1905. 200.97 s > 17: __clone3<unknown>
  1906. 200.97 s > at <unknown source file>:<unknown line>
  1907. 200.97 s >
  1908. 200.97 s > Run with COLORBT_SHOW_HIDDEN=1 environment variable to disable frame filtering.
  1909. 200.97 s > Run with RUST_BACKTRACE=full to include source snippets.
  1910. 200.97 s > Warning: SpanTrace capture is Unsupported.
  1911. 200.97 s > Ensure that you've setup a tracing-error ErrorLayer and the semver versions are compatible
  1912. 200.97 s >
  1913. 200.97 s > 6. gammaloop-integration-tests::test_runs::profile_bulk::scalar_self_energy_amp_bulk_profile_passes
  1914. 200.97 s > failure: test failure with exit code 101
  1915. 200.97 s > Error:
  1916. 200.97 s > 0: IR profiling requested arbitrary precision but received a quad-precision result
  1917. 200.97 s >
  1918. 200.97 s > Location:
  1919. 200.97 s > crates/gammalooprs/src/integrands/process/ir.rs:2123
  1920. 200.97 s >
  1921. 200.97 s > ━━━━━━━━━━━━━━━━━━━━━━━━━━━━━━━━━━ BACKTRACE ━━━━━━━━━━━━━━━━━━━━━━━━━━━━━━━━━━━
  1922. 200.97 s > 1: <color_eyre[51793ea62743adbd]::config::EyreHook>::into_eyre_hook::{closure#0}<unknown>
  1923. 200.97 s > at <unknown source file>:<unknown line>
  1924. 200.97 s > 2: eyre[cb2fd339c0c40fca]::capture_handler<unknown>
  1925. 200.97 s > at <unknown source file>:<unknown line>
  1926. 200.97 s > 3: eyre[cb2fd339c0c40fca]::private::format_err<unknown>
  1927. 200.97 s > at <unknown source file>:<unknown line>
  1928. 200.97 s > 4: gammalooprs[d7a7c067ebd19583]::integrands::process::ir::evaluate_profile_momentum_point_arb::<gammalooprs[d7a7c067ebd19583]::integrands::process::amplitude::AmplitudeIntegrand><unknown>
  1929. 200.97 s > at <unknown source file>:<unknown line>
  1930. 200.97 s > 5: <gammalooprs[d7a7c067ebd19583]::integrands::process::amplitude::AmplitudeIntegrand>::test_single_ir_limit_impl<unknown>
  1931. 200.97 s > at <unknown source file>:<unknown line>
  1932. 200.97 s > 6: gammalooprs[d7a7c067ebd19583]::integrands::process::ir::run_ir_profile::<gammalooprs[d7a7c067ebd19583]::integrands::process::amplitude::AmplitudeIntegrand, <gammalooprs[d7a7c067ebd19583]::integrands::process::amplitude::AmplitudeIntegrand>::enumerate_ir_limits, <gammalooprs[d7a7c067ebd19583]::integrands::process::amplitude::AmplitudeIntegrand>::graph_cut_definitions, <gammalooprs[d7a7c067ebd19583]::integrands::process::amplitude::AmplitudeIntegrand>::test_single_ir_limit_impl><unknown>
  1933. 200.97 s > at <unknown source file>:<unknown line>
  1934. 200.97 s > 7: <gammalooprs[d7a7c067ebd19583]::integrands::process::amplitude::AmplitudeIntegrand>::test_ir<unknown>
  1935. 200.97 s > at <unknown source file>:<unknown line>
  1936. 200.97 s > 8: <gammaloop_api[92ae732909e47e14]::commands::profile::Profile>::run<unknown>
  1937. 200.97 s > at <unknown source file>:<unknown line>
  1938. 200.97 s > 9: test_runs[3e7a390caee4e338]::profile_bulk::scalar_self_energy_amp_bulk_profile_passes<unknown>
  1939. 200.97 s > at <unknown source file>:<unknown line>
  1940. 200.97 s > 10: <test_runs[3e7a390caee4e338]::profile_bulk::scalar_self_energy_amp_bulk_profile_passes::{closure#0} as core[940e698046960fd5]::ops::function::FnOnce<()>>::call_once<unknown>
  1941. 200.97 s > at <unknown source file>:<unknown line>
  1942. 200.97 s > 11: test[75d6903177b1d7e9]::__rust_begin_short_backtrace::<core[940e698046960fd5]::result::Result<(), alloc[2ea6bcb46fca0c42]::string::String>, fn() -> core[940e698046960fd5]::result::Result<(), alloc[2ea6bcb46fca0c42]::string::String>><unknown>
  1943. 200.97 s > at <unknown source file>:<unknown line>
  1944. 200.97 s > 12: test[75d6903177b1d7e9]::run_test::{closure#0}<unknown>
  1945. 200.97 s > at <unknown source file>:<unknown line>
  1946. 200.97 s > 13: std[bcb96dfbba0ab899]::sys::backtrace::__rust_begin_short_backtrace::<test[75d6903177b1d7e9]::run_test::{closure#1}, ()><unknown>
  1947. 200.97 s > at <unknown source file>:<unknown line>
  1948. 200.97 s > 14: <std[bcb96dfbba0ab899]::thread::lifecycle::spawn_unchecked<test[75d6903177b1d7e9]::run_test::{closure#1}, ()>::{closure#1} as core[940e698046960fd5]::ops::function::FnOnce<()>>::call_once::{shim:vtable#0}<unknown>
  1949. 200.97 s > at <unknown source file>:<unknown line>
  1950. 200.97 s > 15: <std[bcb96dfbba0ab899]::sys::thread::unix::Thread>::new::thread_start<unknown>
  1951. 200.97 s > at <unknown source file>:<unknown line>
  1952. 200.97 s > 16: start_thread<unknown>
  1953. 200.97 s > at <unknown source file>:<unknown line>
  1954. 200.97 s > 17: __clone3<unknown>
  1955. 200.97 s > at <unknown source file>:<unknown line>
  1956. 200.97 s >
  1957. 200.97 s > Run with COLORBT_SHOW_HIDDEN=1 environment variable to disable frame filtering.
  1958. 200.97 s > Run with RUST_BACKTRACE=full to include source snippets.
  1959. 200.97 s > Warning: SpanTrace capture is Unsupported.
  1960. 200.97 s > Ensure that you've setup a tracing-error ErrorLayer and the semver versions are compatible
  1961. 200.97 s > system-out
  1962. 200.97 s > running 1 test
  1963. 200.97 s > test profile_bulk::scalar_self_energy_amp_bulk_profile_passes ... FAILED
  1964. 200.97 s >
  1965. 200.97 s > failures:
  1966. 200.97 s >
  1967. 200.97 s > failures:
  1968. 200.97 s > profile_bulk::scalar_self_energy_amp_bulk_profile_passes
  1969. 200.97 s >
  1970. 200.97 s > test result: FAILED. 0 passed; 1 failed; 0 ignored; 0 measured; 82 filtered out; finished in 1.01s
  1971. 200.97 s > system-err
  1972. 200.97 s > [2026-08-28 16:18:33.731] @gammaloop_api::se... INFO : Running command import model ./assets/models/json/scalars/scalars.json
  1973. 200.97 s > [2026-08-28 16:18:33.731] @import::model INFO : Loading JSON model scalars-default from /build/source/assets/models/json/scalars/scalars
  1974. 200.97 s > [2026-08-28 16:18:33.744] @gammalooprs::model INFO : The following 2 external parameters were forced to zero by the restriction card:
  1975. 200.97 s > width_scalar_1, width_scalar_2
  1976. 200.97 s > [2026-08-28 16:18:33.750] @gammaloop_api::se... INFO : Running command import graphs ./tests/resources/graphs/scalar_self_energy_amp.dot
  1977. 200.97 s > [2026-08-28 16:18:33.750] @commands::import INFO : Loading graphs from '/build/source/tests/resources/graphs/scalar_self_energy_amp.dot'
  1978. 200.97 s > [2026-08-28 16:18:33.758] @gammaloop_api::se... INFO : Running command generate
  1979. 200.97 s > [2026-08-28 16:18:34.419] @commands::generate INFO :
  1980. 200.97 s > Integrand generation summary
  1981. 200.97 s > peak RAM 71.12 MiB | cores 1
  1982. 200.97 s > ╭───────────┬────────────────────────┬─────────┬─────────────┬─────────────┬────────────────┬─────────────╮
  1983. 200.97 s > │ integrand │ graph │ # evals │ expr build │ spenso │ symbolica eval │ compile │
  1984. 200.97 s > ├───────────┼────────────────────────┼─────────┼─────────────┼─────────────┼────────────────┼─────────────┤
  1985. 200.97 s > │ default │ scalar_self_energy_amp │ 6 │ 583ms (96%) │ 10ms (1.7%) │ 12ms (2.0%) │ 0ms (0.00%) │
  1986. 200.97 s > ├───────────┼────────────────────────┼─────────┼─────────────┼─────────────┼────────────────┼─────────────┤
  1987. 200.97 s > │ Total │ │ 6 │ 583ms (96%) │ 10ms (1.7%) │ 12ms (2.0%) │ 0ms (0.00%) │
  1988. 200.97 s > ╰───────────┴────────────────────────┴─────────┴─────────────┴─────────────┴────────────────┴─────────────╯
  1989. 200.97 s > [2026-08-28 16:18:34.421] @process::amplitude INFO : Input is above threshold: 2 existing threshold E-surfaces across 1/1 graph groups
  1990. 200.97 s > [2026-08-28 16:18:34.422] @process::amplitude INFO : overlap structure of group 0: [2: [2(1,5), 4(2,3,5)]]
  1991. 200.97 s > Error:
  1992. 200.97 s > 0: IR profiling requested arbitrary precision but received a quad-precision result
  1993. 200.97 s >
  1994. 200.97 s > Location:
  1995. 200.97 s > crates/gammalooprs/src/integrands/process/ir.rs:2123
  1996. 200.97 s >
  1997. 200.97 s > ━━━━━━━━━━━━━━━━━━━━━━━━━━━━━━━━━━ BACKTRACE ━━━━━━━━━━━━━━━━━━━━━━━━━━━━━━━━━━━
  1998. 200.97 s > 1: <color_eyre[51793ea62743adbd]::config::EyreHook>::into_eyre_hook::{closure#0}<unknown>
  1999. 200.97 s > at <unknown source file>:<unknown line>
  2000. 200.97 s > 2: eyre[cb2fd339c0c40fca]::capture_handler<unknown>
  2001. 200.97 s > at <unknown source file>:<unknown line>
  2002. 200.97 s > 3: eyre[cb2fd339c0c40fca]::private::format_err<unknown>
  2003. 200.97 s > at <unknown source file>:<unknown line>
  2004. 200.97 s > 4: gammalooprs[d7a7c067ebd19583]::integrands::process::ir::evaluate_profile_momentum_point_arb::<gammalooprs[d7a7c067ebd19583]::integrands::process::amplitude::AmplitudeIntegrand><unknown>
  2005. 200.97 s > at <unknown source file>:<unknown line>
  2006. 200.97 s > 5: <gammalooprs[d7a7c067ebd19583]::integrands::process::amplitude::AmplitudeIntegrand>::test_single_ir_limit_impl<unknown>
  2007. 200.97 s > at <unknown source file>:<unknown line>
  2008. 200.97 s > 6: gammalooprs[d7a7c067ebd19583]::integrands::process::ir::run_ir_profile::<gammalooprs[d7a7c067ebd19583]::integrands::process::amplitude::AmplitudeIntegrand, <gammalooprs[d7a7c067ebd19583]::integrands::process::amplitude::AmplitudeIntegrand>::enumerate_ir_limits, <gammalooprs[d7a7c067ebd19583]::integrands::process::amplitude::AmplitudeIntegrand>::graph_cut_definitions, <gammalooprs[d7a7c067ebd19583]::integrands::process::amplitude::AmplitudeIntegrand>::test_single_ir_limit_impl><unknown>
  2009. 200.97 s > at <unknown source file>:<unknown line>
  2010. 200.97 s > 7: <gammalooprs[d7a7c067ebd19583]::integrands::process::amplitude::AmplitudeIntegrand>::test_ir<unknown>
  2011. 200.97 s > at <unknown source file>:<unknown line>
  2012. 200.97 s > 8: <gammaloop_api[92ae732909e47e14]::commands::profile::Profile>::run<unknown>
  2013. 200.97 s > at <unknown source file>:<unknown line>
  2014. 200.97 s > 9: test_runs[3e7a390caee4e338]::profile_bulk::scalar_self_energy_amp_bulk_profile_passes<unknown>
  2015. 200.97 s > at <unknown source file>:<unknown line>
  2016. 200.97 s > 10: <test_runs[3e7a390caee4e338]::profile_bulk::scalar_self_energy_amp_bulk_profile_passes::{closure#0} as core[940e698046960fd5]::ops::function::FnOnce<()>>::call_once<unknown>
  2017. 200.97 s > at <unknown source file>:<unknown line>
  2018. 200.97 s > 11: test[75d6903177b1d7e9]::__rust_begin_short_backtrace::<core[940e698046960fd5]::result::Result<(), alloc[2ea6bcb46fca0c42]::string::String>, fn() -> core[940e698046960fd5]::result::Result<(), alloc[2ea6bcb46fca0c42]::string::String>><unknown>
  2019. 200.97 s > at <unknown source file>:<unknown line>
  2020. 200.97 s > 12: test[75d6903177b1d7e9]::run_test::{closure#0}<unknown>
  2021. 200.97 s > at <unknown source file>:<unknown line>
  2022. 200.97 s > 13: std[bcb96dfbba0ab899]::sys::backtrace::__rust_begin_short_backtrace::<test[75d6903177b1d7e9]::run_test::{closure#1}, ()><unknown>
  2023. 200.97 s > at <unknown source file>:<unknown line>
  2024. 200.97 s > 14: <std[bcb96dfbba0ab899]::thread::lifecycle::spawn_unchecked<test[75d6903177b1d7e9]::run_test::{closure#1}, ()>::{closure#1} as core[940e698046960fd5]::ops::function::FnOnce<()>>::call_once::{shim:vtable#0}<unknown>
  2025. 200.97 s > at <unknown source file>:<unknown line>
  2026. 200.97 s > 15: <std[bcb96dfbba0ab899]::sys::thread::unix::Thread>::new::thread_start<unknown>
  2027. 200.97 s > at <unknown source file>:<unknown line>
  2028. 200.97 s > 16: start_thread<unknown>
  2029. 200.97 s > at <unknown source file>:<unknown line>
  2030. 200.97 s > 17: __clone3<unknown>
  2031. 200.97 s > at <unknown source file>:<unknown line>
  2032. 200.97 s >
  2033. 200.97 s > Run with COLORBT_SHOW_HIDDEN=1 environment variable to disable frame filtering.
  2034. 200.97 s > Run with RUST_BACKTRACE=full to include source snippets.
  2035. 200.97 s > Warning: SpanTrace capture is Unsupported.
  2036. 200.97 s > Ensure that you've setup a tracing-error ErrorLayer and the semver versions are compatible
  2037. 200.97 s >
  2038. 200.97 s > 7. gammaloop-integration-tests::uv::dod2_bubble_uv
  2039. 200.97 s > failure: test failure with exit code 101
  2040. 200.97 s > system-out
  2041. 200.97 s > running 1 test
  2042. 200.97 s > test dod2_bubble_uv has been running for over 60 seconds
  2043. 200.97 s > +-------------+-----------------+---------+--------+----------+-----------------------------------------------------------------------------------------------------------------------+-------+
  2044. 200.97 s > | case | check | graph | status | sigma | threshold | error |
  2045. 200.97 s > +-------------+-----------------+---------+--------+----------+-----------------------------------------------------------------------------------------------------------------------+-------+
  2046. 200.97 s > | dod2_bubble | uv_profile | - | FAIL | - | - | - |
  2047. 200.97 s > +-------------+-----------------+---------+--------+----------+-----------------------------------------------------------------------------------------------------------------------+-------+
  2048. 200.97 s > | dod2_bubble | m_uv.inspect | inspect | pass | - | best inspect relative delta 1.000e0 >= 1000*accuracy 1.000e-7 (accuracy=1.000e-10, exponent=+8.0, seed=0, probes=10) | - |
  2049. 200.97 s > +-------------+-----------------+---------+--------+----------+-----------------------------------------------------------------------------------------------------------------------+-------+
  2050. 200.97 s > | dod2_bubble | m_uv.integrated | GL0 | pass | 0.0sigma | compatible within 2sigma | - |
  2051. 200.97 s > +-------------+-----------------+---------+--------+----------+-----------------------------------------------------------------------------------------------------------------------+-------+
  2052. 200.97 s > | dod2_bubble | rls.inspect | inspect | pass | - | best inspect relative delta 2.822e-3 >= 1000*accuracy 1.000e-7 (accuracy=1.000e-10, exponent=+2.0, seed=1, probes=10) | - |
  2053. 200.97 s > +-------------+-----------------+---------+--------+----------+-----------------------------------------------------------------------------------------------------------------------+-------+
  2054. 200.97 s > | dod2_bubble | rls.integrated | GL0 | pass | 0.0sigma | compatible within 2sigma | - |
  2055. 200.97 s > +-------------+-----------------+---------+--------+----------+-----------------------------------------------------------------------------------------------------------------------+-------+
  2056. 200.97 s > | dod2_bubble | mu_r.inspect | inspect | pass | - | best inspect relative delta 6.951e-1 >= 1000*accuracy 1.000e-7 (accuracy=1.000e-10, exponent=+0.0, seed=0, probes=10) | - |
  2057. 200.97 s > +-------------+-----------------+---------+--------+----------+-----------------------------------------------------------------------------------------------------------------------+-------+
  2058. 200.97 s > | dod2_bubble | target | - | pass | - | 2sigma | - |
  2059. 200.97 s > +-------------+-----------------+---------+--------+----------+-----------------------------------------------------------------------------------------------------------------------+-------+
  2060. 200.97 s > test dod2_bubble_uv ... FAILED
  2061. 200.97 s >
  2062. 200.97 s > failures:
  2063. 200.97 s >
  2064. 200.97 s > failures:
  2065. 200.97 s > dod2_bubble_uv
  2066. 200.97 s >
  2067. 200.97 s > test result: FAILED. 0 passed; 1 failed; 0 ignored; 0 measured; 24 filtered out; finished in 84.95s
  2068. 200.97 s > system-err
  2069. 200.97 s > [2026-08-28 16:18:37.735] @gammaloop_api::se... INFO : Running command run generate
  2070. 200.97 s > [2026-08-28 16:18:37.735] @gammaloop_api::se... INFO : Starting command block generate
  2071. 200.97 s > [2026-08-28 16:18:37.736] @gammaloop_api::se... INFO : Running command import model scalars-default.json
  2072. 200.97 s > [2026-08-28 16:18:37.736] @import::model INFO : Loading built-in JSON model scalars-default
  2073. 200.97 s > [2026-08-28 16:18:37.740] @gammalooprs::model INFO : The following 2 external parameters were forced to zero by the restriction card:
  2074. 200.97 s > width_scalar_1, width_scalar_2
  2075. 200.97 s > [2026-08-28 16:18:37.740] @gammaloop_api::se... INFO : Running command remove processes
  2076. 200.97 s > [2026-08-28 16:18:37.740] @gammaloop_api::se... INFO : Running command set global kv global.generation.uv.generate_integrated=true
  2077. 200.97 s > [2026-08-28 16:18:37.741] @gammaloop_api::se... INFO : Running command import graphs ./tests/resources/graphs/scalar/dod2_bubble.dot -p bubble_dod2 -i scalar_bubble_below_thres
  2078. 200.97 s > [2026-08-28 16:18:37.741] @commands::import INFO : Loading graphs from '/build/source/tests/resources/graphs/scalar/dod2_bubble.dot'
  2079. 200.97 s > [2026-08-28 16:18:37.746] @gammaloop_api::se... INFO : Running command generate existing -p bubble_dod2 -i scalar_bubble_below_thres
  2080. 200.97 s > [2026-08-28 16:18:37.747] @approx::local_4d [{#uv, #inspect, #integrated}] DEBUG : Rescaled momenta expanded
  2081. 200.97 s > field value
  2082. 200.97 s > res n-terms: 1, byte size: 3,expr:
  2083. 200.97 s > 1
  2084. 200.97 s > [2026-08-28 16:18:37.750] @approx::local_4d [{#uv, #inspect, #integrated}] DEBUG : Rescaled momenta expanded
  2085. 200.97 s > field value
  2086. 200.97 s > res n-terms: 1, byte size: 585,expr:
  2087. 200.97 s > -SCALAR_COUPLING²·q₀(αᵉ².¹)·q₀(αᵉ³.¹)·q₂(αᵉ².¹)·q₂(αᵉ³.¹)
  2088. 200.97 s > /(t²·denom(3,-q₀-q₂/t,mass_scalar_2²,-mass_scalar_2²+2·(q₀.q₂)/t+(q₂.q₂)/t²+(q₀.q₀))
  2089. 200.97 s > ·denom(2,q₂/t,mass_scalar_2²,-mass_scalar_2²+(q₂.q₂)/t²))
  2090. 200.97 s > [2026-08-28 16:18:37.751] @approx::final_integrand[{#generation, #profile, #uv, #graph, #summary}] DEBUG : Computed global numerator
  2091. 200.97 s > field value
  2092. 200.97 s > global_num n-terms: 1, byte size: 4,expr:
  2093. 200.97 s > 1/2
  2094. 200.97 s > span build_3d{span_context=true graph=GL0 current=subgraph=0, topo_order=0, dod=0}
  2095. 200.97 s > [2026-08-28 16:18:37.753] @uv::approx [{#generation, #uv, #fourd}] DEBUG : Computing 4D
  2096. 200.97 s > field value
  2097. 200.97 s > simple subgraph(S_11,S_y)*Approx(subgraph(S_y,0)) of GL0
  2098. 200.97 s > span compute_4d{span_context=true graph=GL0 current=subgraph=y, topo_order=1, dod=2 given=subgraph=0, topo_order=0, dod=0 reduced=SubSet { set: BitVec<usize, bitvec::order::Lsb0> { addr: 0x7fffec018010, head: 000000, bits: 6, capacity: 64 } [0, 0, 1, 1, 1, 1], id: PhantomData<linnet::half_edge::involution::Hedge> }}
  2099. 200.97 s > [2026-08-28 16:18:37.754] @approx::local_4d [{#uv, #algebra, #integrated, #start}] DEBUG :
  2100. 200.97 s > field value
  2101. 200.97 s > integrand n-terms: 1, byte size: 409,expr:
  2102. 200.97 s > SCALAR_COUPLING²·(q₀(αᵉ³.¹)+q₃(αᵉ³.¹))·q₀(αᵉ².¹)·q₀(αᵉ³.¹)·q₂(αᵉ².¹)
  2103. 200.97 s > /(denom(2,q₂,mass_scalar_2²,-mass_scalar_2²+(q₂.q₂))·denom(3,q₃,mass_scalar_2²,-mass_scalar_2²+(q₃.q₃)))
  2104. 200.97 s > reduced y
  2105. 200.97 s > span grow{span_context=true current=subgraph=y, topo_order=1, dod=2 given=subgraph=0, topo_order=0, dod=0}
  2106. 200.97 s > [2026-08-28 16:18:37.754] @approx::local_4d [{#uv, #inspect, #integrated}] DEBUG : Rescaled momenta expanded
  2107. 200.97 s > field value
  2108. 200.97 s > res n-terms: 1, byte size: 585,expr:
  2109. 200.97 s > -SCALAR_COUPLING²·q₀(αᵉ².¹)·q₀(αᵉ³.¹)·q₂(αᵉ².¹)·q₂(αᵉ³.¹)
  2110. 200.97 s > /(t²·denom(3,-q₀-q₂/t,mass_scalar_2²,-mass_scalar_2²+2·(q₀.q₂)/t+(q₂.q₂)/t²+(q₀.q₀))
  2111. 200.97 s > ·denom(2,q₂/t,mass_scalar_2²,-mass_scalar_2²+(q₂.q₂)/t²))
  2112. 200.97 s > span t{span_context=true current=subgraph=y, topo_order=1, dod=2 given=subgraph=0, topo_order=0, dod=0}
  2113. 200.97 s > [2026-08-28 16:18:37.757] @approx::local_4d [{#uv, #integrated, #rescaled}] DEBUG : Rescaled expanded
  2114. 200.97 s > field value
  2115. 200.97 s > n_loops 1
  2116. 200.97 s > res n-terms: 1, byte size: 707,expr:
  2117. 200.97 s > -SCALAR_COUPLING²·q₀(αᵉ².¹)·q₀(αᵉ³.¹)·q₂(αᵉ².¹)·q₂(αᵉ³.¹)
  2118. 200.97 s > /(t²·denom(3,-q₂,mUVexp²+t²·mass_scalar_2²,-mUV²+t²·(-mass_scalar_2²+2·(q₀.q₂)/t+(q₂.q₂)/t²+(q₀.q₀))+t²·mUVexp²)
  2119. 200.97 s > ·denom(2,q₂,mUVexp²+t²·mass_scalar_2²,-mUV²+t²·(-mass_scalar_2²+(q₂.q₂)/t²)+t²·mUVexp²))
  2120. 200.97 s > span t{span_context=true current=subgraph=y, topo_order=1, dod=2 given=subgraph=0, topo_order=0, dod=0}
  2121. 200.97 s > [2026-08-28 16:18:37.758] @approx::local_4d [{#uv, #integrated, #series}] DEBUG : Series expanded
  2122. 200.97 s > field value
  2123. 200.97 s > res n-terms: 3, byte size: 1896,expr:
  2124. 200.97 s > (1/2·SCALAR_COUPLING²·(2·mUVexp²-2·mass_scalar_2²)/(denom(2,q₂,mUVexp²,-mUV²+(q₂.q₂))²·denom(3,-q₂,mUVexp²,-mUV²+(q₂.q₂)))
  2125. 200.97 s > -SCALAR_COUPLING²
  2126. 200.97 s > ·(-1/2·(2·mUVexp²-2·mass_scalar_2²+2·(q₀.q₀))/denom(3,-q₂,mUVexp²,-mUV²+(q₂.q₂))
  2127. 200.97 s > +4·(q₀.q₂)²/denom(3,-q₂,mUVexp²,-mUV²+(q₂.q₂))²
  2128. 200.97 s > )/(denom(2,q₂,mUVexp²,-mUV²+(q₂.q₂))·denom(3,-q₂,mUVexp²,-mUV²+(q₂.q₂)))
  2129. 200.97 s > )·q₀(αᵉ².¹)·q₀(αᵉ³.¹)·q₂(αᵉ².¹)·q₂(αᵉ³.¹)
  2130. 200.97 s > +2·SCALAR_COUPLING²·(q₀.q₂)·q₀(αᵉ².¹)·q₀(αᵉ³.¹)·q₂(αᵉ².¹)·q₂(αᵉ³.¹)
  2131. 200.97 s > /(t·denom(2,q₂,mUVexp²,-mUV²+(q₂.q₂))·denom(3,-q₂,mUVexp²,-mUV²+(q₂.q₂))²)
  2132. 200.97 s > -SCALAR_COUPLING²·q₀(αᵉ².¹)·q₀(αᵉ³.¹)·q₂(αᵉ².¹)·q₂(αᵉ³.¹)
  2133. 200.97 s > /(t²·denom(2,q₂,mUVexp²,-mUV²+(q₂.q₂))·denom(3,-q₂,mUVexp²,-mUV²+(q₂.q₂)))
  2134. 200.97 s > span t{span_context=true current=subgraph=y, topo_order=1, dod=2 given=subgraph=0, topo_order=0, dod=0}
  2135. 200.97 s > [2026-08-28 16:18:37.759] @approx::local_4d [{#uv, #integrated, #series}] DEBUG : Evaluated at t = 1
  2136. 200.97 s > field value
  2137. 200.97 s > res n-terms: 3, byte size: 1880,expr:
  2138. 200.97 s > (1/2·SCALAR_COUPLING²·(2·mUVexp²-2·mass_scalar_2²)/(denom(2,q₂,mUVexp²,-mUV²+(q₂.q₂))²·denom(3,-q₂,mUVexp²,-mUV²+(q₂.q₂)))
  2139. 200.97 s > -SCALAR_COUPLING²
  2140. 200.97 s > ·(-1/2·(2·mUVexp²-2·mass_scalar_2²+2·(q₀.q₀))/denom(3,-q₂,mUVexp²,-mUV²+(q₂.q₂))
  2141. 200.97 s > +4·(q₀.q₂)²/denom(3,-q₂,mUVexp²,-mUV²+(q₂.q₂))²
  2142. 200.97 s > )/(denom(2,q₂,mUVexp²,-mUV²+(q₂.q₂))·denom(3,-q₂,mUVexp²,-mUV²+(q₂.q₂)))
  2143. 200.97 s > )·q₀(αᵉ².¹)·q₀(αᵉ³.¹)·q₂(αᵉ².¹)·q₂(αᵉ³.¹)
  2144. 200.97 s > -SCALAR_COUPLING²·q₀(αᵉ².¹)·q₀(αᵉ³.¹)·q₂(αᵉ².¹)·q₂(αᵉ³.¹)
  2145. 200.97 s > /(denom(2,q₂,mUVexp²,-mUV²+(q₂.q₂))·denom(3,-q₂,mUVexp²,-mUV²+(q₂.q₂)))
  2146. 200.97 s > +2·SCALAR_COUPLING²·(q₀.q₂)·q₀(αᵉ².¹)·q₀(αᵉ³.¹)·q₂(αᵉ².¹)·q₂(αᵉ³.¹)
  2147. 200.97 s > /(denom(2,q₂,mUVexp²,-mUV²+(q₂.q₂))·denom(3,-q₂,mUVexp²,-mUV²+(q₂.q₂))²)
  2148. 200.97 s > span t{span_context=true current=subgraph=y, topo_order=1, dod=2 given=subgraph=0, topo_order=0, dod=0}
  2149. 200.97 s > [2026-08-28 16:18:37.764] @approx::local_4d [{#uv, #collect, #integrated}] DEBUG : After gamma chain collection
  2150. 200.97 s > field value
  2151. 200.97 s > expr n-terms: 3, byte size: 1880,expr:
  2152. 200.97 s > (1/2·SCALAR_COUPLING²·(2·mUVexp²-2·mass_scalar_2²)/(denom(2,q₂,mUVexp²,-mUV²+(q₂.q₂))²·denom(3,-q₂,mUVexp²,-mUV²+(q₂.q₂)))
  2153. 200.97 s > -SCALAR_COUPLING²
  2154. 200.97 s > ·(-1/2·(2·mUVexp²-2·mass_scalar_2²+2·(q₀.q₀))/denom(3,-q₂,mUVexp²,-mUV²+(q₂.q₂))
  2155. 200.97 s > +4·(q₀.q₂)²/denom(3,-q₂,mUVexp²,-mUV²+(q₂.q₂))²
  2156. 200.97 s > )/(denom(2,q₂,mUVexp²,-mUV²+(q₂.q₂))·denom(3,-q₂,mUVexp²,-mUV²+(q₂.q₂)))
  2157. 200.97 s > )·q₀(αᵉ².¹)·q₀(αᵉ³.¹)·q₂(αᵉ².¹)·q₂(αᵉ³.¹)
  2158. 200.97 s > -SCALAR_COUPLING²·q₀(αᵉ².¹)·q₀(αᵉ³.¹)·q₂(αᵉ².¹)·q₂(αᵉ³.¹)
  2159. 200.97 s > /(denom(2,q₂,mUVexp²,-mUV²+(q₂.q₂))·denom(3,-q₂,mUVexp²,-mUV²+(q₂.q₂)))
  2160. 200.97 s > +2·SCALAR_COUPLING²·(q₀.q₂)·q₀(αᵉ².¹)·q₀(αᵉ³.¹)·q₂(αᵉ².¹)·q₂(αᵉ³.¹)
  2161. 200.97 s > /(denom(2,q₂,mUVexp²,-mUV²+(q₂.q₂))·denom(3,-q₂,mUVexp²,-mUV²+(q₂.q₂))²)
  2162. 200.97 s > span t{span_context=true current=subgraph=y, topo_order=1, dod=2 given=subgraph=0, topo_order=0, dod=0}
  2163. 200.97 s > [2026-08-28 16:18:37.769] @approx::local_4d [{#profile, #uv, #collect, #integrated, #start, #trace}] DEBUG : After gamma schoonschip
  2164. 200.97 s > field value
  2165. 200.97 s > expr n-terms: 3, byte size: 1631,expr:
  2166. 200.97 s > (1/2·SCALAR_COUPLING²·(2·mUVexp²-2·mass_scalar_2²)/(denom(2,q₂,mUVexp²,-mUV²+(q₂.q₂))²·denom(3,-q₂,mUVexp²,-mUV²+(q₂.q₂)))
  2167. 200.97 s > -SCALAR_COUPLING²
  2168. 200.97 s > ·(-1/2·(2·mUVexp²-2·mass_scalar_2²+2·(q₀.q₀))/denom(3,-q₂,mUVexp²,-mUV²+(q₂.q₂))
  2169. 200.97 s > +4·(q₀.q₂)²/denom(3,-q₂,mUVexp²,-mUV²+(q₂.q₂))²
  2170. 200.97 s > )/(denom(2,q₂,mUVexp²,-mUV²+(q₂.q₂))·denom(3,-q₂,mUVexp²,-mUV²+(q₂.q₂)))
  2171. 200.97 s > )·(q₀.q₂)²
  2172. 200.97 s > -SCALAR_COUPLING²·(q₀.q₂)²/(denom(2,q₂,mUVexp²,-mUV²+(q₂.q₂))·denom(3,-q₂,mUVexp²,-mUV²+(q₂.q₂)))
  2173. 200.97 s > +2·SCALAR_COUPLING²·(q₀.q₂)·(q₀.q₂)²
  2174. 200.97 s > /(denom(2,q₂,mUVexp²,-mUV²+(q₂.q₂))·denom(3,-q₂,mUVexp²,-mUV²+(q₂.q₂))²)
  2175. 200.97 s > span t{span_context=true current=subgraph=y, topo_order=1, dod=2 given=subgraph=0, topo_order=0, dod=0}
  2176. 200.97 s > [2026-08-28 16:18:37.771] @approx::local_4d [{#profile, #uv, #collect, #integrated, #start, #trace}] DEBUG : After gamma collection
  2177. 200.97 s > field value
  2178. 200.97 s > expr n-terms: 1, byte size: 1347,expr:
  2179. 200.97 s > SCALAR_COUPLING²
  2180. 200.97 s > ·(-denom(2,q₂,mUVexp²,-mUV²+(q₂.q₂))·denom(3,-q₂,mUVexp²,-mUV²+(q₂.q₂))²
  2181. 200.97 s > +1/2·(2·mUVexp²-2·mass_scalar_2²)·denom(3,-q₂,mUVexp²,-mUV²+(q₂.q₂))²
  2182. 200.97 s > -(-1/2·(2·mUVexp²-2·mass_scalar_2²+2·(q₀.q₀))·denom(3,-q₂,mUVexp²,-mUV²+(q₂.q₂))+4·(q₀.q₂)²)
  2183. 200.97 s > ·denom(2,q₂,mUVexp²,-mUV²+(q₂.q₂))
  2184. 200.97 s > +2·(q₀.q₂)·denom(2,q₂,mUVexp²,-mUV²+(q₂.q₂))·denom(3,-q₂,mUVexp²,-mUV²+(q₂.q₂))
  2185. 200.97 s > )·(q₀.q₂)²/(denom(2,q₂,mUVexp²,-mUV²+(q₂.q₂))²·denom(3,-q₂,mUVexp²,-mUV²+(q₂.q₂))³)
  2186. 200.97 s > span t{span_context=true current=subgraph=y, topo_order=1, dod=2 given=subgraph=0, topo_order=0, dod=0}
  2187. 200.97 s > [2026-08-28 16:18:37.776] @approx::local_4d [{#profile, #uv, #gamma, #integrated, #start, #trace, #vakint}] DEBUG : After gamma simplification
  2188. 200.97 s > ... omitted 3263 more lines; see full nextest output above
  2189. 200.97 s >
  2190. 200.97 s > 8. gammaloop-integration-tests::uv::sunrise_scalar_1_uv
  2191. 200.97 s > failure: test failure with exit code 101
  2192. 200.97 s > system-out
  2193. 200.97 s > running 1 test
  2194. 200.97 s > test sunrise_scalar_1_uv has been running for over 60 seconds
  2195. 200.97 s > +------------------+------------------------+--------------+--------+----------+----------------------------------------------------------------------------------------------------------------------+-------+
  2196. 200.97 s > | case | check | graph | status | sigma | threshold | error |
  2197. 200.97 s > +------------------+------------------------+--------------+--------+----------+----------------------------------------------------------------------------------------------------------------------+-------+
  2198. 200.97 s > | sunrise_scalar_1 | uv_profile | - | FAIL | - | - | - |
  2199. 200.97 s > +------------------+------------------------+--------------+--------+----------+----------------------------------------------------------------------------------------------------------------------+-------+
  2200. 200.97 s > | sunrise_scalar_1 | m_uv.inspect | inspect | pass | - | best inspect relative delta 1.624e0 >= 1000*accuracy 1.000e-3 (accuracy=1.000e-6, exponent=+1.0, seed=1, probes=10) | - |
  2201. 200.97 s > +------------------+------------------------+--------------+--------+----------+----------------------------------------------------------------------------------------------------------------------+-------+
  2202. 200.97 s > | sunrise_scalar_1 | m_uv.integrated | sunrise | pass | 0.1sigma | compatible within 2sigma | - |
  2203. 200.97 s > +------------------+------------------------+--------------+--------+----------+----------------------------------------------------------------------------------------------------------------------+-------+
  2204. 200.97 s > | sunrise_scalar_1 | rls.inspect | inspect | pass | - | best inspect relative delta 8.682e-1 >= 1000*accuracy 1.000e-3 (accuracy=1.000e-6, exponent=+1.0, seed=1, probes=10) | - |
  2205. 200.97 s > +------------------+------------------------+--------------+--------+----------+----------------------------------------------------------------------------------------------------------------------+-------+
  2206. 200.97 s > | sunrise_scalar_1 | rls.integrated | sunrise | pass | 0.0sigma | compatible within 2sigma | - |
  2207. 200.97 s > +------------------+------------------------+--------------+--------+----------+----------------------------------------------------------------------------------------------------------------------+-------+
  2208. 200.97 s > | sunrise_scalar_1 | mu_r.inspect | inspect | pass | - | best inspect relative delta 1.752e0 >= 1000*accuracy 1.000e-3 (accuracy=1.000e-6, exponent=+1.0, seed=1, probes=10) | - |
  2209. 200.97 s > +------------------+------------------------+--------------+--------+----------+----------------------------------------------------------------------------------------------------------------------+-------+
  2210. 200.97 s > | sunrise_scalar_1 | integrated.relerr | integrated | pass | - | relative error 9.20% <= 10.00% | - |
  2211. 200.97 s > +------------------+------------------------+--------------+--------+----------+----------------------------------------------------------------------------------------------------------------------+-------+
  2212. 200.97 s > | sunrise_scalar_1 | m_uv.integrated.relerr | m_uv-shifted | pass | - | relative error 5.89% <= 10.00% | - |
  2213. 200.97 s > +------------------+------------------------+--------------+--------+----------+----------------------------------------------------------------------------------------------------------------------+-------+
  2214. 200.97 s > | sunrise_scalar_1 | target | - | pass | - | 2sigma | - |
  2215. 200.97 s > +------------------+------------------------+--------------+--------+----------+----------------------------------------------------------------------------------------------------------------------+-------+
  2216. 200.97 s > test sunrise_scalar_1_uv ... FAILED
  2217. 200.97 s >
  2218. 200.97 s > failures:
  2219. 200.97 s >
  2220. 200.97 s > failures:
  2221. 200.97 s > sunrise_scalar_1_uv
  2222. 200.97 s >
  2223. 200.97 s > test result: FAILED. 0 passed; 1 failed; 0 ignored; 0 measured; 24 filtered out; finished in 140.84s
  2224. 200.97 s > system-err
  2225. 200.97 s > [2026-08-28 16:18:51.934] @gammaloop_api::se... INFO : Running command run generate
  2226. 200.97 s > [2026-08-28 16:18:51.934] @gammaloop_api::se... INFO : Starting command block generate
  2227. 200.97 s > [2026-08-28 16:18:51.934] @gammaloop_api::se... INFO : Running command import model scalars-default.json
  2228. 200.97 s > [2026-08-28 16:18:51.934] @import::model INFO : Loading built-in JSON model scalars-default
  2229. 200.97 s > [2026-08-28 16:18:51.939] @gammalooprs::model INFO : The following 2 external parameters were forced to zero by the restriction card:
  2230. 200.97 s > width_scalar_1, width_scalar_2
  2231. 200.97 s > [2026-08-28 16:18:51.940] @gammaloop_api::se... INFO : Running command remove processes
  2232. 200.97 s > [2026-08-28 16:18:51.940] @gammaloop_api::se... INFO : Running command set global kv global.generation.uv.generate_integrated=true
  2233. 200.97 s > [2026-08-28 16:18:51.941] @gammaloop_api::se... INFO : Running command import graphs ./tests/resources/graphs/scalar_sunrise.dot -p sunrise_scalar_1 -i scalar_sunrise
  2234. 200.97 s > [2026-08-28 16:18:51.941] @commands::import INFO : Loading graphs from '/build/source/tests/resources/graphs/scalar_sunrise.dot'
  2235. 200.97 s > [2026-08-28 16:18:51.944] @gammaloop_api::se... INFO : Running command generate existing -p sunrise_scalar_1 -i scalar_sunrise
  2236. 200.97 s > [2026-08-28 16:18:51.950] @approx::local_4d [{#uv, #inspect, #integrated}] DEBUG : Rescaled momenta expanded
  2237. 200.97 s > field value
  2238. 200.97 s > res n-terms: 1, byte size: 611,expr:
  2239. 200.97 s > 1/(denom(0,q₀/t,mass_scalar_1²,-mass_scalar_1²+(q₀.q₀)/t²)
  2240. 200.97 s > ·denom(2,-q₁+q₃-q₀/t,mass_scalar_1²,
  2241. 200.97 s > -mass_scalar_1²+2·(q₀.q₁)/t-2·(q₀.q₃)/t+(q₀.q₀)/t²+(q₁.q₁)
  2242. 200.97 s > -2·(q₁.q₃)+(q₃.q₃)
  2243. 200.97 s > ))
  2244. 200.97 s > [2026-08-28 16:18:51.952] @approx::local_4d [{#uv, #inspect, #integrated}] DEBUG : Rescaled momenta expanded
  2245. 200.97 s > field value
  2246. 200.97 s > res n-terms: 1, byte size: 611,expr:
  2247. 200.97 s > 1/(denom(1,q₁/t,mass_scalar_1²,-mass_scalar_1²+(q₁.q₁)/t²)
  2248. 200.97 s > ·denom(2,-q₀+q₃-q₁/t,mass_scalar_1²,
  2249. 200.97 s > -mass_scalar_1²+2·(q₀.q₁)/t-2·(q₁.q₃)/t+(q₁.q₁)/t²+(q₀.q₀)
  2250. 200.97 s > -2·(q₀.q₃)+(q₃.q₃)
  2251. 200.97 s > ))
  2252. 200.97 s > [2026-08-28 16:18:51.957] @approx::local_4d [{#uv, #inspect, #integrated}] DEBUG : Rescaled momenta expanded
  2253. 200.97 s > field value
  2254. 200.97 s > res n-terms: 1, byte size: 611,expr:
  2255. 200.97 s > 1/(denom(0,q₀/t,mass_scalar_1²,-mass_scalar_1²+(q₀.q₀)/t²)
  2256. 200.97 s > ·denom(1,-q₂+q₃-q₀/t,mass_scalar_1²,
  2257. 200.97 s > -mass_scalar_1²+2·(q₀.q₂)/t-2·(q₀.q₃)/t+(q₀.q₀)/t²+(q₂.q₂)
  2258. 200.97 s > -2·(q₂.q₃)+(q₃.q₃)
  2259. 200.97 s > ))
  2260. 200.97 s > [2026-08-28 16:18:51.958] @approx::local_4d [{#uv, #inspect, #integrated}] DEBUG : Rescaled momenta expanded
  2261. 200.97 s > field value
  2262. 200.97 s > res n-terms: 1, byte size: 3,expr:
  2263. 200.97 s > 1
  2264. 200.97 s > [2026-08-28 16:18:51.963] @approx::local_4d [{#uv, #inspect, #integrated}] DEBUG : Rescaled momenta expanded
  2265. 200.97 s > field value
  2266. 200.97 s > res n-terms: 1, byte size: 777,expr:
  2267. 200.97 s > 1/(denom(0,q₀/t,mass_scalar_1²,-mass_scalar_1²+(q₀.q₀)/t²)·denom(1,q₁/t,mass_scalar_1²,-mass_scalar_1²+(q₁.q₁)/t²)
  2268. 200.97 s > ·denom(2,q₄-q₀/t-q₁/t,mass_scalar_1²,
  2269. 200.97 s > -mass_scalar_1²-2·(q₀.q₄)/t-2·(q₁.q₄)/t+(q₀.q₀)/t²+2·(q₀.q₁)/t²
  2270. 200.97 s > +(q₁.q₁)/t²+(q₄.q₄)
  2271. 200.97 s > ))
  2272. 200.97 s > [2026-08-28 16:18:51.969] @approx::final_integrand[{#generation, #profile, #uv, #graph, #summary}] DEBUG : Computed global numerator
  2273. 200.97 s > field value
  2274. 200.97 s > global_num n-terms: 1, byte size: 3,expr:
  2275. 200.97 s > 1
  2276. 200.97 s > span build_3d{span_context=true graph=sunrise current=subgraph=0, topo_order=0, dod=0}
  2277. 200.97 s > [2026-08-28 16:18:51.975] @uv::approx [{#generation, #uv, #fourd}] DEBUG : Computing 4D
  2278. 200.97 s > field value
  2279. 200.97 s > simple subgraph(S_47,S_3I)*Approx(subgraph(S_3I,0)) of sunrise
  2280. 200.97 s > span compute_4d{span_context=true graph=sunrise current=subgraph=3I, topo_order=1, dod=0 given=subgraph=0, topo_order=0, dod=0 reduced=SubSet { set: BitVec<usize, bitvec::order::Lsb0> { addr: 0x7fffec02bbd0, head: 000000, bits: 8, capacity: 64 } [0, 0, 1, 1, 0, 0, 1, 1], id: PhantomData<linnet::half_edge::involution::Hedge> }}
  2281. 200.97 s > [2026-08-28 16:18:51.976] @approx::local_4d [{#uv, #algebra, #integrated, #start}] DEBUG :
  2282. 200.97 s > field value
  2283. 200.97 s > integrand n-terms: 1, byte size: 217,expr:
  2284. 200.97 s > 1/(denom(0,q₀,mass_scalar_1²,-mass_scalar_1²+(q₀.q₀))·denom(2,q₂,mass_scalar_1²,-mass_scalar_1²+(q₂.q₂)))
  2285. 200.97 s > reduced 3I
  2286. 200.97 s > span grow{span_context=true current=subgraph=3I, topo_order=1, dod=0 given=subgraph=0, topo_order=0, dod=0}
  2287. 200.97 s > [2026-08-28 16:18:51.976] @approx::local_4d [{#uv, #inspect, #integrated}] DEBUG : Rescaled momenta expanded
  2288. 200.97 s > field value
  2289. 200.97 s > res n-terms: 1, byte size: 611,expr:
  2290. 200.97 s > 1/(denom(0,q₀/t,mass_scalar_1²,-mass_scalar_1²+(q₀.q₀)/t²)
  2291. 200.97 s > ·denom(2,-q₁+q₃-q₀/t,mass_scalar_1²,
  2292. 200.97 s > -mass_scalar_1²+2·(q₀.q₁)/t-2·(q₀.q₃)/t+(q₀.q₀)/t²+(q₁.q₁)
  2293. 200.97 s > -2·(q₁.q₃)+(q₃.q₃)
  2294. 200.97 s > ))
  2295. 200.97 s > span t{span_context=true current=subgraph=3I, topo_order=1, dod=0 given=subgraph=0, topo_order=0, dod=0}
  2296. 200.97 s > [2026-08-28 16:18:51.976] @approx::local_4d [{#uv, #integrated, #rescaled}] DEBUG : Rescaled expanded
  2297. 200.97 s > field value
  2298. 200.97 s > n_loops 1
  2299. 200.97 s > res n-terms: 1, byte size: 723,expr:
  2300. 200.97 s > 1/(denom(0,q₀,mUVexp²+t²·mass_scalar_1²,-mUV²+t²·(-mass_scalar_1²+(q₀.q₀)/t²)+t²·mUVexp²)
  2301. 200.97 s > ·denom(2,-q₀,mUVexp²+t²·mass_scalar_1²,
  2302. 200.97 s > -mUV²
  2303. 200.97 s > +t²
  2304. 200.97 s > ·(-mass_scalar_1²+2·(q₀.q₁)/t-2·(q₀.q₃)/t+(q₀.q₀)/t²+(q₁.q₁)
  2305. 200.97 s > -2·(q₁.q₃)+(q₃.q₃)
  2306. 200.97 s > )
  2307. 200.97 s > +t²·mUVexp²
  2308. 200.97 s > ))
  2309. 200.97 s > span t{span_context=true current=subgraph=3I, topo_order=1, dod=0 given=subgraph=0, topo_order=0, dod=0}
  2310. 200.97 s > [2026-08-28 16:18:51.980] @approx::local_4d [{#uv, #integrated, #series}] DEBUG : Series expanded
  2311. 200.97 s > field value
  2312. 200.97 s > res n-terms: 1, byte size: 223,expr:
  2313. 200.97 s > 1/(denom(0,q₀,mUVexp²,-mUV²+(q₀.q₀))·denom(2,-q₀,mUVexp²,-mUV²+(q₀.q₀)))
  2314. 200.97 s > span t{span_context=true current=subgraph=3I, topo_order=1, dod=0 given=subgraph=0, topo_order=0, dod=0}
  2315. 200.97 s > [2026-08-28 16:18:51.980] @approx::local_4d [{#uv, #integrated, #series}] DEBUG : Evaluated at t = 1
  2316. 200.97 s > field value
  2317. 200.97 s > res n-terms: 1, byte size: 223,expr:
  2318. 200.97 s > 1/(denom(0,q₀,mUVexp²,-mUV²+(q₀.q₀))·denom(2,-q₀,mUVexp²,-mUV²+(q₀.q₀)))
  2319. 200.97 s > span t{span_context=true current=subgraph=3I, topo_order=1, dod=0 given=subgraph=0, topo_order=0, dod=0}
  2320. 200.97 s > [2026-08-28 16:18:51.980] @approx::local_4d [{#uv, #collect, #integrated}] DEBUG : After gamma chain collection
  2321. 200.97 s > field value
  2322. 200.97 s > expr n-terms: 1, byte size: 223,expr:
  2323. 200.97 s > 1/(denom(0,q₀,mUVexp²,-mUV²+(q₀.q₀))·denom(2,-q₀,mUVexp²,-mUV²+(q₀.q₀)))
  2324. 200.97 s > span t{span_context=true current=subgraph=3I, topo_order=1, dod=0 given=subgraph=0, topo_order=0, dod=0}
  2325. 200.97 s > [2026-08-28 16:18:51.981] @approx::local_4d [{#profile, #uv, #collect, #integrated, #start, #trace}] DEBUG : After gamma schoonschip
  2326. 200.97 s > field value
  2327. 200.97 s > expr n-terms: 1, byte size: 223,expr:
  2328. 200.97 s > 1/(denom(0,q₀,mUVexp²,-mUV²+(q₀.q₀))·denom(2,-q₀,mUVexp²,-mUV²+(q₀.q₀)))
  2329. 200.97 s > span t{span_context=true current=subgraph=3I, topo_order=1, dod=0 given=subgraph=0, topo_order=0, dod=0}
  2330. 200.97 s > [2026-08-28 16:18:51.981] @approx::local_4d [{#profile, #uv, #collect, #integrated, #start, #trace}] DEBUG : After gamma collection
  2331. 200.97 s > field value
  2332. 200.97 s > expr n-terms: 1, byte size: 223,expr:
  2333. 200.97 s > 1/(denom(0,q₀,mUVexp²,-mUV²+(q₀.q₀))·denom(2,-q₀,mUVexp²,-mUV²+(q₀.q₀)))
  2334. 200.97 s > span t{span_context=true current=subgraph=3I, topo_order=1, dod=0 given=subgraph=0, topo_order=0, dod=0}
  2335. 200.97 s > [2026-08-28 16:18:51.981] @approx::local_4d [{#profile, #uv, #gamma, #integrated, #start, #trace, #vakint}] DEBUG : After gamma simplification
  2336. 200.97 s > field value
  2337. 200.97 s > expr n-terms: 1, byte size: 223,expr:
  2338. 200.97 s > 1/(denom(0,q₀,mUVexp²,-mUV²+(q₀.q₀))·denom(2,-q₀,mUVexp²,-mUV²+(q₀.q₀)))
  2339. 200.97 s > span t{span_context=true current=subgraph=3I, topo_order=1, dod=0 given=subgraph=0, topo_order=0, dod=0}
  2340. 200.97 s > [2026-08-28 16:18:51.982] @approx::local_4d [{#profile, #uv, #integrated, #schoonschip, #start, #trace, #vakint}] DEBUG : After Schoonschip net
  2341. 200.97 s > field value
  2342. 200.97 s > expr n-terms: 1, byte size: 223,expr:
  2343. 200.97 s > 1/(denom(0,q₀,mUVexp²,-mUV²+(q₀.q₀))·denom(2,-q₀,mUVexp²,-mUV²+(q₀.q₀)))
  2344. 200.97 s > ... omitted 20090 more lines; see full nextest output above
  2345. 200.97 s >
  2346. 200.97 s > 9. gammaloop-integration-tests::uv::se1l_uv
  2347. 200.97 s > failure: test failure with exit code 101
  2348. 200.97 s > system-out
  2349. 200.97 s > running 1 test
  2350. 200.97 s > test se1l_uv has been running for over 60 seconds
  2351. 200.97 s > +------+-----------------+---------+--------+----------+-----------------------------------------------------------------------------------------------------------------------+-------+
  2352. 200.97 s > | case | check | graph | status | sigma | threshold | error |
  2353. 200.97 s > +------+-----------------+---------+--------+----------+-----------------------------------------------------------------------------------------------------------------------+-------+
  2354. 200.97 s > | se1l | uv_profile | - | FAIL | - | - | - |
  2355. 200.97 s > +------+-----------------+---------+--------+----------+-----------------------------------------------------------------------------------------------------------------------+-------+
  2356. 200.97 s > | se1l | m_uv.inspect | inspect | pass | - | best inspect relative delta 1.097e-1 >= 1000*accuracy 1.000e-7 (accuracy=1.000e-10, exponent=+2.0, seed=1, probes=10) | - |
  2357. 200.97 s > +------+-----------------+---------+--------+----------+-----------------------------------------------------------------------------------------------------------------------+-------+
  2358. 200.97 s > | se1l | m_uv.integrated | se1l | pass | 0.1sigma | compatible within 2sigma | - |
  2359. 200.97 s > +------+-----------------+---------+--------+----------+-----------------------------------------------------------------------------------------------------------------------+-------+
  2360. 200.97 s > | se1l | rls.inspect | inspect | pass | - | best inspect relative delta 4.499e-2 >= 1000*accuracy 1.000e-7 (accuracy=1.000e-10, exponent=+2.0, seed=1, probes=10) | - |
  2361. 200.97 s > +------+-----------------+---------+--------+----------+-----------------------------------------------------------------------------------------------------------------------+-------+
  2362. 200.97 s > | se1l | rls.integrated | se1l | pass | 0.0sigma | compatible within 2sigma | - |
  2363. 200.97 s > +------+-----------------+---------+--------+----------+-----------------------------------------------------------------------------------------------------------------------+-------+
  2364. 200.97 s > | se1l | mu_r.inspect | inspect | pass | - | best inspect relative delta 1.424e-1 >= 1000*accuracy 1.000e-7 (accuracy=1.000e-10, exponent=+2.0, seed=1, probes=10) | - |
  2365. 200.97 s > +------+-----------------+---------+--------+----------+-----------------------------------------------------------------------------------------------------------------------+-------+
  2366. 200.97 s > | se1l | target | - | pass | - | 2sigma | - |
  2367. 200.97 s > +------+-----------------+---------+--------+----------+-----------------------------------------------------------------------------------------------------------------------+-------+
  2368. 200.97 s > test se1l_uv ... FAILED
  2369. 200.97 s >
  2370. 200.97 s > failures:
  2371. 200.97 s >
  2372. 200.97 s > failures:
  2373. 200.97 s > se1l_uv
  2374. 200.97 s >
  2375. 200.97 s > test result: FAILED. 0 passed; 1 failed; 0 ignored; 0 measured; 24 filtered out; finished in 149.15s
  2376. 200.97 s > system-err
  2377. 200.97 s > [2026-08-28 16:18:51.925] @gammaloop_api::se... INFO : Running command run generate
  2378. 200.97 s > [2026-08-28 16:18:51.925] @gammaloop_api::se... INFO : Starting command block generate
  2379. 200.97 s > [2026-08-28 16:18:51.925] @gammaloop_api::se... INFO : Running command import model sm-default
  2380. 200.97 s > [2026-08-28 16:18:51.925] @import::model INFO : Loading built-in JSON model sm-default
  2381. 200.97 s > [2026-08-28 16:18:52.011] @gammalooprs::model INFO : The following 11 external parameters were forced to zero by the restriction card:
  2382. 200.97 s > lamWS, AWS, rhoWS, etaWS, ymc, yme, ymm, MC, Me, MM, WTau
  2383. 200.97 s > [2026-08-28 16:18:52.011] @gammalooprs::model INFO : The following 34 vertex rules were removed by the restriction card:
  2384. 200.97 s > V_82 -> (c~, d, G+) | V_83 -> (t~, d, G+) | V_84 -> (c~, s, G+) | V_85 -> (t~, s, G+) | V_86 -> (u~, b, G+) | V_87 -> (c~, b, G+) | V_90 -> (c~, d, W+) | V_91 -> (t~, d, W+) | V_92 -> (u~, s, W+) | V_94 -> (t~, s, W+) | V_95 -> (u~, b, W+) | V_96 -> (c~, b, W+) | V_101 -> (e+, e-, G0) | V_102 -> (mu+, mu-, G0) | V_104 -> (e+, e-, H) | V_105 -> (mu+, mu-, H) | V_110 -> (ve~, e-, G+) | V_111 -> (vm~, mu-, G+) | V_116 -> (b~, u, G-) | V_117 -> (d~, c, G-) | V_118 -> (s~, c, G-) | V_119 -> (b~, c, G-) | V_120 -> (d~, t, G-) | V_121 -> (s~, t, G-) | V_124 -> (s~, u, W-) | V_125 -> (b~, u, W-) | V_126 -> (d~, c, W-) | V_128 -> (b~, c, W-) | V_129 -> (d~, t, W-) | V_130 -> (s~, t, W-) | V_138 -> (c~, c, G0) | V_140 -> (c~, c, H) | V_145 -> (e+, ve, G-) | V_146 -> (mu+, vm, G-)
  2385. 200.97 s > [2026-08-28 16:18:52.011] @gammalooprs::model INFO : The following 36 couplings were removed by the restriction card:
  2386. 200.97 s > GC_13, GC_14, GC_16, GC_17, GC_18, GC_19, GC_20, GC_22, GC_23, GC_24, GC_25, GC_26, GC_28, GC_29, GC_42, GC_43, GC_44, GC_46, GC_47, GC_48, GC_84, GC_85, GC_86, GC_87, GC_88, GC_89, GC_90, GC_91, GC_92, GC_93, GC_101, GC_102, GC_103, GC_105, GC_106, GC_107
  2387. 200.97 s > [2026-08-28 16:18:52.011] @gammaloop_api::se... INFO : Running command remove processes
  2388. 200.97 s > [2026-08-28 16:18:52.014] @gammaloop_api::se... INFO : Running command set global kv global.generation.uv.generate_integrated=true
  2389. 200.97 s > [2026-08-28 16:18:52.014] @gammaloop_api::se... INFO : Running command import graphs ./tests/resources/graphs/uv_tests/se1l.dot -p se1l -i se1l
  2390. 200.97 s > [2026-08-28 16:18:52.014] @commands::import INFO : Loading graphs from '/build/source/tests/resources/graphs/uv_tests/se1l.dot'
  2391. 200.97 s > [2026-08-28 16:18:52.023] @gammaloop_api::se... INFO : Running command generate existing -p se1l -i se1l
  2392. 200.97 s > [2026-08-28 16:18:53.829] @commands::generate INFO :
  2393. 200.97 s > Integrand generation summary
  2394. 200.97 s > peak RAM 90.56 MiB | cores 1
  2395. 200.97 s > ╭───────────┬───────┬─────────┬─────────────┬─────────────┬────────────────┬─────────────╮
  2396. 200.97 s > │ integrand │ graph │ # evals │ expr build │ spenso │ symbolica eval │ compile │
  2397. 200.97 s > ├───────────┼───────┼─────────┼─────────────┼─────────────┼────────────────┼─────────────┤
  2398. 200.97 s > │ se1l │ se1l │ 5 │ 1.50s (88%) │ 81ms (4.7%) │ 131ms (7.7%) │ 0ms (0.00%) │
  2399. 200.97 s > ├───────────┼───────┼─────────┼─────────────┼─────────────┼────────────────┼─────────────┤
  2400. 200.97 s > │ Total │ │ 5 │ 1.50s (88%) │ 81ms (4.7%) │ 131ms (7.7%) │ 0ms (0.00%) │
  2401. 200.97 s > ╰───────────┴───────┴─────────┴─────────────┴─────────────┴────────────────┴─────────────╯
  2402. 200.97 s > [2026-08-28 16:18:53.830] @gammaloop_api::se... INFO : Running command set process -p se1l -i se1l kv general.m_uv=0.2
  2403. 200.97 s > [2026-08-28 16:18:53.831] @gammaloop_api::se... INFO : Running command set process -p se1l -i se1l kv general.mu_r=0.2
  2404. 200.97 s > [2026-08-28 16:18:53.831] @gammaloop_api::se... INFO : Running command set process -p se1l -i se1l kv general.renormalization_localization_scale=0.2
  2405. 200.97 s > [2026-08-28 16:18:53.836] @gammaloop_api::se... INFO : Running command duplicate integrand -p se1l -i se1l --output_process_name se1l --output_integrand_name se1l_muv_shifted
  2406. 200.97 s > [2026-08-28 16:18:53.837] @gammaloop_api::se... INFO : Running command set process -p se1l -i se1l_muv_shifted kv general.m_uv=0.5
  2407. 200.97 s > [2026-08-28 16:18:53.844] @gammaloop_api::se... INFO : Running command duplicate integrand -p se1l -i se1l --output_process_name se1l --output_integrand_name se1l_rls_shifted
  2408. 200.97 s > [2026-08-28 16:18:53.846] @gammaloop_api::se... INFO : Running command set process -p se1l -i se1l_rls_shifted kv general.renormalization_localization_scale=1
  2409. 200.97 s > [2026-08-28 16:18:53.854] @gammaloop_api::se... INFO : Running command duplicate integrand -p se1l -i se1l --output_process_name se1l --output_integrand_name se1l_mur_shifted
  2410. 200.97 s > [2026-08-28 16:18:53.863] @gammaloop_api::se... INFO : Running command set process -p se1l -i se1l_mur_shifted kv general.mu_r=0.8
  2411. 200.97 s > [2026-08-28 16:18:53.881] @process::amplitude WARNING : External state 0 ('g', PDG 21, helicity +) is off shell: p^2 = +2.5e5, expected m^2 = +0e0 (|Δ| = +2.5e5). Fixed-helicity spinor/vector/tensor external states may be ill-defined at this kinematic point.
  2412. 200.97 s > field value
  2413. 200.97 s > span warm_up{integrand.name=se1l}
  2414. 200.97 s > [2026-08-28 16:18:53.881] @process::amplitude WARNING : External state 1 ('g', PDG 21, helicity -) is off shell: p^2 = +2.5e5, expected m^2 = +0e0 (|Δ| = +2.5e5). Fixed-helicity spinor/vector/tensor external states may be ill-defined at this kinematic point.
  2415. 200.97 s > field value
  2416. 200.97 s > span warm_up{integrand.name=se1l}
  2417. 200.97 s > [2026-08-28 16:18:53.882] @process::amplitude INFO : Input is above threshold: 1 existing threshold E-surfaces across 1/1 graph groups
  2418. 200.97 s > field value
  2419. 200.97 s > existing_esurfaces 1
  2420. 200.97 s > group_count 1
  2421. 200.97 s > groups_above_threshold 1
  2422. 200.97 s > integrand se1l
  2423. 200.97 s > span warm_up{integrand.name=se1l}
  2424. 200.97 s > threshold_status above threshold
  2425. 200.97 s > [2026-08-28 16:18:53.882] @process::amplitude INFO : overlap structure of group 0: [1: [0(2,3)]]
  2426. 200.97 s > field value
  2427. 200.97 s > span warm_up{integrand.name=se1l}
  2428. 200.97 s > [2026-08-28 16:18:54.715] @commands::profile INFO :
  2429. 200.97 s > ╭───────┬──────┬──────────┬───────┬─────┬──────────┬───────────╮
  2430. 200.97 s > │ fixed │ → ∞ │ slope │ r2 │ DOD │ bare DOD │ inspect │
  2431. 200.97 s > ├───────┼──────┼──────────┼───────┼─────┼──────────┼───────────┤
  2432. 200.97 s > │ {} │ {e3} │ 1.639236 │ 0.904 │ 2 │ 2 │ arb retry │
  2433. 200.97 s > │ {} │ {e2} │ 1.698834 │ 0.902 │ 2 │ 2 │ arb retry │
  2434. 200.97 s > ╰───────┴──────┴──────────┴───────┴─────┴──────────┴───────────╯
  2435. 200.97 s > [2026-08-28 16:18:54.715] @commands::profile INFO :
  2436. 200.97 s > ╭───────┬──────┬─────────────┬──────────┬───────┬─────┬──────────┬───────────╮
  2437. 200.97 s > │ fixed │ → ∞ │ orientation │ slope │ r2 │ DOD │ bare DOD │ inspect │
  2438. 200.97 s > ├───────┼──────┼─────────────┼──────────┼───────┼─────┼──────────┼───────────┤
  2439. 200.97 s > │ {} │ {e3} │ 00-+ │ 0.343429 │ 0.145 │ 0 │ 2 │ arb retry │
  2440. 200.97 s > │ {} │ {e3} │ 00+- │ 0.342577 │ 0.135 │ 0 │ 2 │ arb retry │
  2441. 200.97 s > │ {} │ {e2} │ 00-+ │ 0.385975 │ 0.161 │ 0 │ 2 │ arb retry │
  2442. 200.97 s > │ {} │ {e2} │ 00+- │ 0.384920 │ 0.192 │ 0 │ 2 │ arb retry │
  2443. 200.97 s > ╰───────┴──────┴─────────────┴──────────┴───────┴─────┴──────────┴───────────╯
  2444. 200.97 s > [2026-08-28 16:18:54.717] @gammaloop_api::se... INFO : Running command set process kv integrator.target_relative_accuracy=0.001 integrator.n_increase=0 integrator.n_start=50000 integrator.n_max=400000 integrator.seed=1337
  2445. 200.97 s > [2026-08-28 16:18:54.718] @commands::integrate INFO : Created workspace directory at /build/source/tests/artifacts/se1l/integration_workspace_se1l
  2446. 200.97 s > [2026-08-28 16:18:54.911] @commands::integrate INFO : No integration state found, starting new integration
  2447. 200.97 s > [2026-08-28 16:18:54.911] @commands::integrate INFO : Gammaloop now integrates se1l@se1l, se1l@se1l_muv_shifted, se1l@se1l_rls_shifted
  2448. 200.97 s > [2026-08-28 16:18:54.911] @process::amplitude WARNING : External state 0 ('g', PDG 21, helicity +) is off shell: p^2 = +2.5e5, expected m^2 = +0e0 (|Δ| = +2.5e5). Fixed-helicity spinor/vector/tensor external states may be ill-defined at this kinematic point.
  2449. 200.97 s > field value
  2450. 200.97 s > span warm_up{integrand.name=se1l}
  2451. 200.97 s > [2026-08-28 16:18:54.911] @process::amplitude WARNING : External state 1 ('g', PDG 21, helicity -) is off shell: p^2 = +2.5e5, expected m^2 = +0e0 (|Δ| = +2.5e5). Fixed-helicity spinor/vector/tensor external states may be ill-defined at this kinematic point.
  2452. 200.97 s > field value
  2453. 200.97 s > span warm_up{integrand.name=se1l}
  2454. 200.97 s > [2026-08-28 16:18:54.916] @process::amplitude INFO : Input is above threshold: 1 existing threshold E-surfaces across 1/1 graph groups
  2455. 200.97 s > field value
  2456. 200.97 s > existing_esurfaces 1
  2457. 200.97 s > group_count 1
  2458. 200.97 s > groups_above_threshold 1
  2459. 200.97 s > integrand se1l
  2460. 200.97 s > span warm_up{integrand.name=se1l}
  2461. 200.97 s > threshold_status above threshold
  2462. 200.97 s > [2026-08-28 16:18:54.916] @process::amplitude INFO : overlap structure of group 0: [1: [0(2,3)]]
  2463. 200.97 s > field value
  2464. 200.97 s > span warm_up{integrand.name=se1l}
  2465. 200.97 s > [2026-08-28 16:18:54.951] @process::amplitude WARNING : External state 0 ('g', PDG 21, helicity +) is off shell: p^2 = +2.5e5, expected m^2 = +0e0 (|Δ| = +2.5e5). Fixed-helicity spinor/vector/tensor external states may be ill-defined at this kinematic point.
  2466. 200.97 s > field value
  2467. 200.97 s > span warm_up{integrand.name=se1l_muv_shifted}
  2468. 200.97 s > [2026-08-28 16:18:54.951] @process::amplitude WARNING : External state 1 ('g', PDG 21, helicity -) is off shell: p^2 = +2.5e5, expected m^2 = +0e0 (|Δ| = +2.5e5). Fixed-helicity spinor/vector/tensor external states may be ill-defined at this kinematic point.
  2469. 200.97 s > field value
  2470. 200.97 s > span warm_up{integrand.name=se1l_muv_shifted}
  2471. 200.97 s > [2026-08-28 16:18:54.951] @process::amplitude INFO : Input is above threshold: 1 existing threshold E-surfaces across 1/1 graph groups
  2472. 200.97 s > field value
  2473. 200.97 s > existing_esurfaces 1
  2474. 200.97 s > group_count 1
  2475. 200.97 s > groups_above_threshold 1
  2476. 200.97 s > integrand se1l_muv_shifted
  2477. 200.97 s > span warm_up{integrand.name=se1l_muv_shifted}
  2478. 200.97 s > threshold_status above threshold
  2479. 200.97 s > [2026-08-28 16:18:54.951] @process::amplitude INFO : overlap structure of group 0: [1: [0(2,3)]]
  2480. 200.97 s > field value
  2481. 200.97 s > span warm_up{integrand.name=se1l_muv_shifted}
  2482. 200.97 s > [2026-08-28 16:18:54.967] @process::amplitude WARNING : External state 0 ('g', PDG 21, helicity +) is off shell: p^2 = +2.5e5, expected m^2 = +0e0 (|Δ| = +2.5e5). Fixed-helicity spinor/vector/tensor external states may be ill-defined at this kinematic point.
  2483. 200.97 s > field value
  2484. 200.97 s > span warm_up{integrand.name=se1l_rls_shifted}
  2485. 200.97 s > [2026-08-28 16:18:54.967] @process::amplitude WARNING : External state 1 ('g', PDG 21, helicity -) is off shell: p^2 = +2.5e5, expected m^2 = +0e0 (|Δ| = +2.5e5). Fixed-helicity spinor/vector/tensor external states may be ill-defined at this kinematic point.
  2486. 200.97 s > field value
  2487. 200.97 s > span warm_up{integrand.name=se1l_rls_shifted}
  2488. 200.97 s > [2026-08-28 16:18:54.969] @process::amplitude INFO : Input is above threshold: 1 existing threshold E-surfaces across 1/1 graph groups
  2489. 200.97 s > field value
  2490. 200.97 s > existing_esurfaces 1
  2491. 200.97 s > group_count 1
  2492. 200.97 s > groups_above_threshold 1
  2493. 200.97 s > integrand se1l_rls_shifted
  2494. 200.97 s > span warm_up{integrand.name=se1l_rls_shifted}
  2495. 200.97 s > threshold_status above threshold
  2496. 200.97 s > ... omitted 1410 more lines; see full nextest output above
  2497. 200.97 s > =========================================
  2498. 200.97 s For full logs, run:
  2499. 200.97 s nix log /nix/store/5lvckp7qh3dqs2nqf61qj4kz6kj46p4q-gammaloop-nextest-integration.drv
  2500. 201.09 s [0 built (1 failed)]Run failed.