1. 0.17 s $ /nix/store/9ypz3flqsrl5xl495mm8h645gadjsxi1-coreutils-9.11/bin/timeout --kill-after=15s 7200s /nix/store/23zk8sgzamrbmj1fday15szf7f2279s8-nix-2.34.7/bin/nix --extra-experimental-features nix-command --extra-experimental-features flakes flake clone git+https://github.com/alphal00p/gammaloop --dest /tmp/nix-ci-worker/stable-pwd/repo/
  2. 0.20 s Cloning into '/tmp/nix-ci-worker/stable-pwd/repo'...
  3. 2.22 s remote: Enumerating objects: 54634 remote: Enumerating objects: 64182, done.
  4. 2.46 s remote: Counting objects: 0% (1/9548) remote: Counting objects: 1% (96/9548) remote: Counting objects: 2% (191/9548) remote: Counting objects: 3% (287/9548) remote: Counting objects: 4% (382/9548) remote: Counting objects: 5% (478/9548) remote: Counting objects: 6% (573/9548) remote: Counting objects: 7% (669/9548) remote: Counting objects: 8% (764/9548) remote: Counting objects: 9% (860/9548) remote: Counting objects: 10% (955/9548) remote: Counting objects: 11% (1051/9548) remote: Counting objects: 12% (1146/9548) remote: Counting objects: 13% (1242/9548) remote: Counting objects: 14% (1337/9548) remote: Counting objects: 15% (1433/9548) remote: Counting objects: 16% (1528/9548) remote: Counting objects: 17% (1624/9548) remote: Counting objects: 18% (1719/9548) remote: Counting objects: 19% (1815/9548) remote: Counting objects: 20% (1910/9548) remote: Counting objects: 21% (2006/9548) remote: Counting objects: 22% (2101/9548) remote: Counting objects: 23% (2197/9548) remote: Counting objects: 24% (2292/9548) remote: Counting objects: 25% (2387/9548) remote: Counting objects: 26% (2483/9548) remote: Counting objects: 27% (2578/9548) remote: Counting objects: 28% (2674/9548) remote: Counting objects: 29% (2769/9548) remote: Counting objects: 30% (2865/9548) remote: Counting objects: 31% (2960/9548) remote: Counting objects: 32% (3056/9548) remote: Counting objects: 33% (3151/9548) remote: Counting objects: 34% (3247/9548) remote: Counting objects: 35% (3342/9548) remote: Counting objects: 36% (3438/9548) remote: Counting objects: 37% (3533/9548) remote: Counting objects: 38% (3629/9548) remote: Counting objects: 39% (3724/9548) remote: Counting objects: 40% (3820/9548) remote: Counting objects: 41% (3915/9548) remote: Counting objects: 42% (4011/9548) remote: Counting objects: 43% (4106/9548) remote: Counting objects: 44% (4202/9548) remote: Counting objects: 45% (4297/9548) remote: Counting objects: 46% (4393/9548) remote: Counting objects: 47% (4488/9548) remote: Counting objects: 48% (4584/9548) remote: Counting objects: 49% (4679/9548) remote: Counting objects: 50% (4774/9548) remote: Counting objects: 51% (4870/9548) remote: Counting objects: 52% (4965/9548) remote: Counting objects: 53% (5061/9548) remote: Counting objects: 54% (5156/9548) remote: Counting objects: 55% (5252/9548) remote: Counting objects: 56% (5347/9548) remote: Counting objects: 57% (5443/9548) remote: Counting objects: 58% (5538/9548) remote: Counting objects: 59% (5634/9548) remote: Counting objects: 60% (5729/9548) remote: Counting objects: 61% (5825/9548) remote: Counting objects: 62% (5920/9548) remote: Counting objects: 63% (6016/9548) remote: Counting objects: 64% (6111/9548) remote: Counting objects: 65% (6207/9548) remote: Counting objects: 66% (6302/9548) remote: Counting objects: 67% (6398/9548) remote: Counting objects: 68% (6493/9548) remote: Counting objects: 69% (6589/9548) remote: Counting objects: 70% (6684/9548) remote: Counting objects: 71% (6780/9548) remote: Counting objects: 72% (6875/9548) remote: Counting objects: 73% (6971/9548) remote: Counting objects: 74% (7066/9548) remote: Counting objects: 75% (7161/9548) remote: Counting objects: 76% (7257/9548) remote: Counting objects: 77% (7352/9548) remote: Counting objects: 78% (7448/9548) remote: Counting objects: 79% (7543/9548) remote: Counting objects: 80% (7639/9548) remote: Counting objects: 81% (7734/9548) remote: Counting objects: 82% (7830/9548) remote: Counting objects: 83% (7925/9548) remote: Counting objects: 84% (8021/9548) remote: Counting objects: 85% (8116/9548) remote: Counting objects: 86% (8212/9548) remote: Counting objects: 87% (8307/9548) remote: Counting objects: 88% (8403/9548) remote: Counting objects: 89% (8498/9548) remote: Counting objects: 90% (8594/9548) remote: Counting objects: 91% (8689/9548) remote: Counting objects: 92% (8785/9548) remote: Counting objects: 93% (8880/9548) remote: Counting objects: 94% (8976/9548) remote: Counting objects: 95% (9071/9548) remote: Counting objects: 96% (9167/9548) remote: Counting objects: 97% (9262/9548) remote: Counting objects: 98% (9358/9548) remote: Counting objects: 99% (9453/9548) remote: Counting objects: 100% (9548/9548) remote: Counting objects: 100% (9548/9548), done.
  5. 4.78 s remote: Compressing objects: 0% (1/2325) remote: Compressing objects: 1% (24/2325) remote: Compressing objects: 2% (47/2325) remote: Compressing objects: 3% (70/2325) remote: Compressing objects: 4% (93/2325) remote: Compressing objects: 5% (117/2325) remote: Compressing objects: 6% (140/2325) remote: Compressing objects: 7% (163/2325) remote: Compressing objects: 8% (186/2325) remote: Compressing objects: 9% (210/2325) remote: Compressing objects: 10% (233/2325) remote: Compressing objects: 11% (256/2325) remote: Compressing objects: 12% (279/2325) remote: Compressing objects: 13% (303/2325) remote: Compressing objects: 14% (326/2325) remote: Compressing objects: 15% (349/2325) remote: Compressing objects: 16% (372/2325) remote: Compressing objects: 17% (396/2325) remote: Compressing objects: 18% (419/2325) remote: Compressing objects: 19% (442/2325) remote: Compressing objects: 20% (465/2325) remote: Compressing objects: 21% (489/2325) remote: Compressing objects: 22% (512/2325) remote: Compressing objects: 23% (535/2325) remote: Compressing objects: 23% (537/2325) remote: Compressing objects: 24% (558/2325) remote: Compressing objects: 25% (582/2325) remote: Compressing objects: 26% (605/2325) remote: Compressing objects: 27% (628/2325) remote: Compressing objects: 28% (651/2325) remote: Compressing objects: 29% (675/2325) remote: Compressing objects: 30% (698/2325) remote: Compressing objects: 30% (701/2325) remote: Compressing objects: 31% (721/2325) remote: Compressing objects: 32% (744/2325) remote: Compressing objects: 33% (768/2325) remote: Compressing objects: 34% (791/2325) remote: Compressing objects: 35% (814/2325) remote: Compressing objects: 36% (837/2325) remote: Compressing objects: 37% (861/2325) remote: Compressing objects: 38% (884/2325) remote: Compressing objects: 39% (907/2325) remote: Compressing objects: 40% (930/2325) remote: Compressing objects: 41% (954/2325) remote: Compressing objects: 42% (977/2325) remote: Compressing objects: 43% (1000/2325) remote: Compressing objects: 44% (1023/2325) remote: Compressing objects: 45% (1047/2325) remote: Compressing objects: 46% (1070/2325) remote: Compressing objects: 47% (1093/2325) remote: Compressing objects: 48% (1116/2325) remote: Compressing objects: 49% (1140/2325) remote: Compressing objects: 50% (1163/2325) remote: Compressing objects: 51% (1186/2325) remote: Compressing objects: 52% (1209/2325) remote: Compressing objects: 53% (1233/2325) remote: Compressing objects: 54% (1256/2325) remote: Compressing objects: 55% (1279/2325) remote: Compressing objects: 56% (1302/2325) remote: Compressing objects: 57% (1326/2325) remote: Compressing objects: 58% (1349/2325) remote: Compressing objects: 59% (1372/2325) remote: Compressing objects: 60% (1395/2325) remote: Compressing objects: 61% (1419/2325) remote: Compressing objects: 62% (1442/2325) remote: Compressing objects: 63% (1465/2325) remote: Compressing objects: 64% (1488/2325) remote: Compressing objects: 65% (1512/2325) remote: Compressing objects: 66% (1535/2325) remote: Compressing objects: 67% (1558/2325) remote: Compressing objects: 68% (1581/2325) remote: Compressing objects: 69% (1605/2325) remote: Compressing objects: 70% (1628/2325) remote: Compressing objects: 71% (1651/2325) remote: Compressing objects: 72% (1674/2325) remote: Compressing objects: 73% (1698/2325) remote: Compressing objects: 74% (1721/2325) remote: Compressing objects: 75% (1744/2325) remote: Compressing objects: 76% (1767/2325) remote: Compressing objects: 77% (1791/2325) remote: Compressing objects: 78% (1814/2325) remote: Compressing objects: 79% (1837/2325) remote: Compressing objects: 80% (1860/2325) remote: Compressing objects: 81% (1884/2325) remote: Compressing objects: 82% (1907/2325) remote: Compressing objects: 83% (1930/2325) remote: Compressing objects: 84% (1953/2325) remote: Compressing objects: 85% (1977/2325) remote: Compressing objects: 86% (2000/2325) remote: Compressing objects: 87% (2023/2325) remote: Compressing objects: 88% (2046/2325) remote: Compressing objects: 89% (2070/2325) remote: Compressing objects: 90% (2093/2325) remote: Compressing objects: 91% (2116/2325) remote: Compressing objects: 92% (2139/2325) remote: Compressing objects: 93% (2163/2325) remote: Compressing objects: 94% (2186/2325) remote: Compressing objects: 95% (2209/2325) remote: Compressing objects: 96% (2232/2325) remote: Compressing objects: 97% (2256/2325) remote: Compressing objects: 98% (2279/2325) remote: Compressing objects: 99% (2302/2325) remote: Compressing objects: 100% (2325/2325) remote: Compressing objects: 100% (2325/2325), done.
  6. 7.86 s Receiving objects: 0% (1/64182) Receiving objects: 1% (642/64182) Receiving objects: 2% (1284/64182) Receiving objects: 3% (1926/64182) Receiving objects: 4% (2568/64182) Receiving objects: 5% (3210/64182) Receiving objects: 6% (3851/64182) Receiving objects: 7% (4493/64182) Receiving objects: 8% (5135/64182) Receiving objects: 9% (5777/64182) Receiving objects: 10% (6419/64182), 13.40 MiB | 26.78 MiB/s Receiving objects: 11% (7061/64182), 13.40 MiB | 26.78 MiB/s Receiving objects: 12% (7702/64182), 13.40 MiB | 26.78 MiB/s Receiving objects: 13% (8344/64182), 13.40 MiB | 26.78 MiB/s Receiving objects: 14% (8986/64182), 13.40 MiB | 26.78 MiB/s Receiving objects: 15% (9628/64182), 13.40 MiB | 26.78 MiB/s Receiving objects: 16% (10270/64182), 13.40 MiB | 26.78 MiB/s Receiving objects: 17% (10911/64182), 13.40 MiB | 26.78 MiB/s Receiving objects: 18% (11553/64182), 13.40 MiB | 26.78 MiB/s Receiving objects: 19% (12195/64182), 13.40 MiB | 26.78 MiB/s Receiving objects: 20% (12837/64182), 13.40 MiB | 26.78 MiB/s Receiving objects: 21% (13479/64182), 13.40 MiB | 26.78 MiB/s Receiving objects: 22% (14121/64182), 13.40 MiB | 26.78 MiB/s Receiving objects: 23% (14762/64182), 13.40 MiB | 26.78 MiB/s Receiving objects: 24% (15404/64182), 13.40 MiB | 26.78 MiB/s Receiving objects: 25% (16046/64182), 13.40 MiB | 26.78 MiB/s Receiving objects: 26% (16688/64182), 13.40 MiB | 26.78 MiB/s Receiving objects: 27% (17330/64182), 13.40 MiB | 26.78 MiB/s Receiving objects: 28% (17971/64182), 13.40 MiB | 26.78 MiB/s Receiving objects: 29% (18613/64182), 13.40 MiB | 26.78 MiB/s Receiving objects: 30% (19255/64182), 13.40 MiB | 26.78 MiB/s Receiving objects: 31% (19897/64182), 13.40 MiB | 26.78 MiB/s Receiving objects: 32% (20539/64182), 13.40 MiB | 26.78 MiB/s Receiving objects: 33% (21181/64182), 13.40 MiB | 26.78 MiB/s Receiving objects: 34% (21822/64182), 13.40 MiB | 26.78 MiB/s Receiving objects: 35% (22464/64182), 13.40 MiB | 26.78 MiB/s Receiving objects: 36% (23106/64182), 13.40 MiB | 26.78 MiB/s Receiving objects: 37% (23748/64182), 13.40 MiB | 26.78 MiB/s Receiving objects: 38% (24390/64182), 13.40 MiB | 26.78 MiB/s Receiving objects: 39% (25031/64182), 13.40 MiB | 26.78 MiB/s Receiving objects: 40% (25673/64182), 13.40 MiB | 26.78 MiB/s Receiving objects: 41% (26315/64182), 13.40 MiB | 26.78 MiB/s Receiving objects: 42% (26957/64182), 13.40 MiB | 26.78 MiB/s Receiving objects: 43% (27599/64182), 13.40 MiB | 26.78 MiB/s Receiving objects: 44% (28241/64182), 13.40 MiB | 26.78 MiB/s Receiving objects: 45% (28882/64182), 13.40 MiB | 26.78 MiB/s Receiving objects: 46% (29524/64182), 13.40 MiB | 26.78 MiB/s Receiving objects: 47% (30166/64182), 13.40 MiB | 26.78 MiB/s Receiving objects: 48% (30808/64182), 13.40 MiB | 26.78 MiB/s Receiving objects: 49% (31450/64182), 13.40 MiB | 26.78 MiB/s Receiving objects: 50% (32091/64182), 13.40 MiB | 26.78 MiB/s Receiving objects: 51% (32733/64182), 13.40 MiB | 26.78 MiB/s Receiving objects: 52% (33375/64182), 13.40 MiB | 26.78 MiB/s Receiving objects: 52% (33423/64182), 13.40 MiB | 26.78 MiB/s Receiving objects: 53% (34017/64182), 32.10 MiB | 32.09 MiB/s Receiving objects: 54% (34659/64182), 32.10 MiB | 32.09 MiB/s Receiving objects: 55% (35301/64182), 32.10 MiB | 32.09 MiB/s Receiving objects: 56% (35942/64182), 32.10 MiB | 32.09 MiB/s Receiving objects: 57% (36584/64182), 32.10 MiB | 32.09 MiB/s Receiving objects: 58% (37226/64182), 32.10 MiB | 32.09 MiB/s Receiving objects: 59% (37868/64182), 32.10 MiB | 32.09 MiB/s Receiving objects: 60% (38510/64182), 32.10 MiB | 32.09 MiB/s Receiving objects: 61% (39152/64182), 32.10 MiB | 32.09 MiB/s Receiving objects: 62% (39793/64182), 32.10 MiB | 32.09 MiB/s Receiving objects: 63% (40435/64182), 48.75 MiB | 31.65 MiB/s Receiving objects: 64% (41077/64182), 48.75 MiB | 31.65 MiB/s Receiving objects: 65% (41719/64182), 48.75 MiB | 31.65 MiB/s Receiving objects: 66% (42361/64182), 48.75 MiB | 31.65 MiB/s Receiving objects: 67% (43002/64182), 48.75 MiB | 31.65 MiB/s Receiving objects: 68% (43644/64182), 48.75 MiB | 31.65 MiB/s Receiving objects: 69% (44286/64182), 48.75 MiB | 31.65 MiB/s Receiving objects: 70% (44928/64182), 48.75 MiB | 31.65 MiB/s Receiving objects: 71% (45570/64182), 48.75 MiB | 31.65 MiB/s Receiving objects: 72% (46212/64182), 48.75 MiB | 31.65 MiB/s Receiving objects: 73% (46853/64182), 48.75 MiB | 31.65 MiB/s Receiving objects: 74% (47495/64182), 48.75 MiB | 31.65 MiB/s Receiving objects: 74% (47872/64182), 64.57 MiB | 31.53 MiB/s Receiving objects: 75% (48137/64182), 64.57 MiB | 31.53 MiB/s Receiving objects: 76% (48779/64182), 64.57 MiB | 31.53 MiB/s Receiving objects: 77% (49421/64182), 64.57 MiB | 31.53 MiB/s Receiving objects: 78% (50062/64182), 64.57 MiB | 31.53 MiB/s Receiving objects: 79% (50704/64182), 64.57 MiB | 31.53 MiB/s Receiving objects: 80% (51346/64182), 64.57 MiB | 31.53 MiB/s Receiving objects: 81% (51988/64182), 64.57 MiB | 31.53 MiB/s Receiving objects: 82% (52630/64182), 64.57 MiB | 31.53 MiB/s Receiving objects: 83% (53272/64182), 64.57 MiB | 31.53 MiB/s Receiving objects: 84% (53913/64182), 80.65 MiB | 31.64 MiB/s Receiving objects: 85% (54555/64182), 80.65 MiB | 31.64 MiB/s Receiving objects: 86% (55197/64182), 80.65 MiB | 31.64 MiB/s Receiving objects: 87% (55839/64182), 80.65 MiB | 31.64 MiB/s Receiving objects: 88% (56481/64182), 80.65 MiB | 31.64 MiB/s Receiving objects: 89% (57122/64182), 80.65 MiB | 31.64 MiB/s Receiving objects: 90% (57764/64182), 80.65 MiB | 31.64 MiB/s Receiving objects: 91% (58406/64182), 80.65 MiB | 31.64 MiB/s Receiving objects: 92% (59048/64182), 80.65 MiB | 31.64 MiB/s Receiving objects: 93% (59690/64182), 80.65 MiB | 31.64 MiB/s Receiving objects: 94% (60332/64182), 80.65 MiB | 31.64 MiB/s Receiving objects: 95% (60973/64182), 80.65 MiB | 31.64 MiB/s Receiving objects: 96% (61615/64182), 80.65 MiB | 31.64 MiB/s Receiving objects: 97% (62257/64182), 80.65 MiB | 31.64 MiB/s Receiving objects: 98% (62899/64182), 80.65 MiB | 31.64 MiB/s Receiving objects: 98% (62936/64182), 80.65 MiB | 31.64 MiB/s Receiving objects: 99% (63541/64182), 80.65 MiB | 31.64 MiB/s remote: Total 64182 (delta 7395), reused 7772 (delta 6678), pack-reused 54634 (from 3)
  7. 7.87 s Receiving objects: 100% (64182/64182), 96.84 MiB | 31.76 MiB/s Receiving objects: 100% (64182/64182), 97.83 MiB | 31.83 MiB/s, done.
  8. 9.61 s Resolving deltas: 0% (0/44314) Resolving deltas: 1% (445/44314) Resolving deltas: 2% (887/44314) Resolving deltas: 3% (1330/44314) Resolving deltas: 4% (1773/44314) Resolving deltas: 5% (2216/44314) Resolving deltas: 6% (2659/44314) Resolving deltas: 7% (3102/44314) Resolving deltas: 8% (3546/44314) Resolving deltas: 9% (3989/44314) Resolving deltas: 10% (4432/44314) Resolving deltas: 11% (4875/44314) Resolving deltas: 12% (5318/44314) Resolving deltas: 13% (5761/44314) Resolving deltas: 14% (6204/44314) Resolving deltas: 15% (6648/44314) Resolving deltas: 16% (7091/44314) Resolving deltas: 17% (7534/44314) Resolving deltas: 18% (7977/44314) Resolving deltas: 19% (8420/44314) Resolving deltas: 20% (8863/44314) Resolving deltas: 21% (9306/44314) Resolving deltas: 22% (9750/44314) Resolving deltas: 23% (10193/44314) Resolving deltas: 24% (10636/44314) Resolving deltas: 25% (11079/44314) Resolving deltas: 26% (11522/44314) Resolving deltas: 27% (11965/44314) Resolving deltas: 28% (12408/44314) Resolving deltas: 29% (12852/44314) Resolving deltas: 30% (13295/44314) Resolving deltas: 31% (13738/44314) Resolving deltas: 32% (14181/44314) Resolving deltas: 33% (14624/44314) Resolving deltas: 34% (15067/44314) Resolving deltas: 35% (15510/44314) Resolving deltas: 36% (15954/44314) Resolving deltas: 37% (16397/44314) Resolving deltas: 38% (16840/44314) Resolving deltas: 39% (17285/44314) Resolving deltas: 40% (17726/44314) Resolving deltas: 41% (18169/44314) Resolving deltas: 42% (18612/44314) Resolving deltas: 43% (19056/44314) Resolving deltas: 44% (19499/44314) Resolving deltas: 45% (19945/44314) Resolving deltas: 46% (20385/44314) Resolving deltas: 47% (20828/44314) Resolving deltas: 48% (21271/44314) Resolving deltas: 49% (21714/44314) Resolving deltas: 50% (22157/44314) Resolving deltas: 51% (22601/44314) Resolving deltas: 52% (23044/44314) Resolving deltas: 53% (23488/44314) Resolving deltas: 54% (23930/44314) Resolving deltas: 55% (24373/44314) Resolving deltas: 56% (24816/44314) Resolving deltas: 57% (25259/44314) Resolving deltas: 58% (25703/44314) Resolving deltas: 59% (26146/44314) Resolving deltas: 60% (26589/44314) Resolving deltas: 61% (27032/44314) Resolving deltas: 62% (27475/44314) Resolving deltas: 63% (27918/44314) Resolving deltas: 64% (28361/44314) Resolving deltas: 65% (28805/44314) Resolving deltas: 66% (29248/44314) Resolving deltas: 67% (29691/44314) Resolving deltas: 68% (30134/44314) Resolving deltas: 68% (30574/44314) Resolving deltas: 69% (30577/44314) Resolving deltas: 70% (31020/44314) Resolving deltas: 71% (31463/44314) Resolving deltas: 72% (31907/44314) Resolving deltas: 73% (32350/44314) Resolving deltas: 74% (32793/44314) Resolving deltas: 75% (33236/44314) Resolving deltas: 76% (33679/44314) Resolving deltas: 77% (34123/44314) Resolving deltas: 78% (34567/44314) Resolving deltas: 79% (35009/44314) Resolving deltas: 80% (35452/44314) Resolving deltas: 81% (35895/44314) Resolving deltas: 82% (36338/44314) Resolving deltas: 83% (36781/44314) Resolving deltas: 84% (37224/44314) Resolving deltas: 85% (37667/44314) Resolving deltas: 86% (38111/44314) Resolving deltas: 87% (38554/44314) Resolving deltas: 88% (38997/44314) Resolving deltas: 89% (39440/44314) Resolving deltas: 90% (39885/44314) Resolving deltas: 91% (40326/44314) Resolving deltas: 92% (40769/44314) Resolving deltas: 93% (41213/44314) Resolving deltas: 94% (41656/44314) Resolving deltas: 95% (42099/44314) Resolving deltas: 96% (42542/44314) Resolving deltas: 97% (42985/44314) Resolving deltas: 98% (43428/44314) Resolving deltas: 99% (43871/44314) Resolving deltas: 100% (44314/44314) Resolving deltas: 100% (44314/44314), done.
  9. 10.13 s Fetching commit 94e2eb84385825c67e2d00485755754534658cdd for push-vrpyqyylypmw ...
  10. 10.13 s $ /nix/store/bcnisk3ydfgv26v2gw3zlky24g00yww2-git-2.54.0/bin/git fetch origin 94e2eb84385825c67e2d00485755754534658cdd
  11. 10.70 s From https://github.com/alphal00p/gammaloop
  12. 10.70 s * branch 94e2eb84385825c67e2d00485755754534658cdd -> FETCH_HEAD
  13. 10.76 s $ /nix/store/9ypz3flqsrl5xl495mm8h645gadjsxi1-coreutils-9.11/bin/timeout --kill-after=15s 7200s /nix/store/bcnisk3ydfgv26v2gw3zlky24g00yww2-git-2.54.0/bin/git -c advice.detachedHead=false checkout 94e2eb84385825c67e2d00485755754534658cdd
  14. 10.99 s HEAD is now at 94e2eb84 include documentation sources in catalog dependency build
  15. 11.01 s $ /nix/store/9ypz3flqsrl5xl495mm8h645gadjsxi1-coreutils-9.11/bin/timeout --kill-after=15s 7200s /nix/store/23zk8sgzamrbmj1fday15szf7f2279s8-nix-2.34.7/bin/nix --extra-experimental-features nix-command --extra-experimental-features flakes --log-format internal-json run .#packages.x86_64-linux.nix-ci-check-gammaloop-doctest --print-build-logs
  16. 15.18 s
  17. 15.38 s Downloading cached nix-ci-check-gammaloop-doctest from https://cache.nix-ci.com
  18. 15.60 s Downloaded cached nix-ci-check-gammaloop-doctest (1000 B) in 215ms
  19. 15.60 s Progress: 0 of 1 built, 1 of 1 downloaded from cache
  20. 18.76 s evaluating derivation 'g copying '/nix/store/fxbc evaluating derivation 'g querying gammaloop-works [0/1 built, 0.0 KiB DL] [1/0/1 built, 0.0 KiB DLgammaloop-workspace-doctest> Running phase: unpackPhase
  21. 18.77 s gammaloop-workspace-doctest> unpacking source archive /nix/store/n62xwv096bc248rr6y7qpggfdbwshkw9-source
  22. 18.91 s gammaloop-workspace-doctest> source root is source
  23. 18.94 s gammaloop-workspace-doctest> Running phase: patchPhase
  24. 18.94 s gammaloop-workspace-doctest> Executing configureCargoCommonVars
  25. 18.94 s gammaloop-workspace-doctest> decompressing cargo artifacts from /nix/store/kbgwngi7xvi54jsr0kp8rhj1b9mfja7d-gammaloop-workspace-deps-deps-0.1.0/target.tar.zst to target
  26. 20.62 s gammaloop-workspace-doctest> Running phase: updateAutotoolsGnuConfigScriptsPhase
  27. 20.65 s gammaloop-workspace-doctest> Running phase: configurePhase
  28. 20.66 s gammaloop-workspace-doctest> will append /build/source/.cargo-home/config.toml with contents of /nix/store/xdy1vvhll2bijdplvl9fcc2b9plkxhaa-vendor-cargo-deps/config.toml
  29. 20.66 s gammaloop-workspace-doctest> default configurePhase, nothing to do
  30. 20.66 s gammaloop-workspace-doctest> Running phase: buildPhase
  31. 20.66 s gammaloop-workspace-doctest> +++ command cargo --version
  32. 20.67 s gammaloop-workspace-doctest> cargo 1.97.0 (c980f4866 2026-06-30)
  33. 20.70 s gammaloop-workspace-doctest> +++ command cargo test --profile ci-optim --doc --locked --workspace --features gammaloop-api/cli,gammaloop-tracing-filter/clap,gammaloop-tracing-filter/symbolica,idenso/bincode,idenso/reference-cases,linnet/bincode,linnet/drawing,linnet/nodestore-vec,linnet/rkyv,linnet/serde,linnet/symbolica,spenso-macros/shadowing,spenso/shadowing,symbolica/tracing_max_level_info
  34. 21.18 s gammaloop-workspace-doctest> Compiling target-lexicon v0.13.5
  35. 21.20 s gammaloop-workspace-doctest> Compiling symbolica v2.2.0 (https://github.com/symbolica-dev/symbolica?branch=dev#0441bd7a)
  36. 21.20 s gammaloop-workspace-doctest> Compiling maplit v1.0.2
  37. 21.22 s gammaloop-workspace-doctest> Compiling gammaloop-tracing-filter-macros v0.1.0 (/build/source/crates/gammaloop-tracing-filter-macros)
  38. 21.22 s gammaloop-workspace-doctest> Compiling vakint v0.1.2 (/build/source/crates/vakint)
  39. 21.24 s gammaloop-workspace-doctest> Compiling gammalooprs v0.3.4 (/build/source/crates/gammalooprs)
  40. 21.25 s gammaloop-workspace-doctest> Compiling alphal00p-docs-macros v0.1.0 (/build/source/crates/alphal00p-docs-macros)
  41. 21.25 s gammaloop-workspace-doctest> Compiling alphal00p-docs-schema v0.1.0 (/build/source/crates/alphal00p-docs-schema)
  42. 21.25 s gammaloop-workspace-doctest> Compiling rustc_version v0.4.1
  43. 21.26 s gammaloop-workspace-doctest> Compiling bincode v1.3.3
  44. 21.26 s gammaloop-workspace-doctest> Compiling gungraun-runner v0.18.2
  45. 21.27 s gammaloop-workspace-doctest> Compiling iai-callgrind-runner v0.14.2
  46. 21.27 s gammaloop-workspace-doctest> Compiling target-triple v1.0.1
  47. 21.27 s gammaloop-workspace-doctest> Compiling clinnet v0.1.8 (/build/source/crates/clinnet)
  48. 21.28 s gammaloop-workspace-doctest> Compiling gammaloop-integration-tests v0.1.0 (/build/source/tests)
  49. 21.46 s gammaloop-workspace-doctest> Compiling test-log-core v0.2.20
  50. 21.47 s gammaloop-workspace-doctest> Compiling wait-timeout v0.2.1
  51. 21.51 s gammaloop-workspace-doctest> Compiling quick-error v1.2.3
  52. 21.60 s gammaloop-workspace-doctest> Compiling iai-callgrind v0.14.2
  53. 21.61 s gammaloop-workspace-doctest> Compiling bit-vec v0.8.0
  54. 21.70 s gammaloop-workspace-doctest> Compiling rusty-fork v0.3.1
  55. 21.85 s gammaloop-workspace-doctest> Compiling bit-set v0.8.0
  56. 21.90 s gammaloop-workspace-doctest> Compiling iai-callgrind-macros v0.5.1
  57. 21.97 s gammaloop-workspace-doctest> Compiling rand_xorshift v0.4.0
  58. 21.98 s gammaloop-workspace-doctest> Compiling console v0.15.11
  59. 21.99 s gammaloop-workspace-doctest> Compiling termcolor v1.4.1
  60. 22.06 s gammaloop-workspace-doctest> Compiling unarray v0.1.4
  61. 22.13 s gammaloop-workspace-doctest> Compiling base64 v0.21.7
  62. 22.23 s gammaloop-workspace-doctest> Compiling gungraun-macros v0.8.0
  63. 22.23 s gammaloop-workspace-doctest> Compiling glob v0.3.4
  64. 22.38 s gammaloop-workspace-doctest> Compiling similar-asserts v1.7.0
  65. 22.68 s gammaloop-workspace-doctest> Compiling alphal00p-docs-catalogs v0.1.0 (/build/source/crates/alphal00p-docs-catalogs)
  66. 22.68 s gammaloop-workspace-doctest> Compiling trybuild v1.0.120
  67. 22.74 s gammaloop-workspace-doctest> Compiling pyo3-build-config v0.28.3
  68. 22.75 s gammaloop-workspace-doctest> Compiling ron v0.8.1
  69. 22.77 s gammaloop-workspace-doctest> Compiling proptest v1.11.0
  70. 22.97 s gammaloop-workspace-doctest> Compiling alphal00p-docs-builder v0.1.0 (/build/source/crates/alphal00p-docs-builder)
  71. 23.28 s gammaloop-workspace-doctest> Compiling kurvst v0.1.0 (/build/source/crates/kurvst)
  72. 23.44 s gammaloop-workspace-doctest> Compiling test-log-macros v0.2.20
  73. 25.92 s gammaloop-workspace-doctest> Compiling test-log v0.2.20
  74. 26.23 s gammaloop-workspace-doctest> Compiling alphal00p-docs-examples v0.1.0 (/build/source/crates/alphal00p-docs-examples)
  75. 29.00 s gammaloop-workspace-doctest> Compiling pyo3-macros-backend v0.28.3
  76. 29.07 s gammaloop-workspace-doctest> Compiling pyo3-ffi v0.28.3
  77. 29.08 s gammaloop-workspace-doctest> Compiling pyo3 v0.28.3
  78. 29.22 s gammaloop-workspace-doctest> Compiling numpy v0.28.0
  79. 29.51 s gammaloop-workspace-doctest> Compiling gammaloop-api v0.1.0 (/build/source/crates/gammaloop-api)
  80. 29.60 s gammaloop-workspace-doctest> Compiling gungraun v0.18.2
  81. 39.54 s gammaloop-workspace-doctest> Compiling pyo3-macros v0.28.3
  82. 46.40 s gammaloop-workspace-doctest> Compiling pyo3-stub-gen v0.17.2
  83. 47.17 s gammaloop-workspace-doctest> Compiling numerica v2.2.0 (https://github.com/symbolica-dev/symbolica?branch=dev#0441bd7a)
  84. 49.70 s gammaloop-workspace-doctest> Compiling graphica v2.1.0 (https://github.com/symbolica-dev/symbolica?branch=dev#0441bd7a)
  85. 52.70 s gammaloop-workspace-doctest> Compiling symbolica-utils v0.1.0 (/build/source/crates/symbolica-utils)
  86. 261.40 s gammaloop-workspace-doctest> Compiling gammaloop-workspace-hack v0.1.0 (/build/source/crates/gammaloop-workspace-hack)
  87. 261.42 s gammaloop-workspace-doctest> Compiling spenso-macros v0.3.2 (/build/source/crates/spenso-macros)
  88. 261.58 s gammaloop-workspace-doctest> Compiling linnet v0.17.0 (/build/source/crates/linnet)
  89. 265.31 s gammaloop-workspace-doctest> Compiling spenso v0.6.0 (/build/source/crates/spenso)
  90. 273.19 s gammaloop-workspace-doctest> Compiling idenso v0.3.0 (/build/source/crates/idenso)
  91. 273.21 s gammaloop-workspace-doctest> Compiling gammaloop-tracing-filter v0.1.0 (/build/source/crates/gammaloop-tracing-filter)
  92. 277.59 s gammaloop-workspace-doctest> Compiling spenso-hep-lib v0.1.7 (/build/source/crates/spenso-hep-lib)
  93. 277.83 s gammaloop-workspace-doctest> Compiling spynso3 v0.1.2 (/build/source/crates/spynso3)
  94. 317.73 s gammaloop-workspace-doctest> Compiling linnest v0.1.0 (/build/source/crates/linnest)
  95. 317.74 s gammaloop-workspace-doctest> Compiling linnet-py v0.1.0 (/build/source/crates/linnet-py)
  96. 466.52 s gammaloop-workspace-doctest> Finished `ci-optim` profile [optimized] target(s) in 7m 25s
  97. 466.70 s gammaloop-workspace-doctest> warning: the following packages contain code that will be rejected by a future version of Rust: proc-macro-error2 v2.0.1
  98. 466.70 s gammaloop-workspace-doctest> note: to see what the problems were, use the option `--future-incompat-report`, or run `cargo report future-incompatibilities --id 1`
  99. 466.75 s gammaloop-workspace-doctest> Doc-tests alphal00p_docs_builder
  100. 467.06 s gammaloop-workspace-doctest>
  101. 467.06 s gammaloop-workspace-doctest> running 0 tests
  102. 467.06 s gammaloop-workspace-doctest>
  103. 467.06 s gammaloop-workspace-doctest> test result: ok. 0 passed; 0 failed; 0 ignored; 0 measured; 0 filtered out; finished in 0.00s
  104. 467.06 s gammaloop-workspace-doctest>
  105. 467.07 s gammaloop-workspace-doctest> Doc-tests alphal00p_docs_catalogs
  106. 469.28 s gammaloop-workspace-doctest>
  107. 469.28 s gammaloop-workspace-doctest> running 0 tests
  108. 469.28 s gammaloop-workspace-doctest>
  109. 469.28 s gammaloop-workspace-doctest> test result: ok. 0 passed; 0 failed; 0 ignored; 0 measured; 0 filtered out; finished in 0.00s
  110. 469.28 s gammaloop-workspace-doctest>
  111. 469.28 s gammaloop-workspace-doctest> Doc-tests alphal00p_docs_examples
  112. 469.30 s gammaloop-workspace-doctest>
  113. 469.30 s gammaloop-workspace-doctest> running 0 tests
  114. 469.30 s gammaloop-workspace-doctest>
  115. 469.30 s gammaloop-workspace-doctest> test result: ok. 0 passed; 0 failed; 0 ignored; 0 measured; 0 filtered out; finished in 0.00s
  116. 469.30 s gammaloop-workspace-doctest>
  117. 469.31 s gammaloop-workspace-doctest> Doc-tests alphal00p_docs
  118. 469.39 s gammaloop-workspace-doctest>
  119. 469.39 s gammaloop-workspace-doctest> running 0 tests
  120. 469.39 s gammaloop-workspace-doctest>
  121. 469.39 s gammaloop-workspace-doctest> test result: ok. 0 passed; 0 failed; 0 ignored; 0 measured; 0 filtered out; finished in 0.00s
  122. 469.39 s gammaloop-workspace-doctest>
  123. 469.40 s gammaloop-workspace-doctest> Doc-tests alphal00p_docs_schema
  124. 469.51 s gammaloop-workspace-doctest>
  125. 469.51 s gammaloop-workspace-doctest> running 0 tests
  126. 469.51 s gammaloop-workspace-doctest>
  127. 469.51 s gammaloop-workspace-doctest> test result: ok. 0 passed; 0 failed; 0 ignored; 0 measured; 0 filtered out; finished in 0.00s
  128. 469.51 s gammaloop-workspace-doctest>
  129. 469.51 s gammaloop-workspace-doctest> Doc-tests clinnet
  130. 469.60 s gammaloop-workspace-doctest>
  131. 469.60 s gammaloop-workspace-doctest> running 0 tests
  132. 469.60 s gammaloop-workspace-doctest>
  133. 469.60 s gammaloop-workspace-doctest> test result: ok. 0 passed; 0 failed; 0 ignored; 0 measured; 0 filtered out; finished in 0.00s
  134. 469.60 s gammaloop-workspace-doctest>
  135. 469.60 s gammaloop-workspace-doctest> Doc-tests gammaloop_api
  136. 470.88 s gammaloop-workspace-doctest>
  137. 470.88 s gammaloop-workspace-doctest> running 13 tests
  138. 470.91 s gammaloop-workspace-doctest> test crates/gammaloop-api/src/python.rs - python::GammaLoopAPI::evaluate_samples (line 3040) ... FAILED
  139. 470.92 s gammaloop-workspace-doctest> test crates/gammaloop-api/src/python.rs - python::GammaLoopAPI::get_active_command_blocks (line 3652) ... FAILED
  140. 470.92 s gammaloop-workspace-doctest> test crates/gammaloop-api/src/python.rs - python::GammaLoopAPI::get_integrand_settings (line 3539) ... FAILED
  141. 470.92 s gammaloop-workspace-doctest> test crates/gammaloop-api/src/python.rs - python::GammaLoopAPI::get_integrand_info (line 3496) ... FAILED
  142. 470.93 s gammaloop-workspace-doctest> test crates/gammaloop-api/src/python.rs - python::GammaLoopAPI::get_default_runtime_settings (line 3688) ... FAILED
  143. 470.93 s gammaloop-workspace-doctest> test crates/gammaloop-api/src/python.rs - python::GammaLoopAPI::evaluate_sample (line 2926) ... FAILED
  144. 471.06 s gammaloop-workspace-doctest> test crates/gammaloop-api/src/python.rs - python::GammaLoopAPI::get_global_settings (line 3631) ... FAILED
  145. 471.09 s gammaloop-workspace-doctest> test crates/gammaloop-api/src/python.rs - python::GammaLoopAPI::run_command (line 3793) ... FAILED
  146. 471.09 s gammaloop-workspace-doctest> test crates/gammaloop-api/src/python.rs - python::evaluate_graph_overall_factor (line 95) ... FAILED
  147. 471.09 s gammaloop-workspace-doctest> test crates/gammaloop-api/src/python.rs - python::atom_to_canonical_string (line 128) ... FAILED
  148. 471.13 s gammaloop-workspace-doctest> test crates/gammaloop-api/src/python.rs - python::atom_to_dots (line 157) ... FAILED
  149. 471.13 s gammaloop-workspace-doctest> test crates/gammaloop-api/src/python.rs - python::GammaLoopAPI::get_run_history (line 3603) ... FAILED
  150. 471.14 s gammaloop-workspace-doctest> test crates/gammaloop-api/src/python.rs - python::GammaLoopAPI::new_python (line 2804) ... FAILED
  151. 471.14 s gammaloop-workspace-doctest>
  152. 471.14 s gammaloop-workspace-doctest> failures:
  153. 471.14 s gammaloop-workspace-doctest>
  154. 471.14 s gammaloop-workspace-doctest> ---- crates/gammaloop-api/src/python.rs - python::GammaLoopAPI::evaluate_samples (line 3040) stdout ----
  155. 471.14 s gammaloop-workspace-doctest> error: expected one of `!` or `::`, found `=`
  156. 471.14 s gammaloop-workspace-doctest> --> crates/gammaloop-api/src/python.rs:3041:8
  157. 471.14 s gammaloop-workspace-doctest> |
  158. 471.14 s gammaloop-workspace-doctest> 3041 | points = numpy.asarray(points, dtype=numpy.float64)
  159. 471.14 s gammaloop-workspace-doctest> | ^ expected one of `!` or `::`
  160. 471.14 s gammaloop-workspace-doctest>
  161. 471.14 s gammaloop-workspace-doctest> error: aborting due to 1 previous error
  162. 471.14 s gammaloop-workspace-doctest>
  163. 471.14 s gammaloop-workspace-doctest> Couldn't compile the test.
  164. 471.14 s gammaloop-workspace-doctest> ---- crates/gammaloop-api/src/python.rs - python::GammaLoopAPI::get_active_command_blocks (line 3652) stdout ----
  165. 471.14 s gammaloop-workspace-doctest> error: expected item, found keyword `for`
  166. 471.14 s gammaloop-workspace-doctest> --> crates/gammaloop-api/src/python.rs:3653:1
  167. 471.14 s gammaloop-workspace-doctest> |
  168. 471.14 s gammaloop-workspace-doctest> 3653 | for name, commands in api.get_active_command_blocks().items():
  169. 471.14 s gammaloop-workspace-doctest> | ^^^ expected item
  170. 471.14 s gammaloop-workspace-doctest> |
  171. 471.14 s gammaloop-workspace-doctest> = note: for a full list of items that can appear in modules, see <https://doc.rust-lang.org/reference/items.html>
  172. 471.14 s gammaloop-workspace-doctest>
  173. 471.14 s gammaloop-workspace-doctest> error: aborting due to 1 previous error
  174. 471.14 s gammaloop-workspace-doctest>
  175. 471.14 s gammaloop-workspace-doctest> Couldn't compile the test.
  176. 471.14 s gammaloop-workspace-doctest> ---- crates/gammaloop-api/src/python.rs - python::GammaLoopAPI::get_integrand_settings (line 3539) stdout ----
  177. 471.14 s gammaloop-workspace-doctest> error: expected one of `!` or `::`, found `=`
  178. 471.14 s gammaloop-workspace-doctest> --> crates/gammaloop-api/src/python.rs:3540:10
  179. 471.14 s gammaloop-workspace-doctest> |
  180. 471.14 s gammaloop-workspace-doctest> 3540 | settings = api.get_integrand_settings(process_id=0)
  181. 471.14 s gammaloop-workspace-doctest> | ^ expected one of `!` or `::`
  182. 471.14 s gammaloop-workspace-doctest>
  183. 471.14 s gammaloop-workspace-doctest> error: aborting due to 1 previous error
  184. 471.14 s gammaloop-workspace-doctest>
  185. 471.14 s gammaloop-workspace-doctest> Couldn't compile the test.
  186. 471.14 s gammaloop-workspace-doctest> ---- crates/gammaloop-api/src/python.rs - python::GammaLoopAPI::get_integrand_info (line 3496) stdout ----
  187. 471.14 s gammaloop-workspace-doctest> error: expected one of `!` or `::`, found `=`
  188. 471.14 s gammaloop-workspace-doctest> --> crates/gammaloop-api/src/python.rs:3497:6
  189. 471.14 s gammaloop-workspace-doctest> |
  190. 471.14 s gammaloop-workspace-doctest> 3497 | info = api.get_integrand_info(process_id=0)
  191. 471.14 s gammaloop-workspace-doctest> | ^ expected one of `!` or `::`
  192. 471.14 s gammaloop-workspace-doctest>
  193. 471.14 s gammaloop-workspace-doctest> error: aborting due to 1 previous error
  194. 471.14 s gammaloop-workspace-doctest>
  195. 471.14 s gammaloop-workspace-doctest> Couldn't compile the test.
  196. 471.14 s gammaloop-workspace-doctest> ---- crates/gammaloop-api/src/python.rs - python::GammaLoopAPI::get_default_runtime_settings (line 3688) stdout ----
  197. 471.14 s gammaloop-workspace-doctest> error: expected one of `!` or `::`, found `=`
  198. 471.14 s gammaloop-workspace-doctest> --> crates/gammaloop-api/src/python.rs:3689:9
  199. 471.14 s gammaloop-workspace-doctest> |
  200. 471.14 s gammaloop-workspace-doctest> 3689 | runtime = api.get_default_runtime_settings()
  201. 471.14 s gammaloop-workspace-doctest> | ^ expected one of `!` or `::`
  202. 471.14 s gammaloop-workspace-doctest>
  203. 471.14 s gammaloop-workspace-doctest> error: aborting due to 1 previous error
  204. 471.14 s gammaloop-workspace-doctest>
  205. 471.14 s gammaloop-workspace-doctest> Couldn't compile the test.
  206. 471.14 s gammaloop-workspace-doctest> ---- crates/gammaloop-api/src/python.rs - python::GammaLoopAPI::evaluate_sample (line 2926) stdout ----
  207. 471.14 s gammaloop-workspace-doctest> error: expected one of `!` or `::`, found `=`
  208. 471.14 s gammaloop-workspace-doctest> --> crates/gammaloop-api/src/python.rs:2927:8
  209. 471.14 s gammaloop-workspace-doctest> |
  210. 471.14 s gammaloop-workspace-doctest> 2927 | result = api.evaluate_sample(point, process_id=0, minimal_output=True)
  211. 471.14 s gammaloop-workspace-doctest> | ^ expected one of `!` or `::`
  212. 471.14 s gammaloop-workspace-doctest>
  213. 471.14 s gammaloop-workspace-doctest> error: aborting due to 1 previous error
  214. 471.14 s gammaloop-workspace-doctest>
  215. 471.14 s gammaloop-workspace-doctest> Couldn't compile the test.
  216. 471.14 s gammaloop-workspace-doctest> ---- crates/gammaloop-api/src/python.rs - python::GammaLoopAPI::get_global_settings (line 3631) stdout ----
  217. 471.14 s gammaloop-workspace-doctest> error[E0425]: cannot find value `settings_toml` in this scope
  218. 471.14 s gammaloop-workspace-doctest> --> crates/gammaloop-api/src/python.rs:3632:1
  219. 471.14 s gammaloop-workspace-doctest> |
  220. 471.14 s gammaloop-workspace-doctest> 3632 | settings_toml = api.get_global_settings()
  221. 471.14 s gammaloop-workspace-doctest> | ^^^^^^^^^^^^^
  222. 471.14 s gammaloop-workspace-doctest> |
  223. 471.14 s gammaloop-workspace-doctest> help: you might have meant to introduce a new binding
  224. 471.14 s gammaloop-workspace-doctest> |
  225. 471.14 s gammaloop-workspace-doctest> 3632 | let settings_toml = api.get_global_settings()
  226. 471.14 s gammaloop-workspace-doctest> | +++
  227. 471.14 s gammaloop-workspace-doctest>
  228. 471.14 s gammaloop-workspace-doctest> error[E0425]: cannot find value `api` in this scope
  229. 471.14 s gammaloop-workspace-doctest> --> crates/gammaloop-api/src/python.rs:3632:17
  230. 471.14 s gammaloop-workspace-doctest> |
  231. 471.14 s gammaloop-workspace-doctest> 3632 | settings_toml = api.get_global_settings()
  232. 471.14 s gammaloop-workspace-doctest> | ^^^ not found in this scope
  233. 471.14 s gammaloop-workspace-doctest>
  234. 471.14 s gammaloop-workspace-doctest> error: aborting due to 2 previous errors
  235. 471.14 s gammaloop-workspace-doctest>
  236. 471.14 s gammaloop-workspace-doctest> For more information about this error, try `rustc --explain E0425`.
  237. 471.14 s gammaloop-workspace-doctest> Couldn't compile the test.
  238. 471.14 s gammaloop-workspace-doctest> ---- crates/gammaloop-api/src/python.rs - python::GammaLoopAPI::run_command (line 3793) stdout ----
  239. 471.14 s gammaloop-workspace-doctest> error[E0425]: cannot find value `api` in this scope
  240. 471.14 s gammaloop-workspace-doctest> --> crates/gammaloop-api/src/python.rs:3794:1
  241. 471.14 s gammaloop-workspace-doctest> |
  242. 471.14 s gammaloop-workspace-doctest> 3794 | api.run("display processes")
  243. 471.14 s gammaloop-workspace-doctest> | ^^^ not found in this scope
  244. 471.14 s gammaloop-workspace-doctest>
  245. 471.14 s gammaloop-workspace-doctest> error: aborting due to 1 previous error
  246. 471.14 s gammaloop-workspace-doctest>
  247. 471.14 s gammaloop-workspace-doctest> For more information about this error, try `rustc --explain E0425`.
  248. 471.14 s gammaloop-workspace-doctest> Couldn't compile the test.
  249. 471.14 s gammaloop-workspace-doctest> ---- crates/gammaloop-api/src/python.rs - python::evaluate_graph_overall_factor (line 95) stdout ----
  250. 471.14 s gammaloop-workspace-doctest> error[E0425]: cannot find function `evaluate_graph_overall_factor` in this scope
  251. 471.14 s gammaloop-workspace-doctest> --> crates/gammaloop-api/src/python.rs:96:1
  252. 471.14 s gammaloop-workspace-doctest> |
  253. 471.14 s gammaloop-workspace-doctest> 96 | evaluate_graph_overall_factor(
  254. 471.14 s gammaloop-workspace-doctest> | ^^^^^^^^^^^^^^^^^^^^^^^^^^^^^ not found in this scope
  255. 471.14 s gammaloop-workspace-doctest>
  256. 471.14 s gammaloop-workspace-doctest> error: aborting due to 1 previous error
  257. 471.14 s gammaloop-workspace-doctest>
  258. 471.14 s gammaloop-workspace-doctest> For more information about this error, try `rustc --explain E0425`.
  259. 471.14 s gammaloop-workspace-doctest> Couldn't compile the test.
  260. 471.14 s gammaloop-workspace-doctest> ---- crates/gammaloop-api/src/python.rs - python::atom_to_canonical_string (line 128) stdout ----
  261. 471.14 s gammaloop-workspace-doctest> error[E0425]: cannot find function `atom_to_canonical_string` in this scope
  262. 471.14 s gammaloop-workspace-doctest> --> crates/gammaloop-api/src/python.rs:129:1
  263. 471.14 s gammaloop-workspace-doctest> |
  264. 471.14 s gammaloop-workspace-doctest> 129 | atom_to_canonical_string("x + x")
  265. 471.14 s gammaloop-workspace-doctest> | ^^^^^^^^^^^^^^^^^^^^^^^^ not found in this scope
  266. 471.14 s gammaloop-workspace-doctest>
  267. 471.14 s gammaloop-workspace-doctest> error: aborting due to 1 previous error
  268. 471.14 s gammaloop-workspace-doctest>
  269. 471.14 s gammaloop-workspace-doctest> For more information about this error, try `rustc --explain E0425`.
  270. 471.14 s gammaloop-workspace-doctest> Couldn't compile the test.
  271. 471.14 s gammaloop-workspace-doctest> ---- crates/gammaloop-api/src/python.rs - python::atom_to_dots (line 157) stdout ----
  272. 471.14 s gammaloop-workspace-doctest> error[E0425]: cannot find function `to_dots` in this scope
  273. 471.14 s gammaloop-workspace-doctest> --> crates/gammaloop-api/src/python.rs:158:1
  274. 471.14 s gammaloop-workspace-doctest> |
  275. 471.14 s gammaloop-workspace-doctest> 158 | to_dots("p(mu) * q(mu)")
  276. 471.14 s gammaloop-workspace-doctest> | ^^^^^^^ not found in this scope
  277. 471.14 s gammaloop-workspace-doctest>
  278. 471.14 s gammaloop-workspace-doctest> error: aborting due to 1 previous error
  279. 471.14 s gammaloop-workspace-doctest>
  280. 471.14 s gammaloop-workspace-doctest> For more information about this error, try `rustc --explain E0425`.
  281. 471.14 s gammaloop-workspace-doctest> Couldn't compile the test.
  282. 471.14 s gammaloop-workspace-doctest> ---- crates/gammaloop-api/src/python.rs - python::GammaLoopAPI::get_run_history (line 3603) stdout ----
  283. 471.14 s gammaloop-workspace-doctest> error[E0425]: cannot find value `run_card_toml` in this scope
  284. 471.14 s gammaloop-workspace-doctest> --> crates/gammaloop-api/src/python.rs:3604:1
  285. 471.14 s gammaloop-workspace-doctest> |
  286. 471.14 s gammaloop-workspace-doctest> 3604 | run_card_toml = api.get_run_history()
  287. 471.14 s gammaloop-workspace-doctest> | ^^^^^^^^^^^^^
  288. 471.14 s gammaloop-workspace-doctest> |
  289. 471.14 s gammaloop-workspace-doctest> help: you might have meant to introduce a new binding
  290. 471.14 s gammaloop-workspace-doctest> |
  291. 471.14 s gammaloop-workspace-doctest> 3604 | let run_card_toml = api.get_run_history()
  292. 471.14 s gammaloop-workspace-doctest> | +++
  293. 471.14 s gammaloop-workspace-doctest>
  294. 471.14 s gammaloop-workspace-doctest> error[E0425]: cannot find value `api` in this scope
  295. 471.14 s gammaloop-workspace-doctest> --> crates/gammaloop-api/src/python.rs:3604:17
  296. 471.14 s gammaloop-workspace-doctest> |
  297. 471.14 s gammaloop-workspace-doctest> 3604 | run_card_toml = api.get_run_history()
  298. 471.14 s gammaloop-workspace-doctest> | ^^^ not found in this scope
  299. 471.14 s gammaloop-workspace-doctest>
  300. 471.14 s gammaloop-workspace-doctest> error: aborting due to 2 previous errors
  301. 471.14 s gammaloop-workspace-doctest>
  302. 471.14 s gammaloop-workspace-doctest> For more information about this error, try `rustc --explain E0425`.
  303. 471.14 s gammaloop-workspace-doctest> Couldn't compile the test.
  304. 471.14 s gammaloop-workspace-doctest> ---- crates/gammaloop-api/src/python.rs - python::GammaLoopAPI::new_python (line 2804) stdout ----
  305. 471.14 s gammaloop-workspace-doctest> error[E0425]: cannot find value `api` in this scope
  306. 471.14 s gammaloop-workspace-doctest> --> crates/gammaloop-api/src/python.rs:2805:1
  307. 471.14 s gammaloop-workspace-doctest> |
  308. 471.14 s gammaloop-workspace-doctest> 2805 | api = GammaLoopAPI(state_folder="./state", read_only_state=True)
  309. 471.14 s gammaloop-workspace-doctest> | ^^^
  310. 471.14 s gammaloop-workspace-doctest> |
  311. 471.14 s gammaloop-workspace-doctest> help: you might have meant to introduce a new binding
  312. 471.14 s gammaloop-workspace-doctest> |
  313. 471.14 s gammaloop-workspace-doctest> 2805 | let api = GammaLoopAPI(state_folder="./state", read_only_state=True)
  314. 471.14 s gammaloop-workspace-doctest> | +++
  315. 471.14 s gammaloop-workspace-doctest>
  316. 471.14 s gammaloop-workspace-doctest> error[E0425]: cannot find value `state_folder` in this scope
  317. 471.14 s gammaloop-workspace-doctest> --> crates/gammaloop-api/src/python.rs:2805:20
  318. 471.14 s gammaloop-workspace-doctest> |
  319. 471.14 s gammaloop-workspace-doctest> 2805 | api = GammaLoopAPI(state_folder="./state", read_only_state=True)
  320. 471.14 s gammaloop-workspace-doctest> | ^^^^^^^^^^^^ not found in this scope
  321. 471.14 s gammaloop-workspace-doctest>
  322. 471.14 s gammaloop-workspace-doctest> error[E0425]: cannot find value `read_only_state` in this scope
  323. 471.14 s gammaloop-workspace-doctest> --> crates/gammaloop-api/src/python.rs:2805:44
  324. 471.14 s gammaloop-workspace-doctest> |
  325. 471.14 s gammaloop-workspace-doctest> 2805 | api = GammaLoopAPI(state_folder="./state", read_only_state=True)
  326. 471.14 s gammaloop-workspace-doctest> | ^^^^^^^^^^^^^^^ not found in this scope
  327. 471.14 s gammaloop-workspace-doctest>
  328. 471.14 s gammaloop-workspace-doctest> error[E0425]: cannot find value `True` in this scope
  329. 471.14 s gammaloop-workspace-doctest> --> crates/gammaloop-api/src/python.rs:2805:60
  330. 471.14 s gammaloop-workspace-doctest> |
  331. 471.14 s gammaloop-workspace-doctest> 2805 | api = GammaLoopAPI(state_folder="./state", read_only_state=True)
  332. 471.14 s gammaloop-workspace-doctest> | ^^^^ not found in this scope
  333. 471.14 s gammaloop-workspace-doctest> |
  334. 471.14 s gammaloop-workspace-doctest> help: you may want to use a bool value instead
  335. 471.14 s gammaloop-workspace-doctest> |
  336. 471.14 s gammaloop-workspace-doctest> 2805 - api = GammaLoopAPI(state_folder="./state", read_only_state=True)
  337. 471.14 s gammaloop-workspace-doctest> 2805 + api = GammaLoopAPI(state_folder="./state", read_only_state=true)
  338. 471.14 s gammaloop-workspace-doctest> |
  339. 471.14 s gammaloop-workspace-doctest>
  340. 471.14 s gammaloop-workspace-doctest> error[E0425]: cannot find function, tuple struct or tuple variant `GammaLoopAPI` in this scope
  341. 471.14 s gammaloop-workspace-doctest> --> crates/gammaloop-api/src/python.rs:2805:7
  342. 471.14 s gammaloop-workspace-doctest> |
  343. 471.14 s gammaloop-workspace-doctest> 2805 | api = GammaLoopAPI(state_folder="./state", read_only_state=True)
  344. 471.14 s gammaloop-workspace-doctest> | ^^^^^^^^^^^^ not found in this scope
  345. 471.14 s gammaloop-workspace-doctest>
  346. 471.14 s gammaloop-workspace-doctest> error: aborting due to 5 previous errors
  347. 471.14 s gammaloop-workspace-doctest>
  348. 471.14 s gammaloop-workspace-doctest> For more information about this error, try `rustc --explain E0425`.
  349. 471.14 s gammaloop-workspace-doctest> Couldn't compile the test.
  350. 471.14 s gammaloop-workspace-doctest>
  351. 471.14 s gammaloop-workspace-doctest> failures:
  352. 471.14 s gammaloop-workspace-doctest> crates/gammaloop-api/src/python.rs - python::GammaLoopAPI::evaluate_sample (line 2926)
  353. 471.14 s gammaloop-workspace-doctest> crates/gammaloop-api/src/python.rs - python::GammaLoopAPI::evaluate_samples (line 3040)
  354. 471.14 s gammaloop-workspace-doctest> crates/gammaloop-api/src/python.rs - python::GammaLoopAPI::get_active_command_blocks (line 3652)
  355. 471.14 s gammaloop-workspace-doctest> crates/gammaloop-api/src/python.rs - python::GammaLoopAPI::get_default_runtime_settings (line 3688)
  356. 471.14 s gammaloop-workspace-doctest> crates/gammaloop-api/src/python.rs - python::GammaLoopAPI::get_global_settings (line 3631)
  357. 471.14 s gammaloop-workspace-doctest> crates/gammaloop-api/src/python.rs - python::GammaLoopAPI::get_integrand_info (line 3496)
  358. 471.14 s gammaloop-workspace-doctest> crates/gammaloop-api/src/python.rs - python::GammaLoopAPI::get_integrand_settings (line 3539)
  359. 471.14 s gammaloop-workspace-doctest> crates/gammaloop-api/src/python.rs - python::GammaLoopAPI::get_run_history (line 3603)
  360. 471.14 s gammaloop-workspace-doctest> crates/gammaloop-api/src/python.rs - python::GammaLoopAPI::new_python (line 2804)
  361. 471.14 s gammaloop-workspace-doctest> crates/gammaloop-api/src/python.rs - python::GammaLoopAPI::run_command (line 3793)
  362. 471.14 s gammaloop-workspace-doctest> crates/gammaloop-api/src/python.rs - python::atom_to_canonical_string (line 128)
  363. 471.14 s gammaloop-workspace-doctest> crates/gammaloop-api/src/python.rs - python::atom_to_dots (line 157)
  364. 471.14 s gammaloop-workspace-doctest> crates/gammaloop-api/src/python.rs - python::evaluate_graph_overall_factor (line 95)
  365. 471.14 s gammaloop-workspace-doctest>
  366. 471.14 s gammaloop-workspace-doctest> test result: FAILED. 0 passed; 13 failed; 0 ignored; 0 measured; 0 filtered out; finished in 0.25s
  367. 471.14 s gammaloop-workspace-doctest>
  368. 471.15 s gammaloop-workspace-doctest> error: doctest failed, to rerun pass `-p gammaloop-api --doc`
  369. 472.71 s error: Cannot build '/nix/store/d7n0kzr0ab2qmzp3m3y3jhx03bbngjym-gammaloop-workspace-doctest-0.1.0.drv'.
  370. 472.75 s Reason: builder failed with exit code 101.
  371. 472.75 s Output paths:
  372. 472.75 s /nix/store/m1rbsc5idl2jxvknq7bvqysz3ysaha7l-gammaloop-workspace-doctest-0.1.0
  373. 472.75 s Last 349 log lines:
  374. 472.75 s > Running phase: unpackPhase
  375. 472.75 s > unpacking source archive /nix/store/n62xwv096bc248rr6y7qpggfdbwshkw9-source
  376. 472.75 s > source root is source
  377. 472.75 s > Running phase: patchPhase
  378. 472.75 s > Executing configureCargoCommonVars
  379. 472.75 s > decompressing cargo artifacts from /nix/store/kbgwngi7xvi54jsr0kp8rhj1b9mfja7d-gammaloop-workspace-deps-deps-0.1.0/target.tar.zst to target
  380. 472.75 s > Running phase: updateAutotoolsGnuConfigScriptsPhase
  381. 472.75 s > Running phase: configurePhase
  382. 472.75 s > will append /build/source/.cargo-home/config.toml with contents of /nix/store/xdy1vvhll2bijdplvl9fcc2b9plkxhaa-vendor-cargo-deps/config.toml
  383. 472.75 s > default configurePhase, nothing to do
  384. 472.75 s > Running phase: buildPhase
  385. 472.75 s > +++ command cargo --version
  386. 472.75 s > cargo 1.97.0 (c980f4866 2026-06-30)
  387. 472.75 s > +++ command cargo test --profile ci-optim --doc --locked --workspace --features gammaloop-api/cli,gammaloop-tracing-filter/clap,gammaloop-tracing-filter/symbolica,idenso/bincode,idenso/reference-cases,linnet/bincode,linnet/drawing,linnet/nodestore-vec,linnet/rkyv,linnet/serde,linnet/symbolica,spenso-macros/shadowing,spenso/shadowing,symbolica/tracing_max_level_info
  388. 472.75 s > Compiling target-lexicon v0.13.5
  389. 472.75 s > Compiling symbolica v2.2.0 (https://github.com/symbolica-dev/symbolica?branch=dev#0441bd7a)
  390. 472.75 s > Compiling maplit v1.0.2
  391. 472.75 s > Compiling gammaloop-tracing-filter-macros v0.1.0 (/build/source/crates/gammaloop-tracing-filter-macros)
  392. 472.75 s > Compiling vakint v0.1.2 (/build/source/crates/vakint)
  393. 472.75 s > Compiling gammalooprs v0.3.4 (/build/source/crates/gammalooprs)
  394. 472.75 s > Compiling alphal00p-docs-macros v0.1.0 (/build/source/crates/alphal00p-docs-macros)
  395. 472.75 s > Compiling alphal00p-docs-schema v0.1.0 (/build/source/crates/alphal00p-docs-schema)
  396. 472.75 s > Compiling rustc_version v0.4.1
  397. 472.75 s > Compiling bincode v1.3.3
  398. 472.75 s > Compiling gungraun-runner v0.18.2
  399. 472.75 s > Compiling iai-callgrind-runner v0.14.2
  400. 472.75 s > Compiling target-triple v1.0.1
  401. 472.75 s > Compiling clinnet v0.1.8 (/build/source/crates/clinnet)
  402. 472.75 s > Compiling gammaloop-integration-tests v0.1.0 (/build/source/tests)
  403. 472.75 s > Compiling test-log-core v0.2.20
  404. 472.75 s > Compiling wait-timeout v0.2.1
  405. 472.75 s > Compiling quick-error v1.2.3
  406. 472.75 s > Compiling iai-callgrind v0.14.2
  407. 472.75 s > Compiling bit-vec v0.8.0
  408. 472.75 s > Compiling rusty-fork v0.3.1
  409. 472.75 s > Compiling bit-set v0.8.0
  410. 472.75 s > Compiling iai-callgrind-macros v0.5.1
  411. 472.75 s > Compiling rand_xorshift v0.4.0
  412. 472.75 s > Compiling console v0.15.11
  413. 472.75 s > Compiling termcolor v1.4.1
  414. 472.75 s > Compiling unarray v0.1.4
  415. 472.75 s > Compiling base64 v0.21.7
  416. 472.75 s > Compiling gungraun-macros v0.8.0
  417. 472.75 s > Compiling glob v0.3.4
  418. 472.75 s > Compiling similar-asserts v1.7.0
  419. 472.75 s > Compiling alphal00p-docs-catalogs v0.1.0 (/build/source/crates/alphal00p-docs-catalogs)
  420. 472.75 s > Compiling trybuild v1.0.120
  421. 472.75 s > Compiling pyo3-build-config v0.28.3
  422. 472.75 s > Compiling ron v0.8.1
  423. 472.75 s > Compiling proptest v1.11.0
  424. 472.75 s > Compiling alphal00p-docs-builder v0.1.0 (/build/source/crates/alphal00p-docs-builder)
  425. 472.75 s > Compiling kurvst v0.1.0 (/build/source/crates/kurvst)
  426. 472.75 s > Compiling test-log-macros v0.2.20
  427. 472.75 s > Compiling test-log v0.2.20
  428. 472.75 s > Compiling alphal00p-docs-examples v0.1.0 (/build/source/crates/alphal00p-docs-examples)
  429. 472.75 s > Compiling pyo3-macros-backend v0.28.3
  430. 472.75 s > Compiling pyo3-ffi v0.28.3
  431. 472.75 s > Compiling pyo3 v0.28.3
  432. 472.75 s > Compiling numpy v0.28.0
  433. 472.75 s > Compiling gammaloop-api v0.1.0 (/build/source/crates/gammaloop-api)
  434. 472.75 s > Compiling gungraun v0.18.2
  435. 472.75 s > Compiling pyo3-macros v0.28.3
  436. 472.75 s > Compiling pyo3-stub-gen v0.17.2
  437. 472.75 s > Compiling numerica v2.2.0 (https://github.com/symbolica-dev/symbolica?branch=dev#0441bd7a)
  438. 472.75 s > Compiling graphica v2.1.0 (https://github.com/symbolica-dev/symbolica?branch=dev#0441bd7a)
  439. 472.75 s > Compiling symbolica-utils v0.1.0 (/build/source/crates/symbolica-utils)
  440. 472.75 s > Compiling gammaloop-workspace-hack v0.1.0 (/build/source/crates/gammaloop-workspace-hack)
  441. 472.75 s > Compiling spenso-macros v0.3.2 (/build/source/crates/spenso-macros)
  442. 472.75 s > Compiling linnet v0.17.0 (/build/source/crates/linnet)
  443. 472.75 s > Compiling spenso v0.6.0 (/build/source/crates/spenso)
  444. 472.75 s > Compiling idenso v0.3.0 (/build/source/crates/idenso)
  445. 472.75 s > Compiling gammaloop-tracing-filter v0.1.0 (/build/source/crates/gammaloop-tracing-filter)
  446. 472.75 s > Compiling spenso-hep-lib v0.1.7 (/build/source/crates/spenso-hep-lib)
  447. 472.75 s > Compiling spynso3 v0.1.2 (/build/source/crates/spynso3)
  448. 472.75 s > Compiling linnest v0.1.0 (/build/source/crates/linnest)
  449. 472.75 s > Compiling linnet-py v0.1.0 (/build/source/crates/linnet-py)
  450. 472.75 s > Finished `ci-optim` profile [optimized] target(s) in 7m 25s
  451. 472.75 s > warning: the following packages contain code that will be rejected by a future version of Rust: proc-macro-error2 v2.0.1
  452. 472.75 s > note: to see what the problems were, use the option `--future-incompat-report`, or run `cargo report future-incompatibilities --id 1`
  453. 472.75 s > Doc-tests alphal00p_docs_builder
  454. 472.75 s >
  455. 472.75 s > running 0 tests
  456. 472.75 s >
  457. 472.75 s > test result: ok. 0 passed; 0 failed; 0 ignored; 0 measured; 0 filtered out; finished in 0.00s
  458. 472.75 s >
  459. 472.75 s > Doc-tests alphal00p_docs_catalogs
  460. 472.75 s >
  461. 472.75 s > running 0 tests
  462. 472.75 s >
  463. 472.75 s > test result: ok. 0 passed; 0 failed; 0 ignored; 0 measured; 0 filtered out; finished in 0.00s
  464. 472.75 s >
  465. 472.75 s > Doc-tests alphal00p_docs_examples
  466. 472.75 s >
  467. 472.75 s > running 0 tests
  468. 472.75 s >
  469. 472.75 s > test result: ok. 0 passed; 0 failed; 0 ignored; 0 measured; 0 filtered out; finished in 0.00s
  470. 472.75 s >
  471. 472.75 s > Doc-tests alphal00p_docs
  472. 472.75 s >
  473. 472.75 s > running 0 tests
  474. 472.75 s >
  475. 472.75 s > test result: ok. 0 passed; 0 failed; 0 ignored; 0 measured; 0 filtered out; finished in 0.00s
  476. 472.75 s >
  477. 472.75 s > Doc-tests alphal00p_docs_schema
  478. 472.75 s >
  479. 472.75 s > running 0 tests
  480. 472.75 s >
  481. 472.75 s > test result: ok. 0 passed; 0 failed; 0 ignored; 0 measured; 0 filtered out; finished in 0.00s
  482. 472.75 s >
  483. 472.75 s > Doc-tests clinnet
  484. 472.75 s >
  485. 472.75 s > running 0 tests
  486. 472.75 s >
  487. 472.75 s > test result: ok. 0 passed; 0 failed; 0 ignored; 0 measured; 0 filtered out; finished in 0.00s
  488. 472.75 s >
  489. 472.75 s > Doc-tests gammaloop_api
  490. 472.75 s >
  491. 472.75 s > running 13 tests
  492. 472.75 s > test crates/gammaloop-api/src/python.rs - python::GammaLoopAPI::evaluate_samples (line 3040) ... FAILED
  493. 472.75 s > test crates/gammaloop-api/src/python.rs - python::GammaLoopAPI::get_active_command_blocks (line 3652) ... FAILED
  494. 472.75 s > test crates/gammaloop-api/src/python.rs - python::GammaLoopAPI::get_integrand_settings (line 3539) ... FAILED
  495. 472.75 s > test crates/gammaloop-api/src/python.rs - python::GammaLoopAPI::get_integrand_info (line 3496) ... FAILED
  496. 472.75 s > test crates/gammaloop-api/src/python.rs - python::GammaLoopAPI::get_default_runtime_settings (line 3688) ... FAILED
  497. 472.75 s > test crates/gammaloop-api/src/python.rs - python::GammaLoopAPI::evaluate_sample (line 2926) ... FAILED
  498. 472.75 s > test crates/gammaloop-api/src/python.rs - python::GammaLoopAPI::get_global_settings (line 3631) ... FAILED
  499. 472.75 s > test crates/gammaloop-api/src/python.rs - python::GammaLoopAPI::run_command (line 3793) ... FAILED
  500. 472.75 s > test crates/gammaloop-api/src/python.rs - python::evaluate_graph_overall_factor (line 95) ... FAILED
  501. 472.75 s > test crates/gammaloop-api/src/python.rs - python::atom_to_canonical_string (line 128) ... FAILED
  502. 472.75 s > test crates/gammaloop-api/src/python.rs - python::atom_to_dots (line 157) ... FAILED
  503. 472.75 s > test crates/gammaloop-api/src/python.rs - python::GammaLoopAPI::get_run_history (line 3603) ... FAILED
  504. 472.75 s > test crates/gammaloop-api/src/python.rs - python::GammaLoopAPI::new_python (line 2804) ... FAILED
  505. 472.75 s >
  506. 472.75 s > failures:
  507. 472.75 s >
  508. 472.75 s > ---- crates/gammaloop-api/src/python.rs - python::GammaLoopAPI::evaluate_samples (line 3040) stdout ----
  509. 472.75 s > error: expected one of `!` or `::`, found `=`
  510. 472.75 s > --> crates/gammaloop-api/src/python.rs:3041:8
  511. 472.75 s > |
  512. 472.75 s > 3041 | points = numpy.asarray(points, dtype=numpy.float64)
  513. 472.75 s > | ^ expected one of `!` or `::`
  514. 472.75 s >
  515. 472.75 s > error: aborting due to 1 previous error
  516. 472.75 s >
  517. 472.75 s > Couldn't compile the test.
  518. 472.75 s > ---- crates/gammaloop-api/src/python.rs - python::GammaLoopAPI::get_active_command_blocks (line 3652) stdout ----
  519. 472.75 s > error: expected item, found keyword `for`
  520. 472.75 s > --> crates/gammaloop-api/src/python.rs:3653:1
  521. 472.75 s > |
  522. 472.75 s > 3653 | for name, commands in api.get_active_command_blocks().items():
  523. 472.75 s > | ^^^ expected item
  524. 472.75 s > |
  525. 472.75 s > = note: for a full list of items that can appear in modules, see <https://doc.rust-lang.org/reference/items.html>
  526. 472.75 s >
  527. 472.75 s > error: aborting due to 1 previous error
  528. 472.75 s >
  529. 472.75 s > Couldn't compile the test.
  530. 472.75 s > ---- crates/gammaloop-api/src/python.rs - python::GammaLoopAPI::get_integrand_settings (line 3539) stdout ----
  531. 472.75 s > error: expected one of `!` or `::`, found `=`
  532. 472.75 s > --> crates/gammaloop-api/src/python.rs:3540:10
  533. 472.75 s > |
  534. 472.75 s > 3540 | settings = api.get_integrand_settings(process_id=0)
  535. 472.75 s > | ^ expected one of `!` or `::`
  536. 472.75 s >
  537. 472.75 s > error: aborting due to 1 previous error
  538. 472.75 s >
  539. 472.75 s > Couldn't compile the test.
  540. 472.75 s > ---- crates/gammaloop-api/src/python.rs - python::GammaLoopAPI::get_integrand_info (line 3496) stdout ----
  541. 472.75 s > error: expected one of `!` or `::`, found `=`
  542. 472.75 s > --> crates/gammaloop-api/src/python.rs:3497:6
  543. 472.75 s > |
  544. 472.75 s > 3497 | info = api.get_integrand_info(process_id=0)
  545. 472.75 s > | ^ expected one of `!` or `::`
  546. 472.75 s >
  547. 472.75 s > error: aborting due to 1 previous error
  548. 472.75 s >
  549. 472.75 s > Couldn't compile the test.
  550. 472.75 s > ---- crates/gammaloop-api/src/python.rs - python::GammaLoopAPI::get_default_runtime_settings (line 3688) stdout ----
  551. 472.75 s > error: expected one of `!` or `::`, found `=`
  552. 472.75 s > --> crates/gammaloop-api/src/python.rs:3689:9
  553. 472.75 s > |
  554. 472.75 s > 3689 | runtime = api.get_default_runtime_settings()
  555. 472.75 s > | ^ expected one of `!` or `::`
  556. 472.75 s >
  557. 472.75 s > error: aborting due to 1 previous error
  558. 472.75 s >
  559. 472.75 s > Couldn't compile the test.
  560. 472.75 s > ---- crates/gammaloop-api/src/python.rs - python::GammaLoopAPI::evaluate_sample (line 2926) stdout ----
  561. 472.75 s > error: expected one of `!` or `::`, found `=`
  562. 472.75 s > --> crates/gammaloop-api/src/python.rs:2927:8
  563. 472.75 s > |
  564. 472.75 s > 2927 | result = api.evaluate_sample(point, process_id=0, minimal_output=True)
  565. 472.75 s > | ^ expected one of `!` or `::`
  566. 472.75 s >
  567. 472.75 s > error: aborting due to 1 previous error
  568. 472.75 s >
  569. 472.75 s > Couldn't compile the test.
  570. 472.75 s > ---- crates/gammaloop-api/src/python.rs - python::GammaLoopAPI::get_global_settings (line 3631) stdout ----
  571. 472.75 s > error[E0425]: cannot find value `settings_toml` in this scope
  572. 472.75 s > --> crates/gammaloop-api/src/python.rs:3632:1
  573. 472.75 s > |
  574. 472.75 s > 3632 | settings_toml = api.get_global_settings()
  575. 472.75 s > | ^^^^^^^^^^^^^
  576. 472.75 s > |
  577. 472.75 s > help: you might have meant to introduce a new binding
  578. 472.75 s > |
  579. 472.75 s > 3632 | let settings_toml = api.get_global_settings()
  580. 472.75 s > | +++
  581. 472.75 s >
  582. 472.75 s > error[E0425]: cannot find value `api` in this scope
  583. 472.75 s > --> crates/gammaloop-api/src/python.rs:3632:17
  584. 472.75 s > |
  585. 472.75 s > 3632 | settings_toml = api.get_global_settings()
  586. 472.75 s > | ^^^ not found in this scope
  587. 472.75 s >
  588. 472.75 s > error: aborting due to 2 previous errors
  589. 472.75 s >
  590. 472.75 s > For more information about this error, try `rustc --explain E0425`.
  591. 472.75 s > Couldn't compile the test.
  592. 472.75 s > ---- crates/gammaloop-api/src/python.rs - python::GammaLoopAPI::run_command (line 3793) stdout ----
  593. 472.75 s > error[E0425]: cannot find value `api` in this scope
  594. 472.75 s > --> crates/gammaloop-api/src/python.rs:3794:1
  595. 472.75 s > |
  596. 472.75 s > 3794 | api.run("display processes")
  597. 472.75 s > | ^^^ not found in this scope
  598. 472.75 s >
  599. 472.75 s > error: aborting due to 1 previous error
  600. 472.75 s >
  601. 472.75 s > For more information about this error, try `rustc --explain E0425`.
  602. 472.75 s > Couldn't compile the test.
  603. 472.75 s > ---- crates/gammaloop-api/src/python.rs - python::evaluate_graph_overall_factor (line 95) stdout ----
  604. 472.75 s > error[E0425]: cannot find function `evaluate_graph_overall_factor` in this scope
  605. 472.75 s > --> crates/gammaloop-api/src/python.rs:96:1
  606. 472.75 s > |
  607. 472.75 s > 96 | evaluate_graph_overall_factor(
  608. 472.75 s > | ^^^^^^^^^^^^^^^^^^^^^^^^^^^^^ not found in this scope
  609. 472.75 s >
  610. 472.75 s > error: aborting due to 1 previous error
  611. 472.75 s >
  612. 472.75 s > For more information about this error, try `rustc --explain E0425`.
  613. 472.75 s > Couldn't compile the test.
  614. 472.75 s > ---- crates/gammaloop-api/src/python.rs - python::atom_to_canonical_string (line 128) stdout ----
  615. 472.75 s > error[E0425]: cannot find function `atom_to_canonical_string` in this scope
  616. 472.75 s > --> crates/gammaloop-api/src/python.rs:129:1
  617. 472.75 s > |
  618. 472.75 s > 129 | atom_to_canonical_string("x + x")
  619. 472.75 s > | ^^^^^^^^^^^^^^^^^^^^^^^^ not found in this scope
  620. 472.75 s >
  621. 472.75 s > error: aborting due to 1 previous error
  622. 472.75 s >
  623. 472.75 s > For more information about this error, try `rustc --explain E0425`.
  624. 472.75 s > Couldn't compile the test.
  625. 472.75 s > ---- crates/gammaloop-api/src/python.rs - python::atom_to_dots (line 157) stdout ----
  626. 472.75 s > error[E0425]: cannot find function `to_dots` in this scope
  627. 472.75 s > --> crates/gammaloop-api/src/python.rs:158:1
  628. 472.75 s > |
  629. 472.75 s > 158 | to_dots("p(mu) * q(mu)")
  630. 472.75 s > | ^^^^^^^ not found in this scope
  631. 472.75 s >
  632. 472.75 s > error: aborting due to 1 previous error
  633. 472.75 s >
  634. 472.75 s > For more information about this error, try `rustc --explain E0425`.
  635. 472.75 s > Couldn't compile the test.
  636. 472.75 s > ---- crates/gammaloop-api/src/python.rs - python::GammaLoopAPI::get_run_history (line 3603) stdout ----
  637. 472.75 s > error[E0425]: cannot find value `run_card_toml` in this scope
  638. 472.75 s > --> crates/gammaloop-api/src/python.rs:3604:1
  639. 472.75 s > |
  640. 472.75 s > 3604 | run_card_toml = api.get_run_history()
  641. 472.75 s > | ^^^^^^^^^^^^^
  642. 472.75 s > |
  643. 472.75 s > help: you might have meant to introduce a new binding
  644. 472.75 s > |
  645. 472.75 s > 3604 | let run_card_toml = api.get_run_history()
  646. 472.75 s > | +++
  647. 472.75 s >
  648. 472.75 s > error[E0425]: cannot find value `api` in this scope
  649. 472.75 s > --> crates/gammaloop-api/src/python.rs:3604:17
  650. 472.75 s > |
  651. 472.75 s > 3604 | run_card_toml = api.get_run_history()
  652. 472.75 s > | ^^^ not found in this scope
  653. 472.75 s >
  654. 472.75 s > error: aborting due to 2 previous errors
  655. 472.75 s >
  656. 472.75 s > For more information about this error, try `rustc --explain E0425`.
  657. 472.75 s > Couldn't compile the test.
  658. 472.75 s > ---- crates/gammaloop-api/src/python.rs - python::GammaLoopAPI::new_python (line 2804) stdout ----
  659. 472.75 s > error[E0425]: cannot find value `api` in this scope
  660. 472.75 s > --> crates/gammaloop-api/src/python.rs:2805:1
  661. 472.75 s > |
  662. 472.75 s > 2805 | api = GammaLoopAPI(state_folder="./state", read_only_state=True)
  663. 472.75 s > | ^^^
  664. 472.75 s > |
  665. 472.75 s > help: you might have meant to introduce a new binding
  666. 472.75 s > |
  667. 472.75 s > 2805 | let api = GammaLoopAPI(state_folder="./state", read_only_state=True)
  668. 472.75 s > | +++
  669. 472.75 s >
  670. 472.75 s > error[E0425]: cannot find value `state_folder` in this scope
  671. 472.75 s > --> crates/gammaloop-api/src/python.rs:2805:20
  672. 472.75 s > |
  673. 472.75 s > 2805 | api = GammaLoopAPI(state_folder="./state", read_only_state=True)
  674. 472.75 s > | ^^^^^^^^^^^^ not found in this scope
  675. 472.75 s >
  676. 472.75 s > error[E0425]: cannot find value `read_only_state` in this scope
  677. 472.75 s > --> crates/gammaloop-api/src/python.rs:2805:44
  678. 472.75 s > |
  679. 472.75 s > 2805 | api = GammaLoopAPI(state_folder="./state", read_only_state=True)
  680. 472.75 s > | ^^^^^^^^^^^^^^^ not found in this scope
  681. 472.75 s >
  682. 472.75 s > error[E0425]: cannot find value `True` in this scope
  683. 472.75 s > --> crates/gammaloop-api/src/python.rs:2805:60
  684. 472.75 s > |
  685. 472.75 s > 2805 | api = GammaLoopAPI(state_folder="./state", read_only_state=True)
  686. 472.75 s > | ^^^^ not found in this scope
  687. 472.75 s > |
  688. 472.75 s > help: you may want to use a bool value instead
  689. 472.75 s > |
  690. 472.75 s > 2805 - api = GammaLoopAPI(state_folder="./state", read_only_state=True)
  691. 472.75 s > 2805 + api = GammaLoopAPI(state_folder="./state", read_only_state=true)
  692. 472.75 s > |
  693. 472.75 s >
  694. 472.75 s > error[E0425]: cannot find function, tuple struct or tuple variant `GammaLoopAPI` in this scope
  695. 472.75 s > --> crates/gammaloop-api/src/python.rs:2805:7
  696. 472.75 s > |
  697. 472.75 s > 2805 | api = GammaLoopAPI(state_folder="./state", read_only_state=True)
  698. 472.75 s > | ^^^^^^^^^^^^ not found in this scope
  699. 472.75 s >
  700. 472.75 s > error: aborting due to 5 previous errors
  701. 472.75 s >
  702. 472.75 s > For more information about this error, try `rustc --explain E0425`.
  703. 472.75 s > Couldn't compile the test.
  704. 472.75 s >
  705. 472.75 s > failures:
  706. 472.75 s > crates/gammaloop-api/src/python.rs - python::GammaLoopAPI::evaluate_sample (line 2926)
  707. 472.75 s > crates/gammaloop-api/src/python.rs - python::GammaLoopAPI::evaluate_samples (line 3040)
  708. 472.75 s > crates/gammaloop-api/src/python.rs - python::GammaLoopAPI::get_active_command_blocks (line 3652)
  709. 472.75 s > crates/gammaloop-api/src/python.rs - python::GammaLoopAPI::get_default_runtime_settings (line 3688)
  710. 472.75 s > crates/gammaloop-api/src/python.rs - python::GammaLoopAPI::get_global_settings (line 3631)
  711. 472.75 s > crates/gammaloop-api/src/python.rs - python::GammaLoopAPI::get_integrand_info (line 3496)
  712. 472.75 s > crates/gammaloop-api/src/python.rs - python::GammaLoopAPI::get_integrand_settings (line 3539)
  713. 472.75 s > crates/gammaloop-api/src/python.rs - python::GammaLoopAPI::get_run_history (line 3603)
  714. 472.75 s > crates/gammaloop-api/src/python.rs - python::GammaLoopAPI::new_python (line 2804)
  715. 472.75 s > crates/gammaloop-api/src/python.rs - python::GammaLoopAPI::run_command (line 3793)
  716. 472.75 s > crates/gammaloop-api/src/python.rs - python::atom_to_canonical_string (line 128)
  717. 472.75 s > crates/gammaloop-api/src/python.rs - python::atom_to_dots (line 157)
  718. 472.75 s > crates/gammaloop-api/src/python.rs - python::evaluate_graph_overall_factor (line 95)
  719. 472.75 s >
  720. 472.75 s > test result: FAILED. 0 passed; 13 failed; 0 ignored; 0 measured; 0 filtered out; finished in 0.25s
  721. 472.75 s >
  722. 472.75 s > error: doctest failed, to rerun pass `-p gammaloop-api --doc`
  723. 472.75 s For full logs, run:
  724. 472.75 s nix log /nix/store/d7n0kzr0ab2qmzp3m3y3jhx03bbngjym-gammaloop-workspace-doctest-0.1.0.drv
  725. 472.83 s [0 built (1 failed), 0.0Run failed.