1. 0.00 s $ /nix/store/9ypz3flqsrl5xl495mm8h645gadjsxi1-coreutils-9.11/bin/timeout --kill-after=15s 7200s /nix/store/23zk8sgzamrbmj1fday15szf7f2279s8-nix-2.34.7/bin/nix --extra-experimental-features nix-command --extra-experimental-features flakes flake clone git+https://github.com/alphal00p/gammaloop --dest /tmp/nix-ci-worker/stable-pwd/repo/
  2. 0.08 s Cloning into '/tmp/nix-ci-worker/stable-pwd/repo'...
  3. 0.77 s remote: Enumerating objects: 78252, done.
  4. 0.88 s remote: Counting objects: 0% (1/14377) remote: Counting objects: 1% (144/14377) remote: Counting objects: 2% (288/14377) remote: Counting objects: 3% (432/14377) remote: Counting objects: 4% (576/14377) remote: Counting objects: 5% (719/14377) remote: Counting objects: 6% (863/14377) remote: Counting objects: 7% (1007/14377) remote: Counting objects: 8% (1151/14377) remote: Counting objects: 9% (1294/14377) remote: Counting objects: 10% (1438/14377) remote: Counting objects: 11% (1582/14377) remote: Counting objects: 12% (1726/14377) remote: Counting objects: 13% (1870/14377) remote: Counting objects: 14% (2013/14377) remote: Counting objects: 15% (2157/14377) remote: Counting objects: 16% (2301/14377) remote: Counting objects: 17% (2445/14377) remote: Counting objects: 18% (2588/14377) remote: Counting objects: 19% (2732/14377) remote: Counting objects: 20% (2876/14377) remote: Counting objects: 21% (3020/14377) remote: Counting objects: 22% (3163/14377) remote: Counting objects: 23% (3307/14377) remote: Counting objects: 24% (3451/14377) remote: Counting objects: 25% (3595/14377) remote: Counting objects: 26% (3739/14377) remote: Counting objects: 27% (3882/14377) remote: Counting objects: 28% (4026/14377) remote: Counting objects: 29% (4170/14377) remote: Counting objects: 30% (4314/14377) remote: Counting objects: 31% (4457/14377) remote: Counting objects: 32% (4601/14377) remote: Counting objects: 33% (4745/14377) remote: Counting objects: 34% (4889/14377) remote: Counting objects: 35% (5032/14377) remote: Counting objects: 36% (5176/14377) remote: Counting objects: 37% (5320/14377) remote: Counting objects: 38% (5464/14377) remote: Counting objects: 39% (5608/14377) remote: Counting objects: 40% (5751/14377) remote: Counting objects: 41% (5895/14377) remote: Counting objects: 42% (6039/14377) remote: Counting objects: 43% (6183/14377) remote: Counting objects: 44% (6326/14377) remote: Counting objects: 45% (6470/14377) remote: Counting objects: 46% (6614/14377) remote: Counting objects: 47% (6758/14377) remote: Counting objects: 48% (6901/14377) remote: Counting objects: 49% (7045/14377) remote: Counting objects: 50% (7189/14377) remote: Counting objects: 51% (7333/14377) remote: Counting objects: 52% (7477/14377) remote: Counting objects: 53% (7620/14377) remote: Counting objects: 54% (7764/14377) remote: Counting objects: 55% (7908/14377) remote: Counting objects: 56% (8052/14377) remote: Counting objects: 57% (8195/14377) remote: Counting objects: 58% (8339/14377) remote: Counting objects: 59% (8483/14377) remote: Counting objects: 60% (8627/14377) remote: Counting objects: 61% (8770/14377) remote: Counting objects: 62% (8914/14377) remote: Counting objects: 63% (9058/14377) remote: Counting objects: 64% (9202/14377) remote: Counting objects: 65% (9346/14377) remote: Counting objects: 66% (9489/14377) remote: Counting objects: 67% (9633/14377) remote: Counting objects: 68% (9777/14377) remote: Counting objects: 69% (9921/14377) remote: Counting objects: 70% (10064/14377) remote: Counting objects: 71% (10208/14377) remote: Counting objects: 72% (10352/14377) remote: Counting objects: 73% (10496/14377) remote: Counting objects: 74% (10639/14377) remote: Counting objects: 75% (10783/14377) remote: Counting objects: 76% (10927/14377) remote: Counting objects: 77% (11071/14377) remote: Counting objects: 78% (11215/14377) remote: Counting objects: 79% (11358/14377) remote: Counting objects: 80% (11502/14377) remote: Counting objects: 81% (11646/14377) remote: Counting objects: 82% (11790/14377) remote: Counting objects: 83% (11933/14377) remote: Counting objects: 84% (12077/14377) remote: Counting objects: 85% (12221/14377) remote: Counting objects: 86% (12365/14377) remote: Counting objects: 87% (12508/14377) remote: Counting objects: 88% (12652/14377) remote: Counting objects: 89% (12796/14377) remote: Counting objects: 90% (12940/14377) remote: Counting objects: 91% (13084/14377) remote: Counting objects: 92% (13227/14377) remote: Counting objects: 93% (13371/14377) remote: Counting objects: 94% (13515/14377) remote: Counting objects: 95% (13659/14377) remote: Counting objects: 96% (13802/14377) remote: Counting objects: 97% (13946/14377) remote: Counting objects: 98% (14090/14377) remote: Counting objects: 99% (14234/14377) remote: Counting objects: 100% (14377/14377) remote: Counting objects: 100% (14377/14377), done.
  5. 3.87 s remote: Compressing objects: 0% (1/3260) remote: Compressing objects: 1% (33/3260) remote: Compressing objects: 2% (66/3260) remote: Compressing objects: 3% (98/3260) remote: Compressing objects: 4% (131/3260) remote: Compressing objects: 5% (163/3260) remote: Compressing objects: 6% (196/3260) remote: Compressing objects: 7% (229/3260) remote: Compressing objects: 8% (261/3260) remote: Compressing objects: 9% (294/3260) remote: Compressing objects: 10% (326/3260) remote: Compressing objects: 11% (359/3260) remote: Compressing objects: 12% (392/3260) remote: Compressing objects: 13% (424/3260) remote: Compressing objects: 14% (457/3260) remote: Compressing objects: 15% (489/3260) remote: Compressing objects: 16% (522/3260) remote: Compressing objects: 17% (555/3260) remote: Compressing objects: 18% (587/3260) remote: Compressing objects: 19% (620/3260) remote: Compressing objects: 20% (652/3260) remote: Compressing objects: 21% (685/3260) remote: Compressing objects: 22% (718/3260) remote: Compressing objects: 23% (750/3260) remote: Compressing objects: 24% (783/3260) remote: Compressing objects: 25% (815/3260) remote: Compressing objects: 26% (848/3260) remote: Compressing objects: 27% (881/3260) remote: Compressing objects: 27% (902/3260) remote: Compressing objects: 28% (913/3260) remote: Compressing objects: 29% (946/3260) remote: Compressing objects: 30% (978/3260) remote: Compressing objects: 31% (1011/3260) remote: Compressing objects: 32% (1044/3260) remote: Compressing objects: 33% (1076/3260) remote: Compressing objects: 34% (1109/3260) remote: Compressing objects: 35% (1141/3260) remote: Compressing objects: 36% (1174/3260) remote: Compressing objects: 37% (1207/3260) remote: Compressing objects: 38% (1239/3260) remote: Compressing objects: 38% (1262/3260) remote: Compressing objects: 39% (1272/3260) remote: Compressing objects: 40% (1304/3260) remote: Compressing objects: 41% (1337/3260) remote: Compressing objects: 42% (1370/3260) remote: Compressing objects: 43% (1402/3260) remote: Compressing objects: 44% (1435/3260) remote: Compressing objects: 45% (1467/3260) remote: Compressing objects: 46% (1500/3260) remote: Compressing objects: 47% (1533/3260) remote: Compressing objects: 48% (1565/3260) remote: Compressing objects: 49% (1598/3260) remote: Compressing objects: 50% (1630/3260) remote: Compressing objects: 51% (1663/3260) remote: Compressing objects: 52% (1696/3260) remote: Compressing objects: 53% (1728/3260) remote: Compressing objects: 54% (1761/3260) remote: Compressing objects: 55% (1793/3260) remote: Compressing objects: 56% (1826/3260) remote: Compressing objects: 57% (1859/3260) remote: Compressing objects: 58% (1891/3260) remote: Compressing objects: 59% (1924/3260) remote: Compressing objects: 60% (1956/3260) remote: Compressing objects: 61% (1989/3260) remote: Compressing objects: 62% (2022/3260) remote: Compressing objects: 63% (2054/3260) remote: Compressing objects: 64% (2087/3260) remote: Compressing objects: 65% (2119/3260) remote: Compressing objects: 66% (2152/3260) remote: Compressing objects: 67% (2185/3260) remote: Compressing objects: 68% (2217/3260) remote: Compressing objects: 69% (2250/3260) remote: Compressing objects: 70% (2282/3260) remote: Compressing objects: 71% (2315/3260) remote: Compressing objects: 72% (2348/3260) remote: Compressing objects: 73% (2380/3260) remote: Compressing objects: 74% (2413/3260) remote: Compressing objects: 75% (2445/3260) remote: Compressing objects: 76% (2478/3260) remote: Compressing objects: 77% (2511/3260) remote: Compressing objects: 78% (2543/3260) remote: Compressing objects: 79% (2576/3260) remote: Compressing objects: 80% (2608/3260) remote: Compressing objects: 81% (2641/3260) remote: Compressing objects: 82% (2674/3260) remote: Compressing objects: 83% (2706/3260) remote: Compressing objects: 84% (2739/3260) remote: Compressing objects: 85% (2771/3260) remote: Compressing objects: 86% (2804/3260) remote: Compressing objects: 87% (2837/3260) remote: Compressing objects: 88% (2869/3260) remote: Compressing objects: 89% (2902/3260) remote: Compressing objects: 90% (2934/3260) remote: Compressing objects: 91% (2967/3260) remote: Compressing objects: 92% (3000/3260) remote: Compressing objects: 93% (3032/3260) remote: Compressing objects: 94% (3065/3260) remote: Compressing objects: 95% (3097/3260) remote: Compressing objects: 96% (3130/3260) remote: Compressing objects: 97% (3163/3260) remote: Compressing objects: 98% (3195/3260) remote: Compressing objects: 99% (3228/3260) remote: Compressing objects: 100% (3260/3260) remote: Compressing objects: 100% (3260/3260), done.
  6. 7.20 s Receiving objects: 0% (1/78252) Receiving objects: 1% (783/78252) Receiving objects: 2% (1566/78252) Receiving objects: 3% (2348/78252) Receiving objects: 4% (3131/78252) Receiving objects: 5% (3913/78252) Receiving objects: 6% (4696/78252) Receiving objects: 7% (5478/78252) Receiving objects: 8% (6261/78252) Receiving objects: 9% (7043/78252) Receiving objects: 10% (7826/78252), 16.94 MiB | 33.87 MiB/s Receiving objects: 11% (8608/78252), 16.94 MiB | 33.87 MiB/s Receiving objects: 12% (9391/78252), 16.94 MiB | 33.87 MiB/s Receiving objects: 13% (10173/78252), 16.94 MiB | 33.87 MiB/s Receiving objects: 14% (10956/78252), 16.94 MiB | 33.87 MiB/s Receiving objects: 15% (11738/78252), 16.94 MiB | 33.87 MiB/s Receiving objects: 16% (12521/78252), 16.94 MiB | 33.87 MiB/s Receiving objects: 17% (13303/78252), 16.94 MiB | 33.87 MiB/s Receiving objects: 18% (14086/78252), 16.94 MiB | 33.87 MiB/s Receiving objects: 19% (14868/78252), 16.94 MiB | 33.87 MiB/s Receiving objects: 20% (15651/78252), 16.94 MiB | 33.87 MiB/s Receiving objects: 21% (16433/78252), 16.94 MiB | 33.87 MiB/s Receiving objects: 22% (17216/78252), 16.94 MiB | 33.87 MiB/s Receiving objects: 23% (17998/78252), 16.94 MiB | 33.87 MiB/s Receiving objects: 24% (18781/78252), 16.94 MiB | 33.87 MiB/s Receiving objects: 25% (19563/78252), 16.94 MiB | 33.87 MiB/s Receiving objects: 26% (20346/78252), 16.94 MiB | 33.87 MiB/s Receiving objects: 27% (21129/78252), 16.94 MiB | 33.87 MiB/s Receiving objects: 28% (21911/78252), 16.94 MiB | 33.87 MiB/s Receiving objects: 29% (22694/78252), 16.94 MiB | 33.87 MiB/s Receiving objects: 30% (23476/78252), 16.94 MiB | 33.87 MiB/s Receiving objects: 31% (24259/78252), 16.94 MiB | 33.87 MiB/s Receiving objects: 32% (25041/78252), 16.94 MiB | 33.87 MiB/s Receiving objects: 33% (25824/78252), 16.94 MiB | 33.87 MiB/s Receiving objects: 34% (26606/78252), 16.94 MiB | 33.87 MiB/s Receiving objects: 35% (27389/78252), 16.94 MiB | 33.87 MiB/s Receiving objects: 36% (28171/78252), 16.94 MiB | 33.87 MiB/s Receiving objects: 37% (28954/78252), 16.94 MiB | 33.87 MiB/s Receiving objects: 38% (29736/78252), 16.94 MiB | 33.87 MiB/s Receiving objects: 39% (30519/78252), 16.94 MiB | 33.87 MiB/s Receiving objects: 40% (31301/78252), 16.94 MiB | 33.87 MiB/s Receiving objects: 41% (32084/78252), 16.94 MiB | 33.87 MiB/s Receiving objects: 42% (32866/78252), 16.94 MiB | 33.87 MiB/s Receiving objects: 43% (33649/78252), 16.94 MiB | 33.87 MiB/s Receiving objects: 44% (34431/78252), 16.94 MiB | 33.87 MiB/s Receiving objects: 44% (34956/78252), 16.94 MiB | 33.87 MiB/s Receiving objects: 45% (35214/78252), 37.07 MiB | 37.06 MiB/s Receiving objects: 46% (35996/78252), 37.07 MiB | 37.06 MiB/s Receiving objects: 47% (36779/78252), 37.07 MiB | 37.06 MiB/s Receiving objects: 48% (37561/78252), 37.07 MiB | 37.06 MiB/s Receiving objects: 49% (38344/78252), 37.07 MiB | 37.06 MiB/s Receiving objects: 50% (39126/78252), 37.07 MiB | 37.06 MiB/s Receiving objects: 51% (39909/78252), 37.07 MiB | 37.06 MiB/s Receiving objects: 52% (40692/78252), 37.07 MiB | 37.06 MiB/s Receiving objects: 53% (41474/78252), 37.07 MiB | 37.06 MiB/s Receiving objects: 54% (42257/78252), 37.07 MiB | 37.06 MiB/s Receiving objects: 55% (43039/78252), 37.07 MiB | 37.06 MiB/s Receiving objects: 56% (43822/78252), 37.07 MiB | 37.06 MiB/s Receiving objects: 57% (44604/78252), 37.07 MiB | 37.06 MiB/s Receiving objects: 58% (45387/78252), 37.07 MiB | 37.06 MiB/s Receiving objects: 59% (46169/78252), 37.07 MiB | 37.06 MiB/s Receiving objects: 60% (46952/78252), 55.14 MiB | 36.75 MiB/s Receiving objects: 61% (47734/78252), 55.14 MiB | 36.75 MiB/s Receiving objects: 62% (48517/78252), 55.14 MiB | 36.75 MiB/s Receiving objects: 63% (49299/78252), 55.14 MiB | 36.75 MiB/s Receiving objects: 64% (50082/78252), 55.14 MiB | 36.75 MiB/s Receiving objects: 65% (50864/78252), 55.14 MiB | 36.75 MiB/s Receiving objects: 65% (51369/78252), 73.47 MiB | 36.61 MiB/s Receiving objects: 66% (51647/78252), 73.47 MiB | 36.61 MiB/s Receiving objects: 67% (52429/78252), 73.47 MiB | 36.61 MiB/s Receiving objects: 68% (53212/78252), 73.47 MiB | 36.61 MiB/s Receiving objects: 69% (53994/78252), 73.47 MiB | 36.61 MiB/s Receiving objects: 70% (54777/78252), 73.47 MiB | 36.61 MiB/s Receiving objects: 71% (55559/78252), 73.47 MiB | 36.61 MiB/s Receiving objects: 72% (56342/78252), 73.47 MiB | 36.61 MiB/s Receiving objects: 73% (57124/78252), 73.47 MiB | 36.61 MiB/s Receiving objects: 74% (57907/78252), 73.47 MiB | 36.61 MiB/s Receiving objects: 75% (58689/78252), 73.47 MiB | 36.61 MiB/s Receiving objects: 76% (59472/78252), 73.47 MiB | 36.61 MiB/s Receiving objects: 77% (60255/78252), 73.47 MiB | 36.61 MiB/s Receiving objects: 78% (61037/78252), 73.47 MiB | 36.61 MiB/s Receiving objects: 79% (61820/78252), 92.46 MiB | 36.47 MiB/s Receiving objects: 80% (62602/78252), 92.46 MiB | 36.47 MiB/s Receiving objects: 81% (63385/78252), 92.46 MiB | 36.47 MiB/s Receiving objects: 82% (64167/78252), 92.46 MiB | 36.47 MiB/s Receiving objects: 83% (64950/78252), 92.46 MiB | 36.47 MiB/s Receiving objects: 84% (65732/78252), 92.46 MiB | 36.47 MiB/s Receiving objects: 85% (66515/78252), 92.46 MiB | 36.47 MiB/s Receiving objects: 86% (67297/78252), 92.46 MiB | 36.47 MiB/s Receiving objects: 86% (67525/78252), 92.46 MiB | 36.47 MiB/s Receiving objects: 87% (68080/78252), 92.46 MiB | 36.47 MiB/s Receiving objects: 88% (68862/78252), 92.46 MiB | 36.47 MiB/s Receiving objects: 89% (69645/78252), 92.46 MiB | 36.47 MiB/s Receiving objects: 90% (70427/78252), 92.46 MiB | 36.47 MiB/s Receiving objects: 91% (71210/78252), 112.06 MiB | 36.58 MiB/s Receiving objects: 92% (71992/78252), 112.06 MiB | 36.58 MiB/s Receiving objects: 93% (72775/78252), 112.06 MiB | 36.58 MiB/s Receiving objects: 94% (73557/78252), 112.06 MiB | 36.58 MiB/s Receiving objects: 95% (74340/78252), 112.06 MiB | 36.58 MiB/s Receiving objects: 96% (75122/78252), 112.06 MiB | 36.58 MiB/s Receiving objects: 97% (75905/78252), 112.06 MiB | 36.58 MiB/s Receiving objects: 98% (76687/78252), 112.06 MiB | 36.58 MiB/s Receiving objects: 99% (77470/78252), 112.06 MiB | 36.58 MiB/s remote: Total 78252 (delta 10129), reused 12101 (delta 9019), pack-reused 63875 (from 2)
  7. 7.20 s Receiving objects: 100% (78252/78252), 112.06 MiB | 36.58 MiB/s Receiving objects: 100% (78252/78252), 122.17 MiB | 36.77 MiB/s, done.
  8. 8.08 s Resolving deltas: 0% (0/53215) Resolving deltas: 1% (533/53215) Resolving deltas: 2% (1065/53215) Resolving deltas: 3% (1602/53215) Resolving deltas: 4% (2129/53215) Resolving deltas: 5% (2661/53215) Resolving deltas: 6% (3193/53215) Resolving deltas: 7% (3726/53215) Resolving deltas: 8% (4260/53215) Resolving deltas: 9% (4790/53215) Resolving deltas: 10% (5323/53215) Resolving deltas: 11% (5854/53215) Resolving deltas: 12% (6387/53215) Resolving deltas: 13% (6918/53215) Resolving deltas: 14% (7451/53215) Resolving deltas: 15% (7983/53215) Resolving deltas: 16% (8515/53215) Resolving deltas: 17% (9049/53215) Resolving deltas: 18% (9579/53215) Resolving deltas: 19% (10111/53215) Resolving deltas: 20% (10644/53215) Resolving deltas: 21% (11176/53215) Resolving deltas: 22% (11708/53215) Resolving deltas: 23% (12241/53215) Resolving deltas: 24% (12773/53215) Resolving deltas: 25% (13304/53215) Resolving deltas: 26% (13836/53215) Resolving deltas: 27% (14369/53215) Resolving deltas: 28% (14901/53215) Resolving deltas: 29% (15433/53215) Resolving deltas: 30% (15965/53215) Resolving deltas: 31% (16497/53215) Resolving deltas: 32% (17029/53215) Resolving deltas: 33% (17561/53215) Resolving deltas: 34% (18094/53215) Resolving deltas: 35% (18626/53215) Resolving deltas: 36% (19158/53215) Resolving deltas: 37% (19690/53215) Resolving deltas: 38% (20222/53215) Resolving deltas: 39% (20754/53215) Resolving deltas: 40% (21286/53215) Resolving deltas: 41% (21820/53215) Resolving deltas: 42% (22351/53215) Resolving deltas: 43% (22885/53215) Resolving deltas: 44% (23415/53215) Resolving deltas: 45% (23947/53215) Resolving deltas: 46% (24479/53215) Resolving deltas: 47% (25014/53215) Resolving deltas: 48% (25544/53215) Resolving deltas: 49% (26076/53215) Resolving deltas: 50% (26608/53215) Resolving deltas: 51% (27140/53215) Resolving deltas: 52% (27672/53215) Resolving deltas: 53% (28205/53215) Resolving deltas: 54% (28737/53215) Resolving deltas: 55% (29269/53215) Resolving deltas: 56% (29801/53215) Resolving deltas: 57% (30335/53215) Resolving deltas: 58% (30865/53215) Resolving deltas: 59% (31397/53215) Resolving deltas: 60% (31929/53215) Resolving deltas: 61% (32462/53215) Resolving deltas: 62% (32994/53215) Resolving deltas: 63% (33526/53215) Resolving deltas: 64% (34060/53215) Resolving deltas: 65% (34590/53215) Resolving deltas: 66% (35123/53215) Resolving deltas: 67% (35655/53215) Resolving deltas: 68% (36187/53215) Resolving deltas: 69% (36720/53215) Resolving deltas: 70% (37252/53215) Resolving deltas: 71% (37783/53215) Resolving deltas: 72% (38315/53215) Resolving deltas: 73% (38847/53215) Resolving deltas: 74% (39380/53215) Resolving deltas: 75% (39913/53215) Resolving deltas: 76% (40444/53215) Resolving deltas: 77% (40976/53215) Resolving deltas: 78% (41508/53215) Resolving deltas: 79% (42040/53215) Resolving deltas: 80% (42572/53215) Resolving deltas: 81% (43105/53215) Resolving deltas: 82% (43637/53215) Resolving deltas: 83% (44170/53215) Resolving deltas: 84% (44702/53215) Resolving deltas: 85% (45233/53215) Resolving deltas: 86% (45765/53215) Resolving deltas: 87% (46298/53215) Resolving deltas: 88% (46830/53215) Resolving deltas: 89% (47362/53215) Resolving deltas: 90% (47895/53215) Resolving deltas: 91% (48426/53215) Resolving deltas: 92% (48958/53215) Resolving deltas: 93% (49490/53215) Resolving deltas: 94% (50025/53215) Resolving deltas: 95% (50556/53215) Resolving deltas: 96% (51088/53215) Resolving deltas: 97% (51620/53215) Resolving deltas: 98% (52151/53215) Resolving deltas: 99% (52683/53215) Resolving deltas: 100% (53215/53215) Resolving deltas: 100% (53215/53215), done.
  9. 8.47 s Fetching commit bac4ee69535bb90006e6528450f950aef795f67f for push-vrpyqyylypmw ...
  10. 8.47 s $ /nix/store/bcnisk3ydfgv26v2gw3zlky24g00yww2-git-2.54.0/bin/git fetch origin bac4ee69535bb90006e6528450f950aef795f67f
  11. 8.90 s From https://github.com/alphal00p/gammaloop
  12. 8.90 s * branch bac4ee69535bb90006e6528450f950aef795f67f -> FETCH_HEAD
  13. 8.91 s $ /nix/store/9ypz3flqsrl5xl495mm8h645gadjsxi1-coreutils-9.11/bin/timeout --kill-after=15s 7200s /nix/store/bcnisk3ydfgv26v2gw3zlky24g00yww2-git-2.54.0/bin/git -c advice.detachedHead=false checkout bac4ee69535bb90006e6528450f950aef795f67f
  14. 9.14 s HEAD is now at bac4ee695 mirror Linnest and Kurvst standalone packages
  15. 9.14 s $ /nix/store/9ypz3flqsrl5xl495mm8h645gadjsxi1-coreutils-9.11/bin/timeout --kill-after=15s 7200s /nix/store/23zk8sgzamrbmj1fday15szf7f2279s8-nix-2.34.7/bin/nix --extra-experimental-features nix-command --extra-experimental-features flakes --log-format internal-json run .#packages.x86_64-linux.nix-ci-check-gammaloop-nextest-docs --print-build-logs
  16. 14.07 s
  17. 14.11 s Downloading cached nix-ci-check-gammaloop-nextest-docs from https://cache.nix-ci.com
  18. 14.12 s Downloaded cached nix-ci-check-gammaloop-nextest-docs (1016 B) in 3ms
  19. 14.12 s Progress: 0 of 1 built, 1 of 1 downloaded from cache
  20. 19.56 s evaluating derivation 'g copying '/nix/store/a336 evaluating derivation 'g copying '/nix/store/a336 evaluating derivation 'g copying '/nix/store/a336 evaluating derivation 'g copying '/nix/store/a336 evaluating derivation 'g copying '/nix/store/a336 evaluating derivation 'g copying '/nix/store/a336 evaluating derivation 'g querying gammaloop-nexte [0/1 built, 0.0 KiB DL] [1/0/1 built, 0.0 KiB DLgammaloop-nextest-docs> Extracting 2 binaries to /build/source
  21. 19.61 s gammaloop-nextest-docs> Extracted 5 files to /build/source in 0.05s
  22. 19.62 s gammaloop-nextest-docs> ------------
  23. 19.62 s gammaloop-nextest-docs> Nextest run ID c4293722-63cf-46bc-a504-7726a7827b68 with nextest profile: ci_gammaloop
  24. 19.62 s gammaloop-nextest-docs> Starting 111 tests across 2 binaries
  25. 19.71 s gammaloop-nextest-docs> FAIL [ 0.080s] ( 78/111) alphal00p-docs-builder tests::every_product_requires_a_task_chooser_and_each_supported_interface
  26. 19.71 s gammaloop-nextest-docs> stdout ---
  27. 19.71 s gammaloop-nextest-docs>
  28. 19.71 s gammaloop-nextest-docs> running 1 test
  29. 19.71 s gammaloop-nextest-docs> test tests::every_product_requires_a_task_chooser_and_each_supported_interface ... FAILED
  30. 19.71 s gammaloop-nextest-docs>
  31. 19.71 s gammaloop-nextest-docs> failures:
  32. 19.71 s gammaloop-nextest-docs>
  33. 19.71 s gammaloop-nextest-docs> failures:
  34. 19.71 s gammaloop-nextest-docs> tests::every_product_requires_a_task_chooser_and_each_supported_interface
  35. 19.71 s gammaloop-nextest-docs>
  36. 19.71 s gammaloop-nextest-docs> test result: FAILED. 0 passed; 1 failed; 0 ignored; 0 measured; 110 filtered out; finished in 0.08s
  37. 19.71 s gammaloop-nextest-docs>
  38. 19.71 s gammaloop-nextest-docs> stderr ---
  39. 19.71 s gammaloop-nextest-docs> warning: developer note gammaloop-architecture still requires a named owner
  40. 19.71 s gammaloop-nextest-docs> warning: developer note integration-dashboard still requires a named owner
  41. 19.71 s gammaloop-nextest-docs> warning: developer note uv-renormalization still requires a named owner
  42. 19.71 s gammaloop-nextest-docs> warning: developer note spenso-parsing-flow still requires a named owner
  43. 19.71 s gammaloop-nextest-docs> warning: developer note schoonschip-network still requires a named owner
  44. 19.71 s gammaloop-nextest-docs> warning: developer note gammaloop-draw-style-migration still requires a named owner
  45. 19.71 s gammaloop-nextest-docs> warning: developer note gammaloop-drawing-architecture still requires a named owner
  46. 19.71 s gammaloop-nextest-docs> warning: developer note spenso-symbolica-syntax-and-rewrites still requires a named owner
  47. 19.71 s gammaloop-nextest-docs> warning: developer note spenso-architecture still requires a named owner
  48. 19.71 s gammaloop-nextest-docs> warning: developer note idenso-architecture still requires a named owner
  49. 19.71 s gammaloop-nextest-docs> warning: developer note idenso-form-color-dirac-source-map still requires a named owner
  50. 19.71 s gammaloop-nextest-docs> warning: developer note linnet-architecture still requires a named owner
  51. 19.71 s gammaloop-nextest-docs> warning: developer note vakint-architecture still requires a named owner
  52. 19.71 s gammaloop-nextest-docs> warning: developer note gammaloop-roadmap still requires a named owner
  53. 19.71 s gammaloop-nextest-docs> warning: developer note cff-surface-cache-ownership still requires a named owner
  54. 19.71 s gammaloop-nextest-docs> warning: developer note gammaloop-drawing-evaluated-fields-history still requires a named owner
  55. 19.71 s gammaloop-nextest-docs> warning: archived developer note gammaloop-drawing-evaluated-fields-history has no immutable evidence revision
  56. 19.71 s gammaloop-nextest-docs> warning: developer note bnl-benchmark-investigation still requires a named owner
  57. 19.71 s gammaloop-nextest-docs> warning: developer note bnl-contraction-order-performance still requires a named owner
  58. 19.71 s gammaloop-nextest-docs> warning: developer note bnl-scalar-alias-capture still requires a named owner
  59. 19.71 s gammaloop-nextest-docs> warning: developer note aa-aa-three-loop-performance-smoke still requires a named owner
  60. 19.71 s gammaloop-nextest-docs> warning: developer note network-simplification still requires a named owner
  61. 19.71 s gammaloop-nextest-docs> warning: investigation developer note network-simplification has no immutable evidence revision
  62. 19.71 s gammaloop-nextest-docs> warning: developer note spenso-large-expressions still requires a named owner
  63. 19.71 s gammaloop-nextest-docs> warning: developer note spenso-improvement-effects still requires a named owner
  64. 19.71 s gammaloop-nextest-docs> warning: archived developer note spenso-improvement-effects has no immutable evidence revision
  65. 19.71 s gammaloop-nextest-docs> warning: developer note spenso-test-baseline still requires a named owner
  66. 19.71 s gammaloop-nextest-docs> warning: archived developer note spenso-test-baseline has no immutable evidence revision
  67. 19.71 s gammaloop-nextest-docs> warning: developer note bnl-evaluator-atom-capture still requires a named owner
  68. 19.71 s gammaloop-nextest-docs> warning: archived developer note bnl-evaluator-atom-capture has no immutable evidence revision
  69. 19.71 s gammaloop-nextest-docs> warning: developer note uv-scalar-profile-benchmark still requires a named owner
  70. 19.71 s gammaloop-nextest-docs> warning: archived developer note uv-scalar-profile-benchmark has no immutable evidence revision
  71. 19.71 s gammaloop-nextest-docs> warning: developer note ci-test-failure-summary-2026-03-25 still requires a named owner
  72. 19.71 s gammaloop-nextest-docs> warning: archived developer note ci-test-failure-summary-2026-03-25 has no immutable evidence revision
  73. 19.71 s gammaloop-nextest-docs> warning: developer note network-execution-rebase-record still requires a named owner
  74. 19.71 s gammaloop-nextest-docs> warning: archived developer note network-execution-rebase-record has no immutable evidence revision
  75. 19.71 s gammaloop-nextest-docs> warning: developer note ratatui-integration-dashboard-history still requires a named owner
  76. 19.71 s gammaloop-nextest-docs> warning: archived developer note ratatui-integration-dashboard-history has no immutable evidence revision
  77. 19.71 s gammaloop-nextest-docs> warning: developer note nix-crane-cache-reuse still requires a named owner
  78. 19.71 s gammaloop-nextest-docs>
  79. 19.71 s gammaloop-nextest-docs> thread 'tests::every_product_requires_a_task_chooser_and_each_supported_interface' (260) panicked at crates/alphal00p-docs-builder/src/lib.rs:11901:9:
  80. 19.71 s gammaloop-nextest-docs> assertion failed: format!("{error:#}").contains("has no quickstart page")
  81. 19.71 s gammaloop-nextest-docs> stack backtrace:
  82. 19.71 s gammaloop-nextest-docs> 0: __rustc::rust_begin_unwind
  83. 19.71 s gammaloop-nextest-docs> 1: core::panicking::panic_fmt
  84. 19.71 s gammaloop-nextest-docs> 2: core::panicking::panic
  85. 19.71 s gammaloop-nextest-docs> 3: alphal00p_docs_builder::tests::every_product_requires_a_task_chooser_and_each_supported_interface
  86. 19.71 s gammaloop-nextest-docs> 4: <alphal00p_docs_builder::tests::every_product_requires_a_task_chooser_and_each_supported_interface::{closure#0} as core::ops::function::FnOnce<()>>::call_once
  87. 19.71 s gammaloop-nextest-docs> note: Some details are omitted, run with `RUST_BACKTRACE=full` for a verbose backtrace.
  88. 19.71 s gammaloop-nextest-docs>
  89. 19.72 s gammaloop-nextest-docs> FAIL [ 0.101s] ( 84/111) alphal00p-docs-builder tests::checked_in_registry_is_valid
  90. 19.72 s gammaloop-nextest-docs> stdout ---
  91. 19.72 s gammaloop-nextest-docs>
  92. 19.72 s gammaloop-nextest-docs> running 1 test
  93. 19.72 s gammaloop-nextest-docs> test tests::checked_in_registry_is_valid ... FAILED
  94. 19.72 s gammaloop-nextest-docs>
  95. 19.72 s gammaloop-nextest-docs> failures:
  96. 19.72 s gammaloop-nextest-docs>
  97. 19.72 s gammaloop-nextest-docs> failures:
  98. 19.72 s gammaloop-nextest-docs> tests::checked_in_registry_is_valid
  99. 19.72 s gammaloop-nextest-docs>
  100. 19.72 s gammaloop-nextest-docs> test result: FAILED. 0 passed; 1 failed; 0 ignored; 0 measured; 110 filtered out; finished in 0.09s
  101. 19.72 s gammaloop-nextest-docs>
  102. 19.72 s gammaloop-nextest-docs> stderr ---
  103. 19.72 s gammaloop-nextest-docs> warning: developer note gammaloop-architecture still requires a named owner
  104. 19.72 s gammaloop-nextest-docs> warning: developer note integration-dashboard still requires a named owner
  105. 19.72 s gammaloop-nextest-docs> warning: developer note uv-renormalization still requires a named owner
  106. 19.72 s gammaloop-nextest-docs> warning: developer note spenso-parsing-flow still requires a named owner
  107. 19.72 s gammaloop-nextest-docs> warning: developer note schoonschip-network still requires a named owner
  108. 19.72 s gammaloop-nextest-docs> warning: developer note gammaloop-draw-style-migration still requires a named owner
  109. 19.72 s gammaloop-nextest-docs> warning: developer note gammaloop-drawing-architecture still requires a named owner
  110. 19.72 s gammaloop-nextest-docs> warning: developer note spenso-symbolica-syntax-and-rewrites still requires a named owner
  111. 19.72 s gammaloop-nextest-docs> warning: developer note spenso-architecture still requires a named owner
  112. 19.72 s gammaloop-nextest-docs> warning: developer note idenso-architecture still requires a named owner
  113. 19.72 s gammaloop-nextest-docs> warning: developer note idenso-form-color-dirac-source-map still requires a named owner
  114. 19.72 s gammaloop-nextest-docs> warning: developer note linnet-architecture still requires a named owner
  115. 19.72 s gammaloop-nextest-docs> warning: developer note vakint-architecture still requires a named owner
  116. 19.72 s gammaloop-nextest-docs> warning: developer note gammaloop-roadmap still requires a named owner
  117. 19.72 s gammaloop-nextest-docs> warning: developer note cff-surface-cache-ownership still requires a named owner
  118. 19.72 s gammaloop-nextest-docs> warning: developer note gammaloop-drawing-evaluated-fields-history still requires a named owner
  119. 19.72 s gammaloop-nextest-docs> warning: archived developer note gammaloop-drawing-evaluated-fields-history has no immutable evidence revision
  120. 19.72 s gammaloop-nextest-docs> warning: developer note bnl-benchmark-investigation still requires a named owner
  121. 19.72 s gammaloop-nextest-docs> warning: developer note bnl-contraction-order-performance still requires a named owner
  122. 19.72 s gammaloop-nextest-docs> warning: developer note bnl-scalar-alias-capture still requires a named owner
  123. 19.72 s gammaloop-nextest-docs> warning: developer note aa-aa-three-loop-performance-smoke still requires a named owner
  124. 19.72 s gammaloop-nextest-docs> warning: developer note network-simplification still requires a named owner
  125. 19.72 s gammaloop-nextest-docs> warning: investigation developer note network-simplification has no immutable evidence revision
  126. 19.72 s gammaloop-nextest-docs> warning: developer note spenso-large-expressions still requires a named owner
  127. 19.72 s gammaloop-nextest-docs> warning: developer note spenso-improvement-effects still requires a named owner
  128. 19.72 s gammaloop-nextest-docs> warning: archived developer note spenso-improvement-effects has no immutable evidence revision
  129. 19.72 s gammaloop-nextest-docs> warning: developer note spenso-test-baseline still requires a named owner
  130. 19.72 s gammaloop-nextest-docs> warning: archived developer note spenso-test-baseline has no immutable evidence revision
  131. 19.72 s gammaloop-nextest-docs> warning: developer note bnl-evaluator-atom-capture still requires a named owner
  132. 19.72 s gammaloop-nextest-docs> warning: archived developer note bnl-evaluator-atom-capture has no immutable evidence revision
  133. 19.72 s gammaloop-nextest-docs> warning: developer note uv-scalar-profile-benchmark still requires a named owner
  134. 19.72 s gammaloop-nextest-docs> warning: archived developer note uv-scalar-profile-benchmark has no immutable evidence revision
  135. 19.72 s gammaloop-nextest-docs> warning: developer note ci-test-failure-summary-2026-03-25 still requires a named owner
  136. 19.72 s gammaloop-nextest-docs> warning: archived developer note ci-test-failure-summary-2026-03-25 has no immutable evidence revision
  137. 19.72 s gammaloop-nextest-docs> warning: developer note network-execution-rebase-record still requires a named owner
  138. 19.72 s gammaloop-nextest-docs> warning: archived developer note network-execution-rebase-record has no immutable evidence revision
  139. 19.72 s gammaloop-nextest-docs> warning: developer note ratatui-integration-dashboard-history still requires a named owner
  140. 19.72 s gammaloop-nextest-docs> warning: archived developer note ratatui-integration-dashboard-history has no immutable evidence revision
  141. 19.72 s gammaloop-nextest-docs> warning: developer note nix-crane-cache-reuse still requires a named owner
  142. 19.72 s gammaloop-nextest-docs>
  143. 19.72 s gammaloop-nextest-docs> thread 'tests::checked_in_registry_is_valid' (219) panicked at crates/alphal00p-docs-builder/src/lib.rs:11887:50:
  144. 19.72 s gammaloop-nextest-docs> called `Result::unwrap()` on an `Err` value: developer note nix-crane-cache-reuse verified scope flake.nix changed (expected 188504937418859942a6770ca21a4f4e0a7ff125, found 17dc35393f0f0abd5cb31c7eaf1fdc9aa6903ce4); owner review or an explicit no-impact attestation is required
  145. 19.72 s gammaloop-nextest-docs>
  146. 19.72 s gammaloop-nextest-docs> Location:
  147. 19.72 s gammaloop-nextest-docs> crates/alphal00p-docs-builder/src/lib.rs:889:21
  148. 19.72 s gammaloop-nextest-docs> stack backtrace:
  149. 19.72 s gammaloop-nextest-docs> 0: __rustc::rust_begin_unwind
  150. 19.72 s gammaloop-nextest-docs> 1: core::panicking::panic_fmt
  151. 19.72 s gammaloop-nextest-docs> 2: core::result::unwrap_failed
  152. 19.72 s gammaloop-nextest-docs> 3: alphal00p_docs_builder::tests::checked_in_registry_is_valid
  153. 19.72 s gammaloop-nextest-docs> 4: <alphal00p_docs_builder::tests::checked_in_registry_is_valid::{closure#0} as core::ops::function::FnOnce<()>>::call_once
  154. 19.72 s gammaloop-nextest-docs> note: Some details are omitted, run with `RUST_BACKTRACE=full` for a verbose backtrace.
  155. 19.72 s gammaloop-nextest-docs>
  156. 19.73 s gammaloop-nextest-docs> FAIL [ 0.074s] ( 97/111) alphal00p-docs-builder tests::pdf_manual_chapter_order_must_match_the_page_registry
  157. 19.73 s gammaloop-nextest-docs> stdout ---
  158. 19.73 s gammaloop-nextest-docs>
  159. 19.73 s gammaloop-nextest-docs> running 1 test
  160. 19.73 s gammaloop-nextest-docs> test tests::pdf_manual_chapter_order_must_match_the_page_registry ... FAILED
  161. 19.73 s gammaloop-nextest-docs>
  162. 19.73 s gammaloop-nextest-docs> failures:
  163. 19.73 s gammaloop-nextest-docs>
  164. 19.73 s gammaloop-nextest-docs> failures:
  165. 19.73 s gammaloop-nextest-docs> tests::pdf_manual_chapter_order_must_match_the_page_registry
  166. 19.73 s gammaloop-nextest-docs>
  167. 19.73 s gammaloop-nextest-docs> test result: FAILED. 0 passed; 1 failed; 0 ignored; 0 measured; 110 filtered out; finished in 0.07s
  168. 19.73 s gammaloop-nextest-docs>
  169. 19.73 s gammaloop-nextest-docs> stderr ---
  170. 19.73 s gammaloop-nextest-docs> warning: developer note gammaloop-architecture still requires a named owner
  171. 19.73 s gammaloop-nextest-docs> warning: developer note integration-dashboard still requires a named owner
  172. 19.73 s gammaloop-nextest-docs> warning: developer note uv-renormalization still requires a named owner
  173. 19.73 s gammaloop-nextest-docs> warning: developer note spenso-parsing-flow still requires a named owner
  174. 19.73 s gammaloop-nextest-docs> warning: developer note schoonschip-network still requires a named owner
  175. 19.73 s gammaloop-nextest-docs> warning: developer note gammaloop-draw-style-migration still requires a named owner
  176. 19.73 s gammaloop-nextest-docs> warning: developer note gammaloop-drawing-architecture still requires a named owner
  177. 19.73 s gammaloop-nextest-docs> warning: developer note spenso-symbolica-syntax-and-rewrites still requires a named owner
  178. 19.73 s gammaloop-nextest-docs> warning: developer note spenso-architecture still requires a named owner
  179. 19.73 s gammaloop-nextest-docs> warning: developer note idenso-architecture still requires a named owner
  180. 19.73 s gammaloop-nextest-docs> warning: developer note idenso-form-color-dirac-source-map still requires a named owner
  181. 19.73 s gammaloop-nextest-docs> warning: developer note linnet-architecture still requires a named owner
  182. 19.73 s gammaloop-nextest-docs> warning: developer note vakint-architecture still requires a named owner
  183. 19.73 s gammaloop-nextest-docs> warning: developer note gammaloop-roadmap still requires a named owner
  184. 19.73 s gammaloop-nextest-docs> warning: developer note cff-surface-cache-ownership still requires a named owner
  185. 19.73 s gammaloop-nextest-docs> warning: developer note gammaloop-drawing-evaluated-fields-history still requires a named owner
  186. 19.73 s gammaloop-nextest-docs> warning: archived developer note gammaloop-drawing-evaluated-fields-history has no immutable evidence revision
  187. 19.73 s gammaloop-nextest-docs> warning: developer note bnl-benchmark-investigation still requires a named owner
  188. 19.73 s gammaloop-nextest-docs> warning: developer note bnl-contraction-order-performance still requires a named owner
  189. 19.73 s gammaloop-nextest-docs> warning: developer note bnl-scalar-alias-capture still requires a named owner
  190. 19.73 s gammaloop-nextest-docs> warning: developer note aa-aa-three-loop-performance-smoke still requires a named owner
  191. 19.73 s gammaloop-nextest-docs> warning: developer note network-simplification still requires a named owner
  192. 19.73 s gammaloop-nextest-docs> warning: investigation developer note network-simplification has no immutable evidence revision
  193. 19.73 s gammaloop-nextest-docs> warning: developer note spenso-large-expressions still requires a named owner
  194. 19.73 s gammaloop-nextest-docs> warning: developer note spenso-improvement-effects still requires a named owner
  195. 19.73 s gammaloop-nextest-docs> warning: archived developer note spenso-improvement-effects has no immutable evidence revision
  196. 19.73 s gammaloop-nextest-docs> warning: developer note spenso-test-baseline still requires a named owner
  197. 19.73 s gammaloop-nextest-docs> warning: archived developer note spenso-test-baseline has no immutable evidence revision
  198. 19.73 s gammaloop-nextest-docs> warning: developer note bnl-evaluator-atom-capture still requires a named owner
  199. 19.73 s gammaloop-nextest-docs> warning: archived developer note bnl-evaluator-atom-capture has no immutable evidence revision
  200. 19.73 s gammaloop-nextest-docs> warning: developer note uv-scalar-profile-benchmark still requires a named owner
  201. 19.73 s gammaloop-nextest-docs> warning: archived developer note uv-scalar-profile-benchmark has no immutable evidence revision
  202. 19.73 s gammaloop-nextest-docs> warning: developer note ci-test-failure-summary-2026-03-25 still requires a named owner
  203. 19.73 s gammaloop-nextest-docs> warning: archived developer note ci-test-failure-summary-2026-03-25 has no immutable evidence revision
  204. 19.73 s gammaloop-nextest-docs> warning: developer note network-execution-rebase-record still requires a named owner
  205. 19.73 s gammaloop-nextest-docs> warning: archived developer note network-execution-rebase-record has no immutable evidence revision
  206. 19.73 s gammaloop-nextest-docs> warning: developer note ratatui-integration-dashboard-history still requires a named owner
  207. 19.73 s gammaloop-nextest-docs> warning: archived developer note ratatui-integration-dashboard-history has no immutable evidence revision
  208. 19.73 s gammaloop-nextest-docs> warning: developer note nix-crane-cache-reuse still requires a named owner
  209. 19.73 s gammaloop-nextest-docs>
  210. 19.73 s gammaloop-nextest-docs> thread 'tests::pdf_manual_chapter_order_must_match_the_page_registry' (323) panicked at crates/alphal00p-docs-builder/src/lib.rs:11952:9:
  211. 19.73 s gammaloop-nextest-docs> assertion failed: format!("{error:#}").contains("PDF manual chapter order differs")
  212. 19.73 s gammaloop-nextest-docs> stack backtrace:
  213. 19.73 s gammaloop-nextest-docs> 0: __rustc::rust_begin_unwind
  214. 19.73 s gammaloop-nextest-docs> 1: core::panicking::panic_fmt
  215. 19.73 s gammaloop-nextest-docs> 2: core::panicking::panic
  216. 19.73 s gammaloop-nextest-docs> 3: alphal00p_docs_builder::tests::pdf_manual_chapter_order_must_match_the_page_registry
  217. 19.73 s gammaloop-nextest-docs> 4: <alphal00p_docs_builder::tests::pdf_manual_chapter_order_must_match_the_page_registry::{closure#0} as core::ops::function::FnOnce<()>>::call_once
  218. 19.73 s gammaloop-nextest-docs> note: Some details are omitted, run with `RUST_BACKTRACE=full` for a verbose backtrace.
  219. 19.73 s gammaloop-nextest-docs>
  220. 33.25 s gammaloop-nextest-docs> ------------
  221. 33.25 s gammaloop-nextest-docs> Summary [ 13.628s] 111 tests run: 108 passed, 3 failed, 0 skipped
  222. 33.25 s gammaloop-nextest-docs> FAIL [ 0.080s] ( 78/111) alphal00p-docs-builder tests::every_product_requires_a_task_chooser_and_each_supported_interface
  223. 33.25 s gammaloop-nextest-docs> stdout ---
  224. 33.25 s gammaloop-nextest-docs>
  225. 33.25 s gammaloop-nextest-docs> running 1 test
  226. 33.25 s gammaloop-nextest-docs> test tests::every_product_requires_a_task_chooser_and_each_supported_interface ... FAILED
  227. 33.25 s gammaloop-nextest-docs>
  228. 33.25 s gammaloop-nextest-docs> failures:
  229. 33.25 s gammaloop-nextest-docs>
  230. 33.25 s gammaloop-nextest-docs> failures:
  231. 33.25 s gammaloop-nextest-docs> tests::every_product_requires_a_task_chooser_and_each_supported_interface
  232. 33.25 s gammaloop-nextest-docs>
  233. 33.25 s gammaloop-nextest-docs> test result: FAILED. 0 passed; 1 failed; 0 ignored; 0 measured; 110 filtered out; finished in 0.08s
  234. 33.25 s gammaloop-nextest-docs>
  235. 33.25 s gammaloop-nextest-docs> stderr ---
  236. 33.25 s gammaloop-nextest-docs> warning: developer note gammaloop-architecture still requires a named owner
  237. 33.25 s gammaloop-nextest-docs> warning: developer note integration-dashboard still requires a named owner
  238. 33.25 s gammaloop-nextest-docs> warning: developer note uv-renormalization still requires a named owner
  239. 33.25 s gammaloop-nextest-docs> warning: developer note spenso-parsing-flow still requires a named owner
  240. 33.25 s gammaloop-nextest-docs> warning: developer note schoonschip-network still requires a named owner
  241. 33.25 s gammaloop-nextest-docs> warning: developer note gammaloop-draw-style-migration still requires a named owner
  242. 33.25 s gammaloop-nextest-docs> warning: developer note gammaloop-drawing-architecture still requires a named owner
  243. 33.25 s gammaloop-nextest-docs> warning: developer note spenso-symbolica-syntax-and-rewrites still requires a named owner
  244. 33.25 s gammaloop-nextest-docs> warning: developer note spenso-architecture still requires a named owner
  245. 33.25 s gammaloop-nextest-docs> warning: developer note idenso-architecture still requires a named owner
  246. 33.25 s gammaloop-nextest-docs> warning: developer note idenso-form-color-dirac-source-map still requires a named owner
  247. 33.25 s gammaloop-nextest-docs> warning: developer note linnet-architecture still requires a named owner
  248. 33.25 s gammaloop-nextest-docs> warning: developer note vakint-architecture still requires a named owner
  249. 33.25 s gammaloop-nextest-docs> warning: developer note gammaloop-roadmap still requires a named owner
  250. 33.25 s gammaloop-nextest-docs> warning: developer note cff-surface-cache-ownership still requires a named owner
  251. 33.25 s gammaloop-nextest-docs> warning: developer note gammaloop-drawing-evaluated-fields-history still requires a named owner
  252. 33.25 s gammaloop-nextest-docs> warning: archived developer note gammaloop-drawing-evaluated-fields-history has no immutable evidence revision
  253. 33.25 s gammaloop-nextest-docs> warning: developer note bnl-benchmark-investigation still requires a named owner
  254. 33.25 s gammaloop-nextest-docs> warning: developer note bnl-contraction-order-performance still requires a named owner
  255. 33.25 s gammaloop-nextest-docs> warning: developer note bnl-scalar-alias-capture still requires a named owner
  256. 33.25 s gammaloop-nextest-docs> warning: developer note aa-aa-three-loop-performance-smoke still requires a named owner
  257. 33.25 s gammaloop-nextest-docs> warning: developer note network-simplification still requires a named owner
  258. 33.25 s gammaloop-nextest-docs> warning: investigation developer note network-simplification has no immutable evidence revision
  259. 33.25 s gammaloop-nextest-docs> warning: developer note spenso-large-expressions still requires a named owner
  260. 33.25 s gammaloop-nextest-docs> warning: developer note spenso-improvement-effects still requires a named owner
  261. 33.25 s gammaloop-nextest-docs> warning: archived developer note spenso-improvement-effects has no immutable evidence revision
  262. 33.25 s gammaloop-nextest-docs> warning: developer note spenso-test-baseline still requires a named owner
  263. 33.25 s gammaloop-nextest-docs> warning: archived developer note spenso-test-baseline has no immutable evidence revision
  264. 33.25 s gammaloop-nextest-docs> warning: developer note bnl-evaluator-atom-capture still requires a named owner
  265. 33.25 s gammaloop-nextest-docs> warning: archived developer note bnl-evaluator-atom-capture has no immutable evidence revision
  266. 33.25 s gammaloop-nextest-docs> warning: developer note uv-scalar-profile-benchmark still requires a named owner
  267. 33.25 s gammaloop-nextest-docs> warning: archived developer note uv-scalar-profile-benchmark has no immutable evidence revision
  268. 33.25 s gammaloop-nextest-docs> warning: developer note ci-test-failure-summary-2026-03-25 still requires a named owner
  269. 33.25 s gammaloop-nextest-docs> warning: archived developer note ci-test-failure-summary-2026-03-25 has no immutable evidence revision
  270. 33.25 s gammaloop-nextest-docs> warning: developer note network-execution-rebase-record still requires a named owner
  271. 33.25 s gammaloop-nextest-docs> warning: archived developer note network-execution-rebase-record has no immutable evidence revision
  272. 33.25 s gammaloop-nextest-docs> warning: developer note ratatui-integration-dashboard-history still requires a named owner
  273. 33.25 s gammaloop-nextest-docs> warning: archived developer note ratatui-integration-dashboard-history has no immutable evidence revision
  274. 33.25 s gammaloop-nextest-docs> warning: developer note nix-crane-cache-reuse still requires a named owner
  275. 33.25 s gammaloop-nextest-docs>
  276. 33.25 s gammaloop-nextest-docs> thread 'tests::every_product_requires_a_task_chooser_and_each_supported_interface' (260) panicked at crates/alphal00p-docs-builder/src/lib.rs:11901:9:
  277. 33.25 s gammaloop-nextest-docs> assertion failed: format!("{error:#}").contains("has no quickstart page")
  278. 33.25 s gammaloop-nextest-docs> stack backtrace:
  279. 33.25 s gammaloop-nextest-docs> 0: __rustc::rust_begin_unwind
  280. 33.25 s gammaloop-nextest-docs> 1: core::panicking::panic_fmt
  281. 33.25 s gammaloop-nextest-docs> 2: core::panicking::panic
  282. 33.25 s gammaloop-nextest-docs> 3: alphal00p_docs_builder::tests::every_product_requires_a_task_chooser_and_each_supported_interface
  283. 33.25 s gammaloop-nextest-docs> 4: <alphal00p_docs_builder::tests::every_product_requires_a_task_chooser_and_each_supported_interface::{closure#0} as core::ops::function::FnOnce<()>>::call_once
  284. 33.25 s gammaloop-nextest-docs> note: Some details are omitted, run with `RUST_BACKTRACE=full` for a verbose backtrace.
  285. 33.25 s gammaloop-nextest-docs>
  286. 33.25 s gammaloop-nextest-docs> FAIL [ 0.101s] ( 84/111) alphal00p-docs-builder tests::checked_in_registry_is_valid
  287. 33.25 s gammaloop-nextest-docs> stdout ---
  288. 33.25 s gammaloop-nextest-docs>
  289. 33.25 s gammaloop-nextest-docs> running 1 test
  290. 33.25 s gammaloop-nextest-docs> test tests::checked_in_registry_is_valid ... FAILED
  291. 33.25 s gammaloop-nextest-docs>
  292. 33.25 s gammaloop-nextest-docs> failures:
  293. 33.25 s gammaloop-nextest-docs>
  294. 33.25 s gammaloop-nextest-docs> failures:
  295. 33.25 s gammaloop-nextest-docs> tests::checked_in_registry_is_valid
  296. 33.25 s gammaloop-nextest-docs>
  297. 33.25 s gammaloop-nextest-docs> test result: FAILED. 0 passed; 1 failed; 0 ignored; 0 measured; 110 filtered out; finished in 0.09s
  298. 33.25 s gammaloop-nextest-docs>
  299. 33.25 s gammaloop-nextest-docs> stderr ---
  300. 33.25 s gammaloop-nextest-docs> warning: developer note gammaloop-architecture still requires a named owner
  301. 33.25 s gammaloop-nextest-docs> warning: developer note integration-dashboard still requires a named owner
  302. 33.25 s gammaloop-nextest-docs> warning: developer note uv-renormalization still requires a named owner
  303. 33.25 s gammaloop-nextest-docs> warning: developer note spenso-parsing-flow still requires a named owner
  304. 33.25 s gammaloop-nextest-docs> warning: developer note schoonschip-network still requires a named owner
  305. 33.25 s gammaloop-nextest-docs> warning: developer note gammaloop-draw-style-migration still requires a named owner
  306. 33.25 s gammaloop-nextest-docs> warning: developer note gammaloop-drawing-architecture still requires a named owner
  307. 33.25 s gammaloop-nextest-docs> warning: developer note spenso-symbolica-syntax-and-rewrites still requires a named owner
  308. 33.25 s gammaloop-nextest-docs> warning: developer note spenso-architecture still requires a named owner
  309. 33.25 s gammaloop-nextest-docs> warning: developer note idenso-architecture still requires a named owner
  310. 33.25 s gammaloop-nextest-docs> warning: developer note idenso-form-color-dirac-source-map still requires a named owner
  311. 33.25 s gammaloop-nextest-docs> warning: developer note linnet-architecture still requires a named owner
  312. 33.25 s gammaloop-nextest-docs> warning: developer note vakint-architecture still requires a named owner
  313. 33.25 s gammaloop-nextest-docs> warning: developer note gammaloop-roadmap still requires a named owner
  314. 33.25 s gammaloop-nextest-docs> warning: developer note cff-surface-cache-ownership still requires a named owner
  315. 33.25 s gammaloop-nextest-docs> warning: developer note gammaloop-drawing-evaluated-fields-history still requires a named owner
  316. 33.25 s gammaloop-nextest-docs> warning: archived developer note gammaloop-drawing-evaluated-fields-history has no immutable evidence revision
  317. 33.25 s gammaloop-nextest-docs> warning: developer note bnl-benchmark-investigation still requires a named owner
  318. 33.25 s gammaloop-nextest-docs> warning: developer note bnl-contraction-order-performance still requires a named owner
  319. 33.25 s gammaloop-nextest-docs> warning: developer note bnl-scalar-alias-capture still requires a named owner
  320. 33.25 s gammaloop-nextest-docs> warning: developer note aa-aa-three-loop-performance-smoke still requires a named owner
  321. 33.25 s gammaloop-nextest-docs> warning: developer note network-simplification still requires a named owner
  322. 33.25 s gammaloop-nextest-docs> warning: investigation developer note network-simplification has no immutable evidence revision
  323. 33.25 s gammaloop-nextest-docs> warning: developer note spenso-large-expressions still requires a named owner
  324. 33.25 s gammaloop-nextest-docs> warning: developer note spenso-improvement-effects still requires a named owner
  325. 33.25 s gammaloop-nextest-docs> warning: archived developer note spenso-improvement-effects has no immutable evidence revision
  326. 33.25 s gammaloop-nextest-docs> warning: developer note spenso-test-baseline still requires a named owner
  327. 33.25 s gammaloop-nextest-docs> warning: archived developer note spenso-test-baseline has no immutable evidence revision
  328. 33.25 s gammaloop-nextest-docs> warning: developer note bnl-evaluator-atom-capture still requires a named owner
  329. 33.25 s gammaloop-nextest-docs> warning: archived developer note bnl-evaluator-atom-capture has no immutable evidence revision
  330. 33.25 s gammaloop-nextest-docs> warning: developer note uv-scalar-profile-benchmark still requires a named owner
  331. 33.25 s gammaloop-nextest-docs> warning: archived developer note uv-scalar-profile-benchmark has no immutable evidence revision
  332. 33.25 s gammaloop-nextest-docs> warning: developer note ci-test-failure-summary-2026-03-25 still requires a named owner
  333. 33.25 s gammaloop-nextest-docs> warning: archived developer note ci-test-failure-summary-2026-03-25 has no immutable evidence revision
  334. 33.25 s gammaloop-nextest-docs> warning: developer note network-execution-rebase-record still requires a named owner
  335. 33.25 s gammaloop-nextest-docs> warning: archived developer note network-execution-rebase-record has no immutable evidence revision
  336. 33.25 s gammaloop-nextest-docs> warning: developer note ratatui-integration-dashboard-history still requires a named owner
  337. 33.25 s gammaloop-nextest-docs> warning: archived developer note ratatui-integration-dashboard-history has no immutable evidence revision
  338. 33.25 s gammaloop-nextest-docs> warning: developer note nix-crane-cache-reuse still requires a named owner
  339. 33.25 s gammaloop-nextest-docs>
  340. 33.25 s gammaloop-nextest-docs> thread 'tests::checked_in_registry_is_valid' (219) panicked at crates/alphal00p-docs-builder/src/lib.rs:11887:50:
  341. 33.25 s gammaloop-nextest-docs> called `Result::unwrap()` on an `Err` value: developer note nix-crane-cache-reuse verified scope flake.nix changed (expected 188504937418859942a6770ca21a4f4e0a7ff125, found 17dc35393f0f0abd5cb31c7eaf1fdc9aa6903ce4); owner review or an explicit no-impact attestation is required
  342. 33.25 s gammaloop-nextest-docs>
  343. 33.25 s gammaloop-nextest-docs> Location:
  344. 33.25 s gammaloop-nextest-docs> crates/alphal00p-docs-builder/src/lib.rs:889:21
  345. 33.25 s gammaloop-nextest-docs> stack backtrace:
  346. 33.25 s gammaloop-nextest-docs> 0: __rustc::rust_begin_unwind
  347. 33.25 s gammaloop-nextest-docs> 1: core::panicking::panic_fmt
  348. 33.25 s gammaloop-nextest-docs> 2: core::result::unwrap_failed
  349. 33.25 s gammaloop-nextest-docs> 3: alphal00p_docs_builder::tests::checked_in_registry_is_valid
  350. 33.25 s gammaloop-nextest-docs> 4: <alphal00p_docs_builder::tests::checked_in_registry_is_valid::{closure#0} as core::ops::function::FnOnce<()>>::call_once
  351. 33.25 s gammaloop-nextest-docs> note: Some details are omitted, run with `RUST_BACKTRACE=full` for a verbose backtrace.
  352. 33.25 s gammaloop-nextest-docs>
  353. 33.25 s gammaloop-nextest-docs> FAIL [ 0.074s] ( 97/111) alphal00p-docs-builder tests::pdf_manual_chapter_order_must_match_the_page_registry
  354. 33.25 s gammaloop-nextest-docs> stdout ---
  355. 33.25 s gammaloop-nextest-docs>
  356. 33.25 s gammaloop-nextest-docs> running 1 test
  357. 33.25 s gammaloop-nextest-docs> test tests::pdf_manual_chapter_order_must_match_the_page_registry ... FAILED
  358. 33.25 s gammaloop-nextest-docs>
  359. 33.25 s gammaloop-nextest-docs> failures:
  360. 33.25 s gammaloop-nextest-docs>
  361. 33.25 s gammaloop-nextest-docs> failures:
  362. 33.25 s gammaloop-nextest-docs> tests::pdf_manual_chapter_order_must_match_the_page_registry
  363. 33.25 s gammaloop-nextest-docs>
  364. 33.25 s gammaloop-nextest-docs> test result: FAILED. 0 passed; 1 failed; 0 ignored; 0 measured; 110 filtered out; finished in 0.07s
  365. 33.25 s gammaloop-nextest-docs>
  366. 33.25 s gammaloop-nextest-docs> stderr ---
  367. 33.25 s gammaloop-nextest-docs> warning: developer note gammaloop-architecture still requires a named owner
  368. 33.25 s gammaloop-nextest-docs> warning: developer note integration-dashboard still requires a named owner
  369. 33.25 s gammaloop-nextest-docs> warning: developer note uv-renormalization still requires a named owner
  370. 33.25 s gammaloop-nextest-docs> warning: developer note spenso-parsing-flow still requires a named owner
  371. 33.25 s gammaloop-nextest-docs> warning: developer note schoonschip-network still requires a named owner
  372. 33.25 s gammaloop-nextest-docs> warning: developer note gammaloop-draw-style-migration still requires a named owner
  373. 33.25 s gammaloop-nextest-docs> warning: developer note gammaloop-drawing-architecture still requires a named owner
  374. 33.25 s gammaloop-nextest-docs> warning: developer note spenso-symbolica-syntax-and-rewrites still requires a named owner
  375. 33.25 s gammaloop-nextest-docs> warning: developer note spenso-architecture still requires a named owner
  376. 33.25 s gammaloop-nextest-docs> warning: developer note idenso-architecture still requires a named owner
  377. 33.25 s gammaloop-nextest-docs> warning: developer note idenso-form-color-dirac-source-map still requires a named owner
  378. 33.25 s gammaloop-nextest-docs> warning: developer note linnet-architecture still requires a named owner
  379. 33.25 s gammaloop-nextest-docs> warning: developer note vakint-architecture still requires a named owner
  380. 33.25 s gammaloop-nextest-docs> warning: developer note gammaloop-roadmap still requires a named owner
  381. 33.25 s gammaloop-nextest-docs> warning: developer note cff-surface-cache-ownership still requires a named owner
  382. 33.25 s gammaloop-nextest-docs> warning: developer note gammaloop-drawing-evaluated-fields-history still requires a named owner
  383. 33.25 s gammaloop-nextest-docs> warning: archived developer note gammaloop-drawing-evaluated-fields-history has no immutable evidence revision
  384. 33.25 s gammaloop-nextest-docs> warning: developer note bnl-benchmark-investigation still requires a named owner
  385. 33.25 s gammaloop-nextest-docs> warning: developer note bnl-contraction-order-performance still requires a named owner
  386. 33.25 s gammaloop-nextest-docs> warning: developer note bnl-scalar-alias-capture still requires a named owner
  387. 33.25 s gammaloop-nextest-docs> warning: developer note aa-aa-three-loop-performance-smoke still requires a named owner
  388. 33.25 s gammaloop-nextest-docs> warning: developer note network-simplification still requires a named owner
  389. 33.25 s gammaloop-nextest-docs> warning: investigation developer note network-simplification has no immutable evidence revision
  390. 33.25 s gammaloop-nextest-docs> warning: developer note spenso-large-expressions still requires a named owner
  391. 33.25 s gammaloop-nextest-docs> warning: developer note spenso-improvement-effects still requires a named owner
  392. 33.25 s gammaloop-nextest-docs> warning: archived developer note spenso-improvement-effects has no immutable evidence revision
  393. 33.25 s gammaloop-nextest-docs> warning: developer note spenso-test-baseline still requires a named owner
  394. 33.25 s gammaloop-nextest-docs> warning: archived developer note spenso-test-baseline has no immutable evidence revision
  395. 33.25 s gammaloop-nextest-docs> warning: developer note bnl-evaluator-atom-capture still requires a named owner
  396. 33.25 s gammaloop-nextest-docs> warning: archived developer note bnl-evaluator-atom-capture has no immutable evidence revision
  397. 33.25 s gammaloop-nextest-docs> warning: developer note uv-scalar-profile-benchmark still requires a named owner
  398. 33.25 s gammaloop-nextest-docs> warning: archived developer note uv-scalar-profile-benchmark has no immutable evidence revision
  399. 33.25 s gammaloop-nextest-docs> warning: developer note ci-test-failure-summary-2026-03-25 still requires a named owner
  400. 33.25 s gammaloop-nextest-docs> warning: archived developer note ci-test-failure-summary-2026-03-25 has no immutable evidence revision
  401. 33.25 s gammaloop-nextest-docs> warning: developer note network-execution-rebase-record still requires a named owner
  402. 33.25 s gammaloop-nextest-docs> warning: archived developer note network-execution-rebase-record has no immutable evidence revision
  403. 33.25 s gammaloop-nextest-docs> warning: developer note ratatui-integration-dashboard-history still requires a named owner
  404. 33.25 s gammaloop-nextest-docs> warning: archived developer note ratatui-integration-dashboard-history has no immutable evidence revision
  405. 33.25 s gammaloop-nextest-docs> warning: developer note nix-crane-cache-reuse still requires a named owner
  406. 33.25 s gammaloop-nextest-docs>
  407. 33.25 s gammaloop-nextest-docs> thread 'tests::pdf_manual_chapter_order_must_match_the_page_registry' (323) panicked at crates/alphal00p-docs-builder/src/lib.rs:11952:9:
  408. 33.25 s gammaloop-nextest-docs> assertion failed: format!("{error:#}").contains("PDF manual chapter order differs")
  409. 33.25 s gammaloop-nextest-docs> stack backtrace:
  410. 33.25 s gammaloop-nextest-docs> 0: __rustc::rust_begin_unwind
  411. 33.25 s gammaloop-nextest-docs> 1: core::panicking::panic_fmt
  412. 33.25 s gammaloop-nextest-docs> 2: core::panicking::panic
  413. 33.25 s gammaloop-nextest-docs> 3: alphal00p_docs_builder::tests::pdf_manual_chapter_order_must_match_the_page_registry
  414. 33.25 s gammaloop-nextest-docs> 4: <alphal00p_docs_builder::tests::pdf_manual_chapter_order_must_match_the_page_registry::{closure#0} as core::ops::function::FnOnce<()>>::call_once
  415. 33.25 s gammaloop-nextest-docs> note: Some details are omitted, run with `RUST_BACKTRACE=full` for a verbose backtrace.
  416. 33.25 s gammaloop-nextest-docs>
  417. 33.25 s gammaloop-nextest-docs> error: test run failed
  418. 33.28 s gammaloop-nextest-docs>
  419. 33.28 s gammaloop-nextest-docs> ========== nextest test summary ==========
  420. 33.28 s gammaloop-nextest-docs> report: target/nextest/ci_gammaloop/junit.xml
  421. 33.28 s gammaloop-nextest-docs> tests: 111, failures: 3, errors: 0
  422. 33.28 s gammaloop-nextest-docs>
  423. 33.28 s gammaloop-nextest-docs> 1. alphal00p-docs-builder::tests::every_product_requires_a_task_chooser_and_each_supported_interface
  424. 33.28 s gammaloop-nextest-docs> failure: test failure with exit code 101
  425. 33.28 s gammaloop-nextest-docs> thread 'tests::every_product_requires_a_task_chooser_and_each_supported_interface' (260) panicked at crates/alphal00p-docs-builder/src/lib.rs:11901:9:
  426. 33.28 s gammaloop-nextest-docs> assertion failed: format!("{error:#}").contains("has no quickstart page")
  427. 33.28 s gammaloop-nextest-docs> stack backtrace:
  428. 33.28 s gammaloop-nextest-docs> 0: __rustc::rust_begin_unwind
  429. 33.28 s gammaloop-nextest-docs> 1: core::panicking::panic_fmt
  430. 33.28 s gammaloop-nextest-docs> 2: core::panicking::panic
  431. 33.28 s gammaloop-nextest-docs> 3: alphal00p_docs_builder::tests::every_product_requires_a_task_chooser_and_each_supported_interface
  432. 33.28 s gammaloop-nextest-docs> 4: <alphal00p_docs_builder::tests::every_product_requires_a_task_chooser_and_each_supported_interface::{closure#0} as core::ops::function::FnOnce<()>>::call_once
  433. 33.28 s gammaloop-nextest-docs> note: Some details are omitted, run with `RUST_BACKTRACE=full` for a verbose backtrace.
  434. 33.28 s gammaloop-nextest-docs> system-out
  435. 33.28 s gammaloop-nextest-docs> running 1 test
  436. 33.28 s gammaloop-nextest-docs> test tests::every_product_requires_a_task_chooser_and_each_supported_interface ... FAILED
  437. 33.28 s gammaloop-nextest-docs>
  438. 33.28 s gammaloop-nextest-docs> failures:
  439. 33.28 s gammaloop-nextest-docs>
  440. 33.28 s gammaloop-nextest-docs> failures:
  441. 33.28 s gammaloop-nextest-docs> tests::every_product_requires_a_task_chooser_and_each_supported_interface
  442. 33.28 s gammaloop-nextest-docs>
  443. 33.28 s gammaloop-nextest-docs> test result: FAILED. 0 passed; 1 failed; 0 ignored; 0 measured; 110 filtered out; finished in 0.08s
  444. 33.28 s gammaloop-nextest-docs> system-err
  445. 33.28 s gammaloop-nextest-docs> warning: developer note gammaloop-architecture still requires a named owner
  446. 33.28 s gammaloop-nextest-docs> warning: developer note integration-dashboard still requires a named owner
  447. 33.28 s gammaloop-nextest-docs> warning: developer note uv-renormalization still requires a named owner
  448. 33.28 s gammaloop-nextest-docs> warning: developer note spenso-parsing-flow still requires a named owner
  449. 33.28 s gammaloop-nextest-docs> warning: developer note schoonschip-network still requires a named owner
  450. 33.28 s gammaloop-nextest-docs> warning: developer note gammaloop-draw-style-migration still requires a named owner
  451. 33.28 s gammaloop-nextest-docs> warning: developer note gammaloop-drawing-architecture still requires a named owner
  452. 33.28 s gammaloop-nextest-docs> warning: developer note spenso-symbolica-syntax-and-rewrites still requires a named owner
  453. 33.28 s gammaloop-nextest-docs> warning: developer note spenso-architecture still requires a named owner
  454. 33.28 s gammaloop-nextest-docs> warning: developer note idenso-architecture still requires a named owner
  455. 33.28 s gammaloop-nextest-docs> warning: developer note idenso-form-color-dirac-source-map still requires a named owner
  456. 33.28 s gammaloop-nextest-docs> warning: developer note linnet-architecture still requires a named owner
  457. 33.28 s gammaloop-nextest-docs> warning: developer note vakint-architecture still requires a named owner
  458. 33.28 s gammaloop-nextest-docs> warning: developer note gammaloop-roadmap still requires a named owner
  459. 33.28 s gammaloop-nextest-docs> warning: developer note cff-surface-cache-ownership still requires a named owner
  460. 33.28 s gammaloop-nextest-docs> warning: developer note gammaloop-drawing-evaluated-fields-history still requires a named owner
  461. 33.28 s gammaloop-nextest-docs> warning: archived developer note gammaloop-drawing-evaluated-fields-history has no immutable evidence revision
  462. 33.28 s gammaloop-nextest-docs> warning: developer note bnl-benchmark-investigation still requires a named owner
  463. 33.28 s gammaloop-nextest-docs> warning: developer note bnl-contraction-order-performance still requires a named owner
  464. 33.28 s gammaloop-nextest-docs> warning: developer note bnl-scalar-alias-capture still requires a named owner
  465. 33.28 s gammaloop-nextest-docs> warning: developer note aa-aa-three-loop-performance-smoke still requires a named owner
  466. 33.28 s gammaloop-nextest-docs> warning: developer note network-simplification still requires a named owner
  467. 33.28 s gammaloop-nextest-docs> warning: investigation developer note network-simplification has no immutable evidence revision
  468. 33.28 s gammaloop-nextest-docs> warning: developer note spenso-large-expressions still requires a named owner
  469. 33.28 s gammaloop-nextest-docs> warning: developer note spenso-improvement-effects still requires a named owner
  470. 33.28 s gammaloop-nextest-docs> warning: archived developer note spenso-improvement-effects has no immutable evidence revision
  471. 33.28 s gammaloop-nextest-docs> warning: developer note spenso-test-baseline still requires a named owner
  472. 33.28 s gammaloop-nextest-docs> warning: archived developer note spenso-test-baseline has no immutable evidence revision
  473. 33.28 s gammaloop-nextest-docs> warning: developer note bnl-evaluator-atom-capture still requires a named owner
  474. 33.28 s gammaloop-nextest-docs> warning: archived developer note bnl-evaluator-atom-capture has no immutable evidence revision
  475. 33.28 s gammaloop-nextest-docs> warning: developer note uv-scalar-profile-benchmark still requires a named owner
  476. 33.28 s gammaloop-nextest-docs> warning: archived developer note uv-scalar-profile-benchmark has no immutable evidence revision
  477. 33.28 s gammaloop-nextest-docs> warning: developer note ci-test-failure-summary-2026-03-25 still requires a named owner
  478. 33.28 s gammaloop-nextest-docs> warning: archived developer note ci-test-failure-summary-2026-03-25 has no immutable evidence revision
  479. 33.28 s gammaloop-nextest-docs> warning: developer note network-execution-rebase-record still requires a named owner
  480. 33.28 s gammaloop-nextest-docs> warning: archived developer note network-execution-rebase-record has no immutable evidence revision
  481. 33.28 s gammaloop-nextest-docs> warning: developer note ratatui-integration-dashboard-history still requires a named owner
  482. 33.28 s gammaloop-nextest-docs> warning: archived developer note ratatui-integration-dashboard-history has no immutable evidence revision
  483. 33.28 s gammaloop-nextest-docs> warning: developer note nix-crane-cache-reuse still requires a named owner
  484. 33.28 s gammaloop-nextest-docs>
  485. 33.28 s gammaloop-nextest-docs> thread 'tests::every_product_requires_a_task_chooser_and_each_supported_interface' (260) panicked at crates/alphal00p-docs-builder/src/lib.rs:11901:9:
  486. 33.28 s gammaloop-nextest-docs> assertion failed: format!("{error:#}").contains("has no quickstart page")
  487. 33.28 s gammaloop-nextest-docs> stack backtrace:
  488. 33.28 s gammaloop-nextest-docs> 0: __rustc::rust_begin_unwind
  489. 33.28 s gammaloop-nextest-docs> 1: core::panicking::panic_fmt
  490. 33.28 s gammaloop-nextest-docs> 2: core::panicking::panic
  491. 33.28 s gammaloop-nextest-docs> 3: alphal00p_docs_builder::tests::every_product_requires_a_task_chooser_and_each_supported_interface
  492. 33.28 s gammaloop-nextest-docs> 4: <alphal00p_docs_builder::tests::every_product_requires_a_task_chooser_and_each_supported_interface::{closure#0} as core::ops::function::FnOnce<()>>::call_once
  493. 33.28 s gammaloop-nextest-docs> note: Some details are omitted, run with `RUST_BACKTRACE=full` for a verbose backtrace.
  494. 33.28 s gammaloop-nextest-docs>
  495. 33.28 s gammaloop-nextest-docs> 2. alphal00p-docs-builder::tests::checked_in_registry_is_valid
  496. 33.28 s gammaloop-nextest-docs> failure: test failure with exit code 101
  497. 33.28 s gammaloop-nextest-docs> thread 'tests::checked_in_registry_is_valid' (219) panicked at crates/alphal00p-docs-builder/src/lib.rs:11887:50:
  498. 33.28 s gammaloop-nextest-docs> called `Result::unwrap()` on an `Err` value: developer note nix-crane-cache-reuse verified scope flake.nix changed (expected 188504937418859942a6770ca21a4f4e0a7ff125, found 17dc35393f0f0abd5cb31c7eaf1fdc9aa6903ce4); owner review or an explicit no-impact attestation is required
  499. 33.28 s gammaloop-nextest-docs>
  500. 33.28 s gammaloop-nextest-docs> Location:
  501. 33.28 s gammaloop-nextest-docs> crates/alphal00p-docs-builder/src/lib.rs:889:21
  502. 33.28 s gammaloop-nextest-docs> stack backtrace:
  503. 33.28 s gammaloop-nextest-docs> 0: __rustc::rust_begin_unwind
  504. 33.28 s gammaloop-nextest-docs> 1: core::panicking::panic_fmt
  505. 33.28 s gammaloop-nextest-docs> 2: core::result::unwrap_failed
  506. 33.28 s gammaloop-nextest-docs> 3: alphal00p_docs_builder::tests::checked_in_registry_is_valid
  507. 33.28 s gammaloop-nextest-docs> 4: <alphal00p_docs_builder::tests::checked_in_registry_is_valid::{closure#0} as core::ops::function::FnOnce<()>>::call_once
  508. 33.28 s gammaloop-nextest-docs> note: Some details are omitted, run with `RUST_BACKTRACE=full` for a verbose backtrace.
  509. 33.28 s gammaloop-nextest-docs> system-out
  510. 33.28 s gammaloop-nextest-docs> running 1 test
  511. 33.28 s gammaloop-nextest-docs> test tests::checked_in_registry_is_valid ... FAILED
  512. 33.28 s gammaloop-nextest-docs>
  513. 33.28 s gammaloop-nextest-docs> failures:
  514. 33.28 s gammaloop-nextest-docs>
  515. 33.28 s gammaloop-nextest-docs> failures:
  516. 33.28 s gammaloop-nextest-docs> tests::checked_in_registry_is_valid
  517. 33.28 s gammaloop-nextest-docs>
  518. 33.28 s gammaloop-nextest-docs> test result: FAILED. 0 passed; 1 failed; 0 ignored; 0 measured; 110 filtered out; finished in 0.09s
  519. 33.28 s gammaloop-nextest-docs> system-err
  520. 33.28 s gammaloop-nextest-docs> warning: developer note gammaloop-architecture still requires a named owner
  521. 33.28 s gammaloop-nextest-docs> warning: developer note integration-dashboard still requires a named owner
  522. 33.28 s gammaloop-nextest-docs> warning: developer note uv-renormalization still requires a named owner
  523. 33.28 s gammaloop-nextest-docs> warning: developer note spenso-parsing-flow still requires a named owner
  524. 33.28 s gammaloop-nextest-docs> warning: developer note schoonschip-network still requires a named owner
  525. 33.28 s gammaloop-nextest-docs> warning: developer note gammaloop-draw-style-migration still requires a named owner
  526. 33.28 s gammaloop-nextest-docs> warning: developer note gammaloop-drawing-architecture still requires a named owner
  527. 33.28 s gammaloop-nextest-docs> warning: developer note spenso-symbolica-syntax-and-rewrites still requires a named owner
  528. 33.28 s gammaloop-nextest-docs> warning: developer note spenso-architecture still requires a named owner
  529. 33.28 s gammaloop-nextest-docs> warning: developer note idenso-architecture still requires a named owner
  530. 33.28 s gammaloop-nextest-docs> warning: developer note idenso-form-color-dirac-source-map still requires a named owner
  531. 33.28 s gammaloop-nextest-docs> warning: developer note linnet-architecture still requires a named owner
  532. 33.28 s gammaloop-nextest-docs> warning: developer note vakint-architecture still requires a named owner
  533. 33.28 s gammaloop-nextest-docs> warning: developer note gammaloop-roadmap still requires a named owner
  534. 33.28 s gammaloop-nextest-docs> warning: developer note cff-surface-cache-ownership still requires a named owner
  535. 33.28 s gammaloop-nextest-docs> warning: developer note gammaloop-drawing-evaluated-fields-history still requires a named owner
  536. 33.28 s gammaloop-nextest-docs> warning: archived developer note gammaloop-drawing-evaluated-fields-history has no immutable evidence revision
  537. 33.28 s gammaloop-nextest-docs> warning: developer note bnl-benchmark-investigation still requires a named owner
  538. 33.28 s gammaloop-nextest-docs> warning: developer note bnl-contraction-order-performance still requires a named owner
  539. 33.28 s gammaloop-nextest-docs> warning: developer note bnl-scalar-alias-capture still requires a named owner
  540. 33.28 s gammaloop-nextest-docs> warning: developer note aa-aa-three-loop-performance-smoke still requires a named owner
  541. 33.28 s gammaloop-nextest-docs> warning: developer note network-simplification still requires a named owner
  542. 33.28 s gammaloop-nextest-docs> warning: investigation developer note network-simplification has no immutable evidence revision
  543. 33.28 s gammaloop-nextest-docs> warning: developer note spenso-large-expressions still requires a named owner
  544. 33.28 s gammaloop-nextest-docs> warning: developer note spenso-improvement-effects still requires a named owner
  545. 33.28 s gammaloop-nextest-docs> warning: archived developer note spenso-improvement-effects has no immutable evidence revision
  546. 33.28 s gammaloop-nextest-docs> warning: developer note spenso-test-baseline still requires a named owner
  547. 33.28 s gammaloop-nextest-docs> warning: archived developer note spenso-test-baseline has no immutable evidence revision
  548. 33.28 s gammaloop-nextest-docs> warning: developer note bnl-evaluator-atom-capture still requires a named owner
  549. 33.28 s gammaloop-nextest-docs> warning: archived developer note bnl-evaluator-atom-capture has no immutable evidence revision
  550. 33.28 s gammaloop-nextest-docs> warning: developer note uv-scalar-profile-benchmark still requires a named owner
  551. 33.28 s gammaloop-nextest-docs> warning: archived developer note uv-scalar-profile-benchmark has no immutable evidence revision
  552. 33.28 s gammaloop-nextest-docs> warning: developer note ci-test-failure-summary-2026-03-25 still requires a named owner
  553. 33.28 s gammaloop-nextest-docs> warning: archived developer note ci-test-failure-summary-2026-03-25 has no immutable evidence revision
  554. 33.28 s gammaloop-nextest-docs> warning: developer note network-execution-rebase-record still requires a named owner
  555. 33.28 s gammaloop-nextest-docs> warning: archived developer note network-execution-rebase-record has no immutable evidence revision
  556. 33.28 s gammaloop-nextest-docs> warning: developer note ratatui-integration-dashboard-history still requires a named owner
  557. 33.28 s gammaloop-nextest-docs> warning: archived developer note ratatui-integration-dashboard-history has no immutable evidence revision
  558. 33.28 s gammaloop-nextest-docs> warning: developer note nix-crane-cache-reuse still requires a named owner
  559. 33.28 s gammaloop-nextest-docs>
  560. 33.28 s gammaloop-nextest-docs> thread 'tests::checked_in_registry_is_valid' (219) panicked at crates/alphal00p-docs-builder/src/lib.rs:11887:50:
  561. 33.28 s gammaloop-nextest-docs> called `Result::unwrap()` on an `Err` value: developer note nix-crane-cache-reuse verified scope flake.nix changed (expected 188504937418859942a6770ca21a4f4e0a7ff125, found 17dc35393f0f0abd5cb31c7eaf1fdc9aa6903ce4); owner review or an explicit no-impact attestation is required
  562. 33.28 s gammaloop-nextest-docs>
  563. 33.28 s gammaloop-nextest-docs> Location:
  564. 33.28 s gammaloop-nextest-docs> crates/alphal00p-docs-builder/src/lib.rs:889:21
  565. 33.28 s gammaloop-nextest-docs> stack backtrace:
  566. 33.28 s gammaloop-nextest-docs> 0: __rustc::rust_begin_unwind
  567. 33.28 s gammaloop-nextest-docs> 1: core::panicking::panic_fmt
  568. 33.28 s gammaloop-nextest-docs> 2: core::result::unwrap_failed
  569. 33.28 s gammaloop-nextest-docs> 3: alphal00p_docs_builder::tests::checked_in_registry_is_valid
  570. 33.28 s gammaloop-nextest-docs> 4: <alphal00p_docs_builder::tests::checked_in_registry_is_valid::{closure#0} as core::ops::function::FnOnce<()>>::call_once
  571. 33.28 s gammaloop-nextest-docs> note: Some details are omitted, run with `RUST_BACKTRACE=full` for a verbose backtrace.
  572. 33.28 s gammaloop-nextest-docs>
  573. 33.28 s gammaloop-nextest-docs> 3. alphal00p-docs-builder::tests::pdf_manual_chapter_order_must_match_the_page_registry
  574. 33.28 s gammaloop-nextest-docs> failure: test failure with exit code 101
  575. 33.28 s gammaloop-nextest-docs> thread 'tests::pdf_manual_chapter_order_must_match_the_page_registry' (323) panicked at crates/alphal00p-docs-builder/src/lib.rs:11952:9:
  576. 33.28 s gammaloop-nextest-docs> assertion failed: format!("{error:#}").contains("PDF manual chapter order differs")
  577. 33.28 s gammaloop-nextest-docs> stack backtrace:
  578. 33.28 s gammaloop-nextest-docs> 0: __rustc::rust_begin_unwind
  579. 33.28 s gammaloop-nextest-docs> 1: core::panicking::panic_fmt
  580. 33.28 s gammaloop-nextest-docs> 2: core::panicking::panic
  581. 33.28 s gammaloop-nextest-docs> 3: alphal00p_docs_builder::tests::pdf_manual_chapter_order_must_match_the_page_registry
  582. 33.28 s gammaloop-nextest-docs> 4: <alphal00p_docs_builder::tests::pdf_manual_chapter_order_must_match_the_page_registry::{closure#0} as core::ops::function::FnOnce<()>>::call_once
  583. 33.28 s gammaloop-nextest-docs> note: Some details are omitted, run with `RUST_BACKTRACE=full` for a verbose backtrace.
  584. 33.28 s gammaloop-nextest-docs> system-out
  585. 33.28 s gammaloop-nextest-docs> running 1 test
  586. 33.28 s gammaloop-nextest-docs> test tests::pdf_manual_chapter_order_must_match_the_page_registry ... FAILED
  587. 33.28 s gammaloop-nextest-docs>
  588. 33.28 s gammaloop-nextest-docs> failures:
  589. 33.28 s gammaloop-nextest-docs>
  590. 33.28 s gammaloop-nextest-docs> failures:
  591. 33.28 s gammaloop-nextest-docs> tests::pdf_manual_chapter_order_must_match_the_page_registry
  592. 33.28 s gammaloop-nextest-docs>
  593. 33.28 s gammaloop-nextest-docs> test result: FAILED. 0 passed; 1 failed; 0 ignored; 0 measured; 110 filtered out; finished in 0.07s
  594. 33.28 s gammaloop-nextest-docs> system-err
  595. 33.28 s gammaloop-nextest-docs> warning: developer note gammaloop-architecture still requires a named owner
  596. 33.28 s gammaloop-nextest-docs> warning: developer note integration-dashboard still requires a named owner
  597. 33.28 s gammaloop-nextest-docs> warning: developer note uv-renormalization still requires a named owner
  598. 33.28 s gammaloop-nextest-docs> warning: developer note spenso-parsing-flow still requires a named owner
  599. 33.28 s gammaloop-nextest-docs> warning: developer note schoonschip-network still requires a named owner
  600. 33.28 s gammaloop-nextest-docs> warning: developer note gammaloop-draw-style-migration still requires a named owner
  601. 33.28 s gammaloop-nextest-docs> warning: developer note gammaloop-drawing-architecture still requires a named owner
  602. 33.28 s gammaloop-nextest-docs> warning: developer note spenso-symbolica-syntax-and-rewrites still requires a named owner
  603. 33.28 s gammaloop-nextest-docs> warning: developer note spenso-architecture still requires a named owner
  604. 33.28 s gammaloop-nextest-docs> warning: developer note idenso-architecture still requires a named owner
  605. 33.28 s gammaloop-nextest-docs> warning: developer note idenso-form-color-dirac-source-map still requires a named owner
  606. 33.28 s gammaloop-nextest-docs> warning: developer note linnet-architecture still requires a named owner
  607. 33.28 s gammaloop-nextest-docs> warning: developer note vakint-architecture still requires a named owner
  608. 33.28 s gammaloop-nextest-docs> warning: developer note gammaloop-roadmap still requires a named owner
  609. 33.28 s gammaloop-nextest-docs> warning: developer note cff-surface-cache-ownership still requires a named owner
  610. 33.28 s gammaloop-nextest-docs> warning: developer note gammaloop-drawing-evaluated-fields-history still requires a named owner
  611. 33.28 s gammaloop-nextest-docs> warning: archived developer note gammaloop-drawing-evaluated-fields-history has no immutable evidence revision
  612. 33.28 s gammaloop-nextest-docs> warning: developer note bnl-benchmark-investigation still requires a named owner
  613. 33.28 s gammaloop-nextest-docs> warning: developer note bnl-contraction-order-performance still requires a named owner
  614. 33.28 s gammaloop-nextest-docs> warning: developer note bnl-scalar-alias-capture still requires a named owner
  615. 33.28 s gammaloop-nextest-docs> warning: developer note aa-aa-three-loop-performance-smoke still requires a named owner
  616. 33.28 s gammaloop-nextest-docs> warning: developer note network-simplification still requires a named owner
  617. 33.28 s gammaloop-nextest-docs> warning: investigation developer note network-simplification has no immutable evidence revision
  618. 33.28 s gammaloop-nextest-docs> warning: developer note spenso-large-expressions still requires a named owner
  619. 33.28 s gammaloop-nextest-docs> warning: developer note spenso-improvement-effects still requires a named owner
  620. 33.28 s gammaloop-nextest-docs> warning: archived developer note spenso-improvement-effects has no immutable evidence revision
  621. 33.28 s gammaloop-nextest-docs> warning: developer note spenso-test-baseline still requires a named owner
  622. 33.28 s gammaloop-nextest-docs> warning: archived developer note spenso-test-baseline has no immutable evidence revision
  623. 33.28 s gammaloop-nextest-docs> warning: developer note bnl-evaluator-atom-capture still requires a named owner
  624. 33.28 s gammaloop-nextest-docs> warning: archived developer note bnl-evaluator-atom-capture has no immutable evidence revision
  625. 33.28 s gammaloop-nextest-docs> warning: developer note uv-scalar-profile-benchmark still requires a named owner
  626. 33.28 s gammaloop-nextest-docs> warning: archived developer note uv-scalar-profile-benchmark has no immutable evidence revision
  627. 33.28 s gammaloop-nextest-docs> warning: developer note ci-test-failure-summary-2026-03-25 still requires a named owner
  628. 33.28 s gammaloop-nextest-docs> warning: archived developer note ci-test-failure-summary-2026-03-25 has no immutable evidence revision
  629. 33.28 s gammaloop-nextest-docs> warning: developer note network-execution-rebase-record still requires a named owner
  630. 33.28 s gammaloop-nextest-docs> warning: archived developer note network-execution-rebase-record has no immutable evidence revision
  631. 33.28 s gammaloop-nextest-docs> warning: developer note ratatui-integration-dashboard-history still requires a named owner
  632. 33.28 s gammaloop-nextest-docs> warning: archived developer note ratatui-integration-dashboard-history has no immutable evidence revision
  633. 33.28 s gammaloop-nextest-docs> warning: developer note nix-crane-cache-reuse still requires a named owner
  634. 33.28 s gammaloop-nextest-docs>
  635. 33.28 s gammaloop-nextest-docs> thread 'tests::pdf_manual_chapter_order_must_match_the_page_registry' (323) panicked at crates/alphal00p-docs-builder/src/lib.rs:11952:9:
  636. 33.28 s gammaloop-nextest-docs> assertion failed: format!("{error:#}").contains("PDF manual chapter order differs")
  637. 33.28 s gammaloop-nextest-docs> stack backtrace:
  638. 33.28 s gammaloop-nextest-docs> 0: __rustc::rust_begin_unwind
  639. 33.28 s gammaloop-nextest-docs> 1: core::panicking::panic_fmt
  640. 33.28 s gammaloop-nextest-docs> 2: core::panicking::panic
  641. 33.28 s gammaloop-nextest-docs> 3: alphal00p_docs_builder::tests::pdf_manual_chapter_order_must_match_the_page_registry
  642. 33.28 s gammaloop-nextest-docs> 4: <alphal00p_docs_builder::tests::pdf_manual_chapter_order_must_match_the_page_registry::{closure#0} as core::ops::function::FnOnce<()>>::call_once
  643. 33.28 s gammaloop-nextest-docs> note: Some details are omitted, run with `RUST_BACKTRACE=full` for a verbose backtrace.
  644. 33.28 s gammaloop-nextest-docs> =========================================
  645. 33.30 s gammaloop-nextest-docs> Extracting 2 binaries to /build/source
  646. 33.33 s gammaloop-nextest-docs> Extracted 5 files to /build/source in 0.04s
  647. 33.34 s gammaloop-nextest-docs> ------------
  648. 33.34 s gammaloop-nextest-docs> Nextest run ID 79e063cf-e144-4b18-b14f-f48ff4cd0588 with nextest profile: ci_gammaloop
  649. 33.34 s gammaloop-nextest-docs> Starting 22 tests across 2 binaries
  650. 33.35 s gammaloop-nextest-docs> ------------
  651. 33.35 s gammaloop-nextest-docs> Summary [ 0.014s] 22 tests run: 22 passed, 0 skipped
  652. 33.38 s gammaloop-nextest-docs>
  653. 33.38 s gammaloop-nextest-docs> ========== nextest test summary ==========
  654. 33.38 s gammaloop-nextest-docs> report: target/nextest/ci_gammaloop/junit.xml
  655. 33.38 s gammaloop-nextest-docs> tests: 22, failures: 0, errors: 0
  656. 33.38 s gammaloop-nextest-docs> No failing testcases found.
  657. 33.38 s gammaloop-nextest-docs> =========================================
  658. 33.40 s gammaloop-nextest-docs> Extracting 1 binary, 1 build script output directory, and 2 linked paths to /build/source
  659. 33.47 s gammaloop-nextest-docs> Extracted 18 files to /build/source in 0.07s
  660. 33.48 s gammaloop-nextest-docs> ------------
  661. 33.48 s gammaloop-nextest-docs> Nextest run ID c4e8a8ec-e8b8-45f3-b812-8aae66e138cb with nextest profile: ci_gammaloop
  662. 33.48 s gammaloop-nextest-docs> Starting 89 tests across 1 binary
  663. 33.52 s gammaloop-nextest-docs> ------------
  664. 33.52 s gammaloop-nextest-docs> Summary [ 0.039s] 89 tests run: 89 passed, 0 skipped
  665. 33.54 s gammaloop-nextest-docs>
  666. 33.54 s gammaloop-nextest-docs> ========== nextest test summary ==========
  667. 33.54 s gammaloop-nextest-docs> report: target/nextest/ci_gammaloop/junit.xml
  668. 33.54 s gammaloop-nextest-docs> tests: 89, failures: 0, errors: 0
  669. 33.54 s gammaloop-nextest-docs> No failing testcases found.
  670. 33.54 s gammaloop-nextest-docs> =========================================
  671. 33.56 s gammaloop-nextest-docs> Extracting 2 binaries to /build/source
  672. 33.60 s gammaloop-nextest-docs> Extracted 5 files to /build/source in 0.04s
  673. 33.61 s gammaloop-nextest-docs> ------------
  674. 33.61 s gammaloop-nextest-docs> Nextest run ID c6cd3427-721a-410d-898e-56c0e84aa194 with nextest profile: ci_gammaloop
  675. 33.61 s gammaloop-nextest-docs> Starting 10 tests across 2 binaries
  676. 44.89 s gammaloop-nextest-docs> ------------
  677. 44.89 s gammaloop-nextest-docs> Summary [ 11.281s] 10 tests run: 10 passed, 0 skipped
  678. 44.92 s gammaloop-nextest-docs>
  679. 44.92 s gammaloop-nextest-docs> ========== nextest test summary ==========
  680. 44.92 s gammaloop-nextest-docs> report: target/nextest/ci_gammaloop/junit.xml
  681. 44.92 s gammaloop-nextest-docs> tests: 10, failures: 0, errors: 0
  682. 44.92 s gammaloop-nextest-docs> No failing testcases found.
  683. 44.92 s gammaloop-nextest-docs> =========================================
  684. 44.93 s gammaloop-nextest-docs> Extracting 1 binary to /build/source
  685. 44.96 s gammaloop-nextest-docs> Extracted 4 files to /build/source in 0.03s
  686. 44.97 s gammaloop-nextest-docs> ------------
  687. 44.97 s gammaloop-nextest-docs> Nextest run ID 172b2381-02a7-406e-8dbd-c0015322eb5c with nextest profile: ci_gammaloop
  688. 44.97 s gammaloop-nextest-docs> Starting 0 tests across 1 binary
  689. 44.97 s gammaloop-nextest-docs> ------------
  690. 44.97 s gammaloop-nextest-docs> Summary [ 0.000s] 0 tests run: 0 passed, 0 skipped
  691. 45.00 s gammaloop-nextest-docs>
  692. 45.00 s gammaloop-nextest-docs> ========== nextest test summary ==========
  693. 45.00 s gammaloop-nextest-docs> report: target/nextest/ci_gammaloop/junit.xml
  694. 45.00 s gammaloop-nextest-docs> tests: 0, failures: 0, errors: 0
  695. 45.00 s gammaloop-nextest-docs> No failing testcases found.
  696. 45.00 s gammaloop-nextest-docs> =========================================
  697. 45.01 s gammaloop-nextest-docs> Extracting 1 binary to /build/source
  698. 45.04 s gammaloop-nextest-docs> Extracted 4 files to /build/source in 0.03s
  699. 45.05 s gammaloop-nextest-docs> ------------
  700. 45.05 s gammaloop-nextest-docs> Nextest run ID 8dc51b47-6ba5-48fc-be18-ae7c36df1009 with nextest profile: ci_gammaloop
  701. 45.05 s gammaloop-nextest-docs> Starting 5 tests across 1 binary
  702. 45.06 s gammaloop-nextest-docs> ------------
  703. 45.06 s gammaloop-nextest-docs> Summary [ 0.006s] 5 tests run: 5 passed, 0 skipped
  704. 45.08 s gammaloop-nextest-docs>
  705. 45.08 s gammaloop-nextest-docs> ========== nextest test summary ==========
  706. 45.08 s gammaloop-nextest-docs> report: target/nextest/ci_gammaloop/junit.xml
  707. 45.08 s gammaloop-nextest-docs> tests: 5, failures: 0, errors: 0
  708. 45.08 s gammaloop-nextest-docs> No failing testcases found.
  709. 45.08 s gammaloop-nextest-docs> =========================================
  710. 45.24 s error: Cannot build '/nix/store/ig2n8vvnnpdbrss20g10xh19f2x4lxrl-gammaloop-nextest-docs.drv'.
  711. 45.24 s Reason: builder failed with exit code 100.
  712. 45.24 s Output paths:
  713. 45.24 s /nix/store/mvjf7pw7m7955c5sm90aqfnzz834drqw-gammaloop-nextest-docs
  714. 45.24 s Last 690 log lines:
  715. 45.24 s > Extracting 2 binaries to /build/source
  716. 45.24 s > Extracted 5 files to /build/source in 0.05s
  717. 45.24 s > ------------
  718. 45.24 s > Nextest run ID c4293722-63cf-46bc-a504-7726a7827b68 with nextest profile: ci_gammaloop
  719. 45.24 s > Starting 111 tests across 2 binaries
  720. 45.24 s > FAIL [ 0.080s] ( 78/111) alphal00p-docs-builder tests::every_product_requires_a_task_chooser_and_each_supported_interface
  721. 45.24 s > stdout ---
  722. 45.24 s >
  723. 45.24 s > running 1 test
  724. 45.24 s > test tests::every_product_requires_a_task_chooser_and_each_supported_interface ... FAILED
  725. 45.24 s >
  726. 45.24 s > failures:
  727. 45.24 s >
  728. 45.24 s > failures:
  729. 45.24 s > tests::every_product_requires_a_task_chooser_and_each_supported_interface
  730. 45.24 s >
  731. 45.24 s > test result: FAILED. 0 passed; 1 failed; 0 ignored; 0 measured; 110 filtered out; finished in 0.08s
  732. 45.24 s >
  733. 45.24 s > stderr ---
  734. 45.24 s > warning: developer note gammaloop-architecture still requires a named owner
  735. 45.24 s > warning: developer note integration-dashboard still requires a named owner
  736. 45.24 s > warning: developer note uv-renormalization still requires a named owner
  737. 45.24 s > warning: developer note spenso-parsing-flow still requires a named owner
  738. 45.24 s > warning: developer note schoonschip-network still requires a named owner
  739. 45.24 s > warning: developer note gammaloop-draw-style-migration still requires a named owner
  740. 45.24 s > warning: developer note gammaloop-drawing-architecture still requires a named owner
  741. 45.24 s > warning: developer note spenso-symbolica-syntax-and-rewrites still requires a named owner
  742. 45.24 s > warning: developer note spenso-architecture still requires a named owner
  743. 45.24 s > warning: developer note idenso-architecture still requires a named owner
  744. 45.24 s > warning: developer note idenso-form-color-dirac-source-map still requires a named owner
  745. 45.24 s > warning: developer note linnet-architecture still requires a named owner
  746. 45.24 s > warning: developer note vakint-architecture still requires a named owner
  747. 45.24 s > warning: developer note gammaloop-roadmap still requires a named owner
  748. 45.24 s > warning: developer note cff-surface-cache-ownership still requires a named owner
  749. 45.24 s > warning: developer note gammaloop-drawing-evaluated-fields-history still requires a named owner
  750. 45.24 s > warning: archived developer note gammaloop-drawing-evaluated-fields-history has no immutable evidence revision
  751. 45.24 s > warning: developer note bnl-benchmark-investigation still requires a named owner
  752. 45.24 s > warning: developer note bnl-contraction-order-performance still requires a named owner
  753. 45.24 s > warning: developer note bnl-scalar-alias-capture still requires a named owner
  754. 45.24 s > warning: developer note aa-aa-three-loop-performance-smoke still requires a named owner
  755. 45.24 s > warning: developer note network-simplification still requires a named owner
  756. 45.24 s > warning: investigation developer note network-simplification has no immutable evidence revision
  757. 45.24 s > warning: developer note spenso-large-expressions still requires a named owner
  758. 45.24 s > warning: developer note spenso-improvement-effects still requires a named owner
  759. 45.24 s > warning: archived developer note spenso-improvement-effects has no immutable evidence revision
  760. 45.24 s > warning: developer note spenso-test-baseline still requires a named owner
  761. 45.24 s > warning: archived developer note spenso-test-baseline has no immutable evidence revision
  762. 45.24 s > warning: developer note bnl-evaluator-atom-capture still requires a named owner
  763. 45.24 s > warning: archived developer note bnl-evaluator-atom-capture has no immutable evidence revision
  764. 45.24 s > warning: developer note uv-scalar-profile-benchmark still requires a named owner
  765. 45.24 s > warning: archived developer note uv-scalar-profile-benchmark has no immutable evidence revision
  766. 45.24 s > warning: developer note ci-test-failure-summary-2026-03-25 still requires a named owner
  767. 45.24 s > warning: archived developer note ci-test-failure-summary-2026-03-25 has no immutable evidence revision
  768. 45.24 s > warning: developer note network-execution-rebase-record still requires a named owner
  769. 45.24 s > warning: archived developer note network-execution-rebase-record has no immutable evidence revision
  770. 45.24 s > warning: developer note ratatui-integration-dashboard-history still requires a named owner
  771. 45.24 s > warning: archived developer note ratatui-integration-dashboard-history has no immutable evidence revision
  772. 45.24 s > warning: developer note nix-crane-cache-reuse still requires a named owner
  773. 45.24 s >
  774. 45.24 s > thread 'tests::every_product_requires_a_task_chooser_and_each_supported_interface' (260) panicked at crates/alphal00p-docs-builder/src/lib.rs:11901:9:
  775. 45.24 s > assertion failed: format!("{error:#}").contains("has no quickstart page")
  776. 45.24 s > stack backtrace:
  777. 45.24 s > 0: __rustc::rust_begin_unwind
  778. 45.24 s > 1: core::panicking::panic_fmt
  779. 45.24 s > 2: core::panicking::panic
  780. 45.24 s > 3: alphal00p_docs_builder::tests::every_product_requires_a_task_chooser_and_each_supported_interface
  781. 45.24 s > 4: <alphal00p_docs_builder::tests::every_product_requires_a_task_chooser_and_each_supported_interface::{closure#0} as core::ops::function::FnOnce<()>>::call_once
  782. 45.24 s > note: Some details are omitted, run with `RUST_BACKTRACE=full` for a verbose backtrace.
  783. 45.24 s >
  784. 45.24 s > FAIL [ 0.101s] ( 84/111) alphal00p-docs-builder tests::checked_in_registry_is_valid
  785. 45.24 s > stdout ---
  786. 45.24 s >
  787. 45.24 s > running 1 test
  788. 45.24 s > test tests::checked_in_registry_is_valid ... FAILED
  789. 45.24 s >
  790. 45.24 s > failures:
  791. 45.24 s >
  792. 45.24 s > failures:
  793. 45.24 s > tests::checked_in_registry_is_valid
  794. 45.24 s >
  795. 45.24 s > test result: FAILED. 0 passed; 1 failed; 0 ignored; 0 measured; 110 filtered out; finished in 0.09s
  796. 45.24 s >
  797. 45.24 s > stderr ---
  798. 45.24 s > warning: developer note gammaloop-architecture still requires a named owner
  799. 45.24 s > warning: developer note integration-dashboard still requires a named owner
  800. 45.24 s > warning: developer note uv-renormalization still requires a named owner
  801. 45.24 s > warning: developer note spenso-parsing-flow still requires a named owner
  802. 45.24 s > warning: developer note schoonschip-network still requires a named owner
  803. 45.24 s > warning: developer note gammaloop-draw-style-migration still requires a named owner
  804. 45.24 s > warning: developer note gammaloop-drawing-architecture still requires a named owner
  805. 45.24 s > warning: developer note spenso-symbolica-syntax-and-rewrites still requires a named owner
  806. 45.24 s > warning: developer note spenso-architecture still requires a named owner
  807. 45.24 s > warning: developer note idenso-architecture still requires a named owner
  808. 45.24 s > warning: developer note idenso-form-color-dirac-source-map still requires a named owner
  809. 45.24 s > warning: developer note linnet-architecture still requires a named owner
  810. 45.24 s > warning: developer note vakint-architecture still requires a named owner
  811. 45.24 s > warning: developer note gammaloop-roadmap still requires a named owner
  812. 45.24 s > warning: developer note cff-surface-cache-ownership still requires a named owner
  813. 45.24 s > warning: developer note gammaloop-drawing-evaluated-fields-history still requires a named owner
  814. 45.24 s > warning: archived developer note gammaloop-drawing-evaluated-fields-history has no immutable evidence revision
  815. 45.24 s > warning: developer note bnl-benchmark-investigation still requires a named owner
  816. 45.24 s > warning: developer note bnl-contraction-order-performance still requires a named owner
  817. 45.24 s > warning: developer note bnl-scalar-alias-capture still requires a named owner
  818. 45.24 s > warning: developer note aa-aa-three-loop-performance-smoke still requires a named owner
  819. 45.24 s > warning: developer note network-simplification still requires a named owner
  820. 45.24 s > warning: investigation developer note network-simplification has no immutable evidence revision
  821. 45.24 s > warning: developer note spenso-large-expressions still requires a named owner
  822. 45.24 s > warning: developer note spenso-improvement-effects still requires a named owner
  823. 45.24 s > warning: archived developer note spenso-improvement-effects has no immutable evidence revision
  824. 45.24 s > warning: developer note spenso-test-baseline still requires a named owner
  825. 45.24 s > warning: archived developer note spenso-test-baseline has no immutable evidence revision
  826. 45.24 s > warning: developer note bnl-evaluator-atom-capture still requires a named owner
  827. 45.24 s > warning: archived developer note bnl-evaluator-atom-capture has no immutable evidence revision
  828. 45.24 s > warning: developer note uv-scalar-profile-benchmark still requires a named owner
  829. 45.24 s > warning: archived developer note uv-scalar-profile-benchmark has no immutable evidence revision
  830. 45.24 s > warning: developer note ci-test-failure-summary-2026-03-25 still requires a named owner
  831. 45.24 s > warning: archived developer note ci-test-failure-summary-2026-03-25 has no immutable evidence revision
  832. 45.24 s > warning: developer note network-execution-rebase-record still requires a named owner
  833. 45.24 s > warning: archived developer note network-execution-rebase-record has no immutable evidence revision
  834. 45.24 s > warning: developer note ratatui-integration-dashboard-history still requires a named owner
  835. 45.24 s > warning: archived developer note ratatui-integration-dashboard-history has no immutable evidence revision
  836. 45.24 s > warning: developer note nix-crane-cache-reuse still requires a named owner
  837. 45.24 s >
  838. 45.24 s > thread 'tests::checked_in_registry_is_valid' (219) panicked at crates/alphal00p-docs-builder/src/lib.rs:11887:50:
  839. 45.24 s > called `Result::unwrap()` on an `Err` value: developer note nix-crane-cache-reuse verified scope flake.nix changed (expected 188504937418859942a6770ca21a4f4e0a7ff125, found 17dc35393f0f0abd5cb31c7eaf1fdc9aa6903ce4); owner review or an explicit no-impact attestation is required
  840. 45.24 s >
  841. 45.24 s > Location:
  842. 45.24 s > crates/alphal00p-docs-builder/src/lib.rs:889:21
  843. 45.24 s > stack backtrace:
  844. 45.24 s > 0: __rustc::rust_begin_unwind
  845. 45.24 s > 1: core::panicking::panic_fmt
  846. 45.24 s > 2: core::result::unwrap_failed
  847. 45.24 s > 3: alphal00p_docs_builder::tests::checked_in_registry_is_valid
  848. 45.24 s > 4: <alphal00p_docs_builder::tests::checked_in_registry_is_valid::{closure#0} as core::ops::function::FnOnce<()>>::call_once
  849. 45.24 s > note: Some details are omitted, run with `RUST_BACKTRACE=full` for a verbose backtrace.
  850. 45.24 s >
  851. 45.24 s > FAIL [ 0.074s] ( 97/111) alphal00p-docs-builder tests::pdf_manual_chapter_order_must_match_the_page_registry
  852. 45.24 s > stdout ---
  853. 45.24 s >
  854. 45.24 s > running 1 test
  855. 45.24 s > test tests::pdf_manual_chapter_order_must_match_the_page_registry ... FAILED
  856. 45.24 s >
  857. 45.24 s > failures:
  858. 45.24 s >
  859. 45.24 s > failures:
  860. 45.24 s > tests::pdf_manual_chapter_order_must_match_the_page_registry
  861. 45.24 s >
  862. 45.24 s > test result: FAILED. 0 passed; 1 failed; 0 ignored; 0 measured; 110 filtered out; finished in 0.07s
  863. 45.24 s >
  864. 45.24 s > stderr ---
  865. 45.24 s > warning: developer note gammaloop-architecture still requires a named owner
  866. 45.24 s > warning: developer note integration-dashboard still requires a named owner
  867. 45.24 s > warning: developer note uv-renormalization still requires a named owner
  868. 45.24 s > warning: developer note spenso-parsing-flow still requires a named owner
  869. 45.24 s > warning: developer note schoonschip-network still requires a named owner
  870. 45.24 s > warning: developer note gammaloop-draw-style-migration still requires a named owner
  871. 45.24 s > warning: developer note gammaloop-drawing-architecture still requires a named owner
  872. 45.24 s > warning: developer note spenso-symbolica-syntax-and-rewrites still requires a named owner
  873. 45.24 s > warning: developer note spenso-architecture still requires a named owner
  874. 45.24 s > warning: developer note idenso-architecture still requires a named owner
  875. 45.24 s > warning: developer note idenso-form-color-dirac-source-map still requires a named owner
  876. 45.24 s > warning: developer note linnet-architecture still requires a named owner
  877. 45.24 s > warning: developer note vakint-architecture still requires a named owner
  878. 45.24 s > warning: developer note gammaloop-roadmap still requires a named owner
  879. 45.24 s > warning: developer note cff-surface-cache-ownership still requires a named owner
  880. 45.24 s > warning: developer note gammaloop-drawing-evaluated-fields-history still requires a named owner
  881. 45.24 s > warning: archived developer note gammaloop-drawing-evaluated-fields-history has no immutable evidence revision
  882. 45.24 s > warning: developer note bnl-benchmark-investigation still requires a named owner
  883. 45.24 s > warning: developer note bnl-contraction-order-performance still requires a named owner
  884. 45.24 s > warning: developer note bnl-scalar-alias-capture still requires a named owner
  885. 45.24 s > warning: developer note aa-aa-three-loop-performance-smoke still requires a named owner
  886. 45.24 s > warning: developer note network-simplification still requires a named owner
  887. 45.24 s > warning: investigation developer note network-simplification has no immutable evidence revision
  888. 45.24 s > warning: developer note spenso-large-expressions still requires a named owner
  889. 45.24 s > warning: developer note spenso-improvement-effects still requires a named owner
  890. 45.24 s > warning: archived developer note spenso-improvement-effects has no immutable evidence revision
  891. 45.24 s > warning: developer note spenso-test-baseline still requires a named owner
  892. 45.24 s > warning: archived developer note spenso-test-baseline has no immutable evidence revision
  893. 45.24 s > warning: developer note bnl-evaluator-atom-capture still requires a named owner
  894. 45.24 s > warning: archived developer note bnl-evaluator-atom-capture has no immutable evidence revision
  895. 45.24 s > warning: developer note uv-scalar-profile-benchmark still requires a named owner
  896. 45.24 s > warning: archived developer note uv-scalar-profile-benchmark has no immutable evidence revision
  897. 45.24 s > warning: developer note ci-test-failure-summary-2026-03-25 still requires a named owner
  898. 45.24 s > warning: archived developer note ci-test-failure-summary-2026-03-25 has no immutable evidence revision
  899. 45.24 s > warning: developer note network-execution-rebase-record still requires a named owner
  900. 45.24 s > warning: archived developer note network-execution-rebase-record has no immutable evidence revision
  901. 45.24 s > warning: developer note ratatui-integration-dashboard-history still requires a named owner
  902. 45.24 s > warning: archived developer note ratatui-integration-dashboard-history has no immutable evidence revision
  903. 45.24 s > warning: developer note nix-crane-cache-reuse still requires a named owner
  904. 45.24 s >
  905. 45.24 s > thread 'tests::pdf_manual_chapter_order_must_match_the_page_registry' (323) panicked at crates/alphal00p-docs-builder/src/lib.rs:11952:9:
  906. 45.24 s > assertion failed: format!("{error:#}").contains("PDF manual chapter order differs")
  907. 45.24 s > stack backtrace:
  908. 45.24 s > 0: __rustc::rust_begin_unwind
  909. 45.24 s > 1: core::panicking::panic_fmt
  910. 45.24 s > 2: core::panicking::panic
  911. 45.24 s > 3: alphal00p_docs_builder::tests::pdf_manual_chapter_order_must_match_the_page_registry
  912. 45.24 s > 4: <alphal00p_docs_builder::tests::pdf_manual_chapter_order_must_match_the_page_registry::{closure#0} as core::ops::function::FnOnce<()>>::call_once
  913. 45.24 s > note: Some details are omitted, run with `RUST_BACKTRACE=full` for a verbose backtrace.
  914. 45.24 s >
  915. 45.24 s > ------------
  916. 45.24 s > Summary [ 13.628s] 111 tests run: 108 passed, 3 failed, 0 skipped
  917. 45.24 s > FAIL [ 0.080s] ( 78/111) alphal00p-docs-builder tests::every_product_requires_a_task_chooser_and_each_supported_interface
  918. 45.24 s > stdout ---
  919. 45.24 s >
  920. 45.24 s > running 1 test
  921. 45.24 s > test tests::every_product_requires_a_task_chooser_and_each_supported_interface ... FAILED
  922. 45.24 s >
  923. 45.24 s > failures:
  924. 45.24 s >
  925. 45.24 s > failures:
  926. 45.24 s > tests::every_product_requires_a_task_chooser_and_each_supported_interface
  927. 45.24 s >
  928. 45.24 s > test result: FAILED. 0 passed; 1 failed; 0 ignored; 0 measured; 110 filtered out; finished in 0.08s
  929. 45.24 s >
  930. 45.24 s > stderr ---
  931. 45.24 s > warning: developer note gammaloop-architecture still requires a named owner
  932. 45.24 s > warning: developer note integration-dashboard still requires a named owner
  933. 45.24 s > warning: developer note uv-renormalization still requires a named owner
  934. 45.24 s > warning: developer note spenso-parsing-flow still requires a named owner
  935. 45.24 s > warning: developer note schoonschip-network still requires a named owner
  936. 45.24 s > warning: developer note gammaloop-draw-style-migration still requires a named owner
  937. 45.24 s > warning: developer note gammaloop-drawing-architecture still requires a named owner
  938. 45.24 s > warning: developer note spenso-symbolica-syntax-and-rewrites still requires a named owner
  939. 45.24 s > warning: developer note spenso-architecture still requires a named owner
  940. 45.24 s > warning: developer note idenso-architecture still requires a named owner
  941. 45.24 s > warning: developer note idenso-form-color-dirac-source-map still requires a named owner
  942. 45.24 s > warning: developer note linnet-architecture still requires a named owner
  943. 45.24 s > warning: developer note vakint-architecture still requires a named owner
  944. 45.24 s > warning: developer note gammaloop-roadmap still requires a named owner
  945. 45.24 s > warning: developer note cff-surface-cache-ownership still requires a named owner
  946. 45.24 s > warning: developer note gammaloop-drawing-evaluated-fields-history still requires a named owner
  947. 45.24 s > warning: archived developer note gammaloop-drawing-evaluated-fields-history has no immutable evidence revision
  948. 45.24 s > warning: developer note bnl-benchmark-investigation still requires a named owner
  949. 45.24 s > warning: developer note bnl-contraction-order-performance still requires a named owner
  950. 45.24 s > warning: developer note bnl-scalar-alias-capture still requires a named owner
  951. 45.24 s > warning: developer note aa-aa-three-loop-performance-smoke still requires a named owner
  952. 45.24 s > warning: developer note network-simplification still requires a named owner
  953. 45.24 s > warning: investigation developer note network-simplification has no immutable evidence revision
  954. 45.24 s > warning: developer note spenso-large-expressions still requires a named owner
  955. 45.24 s > warning: developer note spenso-improvement-effects still requires a named owner
  956. 45.24 s > warning: archived developer note spenso-improvement-effects has no immutable evidence revision
  957. 45.24 s > warning: developer note spenso-test-baseline still requires a named owner
  958. 45.24 s > warning: archived developer note spenso-test-baseline has no immutable evidence revision
  959. 45.24 s > warning: developer note bnl-evaluator-atom-capture still requires a named owner
  960. 45.24 s > warning: archived developer note bnl-evaluator-atom-capture has no immutable evidence revision
  961. 45.24 s > warning: developer note uv-scalar-profile-benchmark still requires a named owner
  962. 45.24 s > warning: archived developer note uv-scalar-profile-benchmark has no immutable evidence revision
  963. 45.24 s > warning: developer note ci-test-failure-summary-2026-03-25 still requires a named owner
  964. 45.24 s > warning: archived developer note ci-test-failure-summary-2026-03-25 has no immutable evidence revision
  965. 45.24 s > warning: developer note network-execution-rebase-record still requires a named owner
  966. 45.24 s > warning: archived developer note network-execution-rebase-record has no immutable evidence revision
  967. 45.24 s > warning: developer note ratatui-integration-dashboard-history still requires a named owner
  968. 45.24 s > warning: archived developer note ratatui-integration-dashboard-history has no immutable evidence revision
  969. 45.24 s > warning: developer note nix-crane-cache-reuse still requires a named owner
  970. 45.24 s >
  971. 45.24 s > thread 'tests::every_product_requires_a_task_chooser_and_each_supported_interface' (260) panicked at crates/alphal00p-docs-builder/src/lib.rs:11901:9:
  972. 45.24 s > assertion failed: format!("{error:#}").contains("has no quickstart page")
  973. 45.24 s > stack backtrace:
  974. 45.24 s > 0: __rustc::rust_begin_unwind
  975. 45.24 s > 1: core::panicking::panic_fmt
  976. 45.24 s > 2: core::panicking::panic
  977. 45.24 s > 3: alphal00p_docs_builder::tests::every_product_requires_a_task_chooser_and_each_supported_interface
  978. 45.24 s > 4: <alphal00p_docs_builder::tests::every_product_requires_a_task_chooser_and_each_supported_interface::{closure#0} as core::ops::function::FnOnce<()>>::call_once
  979. 45.24 s > note: Some details are omitted, run with `RUST_BACKTRACE=full` for a verbose backtrace.
  980. 45.24 s >
  981. 45.24 s > FAIL [ 0.101s] ( 84/111) alphal00p-docs-builder tests::checked_in_registry_is_valid
  982. 45.24 s > stdout ---
  983. 45.24 s >
  984. 45.24 s > running 1 test
  985. 45.24 s > test tests::checked_in_registry_is_valid ... FAILED
  986. 45.24 s >
  987. 45.24 s > failures:
  988. 45.24 s >
  989. 45.24 s > failures:
  990. 45.24 s > tests::checked_in_registry_is_valid
  991. 45.24 s >
  992. 45.24 s > test result: FAILED. 0 passed; 1 failed; 0 ignored; 0 measured; 110 filtered out; finished in 0.09s
  993. 45.24 s >
  994. 45.24 s > stderr ---
  995. 45.24 s > warning: developer note gammaloop-architecture still requires a named owner
  996. 45.24 s > warning: developer note integration-dashboard still requires a named owner
  997. 45.24 s > warning: developer note uv-renormalization still requires a named owner
  998. 45.24 s > warning: developer note spenso-parsing-flow still requires a named owner
  999. 45.24 s > warning: developer note schoonschip-network still requires a named owner
  1000. 45.24 s > warning: developer note gammaloop-draw-style-migration still requires a named owner
  1001. 45.24 s > warning: developer note gammaloop-drawing-architecture still requires a named owner
  1002. 45.24 s > warning: developer note spenso-symbolica-syntax-and-rewrites still requires a named owner
  1003. 45.24 s > warning: developer note spenso-architecture still requires a named owner
  1004. 45.24 s > warning: developer note idenso-architecture still requires a named owner
  1005. 45.24 s > warning: developer note idenso-form-color-dirac-source-map still requires a named owner
  1006. 45.24 s > warning: developer note linnet-architecture still requires a named owner
  1007. 45.24 s > warning: developer note vakint-architecture still requires a named owner
  1008. 45.24 s > warning: developer note gammaloop-roadmap still requires a named owner
  1009. 45.24 s > warning: developer note cff-surface-cache-ownership still requires a named owner
  1010. 45.24 s > warning: developer note gammaloop-drawing-evaluated-fields-history still requires a named owner
  1011. 45.24 s > warning: archived developer note gammaloop-drawing-evaluated-fields-history has no immutable evidence revision
  1012. 45.24 s > warning: developer note bnl-benchmark-investigation still requires a named owner
  1013. 45.24 s > warning: developer note bnl-contraction-order-performance still requires a named owner
  1014. 45.24 s > warning: developer note bnl-scalar-alias-capture still requires a named owner
  1015. 45.24 s > warning: developer note aa-aa-three-loop-performance-smoke still requires a named owner
  1016. 45.24 s > warning: developer note network-simplification still requires a named owner
  1017. 45.24 s > warning: investigation developer note network-simplification has no immutable evidence revision
  1018. 45.24 s > warning: developer note spenso-large-expressions still requires a named owner
  1019. 45.24 s > warning: developer note spenso-improvement-effects still requires a named owner
  1020. 45.24 s > warning: archived developer note spenso-improvement-effects has no immutable evidence revision
  1021. 45.24 s > warning: developer note spenso-test-baseline still requires a named owner
  1022. 45.24 s > warning: archived developer note spenso-test-baseline has no immutable evidence revision
  1023. 45.24 s > warning: developer note bnl-evaluator-atom-capture still requires a named owner
  1024. 45.24 s > warning: archived developer note bnl-evaluator-atom-capture has no immutable evidence revision
  1025. 45.24 s > warning: developer note uv-scalar-profile-benchmark still requires a named owner
  1026. 45.24 s > warning: archived developer note uv-scalar-profile-benchmark has no immutable evidence revision
  1027. 45.24 s > warning: developer note ci-test-failure-summary-2026-03-25 still requires a named owner
  1028. 45.24 s > warning: archived developer note ci-test-failure-summary-2026-03-25 has no immutable evidence revision
  1029. 45.24 s > warning: developer note network-execution-rebase-record still requires a named owner
  1030. 45.24 s > warning: archived developer note network-execution-rebase-record has no immutable evidence revision
  1031. 45.24 s > warning: developer note ratatui-integration-dashboard-history still requires a named owner
  1032. 45.24 s > warning: archived developer note ratatui-integration-dashboard-history has no immutable evidence revision
  1033. 45.24 s > warning: developer note nix-crane-cache-reuse still requires a named owner
  1034. 45.24 s >
  1035. 45.24 s > thread 'tests::checked_in_registry_is_valid' (219) panicked at crates/alphal00p-docs-builder/src/lib.rs:11887:50:
  1036. 45.24 s > called `Result::unwrap()` on an `Err` value: developer note nix-crane-cache-reuse verified scope flake.nix changed (expected 188504937418859942a6770ca21a4f4e0a7ff125, found 17dc35393f0f0abd5cb31c7eaf1fdc9aa6903ce4); owner review or an explicit no-impact attestation is required
  1037. 45.24 s >
  1038. 45.24 s > Location:
  1039. 45.24 s > crates/alphal00p-docs-builder/src/lib.rs:889:21
  1040. 45.24 s > stack backtrace:
  1041. 45.24 s > 0: __rustc::rust_begin_unwind
  1042. 45.24 s > 1: core::panicking::panic_fmt
  1043. 45.24 s > 2: core::result::unwrap_failed
  1044. 45.24 s > 3: alphal00p_docs_builder::tests::checked_in_registry_is_valid
  1045. 45.24 s > 4: <alphal00p_docs_builder::tests::checked_in_registry_is_valid::{closure#0} as core::ops::function::FnOnce<()>>::call_once
  1046. 45.24 s > note: Some details are omitted, run with `RUST_BACKTRACE=full` for a verbose backtrace.
  1047. 45.24 s >
  1048. 45.24 s > FAIL [ 0.074s] ( 97/111) alphal00p-docs-builder tests::pdf_manual_chapter_order_must_match_the_page_registry
  1049. 45.24 s > stdout ---
  1050. 45.24 s >
  1051. 45.24 s > running 1 test
  1052. 45.24 s > test tests::pdf_manual_chapter_order_must_match_the_page_registry ... FAILED
  1053. 45.24 s >
  1054. 45.24 s > failures:
  1055. 45.24 s >
  1056. 45.24 s > failures:
  1057. 45.24 s > tests::pdf_manual_chapter_order_must_match_the_page_registry
  1058. 45.24 s >
  1059. 45.24 s > test result: FAILED. 0 passed; 1 failed; 0 ignored; 0 measured; 110 filtered out; finished in 0.07s
  1060. 45.24 s >
  1061. 45.24 s > stderr ---
  1062. 45.24 s > warning: developer note gammaloop-architecture still requires a named owner
  1063. 45.24 s > warning: developer note integration-dashboard still requires a named owner
  1064. 45.24 s > warning: developer note uv-renormalization still requires a named owner
  1065. 45.24 s > warning: developer note spenso-parsing-flow still requires a named owner
  1066. 45.24 s > warning: developer note schoonschip-network still requires a named owner
  1067. 45.24 s > warning: developer note gammaloop-draw-style-migration still requires a named owner
  1068. 45.24 s > warning: developer note gammaloop-drawing-architecture still requires a named owner
  1069. 45.24 s > warning: developer note spenso-symbolica-syntax-and-rewrites still requires a named owner
  1070. 45.24 s > warning: developer note spenso-architecture still requires a named owner
  1071. 45.24 s > warning: developer note idenso-architecture still requires a named owner
  1072. 45.24 s > warning: developer note idenso-form-color-dirac-source-map still requires a named owner
  1073. 45.24 s > warning: developer note linnet-architecture still requires a named owner
  1074. 45.24 s > warning: developer note vakint-architecture still requires a named owner
  1075. 45.24 s > warning: developer note gammaloop-roadmap still requires a named owner
  1076. 45.24 s > warning: developer note cff-surface-cache-ownership still requires a named owner
  1077. 45.24 s > warning: developer note gammaloop-drawing-evaluated-fields-history still requires a named owner
  1078. 45.24 s > warning: archived developer note gammaloop-drawing-evaluated-fields-history has no immutable evidence revision
  1079. 45.24 s > warning: developer note bnl-benchmark-investigation still requires a named owner
  1080. 45.24 s > warning: developer note bnl-contraction-order-performance still requires a named owner
  1081. 45.24 s > warning: developer note bnl-scalar-alias-capture still requires a named owner
  1082. 45.24 s > warning: developer note aa-aa-three-loop-performance-smoke still requires a named owner
  1083. 45.24 s > warning: developer note network-simplification still requires a named owner
  1084. 45.24 s > warning: investigation developer note network-simplification has no immutable evidence revision
  1085. 45.24 s > warning: developer note spenso-large-expressions still requires a named owner
  1086. 45.24 s > warning: developer note spenso-improvement-effects still requires a named owner
  1087. 45.24 s > warning: archived developer note spenso-improvement-effects has no immutable evidence revision
  1088. 45.24 s > warning: developer note spenso-test-baseline still requires a named owner
  1089. 45.24 s > warning: archived developer note spenso-test-baseline has no immutable evidence revision
  1090. 45.24 s > warning: developer note bnl-evaluator-atom-capture still requires a named owner
  1091. 45.24 s > warning: archived developer note bnl-evaluator-atom-capture has no immutable evidence revision
  1092. 45.24 s > warning: developer note uv-scalar-profile-benchmark still requires a named owner
  1093. 45.24 s > warning: archived developer note uv-scalar-profile-benchmark has no immutable evidence revision
  1094. 45.24 s > warning: developer note ci-test-failure-summary-2026-03-25 still requires a named owner
  1095. 45.24 s > warning: archived developer note ci-test-failure-summary-2026-03-25 has no immutable evidence revision
  1096. 45.24 s > warning: developer note network-execution-rebase-record still requires a named owner
  1097. 45.24 s > warning: archived developer note network-execution-rebase-record has no immutable evidence revision
  1098. 45.24 s > warning: developer note ratatui-integration-dashboard-history still requires a named owner
  1099. 45.24 s > warning: archived developer note ratatui-integration-dashboard-history has no immutable evidence revision
  1100. 45.24 s > warning: developer note nix-crane-cache-reuse still requires a named owner
  1101. 45.24 s >
  1102. 45.24 s > thread 'tests::pdf_manual_chapter_order_must_match_the_page_registry' (323) panicked at crates/alphal00p-docs-builder/src/lib.rs:11952:9:
  1103. 45.24 s > assertion failed: format!("{error:#}").contains("PDF manual chapter order differs")
  1104. 45.24 s > stack backtrace:
  1105. 45.24 s > 0: __rustc::rust_begin_unwind
  1106. 45.24 s > 1: core::panicking::panic_fmt
  1107. 45.24 s > 2: core::panicking::panic
  1108. 45.24 s > 3: alphal00p_docs_builder::tests::pdf_manual_chapter_order_must_match_the_page_registry
  1109. 45.24 s > 4: <alphal00p_docs_builder::tests::pdf_manual_chapter_order_must_match_the_page_registry::{closure#0} as core::ops::function::FnOnce<()>>::call_once
  1110. 45.24 s > note: Some details are omitted, run with `RUST_BACKTRACE=full` for a verbose backtrace.
  1111. 45.24 s >
  1112. 45.24 s > error: test run failed
  1113. 45.24 s >
  1114. 45.24 s > ========== nextest test summary ==========
  1115. 45.24 s > report: target/nextest/ci_gammaloop/junit.xml
  1116. 45.24 s > tests: 111, failures: 3, errors: 0
  1117. 45.24 s >
  1118. 45.24 s > 1. alphal00p-docs-builder::tests::every_product_requires_a_task_chooser_and_each_supported_interface
  1119. 45.24 s > failure: test failure with exit code 101
  1120. 45.24 s > thread 'tests::every_product_requires_a_task_chooser_and_each_supported_interface' (260) panicked at crates/alphal00p-docs-builder/src/lib.rs:11901:9:
  1121. 45.24 s > assertion failed: format!("{error:#}").contains("has no quickstart page")
  1122. 45.24 s > stack backtrace:
  1123. 45.24 s > 0: __rustc::rust_begin_unwind
  1124. 45.24 s > 1: core::panicking::panic_fmt
  1125. 45.24 s > 2: core::panicking::panic
  1126. 45.24 s > 3: alphal00p_docs_builder::tests::every_product_requires_a_task_chooser_and_each_supported_interface
  1127. 45.24 s > 4: <alphal00p_docs_builder::tests::every_product_requires_a_task_chooser_and_each_supported_interface::{closure#0} as core::ops::function::FnOnce<()>>::call_once
  1128. 45.24 s > note: Some details are omitted, run with `RUST_BACKTRACE=full` for a verbose backtrace.
  1129. 45.24 s > system-out
  1130. 45.24 s > running 1 test
  1131. 45.24 s > test tests::every_product_requires_a_task_chooser_and_each_supported_interface ... FAILED
  1132. 45.24 s >
  1133. 45.24 s > failures:
  1134. 45.24 s >
  1135. 45.24 s > failures:
  1136. 45.24 s > tests::every_product_requires_a_task_chooser_and_each_supported_interface
  1137. 45.24 s >
  1138. 45.24 s > test result: FAILED. 0 passed; 1 failed; 0 ignored; 0 measured; 110 filtered out; finished in 0.08s
  1139. 45.24 s > system-err
  1140. 45.24 s > warning: developer note gammaloop-architecture still requires a named owner
  1141. 45.24 s > warning: developer note integration-dashboard still requires a named owner
  1142. 45.24 s > warning: developer note uv-renormalization still requires a named owner
  1143. 45.24 s > warning: developer note spenso-parsing-flow still requires a named owner
  1144. 45.24 s > warning: developer note schoonschip-network still requires a named owner
  1145. 45.24 s > warning: developer note gammaloop-draw-style-migration still requires a named owner
  1146. 45.24 s > warning: developer note gammaloop-drawing-architecture still requires a named owner
  1147. 45.24 s > warning: developer note spenso-symbolica-syntax-and-rewrites still requires a named owner
  1148. 45.24 s > warning: developer note spenso-architecture still requires a named owner
  1149. 45.24 s > warning: developer note idenso-architecture still requires a named owner
  1150. 45.24 s > warning: developer note idenso-form-color-dirac-source-map still requires a named owner
  1151. 45.24 s > warning: developer note linnet-architecture still requires a named owner
  1152. 45.24 s > warning: developer note vakint-architecture still requires a named owner
  1153. 45.24 s > warning: developer note gammaloop-roadmap still requires a named owner
  1154. 45.24 s > warning: developer note cff-surface-cache-ownership still requires a named owner
  1155. 45.24 s > warning: developer note gammaloop-drawing-evaluated-fields-history still requires a named owner
  1156. 45.24 s > warning: archived developer note gammaloop-drawing-evaluated-fields-history has no immutable evidence revision
  1157. 45.24 s > warning: developer note bnl-benchmark-investigation still requires a named owner
  1158. 45.24 s > warning: developer note bnl-contraction-order-performance still requires a named owner
  1159. 45.24 s > warning: developer note bnl-scalar-alias-capture still requires a named owner
  1160. 45.24 s > warning: developer note aa-aa-three-loop-performance-smoke still requires a named owner
  1161. 45.24 s > warning: developer note network-simplification still requires a named owner
  1162. 45.24 s > warning: investigation developer note network-simplification has no immutable evidence revision
  1163. 45.24 s > warning: developer note spenso-large-expressions still requires a named owner
  1164. 45.24 s > warning: developer note spenso-improvement-effects still requires a named owner
  1165. 45.24 s > warning: archived developer note spenso-improvement-effects has no immutable evidence revision
  1166. 45.24 s > warning: developer note spenso-test-baseline still requires a named owner
  1167. 45.24 s > warning: archived developer note spenso-test-baseline has no immutable evidence revision
  1168. 45.24 s > warning: developer note bnl-evaluator-atom-capture still requires a named owner
  1169. 45.24 s > warning: archived developer note bnl-evaluator-atom-capture has no immutable evidence revision
  1170. 45.24 s > warning: developer note uv-scalar-profile-benchmark still requires a named owner
  1171. 45.24 s > warning: archived developer note uv-scalar-profile-benchmark has no immutable evidence revision
  1172. 45.24 s > warning: developer note ci-test-failure-summary-2026-03-25 still requires a named owner
  1173. 45.24 s > warning: archived developer note ci-test-failure-summary-2026-03-25 has no immutable evidence revision
  1174. 45.24 s > warning: developer note network-execution-rebase-record still requires a named owner
  1175. 45.24 s > warning: archived developer note network-execution-rebase-record has no immutable evidence revision
  1176. 45.24 s > warning: developer note ratatui-integration-dashboard-history still requires a named owner
  1177. 45.24 s > warning: archived developer note ratatui-integration-dashboard-history has no immutable evidence revision
  1178. 45.24 s > warning: developer note nix-crane-cache-reuse still requires a named owner
  1179. 45.24 s >
  1180. 45.24 s > thread 'tests::every_product_requires_a_task_chooser_and_each_supported_interface' (260) panicked at crates/alphal00p-docs-builder/src/lib.rs:11901:9:
  1181. 45.24 s > assertion failed: format!("{error:#}").contains("has no quickstart page")
  1182. 45.24 s > stack backtrace:
  1183. 45.24 s > 0: __rustc::rust_begin_unwind
  1184. 45.24 s > 1: core::panicking::panic_fmt
  1185. 45.24 s > 2: core::panicking::panic
  1186. 45.24 s > 3: alphal00p_docs_builder::tests::every_product_requires_a_task_chooser_and_each_supported_interface
  1187. 45.24 s > 4: <alphal00p_docs_builder::tests::every_product_requires_a_task_chooser_and_each_supported_interface::{closure#0} as core::ops::function::FnOnce<()>>::call_once
  1188. 45.24 s > note: Some details are omitted, run with `RUST_BACKTRACE=full` for a verbose backtrace.
  1189. 45.24 s >
  1190. 45.24 s > 2. alphal00p-docs-builder::tests::checked_in_registry_is_valid
  1191. 45.24 s > failure: test failure with exit code 101
  1192. 45.24 s > thread 'tests::checked_in_registry_is_valid' (219) panicked at crates/alphal00p-docs-builder/src/lib.rs:11887:50:
  1193. 45.24 s > called `Result::unwrap()` on an `Err` value: developer note nix-crane-cache-reuse verified scope flake.nix changed (expected 188504937418859942a6770ca21a4f4e0a7ff125, found 17dc35393f0f0abd5cb31c7eaf1fdc9aa6903ce4); owner review or an explicit no-impact attestation is required
  1194. 45.24 s >
  1195. 45.24 s > Location:
  1196. 45.24 s > crates/alphal00p-docs-builder/src/lib.rs:889:21
  1197. 45.24 s > stack backtrace:
  1198. 45.24 s > 0: __rustc::rust_begin_unwind
  1199. 45.24 s > 1: core::panicking::panic_fmt
  1200. 45.24 s > 2: core::result::unwrap_failed
  1201. 45.24 s > 3: alphal00p_docs_builder::tests::checked_in_registry_is_valid
  1202. 45.24 s > 4: <alphal00p_docs_builder::tests::checked_in_registry_is_valid::{closure#0} as core::ops::function::FnOnce<()>>::call_once
  1203. 45.24 s > note: Some details are omitted, run with `RUST_BACKTRACE=full` for a verbose backtrace.
  1204. 45.24 s > system-out
  1205. 45.24 s > running 1 test
  1206. 45.24 s > test tests::checked_in_registry_is_valid ... FAILED
  1207. 45.24 s >
  1208. 45.24 s > failures:
  1209. 45.24 s >
  1210. 45.24 s > failures:
  1211. 45.24 s > tests::checked_in_registry_is_valid
  1212. 45.24 s >
  1213. 45.24 s > test result: FAILED. 0 passed; 1 failed; 0 ignored; 0 measured; 110 filtered out; finished in 0.09s
  1214. 45.24 s > system-err
  1215. 45.24 s > warning: developer note gammaloop-architecture still requires a named owner
  1216. 45.24 s > warning: developer note integration-dashboard still requires a named owner
  1217. 45.24 s > warning: developer note uv-renormalization still requires a named owner
  1218. 45.24 s > warning: developer note spenso-parsing-flow still requires a named owner
  1219. 45.24 s > warning: developer note schoonschip-network still requires a named owner
  1220. 45.24 s > warning: developer note gammaloop-draw-style-migration still requires a named owner
  1221. 45.24 s > warning: developer note gammaloop-drawing-architecture still requires a named owner
  1222. 45.24 s > warning: developer note spenso-symbolica-syntax-and-rewrites still requires a named owner
  1223. 45.24 s > warning: developer note spenso-architecture still requires a named owner
  1224. 45.24 s > warning: developer note idenso-architecture still requires a named owner
  1225. 45.24 s > warning: developer note idenso-form-color-dirac-source-map still requires a named owner
  1226. 45.24 s > warning: developer note linnet-architecture still requires a named owner
  1227. 45.24 s > warning: developer note vakint-architecture still requires a named owner
  1228. 45.24 s > warning: developer note gammaloop-roadmap still requires a named owner
  1229. 45.24 s > warning: developer note cff-surface-cache-ownership still requires a named owner
  1230. 45.24 s > warning: developer note gammaloop-drawing-evaluated-fields-history still requires a named owner
  1231. 45.24 s > warning: archived developer note gammaloop-drawing-evaluated-fields-history has no immutable evidence revision
  1232. 45.24 s > warning: developer note bnl-benchmark-investigation still requires a named owner
  1233. 45.24 s > warning: developer note bnl-contraction-order-performance still requires a named owner
  1234. 45.24 s > warning: developer note bnl-scalar-alias-capture still requires a named owner
  1235. 45.24 s > warning: developer note aa-aa-three-loop-performance-smoke still requires a named owner
  1236. 45.24 s > warning: developer note network-simplification still requires a named owner
  1237. 45.24 s > warning: investigation developer note network-simplification has no immutable evidence revision
  1238. 45.24 s > warning: developer note spenso-large-expressions still requires a named owner
  1239. 45.24 s > warning: developer note spenso-improvement-effects still requires a named owner
  1240. 45.24 s > warning: archived developer note spenso-improvement-effects has no immutable evidence revision
  1241. 45.24 s > warning: developer note spenso-test-baseline still requires a named owner
  1242. 45.24 s > warning: archived developer note spenso-test-baseline has no immutable evidence revision
  1243. 45.24 s > warning: developer note bnl-evaluator-atom-capture still requires a named owner
  1244. 45.24 s > warning: archived developer note bnl-evaluator-atom-capture has no immutable evidence revision
  1245. 45.24 s > warning: developer note uv-scalar-profile-benchmark still requires a named owner
  1246. 45.24 s > warning: archived developer note uv-scalar-profile-benchmark has no immutable evidence revision
  1247. 45.24 s > warning: developer note ci-test-failure-summary-2026-03-25 still requires a named owner
  1248. 45.24 s > warning: archived developer note ci-test-failure-summary-2026-03-25 has no immutable evidence revision
  1249. 45.24 s > warning: developer note network-execution-rebase-record still requires a named owner
  1250. 45.24 s > warning: archived developer note network-execution-rebase-record has no immutable evidence revision
  1251. 45.24 s > warning: developer note ratatui-integration-dashboard-history still requires a named owner
  1252. 45.24 s > warning: archived developer note ratatui-integration-dashboard-history has no immutable evidence revision
  1253. 45.24 s > warning: developer note nix-crane-cache-reuse still requires a named owner
  1254. 45.24 s >
  1255. 45.24 s > thread 'tests::checked_in_registry_is_valid' (219) panicked at crates/alphal00p-docs-builder/src/lib.rs:11887:50:
  1256. 45.24 s > called `Result::unwrap()` on an `Err` value: developer note nix-crane-cache-reuse verified scope flake.nix changed (expected 188504937418859942a6770ca21a4f4e0a7ff125, found 17dc35393f0f0abd5cb31c7eaf1fdc9aa6903ce4); owner review or an explicit no-impact attestation is required
  1257. 45.24 s >
  1258. 45.24 s > Location:
  1259. 45.24 s > crates/alphal00p-docs-builder/src/lib.rs:889:21
  1260. 45.24 s > stack backtrace:
  1261. 45.24 s > 0: __rustc::rust_begin_unwind
  1262. 45.24 s > 1: core::panicking::panic_fmt
  1263. 45.24 s > 2: core::result::unwrap_failed
  1264. 45.24 s > 3: alphal00p_docs_builder::tests::checked_in_registry_is_valid
  1265. 45.24 s > 4: <alphal00p_docs_builder::tests::checked_in_registry_is_valid::{closure#0} as core::ops::function::FnOnce<()>>::call_once
  1266. 45.24 s > note: Some details are omitted, run with `RUST_BACKTRACE=full` for a verbose backtrace.
  1267. 45.24 s >
  1268. 45.24 s > 3. alphal00p-docs-builder::tests::pdf_manual_chapter_order_must_match_the_page_registry
  1269. 45.24 s > failure: test failure with exit code 101
  1270. 45.24 s > thread 'tests::pdf_manual_chapter_order_must_match_the_page_registry' (323) panicked at crates/alphal00p-docs-builder/src/lib.rs:11952:9:
  1271. 45.24 s > assertion failed: format!("{error:#}").contains("PDF manual chapter order differs")
  1272. 45.24 s > stack backtrace:
  1273. 45.24 s > 0: __rustc::rust_begin_unwind
  1274. 45.24 s > 1: core::panicking::panic_fmt
  1275. 45.24 s > 2: core::panicking::panic
  1276. 45.24 s > 3: alphal00p_docs_builder::tests::pdf_manual_chapter_order_must_match_the_page_registry
  1277. 45.24 s > 4: <alphal00p_docs_builder::tests::pdf_manual_chapter_order_must_match_the_page_registry::{closure#0} as core::ops::function::FnOnce<()>>::call_once
  1278. 45.24 s > note: Some details are omitted, run with `RUST_BACKTRACE=full` for a verbose backtrace.
  1279. 45.24 s > system-out
  1280. 45.24 s > running 1 test
  1281. 45.24 s > test tests::pdf_manual_chapter_order_must_match_the_page_registry ... FAILED
  1282. 45.24 s >
  1283. 45.24 s > failures:
  1284. 45.24 s >
  1285. 45.24 s > failures:
  1286. 45.24 s > tests::pdf_manual_chapter_order_must_match_the_page_registry
  1287. 45.24 s >
  1288. 45.24 s > test result: FAILED. 0 passed; 1 failed; 0 ignored; 0 measured; 110 filtered out; finished in 0.07s
  1289. 45.24 s > system-err
  1290. 45.24 s > warning: developer note gammaloop-architecture still requires a named owner
  1291. 45.24 s > warning: developer note integration-dashboard still requires a named owner
  1292. 45.24 s > warning: developer note uv-renormalization still requires a named owner
  1293. 45.24 s > warning: developer note spenso-parsing-flow still requires a named owner
  1294. 45.24 s > warning: developer note schoonschip-network still requires a named owner
  1295. 45.24 s > warning: developer note gammaloop-draw-style-migration still requires a named owner
  1296. 45.24 s > warning: developer note gammaloop-drawing-architecture still requires a named owner
  1297. 45.24 s > warning: developer note spenso-symbolica-syntax-and-rewrites still requires a named owner
  1298. 45.24 s > warning: developer note spenso-architecture still requires a named owner
  1299. 45.24 s > warning: developer note idenso-architecture still requires a named owner
  1300. 45.24 s > warning: developer note idenso-form-color-dirac-source-map still requires a named owner
  1301. 45.24 s > warning: developer note linnet-architecture still requires a named owner
  1302. 45.24 s > warning: developer note vakint-architecture still requires a named owner
  1303. 45.24 s > warning: developer note gammaloop-roadmap still requires a named owner
  1304. 45.24 s > warning: developer note cff-surface-cache-ownership still requires a named owner
  1305. 45.24 s > warning: developer note gammaloop-drawing-evaluated-fields-history still requires a named owner
  1306. 45.24 s > warning: archived developer note gammaloop-drawing-evaluated-fields-history has no immutable evidence revision
  1307. 45.24 s > warning: developer note bnl-benchmark-investigation still requires a named owner
  1308. 45.24 s > warning: developer note bnl-contraction-order-performance still requires a named owner
  1309. 45.24 s > warning: developer note bnl-scalar-alias-capture still requires a named owner
  1310. 45.24 s > warning: developer note aa-aa-three-loop-performance-smoke still requires a named owner
  1311. 45.24 s > warning: developer note network-simplification still requires a named owner
  1312. 45.24 s > warning: investigation developer note network-simplification has no immutable evidence revision
  1313. 45.24 s > warning: developer note spenso-large-expressions still requires a named owner
  1314. 45.24 s > warning: developer note spenso-improvement-effects still requires a named owner
  1315. 45.24 s > warning: archived developer note spenso-improvement-effects has no immutable evidence revision
  1316. 45.24 s > warning: developer note spenso-test-baseline still requires a named owner
  1317. 45.24 s > warning: archived developer note spenso-test-baseline has no immutable evidence revision
  1318. 45.24 s > warning: developer note bnl-evaluator-atom-capture still requires a named owner
  1319. 45.24 s > warning: archived developer note bnl-evaluator-atom-capture has no immutable evidence revision
  1320. 45.24 s > warning: developer note uv-scalar-profile-benchmark still requires a named owner
  1321. 45.24 s > warning: archived developer note uv-scalar-profile-benchmark has no immutable evidence revision
  1322. 45.24 s > warning: developer note ci-test-failure-summary-2026-03-25 still requires a named owner
  1323. 45.24 s > warning: archived developer note ci-test-failure-summary-2026-03-25 has no immutable evidence revision
  1324. 45.24 s > warning: developer note network-execution-rebase-record still requires a named owner
  1325. 45.24 s > warning: archived developer note network-execution-rebase-record has no immutable evidence revision
  1326. 45.24 s > warning: developer note ratatui-integration-dashboard-history still requires a named owner
  1327. 45.24 s > warning: archived developer note ratatui-integration-dashboard-history has no immutable evidence revision
  1328. 45.24 s > warning: developer note nix-crane-cache-reuse still requires a named owner
  1329. 45.24 s >
  1330. 45.24 s > thread 'tests::pdf_manual_chapter_order_must_match_the_page_registry' (323) panicked at crates/alphal00p-docs-builder/src/lib.rs:11952:9:
  1331. 45.24 s > assertion failed: format!("{error:#}").contains("PDF manual chapter order differs")
  1332. 45.24 s > stack backtrace:
  1333. 45.24 s > 0: __rustc::rust_begin_unwind
  1334. 45.24 s > 1: core::panicking::panic_fmt
  1335. 45.24 s > 2: core::panicking::panic
  1336. 45.24 s > 3: alphal00p_docs_builder::tests::pdf_manual_chapter_order_must_match_the_page_registry
  1337. 45.24 s > 4: <alphal00p_docs_builder::tests::pdf_manual_chapter_order_must_match_the_page_registry::{closure#0} as core::ops::function::FnOnce<()>>::call_once
  1338. 45.24 s > note: Some details are omitted, run with `RUST_BACKTRACE=full` for a verbose backtrace.
  1339. 45.24 s > =========================================
  1340. 45.24 s > Extracting 2 binaries to /build/source
  1341. 45.24 s > Extracted 5 files to /build/source in 0.04s
  1342. 45.24 s > ------------
  1343. 45.24 s > Nextest run ID 79e063cf-e144-4b18-b14f-f48ff4cd0588 with nextest profile: ci_gammaloop
  1344. 45.24 s > Starting 22 tests across 2 binaries
  1345. 45.24 s > ------------
  1346. 45.24 s > Summary [ 0.014s] 22 tests run: 22 passed, 0 skipped
  1347. 45.24 s >
  1348. 45.24 s > ========== nextest test summary ==========
  1349. 45.24 s > report: target/nextest/ci_gammaloop/junit.xml
  1350. 45.24 s > tests: 22, failures: 0, errors: 0
  1351. 45.24 s > No failing testcases found.
  1352. 45.24 s > =========================================
  1353. 45.24 s > Extracting 1 binary, 1 build script output directory, and 2 linked paths to /build/source
  1354. 45.24 s > Extracted 18 files to /build/source in 0.07s
  1355. 45.24 s > ------------
  1356. 45.24 s > Nextest run ID c4e8a8ec-e8b8-45f3-b812-8aae66e138cb with nextest profile: ci_gammaloop
  1357. 45.24 s > Starting 89 tests across 1 binary
  1358. 45.24 s > ------------
  1359. 45.24 s > Summary [ 0.039s] 89 tests run: 89 passed, 0 skipped
  1360. 45.24 s >
  1361. 45.24 s > ========== nextest test summary ==========
  1362. 45.24 s > report: target/nextest/ci_gammaloop/junit.xml
  1363. 45.24 s > tests: 89, failures: 0, errors: 0
  1364. 45.24 s > No failing testcases found.
  1365. 45.24 s > =========================================
  1366. 45.24 s > Extracting 2 binaries to /build/source
  1367. 45.24 s > Extracted 5 files to /build/source in 0.04s
  1368. 45.24 s > ------------
  1369. 45.24 s > Nextest run ID c6cd3427-721a-410d-898e-56c0e84aa194 with nextest profile: ci_gammaloop
  1370. 45.24 s > Starting 10 tests across 2 binaries
  1371. 45.24 s > ------------
  1372. 45.24 s > Summary [ 11.281s] 10 tests run: 10 passed, 0 skipped
  1373. 45.24 s >
  1374. 45.24 s > ========== nextest test summary ==========
  1375. 45.24 s > report: target/nextest/ci_gammaloop/junit.xml
  1376. 45.24 s > tests: 10, failures: 0, errors: 0
  1377. 45.24 s > No failing testcases found.
  1378. 45.24 s > =========================================
  1379. 45.24 s > Extracting 1 binary to /build/source
  1380. 45.24 s > Extracted 4 files to /build/source in 0.03s
  1381. 45.24 s > ------------
  1382. 45.24 s > Nextest run ID 172b2381-02a7-406e-8dbd-c0015322eb5c with nextest profile: ci_gammaloop
  1383. 45.24 s > Starting 0 tests across 1 binary
  1384. 45.24 s > ------------
  1385. 45.24 s > Summary [ 0.000s] 0 tests run: 0 passed, 0 skipped
  1386. 45.24 s >
  1387. 45.24 s > ========== nextest test summary ==========
  1388. 45.24 s > report: target/nextest/ci_gammaloop/junit.xml
  1389. 45.24 s > tests: 0, failures: 0, errors: 0
  1390. 45.24 s > No failing testcases found.
  1391. 45.24 s > =========================================
  1392. 45.24 s > Extracting 1 binary to /build/source
  1393. 45.24 s > Extracted 4 files to /build/source in 0.03s
  1394. 45.24 s > ------------
  1395. 45.24 s > Nextest run ID 8dc51b47-6ba5-48fc-be18-ae7c36df1009 with nextest profile: ci_gammaloop
  1396. 45.24 s > Starting 5 tests across 1 binary
  1397. 45.24 s > ------------
  1398. 45.24 s > Summary [ 0.006s] 5 tests run: 5 passed, 0 skipped
  1399. 45.24 s >
  1400. 45.24 s > ========== nextest test summary ==========
  1401. 45.24 s > report: target/nextest/ci_gammaloop/junit.xml
  1402. 45.24 s > tests: 5, failures: 0, errors: 0
  1403. 45.24 s > No failing testcases found.
  1404. 45.24 s > =========================================
  1405. 45.24 s For full logs, run:
  1406. 45.24 s nix log /nix/store/ig2n8vvnnpdbrss20g10xh19f2x4lxrl-gammaloop-nextest-docs.drv
  1407. 45.36 s [0 built (1 failed), 0.0Run failed.