test packages.x86_64-linux.nix-ci-check-gammaloop-nextest-integration

Reproduce this run
Retry Run
  1. 211.65 s gammaloop-nextest-integration> | dod2_bubble | rls.integrated | GL0 | pass | 0.0sigma | compatible within 2sigma | - |
  2. 211.65 s gammaloop-nextest-integration> +-------------+-----------------+---------+--------+----------+-----------------------------------------------------------------------------------------------------------------------+-------+
  3. 211.65 s gammaloop-nextest-integration> | dod2_bubble | mu_r.inspect | inspect | pass | - | best inspect relative delta 6.951e-1 >= 1000*accuracy 1.000e-7 (accuracy=1.000e-10, exponent=+0.0, seed=0, probes=10) | - |
  4. 211.65 s gammaloop-nextest-integration> +-------------+-----------------+---------+--------+----------+-----------------------------------------------------------------------------------------------------------------------+-------+
  5. 211.65 s gammaloop-nextest-integration> | dod2_bubble | target | - | pass | - | 2sigma | - |
  6. 211.65 s gammaloop-nextest-integration> +-------------+-----------------+---------+--------+----------+-----------------------------------------------------------------------------------------------------------------------+-------+
  7. 211.65 s gammaloop-nextest-integration> test dod2_bubble_uv ... FAILED
  8. 211.65 s gammaloop-nextest-integration>
  9. 211.65 s gammaloop-nextest-integration> failures:
  10. 211.65 s gammaloop-nextest-integration>
  11. 211.65 s gammaloop-nextest-integration> failures:
  12. 211.65 s gammaloop-nextest-integration> dod2_bubble_uv
  13. 211.65 s gammaloop-nextest-integration>
  14. 211.65 s gammaloop-nextest-integration> test result: FAILED. 0 passed; 1 failed; 0 ignored; 0 measured; 24 filtered out; finished in 68.42s
  15. 211.65 s gammaloop-nextest-integration> system-err
  16. 211.65 s gammaloop-nextest-integration> [2026-08-28 19:10:58.263] @gammaloop_api::se... INFO : Running command run generate
  17. 211.65 s gammaloop-nextest-integration> [2026-08-28 19:10:58.263] @gammaloop_api::se... INFO : Starting command block generate
  18. 211.65 s gammaloop-nextest-integration> [2026-08-28 19:10:58.263] @gammaloop_api::se... INFO : Running command import model scalars-default.json
  19. 211.65 s gammaloop-nextest-integration> [2026-08-28 19:10:58.263] @import::model INFO : Loading built-in JSON model scalars-default
  20. 211.65 s gammaloop-nextest-integration> [2026-08-28 19:10:58.297] @gammalooprs::model INFO : The following 2 external parameters were forced to zero by the restriction card:
  21. 211.65 s gammaloop-nextest-integration> width_scalar_1, width_scalar_2
  22. 211.65 s gammaloop-nextest-integration> [2026-08-28 19:10:58.298] @gammaloop_api::se... INFO : Running command remove processes
  23. 211.65 s gammaloop-nextest-integration> [2026-08-28 19:10:58.298] @gammaloop_api::se... INFO : Running command set global kv global.generation.uv.generate_integrated=true
  24. 211.65 s gammaloop-nextest-integration> [2026-08-28 19:10:58.299] @gammaloop_api::se... INFO : Running command import graphs ./tests/resources/graphs/scalar/dod2_bubble.dot -p bubble_dod2 -i scalar_bubble_below_thres
  25. 211.65 s gammaloop-nextest-integration> [2026-08-28 19:10:58.299] @commands::import INFO : Loading graphs from '/build/source/tests/resources/graphs/scalar/dod2_bubble.dot'
  26. 211.65 s gammaloop-nextest-integration> [2026-08-28 19:10:58.305] @gammaloop_api::se... INFO : Running command generate existing -p bubble_dod2 -i scalar_bubble_below_thres
  27. 211.65 s gammaloop-nextest-integration> [2026-08-28 19:10:58.306] @approx::local_4d [{#uv, #inspect, #integrated}] DEBUG : Rescaled momenta expanded
  28. 211.65 s gammaloop-nextest-integration> field value
  29. 211.65 s gammaloop-nextest-integration> res n-terms: 1, byte size: 3,expr:
  30. 211.65 s gammaloop-nextest-integration> 1
  31. 211.65 s gammaloop-nextest-integration> [2026-08-28 19:10:58.314] @approx::local_4d [{#uv, #inspect, #integrated}] DEBUG : Rescaled momenta expanded
  32. 211.65 s gammaloop-nextest-integration> field value
  33. 211.65 s gammaloop-nextest-integration> res n-terms: 1, byte size: 585,expr:
  34. 211.65 s gammaloop-nextest-integration> -SCALAR_COUPLING²·q₀(αᵉ².¹)·q₀(αᵉ³.¹)·q₂(αᵉ².¹)·q₂(αᵉ³.¹)
  35. 211.65 s gammaloop-nextest-integration> /(t²·denom(3,-q₀-q₂/t,mass_scalar_2²,-mass_scalar_2²+2·(q₀.q₂)/t+(q₂.q₂)/t²+(q₀.q₀))
  36. 211.65 s gammaloop-nextest-integration> ·denom(2,q₂/t,mass_scalar_2²,-mass_scalar_2²+(q₂.q₂)/t²))
  37. 211.65 s gammaloop-nextest-integration> [2026-08-28 19:10:58.324] @approx::final_integrand[{#generation, #profile, #uv, #graph, #summary}] DEBUG : Computed global numerator
  38. 211.65 s gammaloop-nextest-integration> field value
  39. 211.65 s gammaloop-nextest-integration> global_num n-terms: 1, byte size: 4,expr:
  40. 211.65 s gammaloop-nextest-integration> 1/2
  41. 211.65 s gammaloop-nextest-integration> span build_3d{span_context=true graph=GL0 current=subgraph=0, topo_order=0, dod=0}
  42. 211.65 s gammaloop-nextest-integration> [2026-08-28 19:10:58.335] @uv::approx [{#generation, #uv, #fourd}] DEBUG : Computing 4D
  43. 211.65 s gammaloop-nextest-integration> field value
  44. 211.65 s gammaloop-nextest-integration> simple subgraph(S_11,S_y)*Approx(subgraph(S_y,0)) of GL0
  45. 211.65 s gammaloop-nextest-integration> span compute_4d{span_context=true graph=GL0 current=subgraph=y, topo_order=1, dod=2 given=subgraph=0, topo_order=0, dod=0 reduced=SubSet { set: BitVec<usize, bitvec::order::Lsb0> { addr: 0x7fffec018010, head: 000000, bits: 6, capacity: 64 } [0, 0, 1, 1, 1, 1], id: PhantomData<linnet::half_edge::involution::Hedge> }}
  46. 211.65 s gammaloop-nextest-integration> [2026-08-28 19:10:58.336] @approx::local_4d [{#uv, #algebra, #integrated, #start}] DEBUG :
  47. 211.65 s gammaloop-nextest-integration> field value
  48. 211.65 s gammaloop-nextest-integration> integrand n-terms: 1, byte size: 409,expr:
  49. 211.65 s gammaloop-nextest-integration> SCALAR_COUPLING²·(q₀(αᵉ³.¹)+q₃(αᵉ³.¹))·q₀(αᵉ².¹)·q₀(αᵉ³.¹)·q₂(αᵉ².¹)
  50. 211.65 s gammaloop-nextest-integration> /(denom(2,q₂,mass_scalar_2²,-mass_scalar_2²+(q₂.q₂))·denom(3,q₃,mass_scalar_2²,-mass_scalar_2²+(q₃.q₃)))
  51. 211.65 s gammaloop-nextest-integration> reduced y
  52. 211.65 s gammaloop-nextest-integration> span grow{span_context=true current=subgraph=y, topo_order=1, dod=2 given=subgraph=0, topo_order=0, dod=0}
  53. 211.65 s gammaloop-nextest-integration> [2026-08-28 19:10:58.336] @approx::local_4d [{#uv, #inspect, #integrated}] DEBUG : Rescaled momenta expanded
  54. 211.65 s gammaloop-nextest-integration> field value
  55. 211.65 s gammaloop-nextest-integration> res n-terms: 1, byte size: 585,expr:
  56. 211.65 s gammaloop-nextest-integration> -SCALAR_COUPLING²·q₀(αᵉ².¹)·q₀(αᵉ³.¹)·q₂(αᵉ².¹)·q₂(αᵉ³.¹)
  57. 211.65 s gammaloop-nextest-integration> /(t²·denom(3,-q₀-q₂/t,mass_scalar_2²,-mass_scalar_2²+2·(q₀.q₂)/t+(q₂.q₂)/t²+(q₀.q₀))
  58. 211.65 s gammaloop-nextest-integration> ·denom(2,q₂/t,mass_scalar_2²,-mass_scalar_2²+(q₂.q₂)/t²))
  59. 211.65 s gammaloop-nextest-integration> span t{span_context=true current=subgraph=y, topo_order=1, dod=2 given=subgraph=0, topo_order=0, dod=0}
  60. 211.65 s gammaloop-nextest-integration> [2026-08-28 19:10:58.336] @approx::local_4d [{#uv, #integrated, #rescaled}] DEBUG : Rescaled expanded
  61. 211.65 s gammaloop-nextest-integration> field value
  62. 211.65 s gammaloop-nextest-integration> n_loops 1
  63. 211.65 s gammaloop-nextest-integration> res n-terms: 1, byte size: 707,expr:
  64. 211.65 s gammaloop-nextest-integration> -SCALAR_COUPLING²·q₀(αᵉ².¹)·q₀(αᵉ³.¹)·q₂(αᵉ².¹)·q₂(αᵉ³.¹)
  65. 211.65 s gammaloop-nextest-integration> /(t²·denom(3,-q₂,mUVexp²+t²·mass_scalar_2²,-mUV²+t²·(-mass_scalar_2²+2·(q₀.q₂)/t+(q₂.q₂)/t²+(q₀.q₀))+t²·mUVexp²)
  66. 211.65 s gammaloop-nextest-integration> ·denom(2,q₂,mUVexp²+t²·mass_scalar_2²,-mUV²+t²·(-mass_scalar_2²+(q₂.q₂)/t²)+t²·mUVexp²))
  67. 211.65 s gammaloop-nextest-integration> span t{span_context=true current=subgraph=y, topo_order=1, dod=2 given=subgraph=0, topo_order=0, dod=0}
  68. 211.65 s gammaloop-nextest-integration> [2026-08-28 19:10:58.346] @approx::local_4d [{#uv, #integrated, #series}] DEBUG : Series expanded
  69. 211.65 s gammaloop-nextest-integration> field value
  70. 211.65 s gammaloop-nextest-integration> res n-terms: 3, byte size: 1896,expr:
  71. 211.65 s gammaloop-nextest-integration> (1/2·SCALAR_COUPLING²·(2·mUVexp²-2·mass_scalar_2²)/(denom(2,q₂,mUVexp²,-mUV²+(q₂.q₂))²·denom(3,-q₂,mUVexp²,-mUV²+(q₂.q₂)))
  72. 211.65 s gammaloop-nextest-integration> -SCALAR_COUPLING²
  73. 211.65 s gammaloop-nextest-integration> ·(-1/2·(2·mUVexp²-2·mass_scalar_2²+2·(q₀.q₀))/denom(3,-q₂,mUVexp²,-mUV²+(q₂.q₂))
  74. 211.65 s gammaloop-nextest-integration> +4·(q₀.q₂)²/denom(3,-q₂,mUVexp²,-mUV²+(q₂.q₂))²
  75. 211.66 s gammaloop-nextest-integration> )/(denom(2,q₂,mUVexp²,-mUV²+(q₂.q₂))·denom(3,-q₂,mUVexp²,-mUV²+(q₂.q₂)))
  76. 211.66 s gammaloop-nextest-integration> )·q₀(αᵉ².¹)·q₀(αᵉ³.¹)·q₂(αᵉ².¹)·q₂(αᵉ³.¹)
  77. 211.66 s gammaloop-nextest-integration> +2·SCALAR_COUPLING²·(q₀.q₂)·q₀(αᵉ².¹)·q₀(αᵉ³.¹)·q₂(αᵉ².¹)·q₂(αᵉ³.¹)
  78. 211.66 s gammaloop-nextest-integration> /(t·denom(2,q₂,mUVexp²,-mUV²+(q₂.q₂))·denom(3,-q₂,mUVexp²,-mUV²+(q₂.q₂))²)
  79. 211.66 s gammaloop-nextest-integration> -SCALAR_COUPLING²·q₀(αᵉ².¹)·q₀(αᵉ³.¹)·q₂(αᵉ².¹)·q₂(αᵉ³.¹)
  80. 211.66 s gammaloop-nextest-integration> /(t²·denom(2,q₂,mUVexp²,-mUV²+(q₂.q₂))·denom(3,-q₂,mUVexp²,-mUV²+(q₂.q₂)))
  81. 211.66 s gammaloop-nextest-integration> span t{span_context=true current=subgraph=y, topo_order=1, dod=2 given=subgraph=0, topo_order=0, dod=0}
  82. 211.66 s gammaloop-nextest-integration> [2026-08-28 19:10:58.347] @approx::local_4d [{#uv, #integrated, #series}] DEBUG : Evaluated at t = 1
  83. 211.66 s gammaloop-nextest-integration> field value
  84. 211.66 s gammaloop-nextest-integration> res n-terms: 3, byte size: 1880,expr:
  85. 211.66 s gammaloop-nextest-integration> (1/2·SCALAR_COUPLING²·(2·mUVexp²-2·mass_scalar_2²)/(denom(2,q₂,mUVexp²,-mUV²+(q₂.q₂))²·denom(3,-q₂,mUVexp²,-mUV²+(q₂.q₂)))
  86. 211.66 s gammaloop-nextest-integration> -SCALAR_COUPLING²
  87. 211.66 s gammaloop-nextest-integration> ·(-1/2·(2·mUVexp²-2·mass_scalar_2²+2·(q₀.q₀))/denom(3,-q₂,mUVexp²,-mUV²+(q₂.q₂))
  88. 211.66 s gammaloop-nextest-integration> +4·(q₀.q₂)²/denom(3,-q₂,mUVexp²,-mUV²+(q₂.q₂))²
  89. 211.66 s gammaloop-nextest-integration> )/(denom(2,q₂,mUVexp²,-mUV²+(q₂.q₂))·denom(3,-q₂,mUVexp²,-mUV²+(q₂.q₂)))
  90. 211.66 s gammaloop-nextest-integration> )·q₀(αᵉ².¹)·q₀(αᵉ³.¹)·q₂(αᵉ².¹)·q₂(αᵉ³.¹)
  91. 211.66 s gammaloop-nextest-integration> -SCALAR_COUPLING²·q₀(αᵉ².¹)·q₀(αᵉ³.¹)·q₂(αᵉ².¹)·q₂(αᵉ³.¹)
  92. 211.66 s gammaloop-nextest-integration> /(denom(2,q₂,mUVexp²,-mUV²+(q₂.q₂))·denom(3,-q₂,mUVexp²,-mUV²+(q₂.q₂)))
  93. 211.66 s gammaloop-nextest-integration> +2·SCALAR_COUPLING²·(q₀.q₂)·q₀(αᵉ².¹)·q₀(αᵉ³.¹)·q₂(αᵉ².¹)·q₂(αᵉ³.¹)
  94. 211.66 s gammaloop-nextest-integration> /(denom(2,q₂,mUVexp²,-mUV²+(q₂.q₂))·denom(3,-q₂,mUVexp²,-mUV²+(q₂.q₂))²)
  95. 211.66 s gammaloop-nextest-integration> span t{span_context=true current=subgraph=y, topo_order=1, dod=2 given=subgraph=0, topo_order=0, dod=0}
  96. 211.66 s gammaloop-nextest-integration> [2026-08-28 19:10:58.356] @approx::local_4d [{#uv, #collect, #integrated}] DEBUG : After gamma chain collection
  97. 211.66 s gammaloop-nextest-integration> field value
  98. 211.66 s gammaloop-nextest-integration> expr n-terms: 3, byte size: 1880,expr:
  99. 211.66 s gammaloop-nextest-integration> (1/2·SCALAR_COUPLING²·(2·mUVexp²-2·mass_scalar_2²)/(denom(2,q₂,mUVexp²,-mUV²+(q₂.q₂))²·denom(3,-q₂,mUVexp²,-mUV²+(q₂.q₂)))
  100. 211.66 s gammaloop-nextest-integration> -SCALAR_COUPLING²
  101. 211.66 s gammaloop-nextest-integration> ·(-1/2·(2·mUVexp²-2·mass_scalar_2²+2·(q₀.q₀))/denom(3,-q₂,mUVexp²,-mUV²+(q₂.q₂))
  102. 211.66 s gammaloop-nextest-integration> +4·(q₀.q₂)²/denom(3,-q₂,mUVexp²,-mUV²+(q₂.q₂))²
  103. 211.66 s gammaloop-nextest-integration> )/(denom(2,q₂,mUVexp²,-mUV²+(q₂.q₂))·denom(3,-q₂,mUVexp²,-mUV²+(q₂.q₂)))
  104. 211.66 s gammaloop-nextest-integration> )·q₀(αᵉ².¹)·q₀(αᵉ³.¹)·q₂(αᵉ².¹)·q₂(αᵉ³.¹)
  105. 211.66 s gammaloop-nextest-integration> -SCALAR_COUPLING²·q₀(αᵉ².¹)·q₀(αᵉ³.¹)·q₂(αᵉ².¹)·q₂(αᵉ³.¹)
  106. 211.66 s gammaloop-nextest-integration> /(denom(2,q₂,mUVexp²,-mUV²+(q₂.q₂))·denom(3,-q₂,mUVexp²,-mUV²+(q₂.q₂)))
  107. 211.66 s gammaloop-nextest-integration> +2·SCALAR_COUPLING²·(q₀.q₂)·q₀(αᵉ².¹)·q₀(αᵉ³.¹)·q₂(αᵉ².¹)·q₂(αᵉ³.¹)
  108. 211.66 s gammaloop-nextest-integration> /(denom(2,q₂,mUVexp²,-mUV²+(q₂.q₂))·denom(3,-q₂,mUVexp²,-mUV²+(q₂.q₂))²)
  109. 211.66 s gammaloop-nextest-integration> span t{span_context=true current=subgraph=y, topo_order=1, dod=2 given=subgraph=0, topo_order=0, dod=0}
  110. 211.66 s gammaloop-nextest-integration> [2026-08-28 19:10:58.364] @approx::local_4d [{#profile, #uv, #collect, #integrated, #start, #trace}] DEBUG : After gamma schoonschip
  111. 211.66 s gammaloop-nextest-integration> field value
  112. 211.66 s gammaloop-nextest-integration> expr n-terms: 3, byte size: 1631,expr:
  113. 211.66 s gammaloop-nextest-integration> (1/2·SCALAR_COUPLING²·(2·mUVexp²-2·mass_scalar_2²)/(denom(2,q₂,mUVexp²,-mUV²+(q₂.q₂))²·denom(3,-q₂,mUVexp²,-mUV²+(q₂.q₂)))
  114. 211.66 s gammaloop-nextest-integration> -SCALAR_COUPLING²
  115. 211.66 s gammaloop-nextest-integration> ·(-1/2·(2·mUVexp²-2·mass_scalar_2²+2·(q₀.q₀))/denom(3,-q₂,mUVexp²,-mUV²+(q₂.q₂))
  116. 211.66 s gammaloop-nextest-integration> +4·(q₀.q₂)²/denom(3,-q₂,mUVexp²,-mUV²+(q₂.q₂))²
  117. 211.66 s gammaloop-nextest-integration> )/(denom(2,q₂,mUVexp²,-mUV²+(q₂.q₂))·denom(3,-q₂,mUVexp²,-mUV²+(q₂.q₂)))
  118. 211.66 s gammaloop-nextest-integration> )·(q₀.q₂)²
  119. 211.66 s gammaloop-nextest-integration> -SCALAR_COUPLING²·(q₀.q₂)²/(denom(2,q₂,mUVexp²,-mUV²+(q₂.q₂))·denom(3,-q₂,mUVexp²,-mUV²+(q₂.q₂)))
  120. 211.66 s gammaloop-nextest-integration> +2·SCALAR_COUPLING²·(q₀.q₂)·(q₀.q₂)²
  121. 211.66 s gammaloop-nextest-integration> /(denom(2,q₂,mUVexp²,-mUV²+(q₂.q₂))·denom(3,-q₂,mUVexp²,-mUV²+(q₂.q₂))²)
  122. 211.66 s gammaloop-nextest-integration> span t{span_context=true current=subgraph=y, topo_order=1, dod=2 given=subgraph=0, topo_order=0, dod=0}
  123. 211.66 s gammaloop-nextest-integration> [2026-08-28 19:10:58.367] @approx::local_4d [{#profile, #uv, #collect, #integrated, #start, #trace}] DEBUG : After gamma collection
  124. 211.66 s gammaloop-nextest-integration> field value
  125. 211.66 s gammaloop-nextest-integration> expr n-terms: 1, byte size: 1347,expr:
  126. 211.66 s gammaloop-nextest-integration> SCALAR_COUPLING²
  127. 211.66 s gammaloop-nextest-integration> ·(-denom(2,q₂,mUVexp²,-mUV²+(q₂.q₂))·denom(3,-q₂,mUVexp²,-mUV²+(q₂.q₂))²
  128. 211.66 s gammaloop-nextest-integration> +1/2·(2·mUVexp²-2·mass_scalar_2²)·denom(3,-q₂,mUVexp²,-mUV²+(q₂.q₂))²
  129. 211.66 s gammaloop-nextest-integration> -(-1/2·(2·mUVexp²-2·mass_scalar_2²+2·(q₀.q₀))·denom(3,-q₂,mUVexp²,-mUV²+(q₂.q₂))+4·(q₀.q₂)²)
  130. 211.66 s gammaloop-nextest-integration> ·denom(2,q₂,mUVexp²,-mUV²+(q₂.q₂))
  131. 211.66 s gammaloop-nextest-integration> +2·(q₀.q₂)·denom(2,q₂,mUVexp²,-mUV²+(q₂.q₂))·denom(3,-q₂,mUVexp²,-mUV²+(q₂.q₂))
  132. 211.66 s gammaloop-nextest-integration> )·(q₀.q₂)²/(denom(2,q₂,mUVexp²,-mUV²+(q₂.q₂))²·denom(3,-q₂,mUVexp²,-mUV²+(q₂.q₂))³)
  133. 211.66 s gammaloop-nextest-integration> span t{span_context=true current=subgraph=y, topo_order=1, dod=2 given=subgraph=0, topo_order=0, dod=0}
  134. 211.66 s gammaloop-nextest-integration> [2026-08-28 19:10:58.375] @approx::local_4d [{#profile, #uv, #gamma, #integrated, #start, #trace, #vakint}] DEBUG : After gamma simplification
  135. 211.66 s gammaloop-nextest-integration> ... omitted 3263 more lines; see full nextest output above
  136. 211.66 s gammaloop-nextest-integration>
  137. 211.66 s gammaloop-nextest-integration> 8. gammaloop-integration-tests::uv::sunrise_scalar_1_uv
  138. 211.69 s gammaloop-nextest-integration> failure: test failure with exit code 101
  139. 211.69 s gammaloop-nextest-integration> system-out
  140. 211.69 s gammaloop-nextest-integration> running 1 test
  141. 211.69 s gammaloop-nextest-integration> test sunrise_scalar_1_uv has been running for over 60 seconds
  142. 211.69 s gammaloop-nextest-integration> +------------------+------------------------+--------------+--------+----------+----------------------------------------------------------------------------------------------------------------------+-------+
  143. 211.69 s gammaloop-nextest-integration> | case | check | graph | status | sigma | threshold | error |
  144. 211.69 s gammaloop-nextest-integration> +------------------+------------------------+--------------+--------+----------+----------------------------------------------------------------------------------------------------------------------+-------+
  145. 211.69 s gammaloop-nextest-integration> | sunrise_scalar_1 | uv_profile | - | FAIL | - | - | - |
  146. 211.69 s gammaloop-nextest-integration> +------------------+------------------------+--------------+--------+----------+----------------------------------------------------------------------------------------------------------------------+-------+
  147. 211.69 s gammaloop-nextest-integration> | sunrise_scalar_1 | m_uv.inspect | inspect | pass | - | best inspect relative delta 1.624e0 >= 1000*accuracy 1.000e-3 (accuracy=1.000e-6, exponent=+1.0, seed=1, probes=10) | - |
  148. 211.69 s gammaloop-nextest-integration> +------------------+------------------------+--------------+--------+----------+----------------------------------------------------------------------------------------------------------------------+-------+
  149. 211.69 s gammaloop-nextest-integration> | sunrise_scalar_1 | m_uv.integrated | sunrise | pass | 0.1sigma | compatible within 2sigma | - |
  150. 211.69 s gammaloop-nextest-integration> +------------------+------------------------+--------------+--------+----------+----------------------------------------------------------------------------------------------------------------------+-------+
  151. 211.69 s gammaloop-nextest-integration> | sunrise_scalar_1 | rls.inspect | inspect | pass | - | best inspect relative delta 8.682e-1 >= 1000*accuracy 1.000e-3 (accuracy=1.000e-6, exponent=+1.0, seed=1, probes=10) | - |
  152. 211.69 s gammaloop-nextest-integration> +------------------+------------------------+--------------+--------+----------+----------------------------------------------------------------------------------------------------------------------+-------+
  153. 211.69 s gammaloop-nextest-integration> | sunrise_scalar_1 | rls.integrated | sunrise | pass | 0.0sigma | compatible within 2sigma | - |
  154. 211.69 s gammaloop-nextest-integration> +------------------+------------------------+--------------+--------+----------+----------------------------------------------------------------------------------------------------------------------+-------+
  155. 211.69 s gammaloop-nextest-integration> | sunrise_scalar_1 | mu_r.inspect | inspect | pass | - | best inspect relative delta 1.752e0 >= 1000*accuracy 1.000e-3 (accuracy=1.000e-6, exponent=+1.0, seed=1, probes=10) | - |
  156. 211.69 s gammaloop-nextest-integration> +------------------+------------------------+--------------+--------+----------+----------------------------------------------------------------------------------------------------------------------+-------+
  157. 211.69 s gammaloop-nextest-integration> | sunrise_scalar_1 | integrated.relerr | integrated | pass | - | relative error 9.20% <= 10.00% | - |
  158. 211.69 s gammaloop-nextest-integration> +------------------+------------------------+--------------+--------+----------+----------------------------------------------------------------------------------------------------------------------+-------+
  159. 211.69 s gammaloop-nextest-integration> | sunrise_scalar_1 | m_uv.integrated.relerr | m_uv-shifted | pass | - | relative error 5.89% <= 10.00% | - |
  160. 211.69 s gammaloop-nextest-integration> +------------------+------------------------+--------------+--------+----------+----------------------------------------------------------------------------------------------------------------------+-------+
  161. 211.69 s gammaloop-nextest-integration> | sunrise_scalar_1 | target | - | pass | - | 2sigma | - |
  162. 211.69 s gammaloop-nextest-integration> +------------------+------------------------+--------------+--------+----------+----------------------------------------------------------------------------------------------------------------------+-------+
  163. 211.69 s gammaloop-nextest-integration> test sunrise_scalar_1_uv ... FAILED
  164. 211.69 s gammaloop-nextest-integration>
  165. 211.69 s gammaloop-nextest-integration> failures:
  166. 211.69 s gammaloop-nextest-integration>
  167. 211.69 s gammaloop-nextest-integration> failures:
  168. 211.69 s gammaloop-nextest-integration> sunrise_scalar_1_uv
  169. 211.69 s gammaloop-nextest-integration>
  170. 211.69 s gammaloop-nextest-integration> test result: FAILED. 0 passed; 1 failed; 0 ignored; 0 measured; 24 filtered out; finished in 129.39s
  171. 211.69 s gammaloop-nextest-integration> system-err
  172. 211.69 s gammaloop-nextest-integration> [2026-08-28 19:11:08.220] @gammaloop_api::se... INFO : Running command run generate
  173. 211.69 s gammaloop-nextest-integration> [2026-08-28 19:11:08.220] @gammaloop_api::se... INFO : Starting command block generate
  174. 211.69 s gammaloop-nextest-integration> [2026-08-28 19:11:08.220] @gammaloop_api::se... INFO : Running command import model scalars-default.json
  175. 211.69 s gammaloop-nextest-integration> [2026-08-28 19:11:08.220] @import::model INFO : Loading built-in JSON model scalars-default
  176. 211.69 s gammaloop-nextest-integration> [2026-08-28 19:11:08.233] @gammalooprs::model INFO : The following 2 external parameters were forced to zero by the restriction card:
  177. 211.69 s gammaloop-nextest-integration> width_scalar_1, width_scalar_2
  178. 211.69 s gammaloop-nextest-integration> [2026-08-28 19:11:08.234] @gammaloop_api::se... INFO : Running command remove processes
  179. 211.69 s gammaloop-nextest-integration> [2026-08-28 19:11:08.234] @gammaloop_api::se... INFO : Running command set global kv global.generation.uv.generate_integrated=true
  180. 211.69 s gammaloop-nextest-integration> [2026-08-28 19:11:08.235] @gammaloop_api::se... INFO : Running command import graphs ./tests/resources/graphs/scalar_sunrise.dot -p sunrise_scalar_1 -i scalar_sunrise
  181. 211.69 s gammaloop-nextest-integration> [2026-08-28 19:11:08.235] @commands::import INFO : Loading graphs from '/build/source/tests/resources/graphs/scalar_sunrise.dot'
  182. 211.69 s gammaloop-nextest-integration> [2026-08-28 19:11:08.246] @gammaloop_api::se... INFO : Running command generate existing -p sunrise_scalar_1 -i scalar_sunrise
  183. 211.69 s gammaloop-nextest-integration> [2026-08-28 19:11:08.252] @approx::local_4d [{#uv, #inspect, #integrated}] DEBUG : Rescaled momenta expanded
  184. 211.69 s gammaloop-nextest-integration> field value
  185. 211.69 s gammaloop-nextest-integration> res n-terms: 1, byte size: 777,expr:
  186. 211.69 s gammaloop-nextest-integration> 1/(denom(0,q₀/t,mass_scalar_1²,-mass_scalar_1²+(q₀.q₀)/t²)·denom(1,q₁/t,mass_scalar_1²,-mass_scalar_1²+(q₁.q₁)/t²)
  187. 211.69 s gammaloop-nextest-integration> ·denom(2,q₄-q₀/t-q₁/t,mass_scalar_1²,
  188. 211.69 s gammaloop-nextest-integration> -mass_scalar_1²-2·(q₀.q₄)/t-2·(q₁.q₄)/t+(q₀.q₀)/t²+2·(q₀.q₁)/t²
  189. 211.69 s gammaloop-nextest-integration> +(q₁.q₁)/t²+(q₄.q₄)
  190. 211.69 s gammaloop-nextest-integration> ))
  191. 211.69 s gammaloop-nextest-integration> [2026-08-28 19:11:08.263] @approx::local_4d [{#uv, #inspect, #integrated}] DEBUG : Rescaled momenta expanded
  192. 211.69 s gammaloop-nextest-integration> field value
  193. 211.69 s gammaloop-nextest-integration> res n-terms: 1, byte size: 3,expr:
  194. 211.69 s gammaloop-nextest-integration> 1
  195. 211.69 s gammaloop-nextest-integration> [2026-08-28 19:11:08.265] @approx::local_4d [{#uv, #inspect, #integrated}] DEBUG : Rescaled momenta expanded
  196. 211.69 s gammaloop-nextest-integration> field value
  197. 211.69 s gammaloop-nextest-integration> res n-terms: 1, byte size: 611,expr:
  198. 211.69 s gammaloop-nextest-integration> 1/(denom(0,q₀/t,mass_scalar_1²,-mass_scalar_1²+(q₀.q₀)/t²)
  199. 211.69 s gammaloop-nextest-integration> ·denom(2,-q₁+q₃-q₀/t,mass_scalar_1²,
  200. 211.69 s gammaloop-nextest-integration> -mass_scalar_1²+2·(q₀.q₁)/t-2·(q₀.q₃)/t+(q₀.q₀)/t²+(q₁.q₁)
  201. 211.69 s gammaloop-nextest-integration> -2·(q₁.q₃)+(q₃.q₃)
  202. 211.69 s gammaloop-nextest-integration> ))
  203. 211.69 s gammaloop-nextest-integration> [2026-08-28 19:11:08.273] @approx::local_4d [{#uv, #inspect, #integrated}] DEBUG : Rescaled momenta expanded
  204. 211.69 s gammaloop-nextest-integration> field value
  205. 211.69 s gammaloop-nextest-integration> res n-terms: 1, byte size: 611,expr:
  206. 211.69 s gammaloop-nextest-integration> 1/(denom(0,q₀/t,mass_scalar_1²,-mass_scalar_1²+(q₀.q₀)/t²)
  207. 211.69 s gammaloop-nextest-integration> ·denom(1,-q₂+q₃-q₀/t,mass_scalar_1²,
  208. 211.69 s gammaloop-nextest-integration> -mass_scalar_1²+2·(q₀.q₂)/t-2·(q₀.q₃)/t+(q₀.q₀)/t²+(q₂.q₂)
  209. 211.69 s gammaloop-nextest-integration> -2·(q₂.q₃)+(q₃.q₃)
  210. 211.69 s gammaloop-nextest-integration> ))
  211. 211.69 s gammaloop-nextest-integration> [2026-08-28 19:11:08.275] @approx::local_4d [{#uv, #inspect, #integrated}] DEBUG : Rescaled momenta expanded
  212. 211.69 s gammaloop-nextest-integration> field value
  213. 211.69 s gammaloop-nextest-integration> res n-terms: 1, byte size: 611,expr:
  214. 211.69 s gammaloop-nextest-integration> 1/(denom(1,q₁/t,mass_scalar_1²,-mass_scalar_1²+(q₁.q₁)/t²)
  215. 211.69 s gammaloop-nextest-integration> ·denom(2,-q₀+q₃-q₁/t,mass_scalar_1²,
  216. 211.69 s gammaloop-nextest-integration> -mass_scalar_1²+2·(q₀.q₁)/t-2·(q₁.q₃)/t+(q₁.q₁)/t²+(q₀.q₀)
  217. 211.69 s gammaloop-nextest-integration> -2·(q₀.q₃)+(q₃.q₃)
  218. 211.70 s gammaloop-nextest-integration> ))
  219. 211.70 s gammaloop-nextest-integration> [2026-08-28 19:11:08.283] @approx::final_integrand[{#generation, #profile, #uv, #graph, #summary}] DEBUG : Computed global numerator
  220. 211.70 s gammaloop-nextest-integration> field value
  221. 211.70 s gammaloop-nextest-integration> global_num n-terms: 1, byte size: 3,expr:
  222. 211.70 s gammaloop-nextest-integration> 1
  223. 211.70 s gammaloop-nextest-integration> span build_3d{span_context=true graph=sunrise current=subgraph=0, topo_order=0, dod=0}
  224. 211.70 s gammaloop-nextest-integration> [2026-08-28 19:11:08.293] @uv::approx [{#generation, #uv, #fourd}] DEBUG : Computing 4D
  225. 211.70 s gammaloop-nextest-integration> field value
  226. 211.70 s gammaloop-nextest-integration> simple subgraph(S_47,S_44)*Approx(subgraph(S_44,0)) of sunrise
  227. 211.70 s gammaloop-nextest-integration> span compute_4d{span_context=true graph=sunrise current=subgraph=44, topo_order=1, dod=2 given=subgraph=0, topo_order=0, dod=0 reduced=SubSet { set: BitVec<usize, bitvec::order::Lsb0> { addr: 0x7fffe8010960, head: 000000, bits: 8, capacity: 64 } [0, 0, 1, 1, 1, 1, 1, 1], id: PhantomData<linnet::half_edge::involution::Hedge> }}
  228. 211.70 s gammaloop-nextest-integration> [2026-08-28 19:11:08.295] @approx::local_4d [{#uv, #algebra, #integrated, #start}] DEBUG :
  229. 211.70 s gammaloop-nextest-integration> field value
  230. 211.70 s gammaloop-nextest-integration> integrand n-terms: 1, byte size: 322,expr:
  231. 211.70 s gammaloop-nextest-integration> 1/(denom(0,q₀,mass_scalar_1²,-mass_scalar_1²+(q₀.q₀))·denom(1,q₁,mass_scalar_1²,-mass_scalar_1²+(q₁.q₁))
  232. 211.70 s gammaloop-nextest-integration> ·denom(2,q₂,mass_scalar_1²,-mass_scalar_1²+(q₂.q₂)))
  233. 211.70 s gammaloop-nextest-integration> reduced 44
  234. 211.70 s gammaloop-nextest-integration> span grow{span_context=true current=subgraph=44, topo_order=1, dod=2 given=subgraph=0, topo_order=0, dod=0}
  235. 211.70 s gammaloop-nextest-integration> [2026-08-28 19:11:08.295] @approx::local_4d [{#uv, #inspect, #integrated}] DEBUG : Rescaled momenta expanded
  236. 211.70 s gammaloop-nextest-integration> field value
  237. 211.70 s gammaloop-nextest-integration> res n-terms: 1, byte size: 777,expr:
  238. 211.70 s gammaloop-nextest-integration> 1/(denom(0,q₀/t,mass_scalar_1²,-mass_scalar_1²+(q₀.q₀)/t²)·denom(1,q₁/t,mass_scalar_1²,-mass_scalar_1²+(q₁.q₁)/t²)
  239. 211.70 s gammaloop-nextest-integration> ·denom(2,q₄-q₀/t-q₁/t,mass_scalar_1²,
  240. 211.70 s gammaloop-nextest-integration> -mass_scalar_1²-2·(q₀.q₄)/t-2·(q₁.q₄)/t+(q₀.q₀)/t²+2·(q₀.q₁)/t²
  241. 211.70 s gammaloop-nextest-integration> +(q₁.q₁)/t²+(q₄.q₄)
  242. 211.70 s gammaloop-nextest-integration> ))
  243. 211.70 s gammaloop-nextest-integration> span t{span_context=true current=subgraph=44, topo_order=1, dod=2 given=subgraph=0, topo_order=0, dod=0}
  244. 211.70 s gammaloop-nextest-integration> [2026-08-28 19:11:08.302] @approx::local_4d [{#uv, #integrated, #rescaled}] DEBUG : Rescaled expanded
  245. 211.70 s gammaloop-nextest-integration> field value
  246. 211.70 s gammaloop-nextest-integration> n_loops 2
  247. 211.70 s gammaloop-nextest-integration> res n-terms: 1, byte size: 982,expr:
  248. 211.70 s gammaloop-nextest-integration> 1/(t²
  249. 211.70 s gammaloop-nextest-integration> ·denom(2,-q₀-q₁,mUVexp²+t²·mass_scalar_1²,
  250. 211.70 s gammaloop-nextest-integration> -mUV²
  251. 211.70 s gammaloop-nextest-integration> +t²
  252. 211.70 s gammaloop-nextest-integration> ·(-mass_scalar_1²-2·(q₀.q₄)/t-2·(q₁.q₄)/t+(q₀.q₀)/t²+2·(q₀.q₁)/t²
  253. 211.70 s gammaloop-nextest-integration> +(q₁.q₁)/t²+(q₄.q₄)
  254. 211.70 s gammaloop-nextest-integration> )
  255. 211.70 s gammaloop-nextest-integration> +t²·mUVexp²
  256. 211.70 s gammaloop-nextest-integration> )
  257. 211.70 s gammaloop-nextest-integration> ·denom(0,q₀,mUVexp²+t²·mass_scalar_1²,-mUV²+t²·(-mass_scalar_1²+(q₀.q₀)/t²)+t²·mUVexp²)
  258. 211.70 s gammaloop-nextest-integration> ·denom(1,q₁,mUVexp²+t²·mass_scalar_1²,-mUV²+t²·(-mass_scalar_1²+(q₁.q₁)/t²)+t²·mUVexp²))
  259. 211.70 s gammaloop-nextest-integration> span t{span_context=true current=subgraph=44, topo_order=1, dod=2 given=subgraph=0, topo_order=0, dod=0}
  260. 211.70 s gammaloop-nextest-integration> [2026-08-28 19:11:08.304] @approx::local_4d [{#uv, #integrated, #series}] DEBUG : Series expanded
  261. 211.70 s gammaloop-nextest-integration> field value
  262. 211.70 s gammaloop-nextest-integration> res n-terms: 4, byte size: 3187,expr:
  263. 211.70 s gammaloop-nextest-integration> -1/2·(2·mUVexp²-2·mass_scalar_1²)
  264. 211.70 s gammaloop-nextest-integration> /(denom(0,q₀,mUVexp²,-mUV²+(q₀.q₀))·denom(1,q₁,mUVexp²,-mUV²+(q₁.q₁))²
  265. 211.70 s gammaloop-nextest-integration> ·denom(2,-q₀-q₁,mUVexp²,-mUV²+(q₀.q₀)+2·(q₀.q₁)+(q₁.q₁)))
  266. 211.70 s gammaloop-nextest-integration> +(-1/2·(2·mUVexp²-2·mass_scalar_1²)
  267. 211.70 s gammaloop-nextest-integration> /(denom(0,q₀,mUVexp²,-mUV²+(q₀.q₀))²
  268. 211.70 s gammaloop-nextest-integration> ·denom(2,-q₀-q₁,mUVexp²,-mUV²+(q₀.q₀)+2·(q₀.q₁)+(q₁.q₁)))
  269. 211.70 s gammaloop-nextest-integration> +(-1/2·(2·mUVexp²-2·mass_scalar_1²+2·(q₄.q₄))
  270. 211.70 s gammaloop-nextest-integration> /denom(2,-q₀-q₁,mUVexp²,-mUV²+(q₀.q₀)+2·(q₀.q₁)+(q₁.q₁))
  271. 211.70 s gammaloop-nextest-integration> +(-2·(q₀.q₄)-2·(q₁.q₄))²
  272. 211.70 s gammaloop-nextest-integration> /denom(2,-q₀-q₁,mUVexp²,-mUV²+(q₀.q₀)+2·(q₀.q₁)+(q₁.q₁))²
  273. 211.70 s gammaloop-nextest-integration> )
  274. 211.70 s gammaloop-nextest-integration> /(denom(0,q₀,mUVexp²,-mUV²+(q₀.q₀))
  275. 211.70 s gammaloop-nextest-integration> ·denom(2,-q₀-q₁,mUVexp²,-mUV²+(q₀.q₀)+2·(q₀.q₁)+(q₁.q₁)))
  276. 211.70 s gammaloop-nextest-integration> )/denom(1,q₁,mUVexp²,-mUV²+(q₁.q₁))
  277. 211.70 s gammaloop-nextest-integration> -(-2·(q₀.q₄)-2·(q₁.q₄))
  278. 211.70 s gammaloop-nextest-integration> /(t·denom(0,q₀,mUVexp²,-mUV²+(q₀.q₀))·denom(1,q₁,mUVexp²,-mUV²+(q₁.q₁))
  279. 211.70 s gammaloop-nextest-integration> ·denom(2,-q₀-q₁,mUVexp²,-mUV²+(q₀.q₀)+2·(q₀.q₁)+(q₁.q₁))²)
  280. 211.70 s gammaloop-nextest-integration> +1/(t²·denom(0,q₀,mUVexp²,-mUV²+(q₀.q₀))·denom(1,q₁,mUVexp²,-mUV²+(q₁.q₁))
  281. 211.70 s gammaloop-nextest-integration> ·denom(2,-q₀-q₁,mUVexp²,-mUV²+(q₀.q₀)+2·(q₀.q₁)+(q₁.q₁)))
  282. 211.70 s gammaloop-nextest-integration> span t{span_context=true current=subgraph=44, topo_order=1, dod=2 given=subgraph=0, topo_order=0, dod=0}
  283. 211.70 s gammaloop-nextest-integration> [2026-08-28 19:11:08.304] @approx::local_4d [{#uv, #integrated, #series}] DEBUG : Evaluated at t = 1
  284. 211.70 s gammaloop-nextest-integration> field value
  285. 211.70 s gammaloop-nextest-integration> res n-terms: 4, byte size: 3171,expr:
  286. 211.70 s gammaloop-nextest-integration> -1/2·(2·mUVexp²-2·mass_scalar_1²)
  287. 211.70 s gammaloop-nextest-integration> /(denom(0,q₀,mUVexp²,-mUV²+(q₀.q₀))·denom(1,q₁,mUVexp²,-mUV²+(q₁.q₁))²
  288. 211.70 s gammaloop-nextest-integration> ·denom(2,-q₀-q₁,mUVexp²,-mUV²+(q₀.q₀)+2·(q₀.q₁)+(q₁.q₁)))
  289. 211.70 s gammaloop-nextest-integration> -(-2·(q₀.q₄)-2·(q₁.q₄))
  290. 211.70 s gammaloop-nextest-integration> /(denom(0,q₀,mUVexp²,-mUV²+(q₀.q₀))·denom(1,q₁,mUVexp²,-mUV²+(q₁.q₁))
  291. 211.70 s gammaloop-nextest-integration> ... omitted 20090 more lines; see full nextest output above
  292. 211.70 s gammaloop-nextest-integration>
  293. 211.70 s gammaloop-nextest-integration> 9. gammaloop-integration-tests::uv::se1l_uv
  294. 211.70 s gammaloop-nextest-integration> failure: test failure with exit code 101
  295. 211.70 s gammaloop-nextest-integration> system-out
  296. 211.70 s gammaloop-nextest-integration> running 1 test
  297. 211.70 s gammaloop-nextest-integration> test se1l_uv has been running for over 60 seconds
  298. 211.70 s gammaloop-nextest-integration> +------+-----------------+---------+--------+----------+-----------------------------------------------------------------------------------------------------------------------+-------+
  299. 211.70 s gammaloop-nextest-integration> | case | check | graph | status | sigma | threshold | error |
  300. 211.70 s gammaloop-nextest-integration> +------+-----------------+---------+--------+----------+-----------------------------------------------------------------------------------------------------------------------+-------+
  301. 211.70 s gammaloop-nextest-integration> | se1l | uv_profile | - | FAIL | - | - | - |
  302. 211.70 s gammaloop-nextest-integration> +------+-----------------+---------+--------+----------+-----------------------------------------------------------------------------------------------------------------------+-------+
  303. 211.70 s gammaloop-nextest-integration> | se1l | m_uv.inspect | inspect | pass | - | best inspect relative delta 1.097e-1 >= 1000*accuracy 1.000e-7 (accuracy=1.000e-10, exponent=+2.0, seed=1, probes=10) | - |
  304. 211.70 s gammaloop-nextest-integration> +------+-----------------+---------+--------+----------+-----------------------------------------------------------------------------------------------------------------------+-------+
  305. 211.70 s gammaloop-nextest-integration> | se1l | m_uv.integrated | se1l | pass | 0.1sigma | compatible within 2sigma | - |
  306. 211.70 s gammaloop-nextest-integration> +------+-----------------+---------+--------+----------+-----------------------------------------------------------------------------------------------------------------------+-------+
  307. 211.70 s gammaloop-nextest-integration> | se1l | rls.inspect | inspect | pass | - | best inspect relative delta 4.499e-2 >= 1000*accuracy 1.000e-7 (accuracy=1.000e-10, exponent=+2.0, seed=1, probes=10) | - |
  308. 211.70 s gammaloop-nextest-integration> +------+-----------------+---------+--------+----------+-----------------------------------------------------------------------------------------------------------------------+-------+
  309. 211.70 s gammaloop-nextest-integration> | se1l | rls.integrated | se1l | pass | 0.0sigma | compatible within 2sigma | - |
  310. 211.70 s gammaloop-nextest-integration> +------+-----------------+---------+--------+----------+-----------------------------------------------------------------------------------------------------------------------+-------+
  311. 211.70 s gammaloop-nextest-integration> | se1l | mu_r.inspect | inspect | pass | - | best inspect relative delta 1.424e-1 >= 1000*accuracy 1.000e-7 (accuracy=1.000e-10, exponent=+2.0, seed=1, probes=10) | - |
  312. 211.70 s gammaloop-nextest-integration> +------+-----------------+---------+--------+----------+-----------------------------------------------------------------------------------------------------------------------+-------+
  313. 211.70 s gammaloop-nextest-integration> | se1l | target | - | pass | - | 2sigma | - |
  314. 211.70 s gammaloop-nextest-integration> +------+-----------------+---------+--------+----------+-----------------------------------------------------------------------------------------------------------------------+-------+
  315. 211.70 s gammaloop-nextest-integration> test se1l_uv ... FAILED
  316. 211.70 s gammaloop-nextest-integration>
  317. 211.70 s gammaloop-nextest-integration> failures:
  318. 211.70 s gammaloop-nextest-integration>
  319. 211.70 s gammaloop-nextest-integration> failures:
  320. 211.70 s gammaloop-nextest-integration> se1l_uv
  321. 211.70 s gammaloop-nextest-integration>
  322. 211.70 s gammaloop-nextest-integration> test result: FAILED. 0 passed; 1 failed; 0 ignored; 0 measured; 24 filtered out; finished in 145.30s
  323. 211.70 s gammaloop-nextest-integration> system-err
  324. 211.70 s gammaloop-nextest-integration> [2026-08-28 19:11:07.893] @gammaloop_api::se... INFO : Running command run generate
  325. 211.70 s gammaloop-nextest-integration> [2026-08-28 19:11:07.893] @gammaloop_api::se... INFO : Starting command block generate
  326. 211.70 s gammaloop-nextest-integration> [2026-08-28 19:11:07.893] @gammaloop_api::se... INFO : Running command import model sm-default
  327. 211.70 s gammaloop-nextest-integration> [2026-08-28 19:11:07.893] @import::model INFO : Loading built-in JSON model sm-default
  328. 211.70 s gammaloop-nextest-integration> [2026-08-28 19:11:08.018] @gammalooprs::model INFO : The following 11 external parameters were forced to zero by the restriction card:
  329. 211.70 s gammaloop-nextest-integration> lamWS, AWS, rhoWS, etaWS, ymc, yme, ymm, MC, Me, MM, WTau
  330. 211.70 s gammaloop-nextest-integration> [2026-08-28 19:11:08.019] @gammalooprs::model INFO : The following 34 vertex rules were removed by the restriction card:
  331. 211.70 s gammaloop-nextest-integration> V_82 -> (c~, d, G+) | V_83 -> (t~, d, G+) | V_84 -> (c~, s, G+) | V_85 -> (t~, s, G+) | V_86 -> (u~, b, G+) | V_87 -> (c~, b, G+) | V_90 -> (c~, d, W+) | V_91 -> (t~, d, W+) | V_92 -> (u~, s, W+) | V_94 -> (t~, s, W+) | V_95 -> (u~, b, W+) | V_96 -> (c~, b, W+) | V_101 -> (e+, e-, G0) | V_102 -> (mu+, mu-, G0) | V_104 -> (e+, e-, H) | V_105 -> (mu+, mu-, H) | V_110 -> (ve~, e-, G+) | V_111 -> (vm~, mu-, G+) | V_116 -> (b~, u, G-) | V_117 -> (d~, c, G-) | V_118 -> (s~, c, G-) | V_119 -> (b~, c, G-) | V_120 -> (d~, t, G-) | V_121 -> (s~, t, G-) | V_124 -> (s~, u, W-) | V_125 -> (b~, u, W-) | V_126 -> (d~, c, W-) | V_128 -> (b~, c, W-) | V_129 -> (d~, t, W-) | V_130 -> (s~, t, W-) | V_138 -> (c~, c, G0) | V_140 -> (c~, c, H) | V_145 -> (e+, ve, G-) | V_146 -> (mu+, vm, G-)
  332. 211.70 s gammaloop-nextest-integration> [2026-08-28 19:11:08.019] @gammalooprs::model INFO : The following 36 couplings were removed by the restriction card:
  333. 211.70 s gammaloop-nextest-integration> GC_13, GC_14, GC_16, GC_17, GC_18, GC_19, GC_20, GC_22, GC_23, GC_24, GC_25, GC_26, GC_28, GC_29, GC_42, GC_43, GC_44, GC_46, GC_47, GC_48, GC_84, GC_85, GC_86, GC_87, GC_88, GC_89, GC_90, GC_91, GC_92, GC_93, GC_101, GC_102, GC_103, GC_105, GC_106, GC_107
  334. 211.70 s gammaloop-nextest-integration> [2026-08-28 19:11:08.019] @gammaloop_api::se... INFO : Running command remove processes
  335. 211.70 s gammaloop-nextest-integration> [2026-08-28 19:11:08.020] @gammaloop_api::se... INFO : Running command set global kv global.generation.uv.generate_integrated=true
  336. 211.70 s gammaloop-nextest-integration> [2026-08-28 19:11:08.020] @gammaloop_api::se... INFO : Running command import graphs ./tests/resources/graphs/uv_tests/se1l.dot -p se1l -i se1l
  337. 211.70 s gammaloop-nextest-integration> [2026-08-28 19:11:08.026] @commands::import INFO : Loading graphs from '/build/source/tests/resources/graphs/uv_tests/se1l.dot'
  338. 211.70 s gammaloop-nextest-integration> [2026-08-28 19:11:08.038] @gammaloop_api::se... INFO : Running command generate existing -p se1l -i se1l
  339. 211.70 s gammaloop-nextest-integration> [2026-08-28 19:11:11.334] @commands::generate INFO :
  340. 211.70 s gammaloop-nextest-integration> Integrand generation summary
  341. 211.70 s gammaloop-nextest-integration> peak RAM 90.73 MiB | cores 1
  342. 211.70 s gammaloop-nextest-integration> ╭───────────┬───────┬─────────┬─────────────┬─────────────┬────────────────┬─────────────╮
  343. 211.70 s gammaloop-nextest-integration> │ integrand │ graph │ # evals │ expr build │ spenso │ symbolica eval │ compile │
  344. 211.70 s gammaloop-nextest-integration> ├───────────┼───────┼─────────┼─────────────┼─────────────┼────────────────┼─────────────┤
  345. 211.70 s gammaloop-nextest-integration> │ se1l │ se1l │ 5 │ 3.04s (95%) │ 55ms (1.7%) │ 105ms (3.3%) │ 0ms (0.00%) │
  346. 211.70 s gammaloop-nextest-integration> ├───────────┼───────┼─────────┼─────────────┼─────────────┼────────────────┼─────────────┤
  347. 211.70 s gammaloop-nextest-integration> │ Total │ │ 5 │ 3.04s (95%) │ 55ms (1.7%) │ 105ms (3.3%) │ 0ms (0.00%) │
  348. 211.70 s gammaloop-nextest-integration> ╰───────────┴───────┴─────────┴─────────────┴─────────────┴────────────────┴─────────────╯
  349. 211.70 s gammaloop-nextest-integration> [2026-08-28 19:11:11.336] @gammaloop_api::se... INFO : Running command set process -p se1l -i se1l kv general.m_uv=0.2
  350. 211.70 s gammaloop-nextest-integration> [2026-08-28 19:11:11.337] @gammaloop_api::se... INFO : Running command set process -p se1l -i se1l kv general.mu_r=0.2
  351. 211.70 s gammaloop-nextest-integration> [2026-08-28 19:11:11.338] @gammaloop_api::se... INFO : Running command set process -p se1l -i se1l kv general.renormalization_localization_scale=0.2
  352. 211.70 s gammaloop-nextest-integration> [2026-08-28 19:11:11.339] @gammaloop_api::se... INFO : Running command duplicate integrand -p se1l -i se1l --output_process_name se1l --output_integrand_name se1l_muv_shifted
  353. 211.70 s gammaloop-nextest-integration> [2026-08-28 19:11:11.341] @gammaloop_api::se... INFO : Running command set process -p se1l -i se1l_muv_shifted kv general.m_uv=0.5
  354. 211.70 s gammaloop-nextest-integration> [2026-08-28 19:11:11.342] @gammaloop_api::se... INFO : Running command duplicate integrand -p se1l -i se1l --output_process_name se1l --output_integrand_name se1l_rls_shifted
  355. 211.70 s gammaloop-nextest-integration> [2026-08-28 19:11:11.348] @gammaloop_api::se... INFO : Running command set process -p se1l -i se1l_rls_shifted kv general.renormalization_localization_scale=1
  356. 211.70 s gammaloop-nextest-integration> [2026-08-28 19:11:11.352] @gammaloop_api::se... INFO : Running command duplicate integrand -p se1l -i se1l --output_process_name se1l --output_integrand_name se1l_mur_shifted
  357. 211.70 s gammaloop-nextest-integration> [2026-08-28 19:11:11.364] @gammaloop_api::se... INFO : Running command set process -p se1l -i se1l_mur_shifted kv general.mu_r=0.8
  358. 211.70 s gammaloop-nextest-integration> [2026-08-28 19:11:11.408] @process::amplitude WARNING : External state 0 ('g', PDG 21, helicity +) is off shell: p^2 = +2.5e5, expected m^2 = +0e0 (|Δ| = +2.5e5). Fixed-helicity spinor/vector/tensor external states may be ill-defined at this kinematic point.
  359. 211.70 s gammaloop-nextest-integration> field value
  360. 211.70 s gammaloop-nextest-integration> span warm_up{integrand.name=se1l}
  361. 211.70 s gammaloop-nextest-integration> [2026-08-28 19:11:11.408] @process::amplitude WARNING : External state 1 ('g', PDG 21, helicity -) is off shell: p^2 = +2.5e5, expected m^2 = +0e0 (|Δ| = +2.5e5). Fixed-helicity spinor/vector/tensor external states may be ill-defined at this kinematic point.
  362. 211.70 s gammaloop-nextest-integration> field value
  363. 211.70 s gammaloop-nextest-integration> span warm_up{integrand.name=se1l}
  364. 211.70 s gammaloop-nextest-integration> [2026-08-28 19:11:11.413] @process::amplitude INFO : Input is above threshold: 1 existing threshold E-surfaces across 1/1 graph groups
  365. 211.70 s gammaloop-nextest-integration> field value
  366. 211.70 s gammaloop-nextest-integration> existing_esurfaces 1
  367. 211.70 s gammaloop-nextest-integration> group_count 1
  368. 211.70 s gammaloop-nextest-integration> groups_above_threshold 1
  369. 211.70 s gammaloop-nextest-integration> integrand se1l
  370. 211.70 s gammaloop-nextest-integration> span warm_up{integrand.name=se1l}
  371. 211.70 s gammaloop-nextest-integration> threshold_status above threshold
  372. 211.70 s gammaloop-nextest-integration> [2026-08-28 19:11:11.414] @process::amplitude INFO : overlap structure of group 0: [1: [0(2,3)]]
  373. 211.70 s gammaloop-nextest-integration> field value
  374. 211.70 s gammaloop-nextest-integration> span warm_up{integrand.name=se1l}
  375. 211.70 s gammaloop-nextest-integration> [2026-08-28 19:11:11.973] @commands::profile INFO :
  376. 211.70 s gammaloop-nextest-integration> ╭───────┬──────┬──────────┬───────┬─────┬──────────┬───────────╮
  377. 211.70 s gammaloop-nextest-integration> │ fixed │ → ∞ │ slope │ r2 │ DOD │ bare DOD │ inspect │
  378. 211.70 s gammaloop-nextest-integration> ├───────┼──────┼──────────┼───────┼─────┼──────────┼───────────┤
  379. 211.70 s gammaloop-nextest-integration> │ {} │ {e3} │ 1.639236 │ 0.904 │ 2 │ 2 │ arb retry │
  380. 211.70 s gammaloop-nextest-integration> │ {} │ {e2} │ 1.698834 │ 0.902 │ 2 │ 2 │ arb retry │
  381. 211.70 s gammaloop-nextest-integration> ╰───────┴──────┴──────────┴───────┴─────┴──────────┴───────────╯
  382. 211.70 s gammaloop-nextest-integration> [2026-08-28 19:11:11.973] @commands::profile INFO :
  383. 211.70 s gammaloop-nextest-integration> ╭───────┬──────┬─────────────┬──────────┬───────┬─────┬──────────┬───────────╮
  384. 211.70 s gammaloop-nextest-integration> │ fixed │ → ∞ │ orientation │ slope │ r2 │ DOD │ bare DOD │ inspect │
  385. 211.70 s gammaloop-nextest-integration> ├───────┼──────┼─────────────┼──────────┼───────┼─────┼──────────┼───────────┤
  386. 211.70 s gammaloop-nextest-integration> │ {} │ {e3} │ 00-+ │ 0.343429 │ 0.145 │ 0 │ 2 │ arb retry │
  387. 211.70 s gammaloop-nextest-integration> │ {} │ {e3} │ 00+- │ 0.342577 │ 0.135 │ 0 │ 2 │ arb retry │
  388. 211.70 s gammaloop-nextest-integration> │ {} │ {e2} │ 00-+ │ 0.385975 │ 0.161 │ 0 │ 2 │ arb retry │
  389. 211.70 s gammaloop-nextest-integration> │ {} │ {e2} │ 00+- │ 0.384920 │ 0.192 │ 0 │ 2 │ arb retry │
  390. 211.70 s gammaloop-nextest-integration> ╰───────┴──────┴─────────────┴──────────┴───────┴─────┴──────────┴───────────╯
  391. 211.70 s gammaloop-nextest-integration> [2026-08-28 19:11:11.975] @gammaloop_api::se... INFO : Running command set process kv integrator.target_relative_accuracy=0.001 integrator.n_increase=0 integrator.n_start=50000 integrator.n_max=400000 integrator.seed=1337
  392. 211.70 s gammaloop-nextest-integration> [2026-08-28 19:11:11.976] @commands::integrate INFO : Created workspace directory at /build/source/tests/artifacts/se1l/integration_workspace_se1l
  393. 211.70 s gammaloop-nextest-integration> [2026-08-28 19:11:12.005] @commands::integrate INFO : No integration state found, starting new integration
  394. 211.70 s gammaloop-nextest-integration> [2026-08-28 19:11:12.005] @commands::integrate INFO : Gammaloop now integrates se1l@se1l, se1l@se1l_muv_shifted, se1l@se1l_rls_shifted
  395. 211.70 s gammaloop-nextest-integration> [2026-08-28 19:11:12.005] @process::amplitude WARNING : External state 0 ('g', PDG 21, helicity +) is off shell: p^2 = +2.5e5, expected m^2 = +0e0 (|Δ| = +2.5e5). Fixed-helicity spinor/vector/tensor external states may be ill-defined at this kinematic point.
  396. 211.70 s gammaloop-nextest-integration> field value
  397. 211.70 s gammaloop-nextest-integration> span warm_up{integrand.name=se1l}
  398. 211.70 s gammaloop-nextest-integration> [2026-08-28 19:11:12.005] @process::amplitude WARNING : External state 1 ('g', PDG 21, helicity -) is off shell: p^2 = +2.5e5, expected m^2 = +0e0 (|Δ| = +2.5e5). Fixed-helicity spinor/vector/tensor external states may be ill-defined at this kinematic point.
  399. 211.70 s gammaloop-nextest-integration> field value
  400. 211.70 s gammaloop-nextest-integration> span warm_up{integrand.name=se1l}
  401. 211.70 s gammaloop-nextest-integration> [2026-08-28 19:11:12.006] @process::amplitude INFO : Input is above threshold: 1 existing threshold E-surfaces across 1/1 graph groups
  402. 211.70 s gammaloop-nextest-integration> field value
  403. 211.70 s gammaloop-nextest-integration> existing_esurfaces 1
  404. 211.70 s gammaloop-nextest-integration> group_count 1
  405. 211.70 s gammaloop-nextest-integration> groups_above_threshold 1
  406. 211.70 s gammaloop-nextest-integration> integrand se1l
  407. 211.70 s gammaloop-nextest-integration> span warm_up{integrand.name=se1l}
  408. 211.70 s gammaloop-nextest-integration> threshold_status above threshold
  409. 211.70 s gammaloop-nextest-integration> [2026-08-28 19:11:12.006] @process::amplitude INFO : overlap structure of group 0: [1: [0(2,3)]]
  410. 211.70 s gammaloop-nextest-integration> field value
  411. 211.70 s gammaloop-nextest-integration> span warm_up{integrand.name=se1l}
  412. 211.70 s gammaloop-nextest-integration> [2026-08-28 19:11:12.008] @process::amplitude WARNING : External state 0 ('g', PDG 21, helicity +) is off shell: p^2 = +2.5e5, expected m^2 = +0e0 (|Δ| = +2.5e5). Fixed-helicity spinor/vector/tensor external states may be ill-defined at this kinematic point.
  413. 211.70 s gammaloop-nextest-integration> field value
  414. 211.70 s gammaloop-nextest-integration> span warm_up{integrand.name=se1l_muv_shifted}
  415. 211.70 s gammaloop-nextest-integration> [2026-08-28 19:11:12.008] @process::amplitude WARNING : External state 1 ('g', PDG 21, helicity -) is off shell: p^2 = +2.5e5, expected m^2 = +0e0 (|Δ| = +2.5e5). Fixed-helicity spinor/vector/tensor external states may be ill-defined at this kinematic point.
  416. 211.70 s gammaloop-nextest-integration> field value
  417. 211.70 s gammaloop-nextest-integration> span warm_up{integrand.name=se1l_muv_shifted}
  418. 211.70 s gammaloop-nextest-integration> [2026-08-28 19:11:12.008] @process::amplitude INFO : Input is above threshold: 1 existing threshold E-surfaces across 1/1 graph groups
  419. 211.70 s gammaloop-nextest-integration> field value
  420. 211.70 s gammaloop-nextest-integration> existing_esurfaces 1
  421. 211.70 s gammaloop-nextest-integration> group_count 1
  422. 211.70 s gammaloop-nextest-integration> groups_above_threshold 1
  423. 211.70 s gammaloop-nextest-integration> integrand se1l_muv_shifted
  424. 211.70 s gammaloop-nextest-integration> span warm_up{integrand.name=se1l_muv_shifted}
  425. 211.70 s gammaloop-nextest-integration> threshold_status above threshold
  426. 211.70 s gammaloop-nextest-integration> [2026-08-28 19:11:12.009] @process::amplitude INFO : overlap structure of group 0: [1: [0(2,3)]]
  427. 211.70 s gammaloop-nextest-integration> field value
  428. 211.70 s gammaloop-nextest-integration> span warm_up{integrand.name=se1l_muv_shifted}
  429. 211.70 s gammaloop-nextest-integration> [2026-08-28 19:11:12.011] @process::amplitude WARNING : External state 0 ('g', PDG 21, helicity +) is off shell: p^2 = +2.5e5, expected m^2 = +0e0 (|Δ| = +2.5e5). Fixed-helicity spinor/vector/tensor external states may be ill-defined at this kinematic point.
  430. 211.70 s gammaloop-nextest-integration> field value
  431. 211.70 s gammaloop-nextest-integration> span warm_up{integrand.name=se1l_rls_shifted}
  432. 211.70 s gammaloop-nextest-integration> [2026-08-28 19:11:12.011] @process::amplitude WARNING : External state 1 ('g', PDG 21, helicity -) is off shell: p^2 = +2.5e5, expected m^2 = +0e0 (|Δ| = +2.5e5). Fixed-helicity spinor/vector/tensor external states may be ill-defined at this kinematic point.
  433. 211.70 s gammaloop-nextest-integration> field value
  434. 211.70 s gammaloop-nextest-integration> span warm_up{integrand.name=se1l_rls_shifted}
  435. 211.70 s gammaloop-nextest-integration> [2026-08-28 19:11:12.011] @process::amplitude INFO : Input is above threshold: 1 existing threshold E-surfaces across 1/1 graph groups
  436. 211.70 s gammaloop-nextest-integration> field value
  437. 211.70 s gammaloop-nextest-integration> existing_esurfaces 1
  438. 211.70 s gammaloop-nextest-integration> group_count 1
  439. 211.70 s gammaloop-nextest-integration> groups_above_threshold 1
  440. 211.70 s gammaloop-nextest-integration> integrand se1l_rls_shifted
  441. 211.70 s gammaloop-nextest-integration> span warm_up{integrand.name=se1l_rls_shifted}
  442. 211.70 s gammaloop-nextest-integration> threshold_status above threshold
  443. 211.70 s gammaloop-nextest-integration> ... omitted 1410 more lines; see full nextest output above
  444. 211.70 s gammaloop-nextest-integration> =========================================
  445. 212.15 s error: Cannot build '/nix/store/5lvckp7qh3dqs2nqf61qj4kz6kj46p4q-gammaloop-nextest-integration.drv'.
  446. 212.15 s Reason: builder failed with exit code 100.
  447. 212.15 s Output paths:
  448. 212.15 s /nix/store/q9ndadp0vb7l2ihf07rjiriv26fb03g2-gammaloop-nextest-integration
  449. 212.15 s Last 2048 log lines:
  450. 212.15 s > threshold_status above threshold
  451. 212.15 s > [2026-08-28 19:13:32.347] @process::amplitude INFO : overlap structure of group 0: [1: [0(2,3)]]
  452. 212.15 s > field value
  453. 212.15 s > span warm_up{integrand.name=se1l_muv_shifted}
  454. 212.15 s > [2026-08-28 19:13:32.354] @process::amplitude WARNING : External state 0 ('g', PDG 21, helicity +) is off shell: p^2 = +2.5e5, expected m^2 = +0e0 (|Δ| = +2.5e5). Fixed-helicity spinor/vector/tensor external states may be ill-defined at this kinematic point.
  455. 212.15 s > field value
  456. 212.15 s > span warm_up{integrand.name=se1l}
  457. 212.15 s > [2026-08-28 19:13:32.354] @process::amplitude WARNING : External state 1 ('g', PDG 21, helicity -) is off shell: p^2 = +2.5e5, expected m^2 = +0e0 (|Δ| = +2.5e5). Fixed-helicity spinor/vector/tensor external states may be ill-defined at this kinematic point.
  458. 212.15 s > field value
  459. 212.15 s > span warm_up{integrand.name=se1l}
  460. 212.15 s > [2026-08-28 19:13:32.354] @process::amplitude INFO : Input is above threshold: 1 existing threshold E-surfaces across 1/1 graph groups
  461. 212.15 s > field value
  462. 212.15 s > existing_esurfaces 1
  463. 212.15 s > group_count 1
  464. 212.15 s > groups_above_threshold 1
  465. 212.15 s > integrand se1l
  466. 212.15 s > span warm_up{integrand.name=se1l}
  467. 212.15 s > threshold_status above threshold
  468. 212.15 s > [2026-08-28 19:13:32.355] @process::amplitude INFO : overlap structure of group 0: [1: [0(2,3)]]
  469. 212.15 s > field value
  470. 212.15 s > span warm_up{integrand.name=se1l}
  471. 212.15 s > [2026-08-28 19:13:32.362] @process::amplitude WARNING : External state 0 ('g', PDG 21, helicity +) is off shell: p^2 = +2.5e5, expected m^2 = +0e0 (|Δ| = +2.5e5). Fixed-helicity spinor/vector/tensor external states may be ill-defined at this kinematic point.
  472. 212.15 s > field value
  473. 212.15 s > span warm_up{integrand.name=se1l_muv_shifted}
  474. 212.15 s > [2026-08-28 19:13:32.362] @process::amplitude WARNING : External state 1 ('g', PDG 21, helicity -) is off shell: p^2 = +2.5e5, expected m^2 = +0e0 (|Δ| = +2.5e5). Fixed-helicity spinor/vector/tensor external states may be ill-defined at this kinematic point.
  475. 212.15 s > field value
  476. 212.15 s > span warm_up{integrand.name=se1l_muv_shifted}
  477. 212.15 s > [2026-08-28 19:13:32.362] @process::amplitude INFO : Input is above threshold: 1 existing threshold E-surfaces across 1/1 graph groups
  478. 212.15 s > field value
  479. 212.15 s > existing_esurfaces 1
  480. 212.15 s > group_count 1
  481. 212.15 s > groups_above_threshold 1
  482. 212.15 s > integrand se1l_muv_shifted
  483. 212.15 s > span warm_up{integrand.name=se1l_muv_shifted}
  484. 212.15 s > threshold_status above threshold
  485. 212.15 s > [2026-08-28 19:13:32.362] @process::amplitude INFO : overlap structure of group 0: [1: [0(2,3)]]
  486. 212.15 s > field value
  487. 212.15 s > span warm_up{integrand.name=se1l_muv_shifted}
  488. 212.15 s > [2026-08-28 19:13:32.370] @process::amplitude WARNING : External state 0 ('g', PDG 21, helicity +) is off shell: p^2 = +2.5e5, expected m^2 = +0e0 (|Δ| = +2.5e5). Fixed-helicity spinor/vector/tensor external states may be ill-defined at this kinematic point.
  489. 212.15 s > field value
  490. 212.15 s > span warm_up{integrand.name=se1l}
  491. 212.15 s > [2026-08-28 19:13:32.370] @process::amplitude WARNING : External state 1 ('g', PDG 21, helicity -) is off shell: p^2 = +2.5e5, expected m^2 = +0e0 (|Δ| = +2.5e5). Fixed-helicity spinor/vector/tensor external states may be ill-defined at this kinematic point.
  492. 212.15 s > field value
  493. 212.15 s > span warm_up{integrand.name=se1l}
  494. 212.15 s > [2026-08-28 19:13:32.370] @process::amplitude INFO : Input is above threshold: 1 existing threshold E-surfaces across 1/1 graph groups
  495. 212.15 s > field value
  496. 212.15 s > existing_esurfaces 1
  497. 212.15 s > group_count 1
  498. 212.15 s > groups_above_threshold 1
  499. 212.15 s > integrand se1l
  500. 212.15 s > span warm_up{integrand.name=se1l}
  501. 212.15 s > threshold_status above threshold
  502. 212.15 s > [2026-08-28 19:13:32.370] @process::amplitude INFO : overlap structure of group 0: [1: [0(2,3)]]
  503. 212.15 s > field value
  504. 212.15 s > span warm_up{integrand.name=se1l}
  505. 212.15 s > [2026-08-28 19:13:32.378] @process::amplitude WARNING : External state 0 ('g', PDG 21, helicity +) is off shell: p^2 = +2.5e5, expected m^2 = +0e0 (|Δ| = +2.5e5). Fixed-helicity spinor/vector/tensor external states may be ill-defined at this kinematic point.
  506. 212.15 s > field value
  507. 212.15 s > span warm_up{integrand.name=se1l_muv_shifted}
  508. 212.15 s > [2026-08-28 19:13:32.378] @process::amplitude WARNING : External state 1 ('g', PDG 21, helicity -) is off shell: p^2 = +2.5e5, expected m^2 = +0e0 (|Δ| = +2.5e5). Fixed-helicity spinor/vector/tensor external states may be ill-defined at this kinematic point.
  509. 212.15 s > field value
  510. 212.15 s > span warm_up{integrand.name=se1l_muv_shifted}
  511. 212.15 s > [2026-08-28 19:13:32.378] @process::amplitude INFO : Input is above threshold: 1 existing threshold E-surfaces across 1/1 graph groups
  512. 212.15 s > field value
  513. 212.15 s > existing_esurfaces 1
  514. 212.15 s > group_count 1
  515. 212.15 s > groups_above_threshold 1
  516. 212.15 s > integrand se1l_muv_shifted
  517. 212.15 s > span warm_up{integrand.name=se1l_muv_shifted}
  518. 212.15 s > threshold_status above threshold
  519. 212.15 s > [2026-08-28 19:13:32.378] @process::amplitude INFO : overlap structure of group 0: [1: [0(2,3)]]
  520. 212.15 s > field value
  521. 212.15 s > span warm_up{integrand.name=se1l_muv_shifted}
  522. 212.15 s > [2026-08-28 19:13:32.385] @process::amplitude WARNING : External state 0 ('g', PDG 21, helicity +) is off shell: p^2 = +2.5e5, expected m^2 = +0e0 (|Δ| = +2.5e5). Fixed-helicity spinor/vector/tensor external states may be ill-defined at this kinematic point.
  523. 212.15 s > field value
  524. 212.15 s > span warm_up{integrand.name=se1l}
  525. 212.15 s > [2026-08-28 19:13:32.385] @process::amplitude WARNING : External state 1 ('g', PDG 21, helicity -) is off shell: p^2 = +2.5e5, expected m^2 = +0e0 (|Δ| = +2.5e5). Fixed-helicity spinor/vector/tensor external states may be ill-defined at this kinematic point.
  526. 212.15 s > field value
  527. 212.15 s > span warm_up{integrand.name=se1l}
  528. 212.15 s > [2026-08-28 19:13:32.386] @process::amplitude INFO : Input is above threshold: 1 existing threshold E-surfaces across 1/1 graph groups
  529. 212.15 s > field value
  530. 212.15 s > existing_esurfaces 1
  531. 212.15 s > group_count 1
  532. 212.15 s > groups_above_threshold 1
  533. 212.15 s > integrand se1l
  534. 212.15 s > span warm_up{integrand.name=se1l}
  535. 212.15 s > threshold_status above threshold
  536. 212.15 s > [2026-08-28 19:13:32.386] @process::amplitude INFO : overlap structure of group 0: [1: [0(2,3)]]
  537. 212.15 s > field value
  538. 212.15 s > span warm_up{integrand.name=se1l}
  539. 212.15 s > [2026-08-28 19:13:32.393] @process::amplitude WARNING : External state 0 ('g', PDG 21, helicity +) is off shell: p^2 = +2.5e5, expected m^2 = +0e0 (|Δ| = +2.5e5). Fixed-helicity spinor/vector/tensor external states may be ill-defined at this kinematic point.
  540. 212.15 s > field value
  541. 212.15 s > span warm_up{integrand.name=se1l_muv_shifted}
  542. 212.15 s > [2026-08-28 19:13:32.393] @process::amplitude WARNING : External state 1 ('g', PDG 21, helicity -) is off shell: p^2 = +2.5e5, expected m^2 = +0e0 (|Δ| = +2.5e5). Fixed-helicity spinor/vector/tensor external states may be ill-defined at this kinematic point.
  543. 212.15 s > field value
  544. 212.15 s > span warm_up{integrand.name=se1l_muv_shifted}
  545. 212.15 s > [2026-08-28 19:13:32.394] @process::amplitude INFO : Input is above threshold: 1 existing threshold E-surfaces across 1/1 graph groups
  546. 212.15 s > field value
  547. 212.15 s > existing_esurfaces 1
  548. 212.15 s > group_count 1
  549. 212.15 s > groups_above_threshold 1
  550. 212.15 s > integrand se1l_muv_shifted
  551. 212.15 s > span warm_up{integrand.name=se1l_muv_shifted}
  552. 212.15 s > threshold_status above threshold
  553. 212.15 s > [2026-08-28 19:13:32.394] @process::amplitude INFO : overlap structure of group 0: [1: [0(2,3)]]
  554. 212.15 s > field value
  555. 212.15 s > span warm_up{integrand.name=se1l_muv_shifted}
  556. 212.15 s > [2026-08-28 19:13:32.401] @process::amplitude WARNING : External state 0 ('g', PDG 21, helicity +) is off shell: p^2 = +2.5e5, expected m^2 = +0e0 (|Δ| = +2.5e5). Fixed-helicity spinor/vector/tensor external states may be ill-defined at this kinematic point.
  557. 212.15 s > field value
  558. 212.15 s > span warm_up{integrand.name=se1l}
  559. 212.15 s > [2026-08-28 19:13:32.401] @process::amplitude WARNING : External state 1 ('g', PDG 21, helicity -) is off shell: p^2 = +2.5e5, expected m^2 = +0e0 (|Δ| = +2.5e5). Fixed-helicity spinor/vector/tensor external states may be ill-defined at this kinematic point.
  560. 212.15 s > field value
  561. 212.15 s > span warm_up{integrand.name=se1l}
  562. 212.15 s > [2026-08-28 19:13:32.401] @process::amplitude INFO : Input is above threshold: 1 existing threshold E-surfaces across 1/1 graph groups
  563. 212.15 s > field value
  564. 212.15 s > existing_esurfaces 1
  565. 212.15 s > group_count 1
  566. 212.15 s > groups_above_threshold 1
  567. 212.15 s > integrand se1l
  568. 212.15 s > span warm_up{integrand.name=se1l}
  569. 212.15 s > threshold_status above threshold
  570. 212.15 s > [2026-08-28 19:13:32.402] @process::amplitude INFO : overlap structure of group 0: [1: [0(2,3)]]
  571. 212.15 s > field value
  572. 212.15 s > span warm_up{integrand.name=se1l}
  573. 212.15 s > [2026-08-28 19:13:32.409] @process::amplitude WARNING : External state 0 ('g', PDG 21, helicity +) is off shell: p^2 = +2.5e5, expected m^2 = +0e0 (|Δ| = +2.5e5). Fixed-helicity spinor/vector/tensor external states may be ill-defined at this kinematic point.
  574. 212.15 s > field value
  575. 212.15 s > span warm_up{integrand.name=se1l_rls_shifted}
  576. 212.15 s > [2026-08-28 19:13:32.409] @process::amplitude WARNING : External state 1 ('g', PDG 21, helicity -) is off shell: p^2 = +2.5e5, expected m^2 = +0e0 (|Δ| = +2.5e5). Fixed-helicity spinor/vector/tensor external states may be ill-defined at this kinematic point.
  577. 212.15 s > field value
  578. 212.15 s > span warm_up{integrand.name=se1l_rls_shifted}
  579. 212.15 s > [2026-08-28 19:13:32.409] @process::amplitude INFO : Input is above threshold: 1 existing threshold E-surfaces across 1/1 graph groups
  580. 212.15 s > field value
  581. 212.15 s > existing_esurfaces 1
  582. 212.15 s > group_count 1
  583. 212.15 s > groups_above_threshold 1
  584. 212.15 s > integrand se1l_rls_shifted
  585. 212.15 s > span warm_up{integrand.name=se1l_rls_shifted}
  586. 212.15 s > threshold_status above threshold
  587. 212.15 s > [2026-08-28 19:13:32.410] @process::amplitude INFO : overlap structure of group 0: [1: [0(2,3)]]
  588. 212.15 s > field value
  589. 212.15 s > span warm_up{integrand.name=se1l_rls_shifted}
  590. 212.15 s > [2026-08-28 19:13:32.417] @process::amplitude WARNING : External state 0 ('g', PDG 21, helicity +) is off shell: p^2 = +2.5e5, expected m^2 = +0e0 (|Δ| = +2.5e5). Fixed-helicity spinor/vector/tensor external states may be ill-defined at this kinematic point.
  591. 212.15 s > field value
  592. 212.15 s > span warm_up{integrand.name=se1l}
  593. 212.15 s > [2026-08-28 19:13:32.417] @process::amplitude WARNING : External state 1 ('g', PDG 21, helicity -) is off shell: p^2 = +2.5e5, expected m^2 = +0e0 (|Δ| = +2.5e5). Fixed-helicity spinor/vector/tensor external states may be ill-defined at this kinematic point.
  594. 212.15 s > field value
  595. 212.15 s > span warm_up{integrand.name=se1l}
  596. 212.15 s > [2026-08-28 19:13:32.417] @process::amplitude INFO : Input is above threshold: 1 existing threshold E-surfaces across 1/1 graph groups
  597. 212.15 s > field value
  598. 212.15 s > existing_esurfaces 1
  599. 212.15 s > group_count 1
  600. 212.15 s > groups_above_threshold 1
  601. 212.15 s > integrand se1l
  602. 212.15 s > span warm_up{integrand.name=se1l}
  603. 212.15 s > threshold_status above threshold
  604. 212.15 s > [2026-08-28 19:13:32.417] @process::amplitude INFO : overlap structure of group 0: [1: [0(2,3)]]
  605. 212.15 s > field value
  606. 212.15 s > span warm_up{integrand.name=se1l}
  607. 212.15 s > [2026-08-28 19:13:32.425] @process::amplitude WARNING : External state 0 ('g', PDG 21, helicity +) is off shell: p^2 = +2.5e5, expected m^2 = +0e0 (|Δ| = +2.5e5). Fixed-helicity spinor/vector/tensor external states may be ill-defined at this kinematic point.
  608. 212.15 s > field value
  609. 212.15 s > span warm_up{integrand.name=se1l_rls_shifted}
  610. 212.15 s > [2026-08-28 19:13:32.425] @process::amplitude WARNING : External state 1 ('g', PDG 21, helicity -) is off shell: p^2 = +2.5e5, expected m^2 = +0e0 (|Δ| = +2.5e5). Fixed-helicity spinor/vector/tensor external states may be ill-defined at this kinematic point.
  611. 212.15 s > field value
  612. 212.15 s > span warm_up{integrand.name=se1l_rls_shifted}
  613. 212.15 s > [2026-08-28 19:13:32.425] @process::amplitude INFO : Input is above threshold: 1 existing threshold E-surfaces across 1/1 graph groups
  614. 212.15 s > field value
  615. 212.15 s > existing_esurfaces 1
  616. 212.15 s > group_count 1
  617. 212.15 s > groups_above_threshold 1
  618. 212.15 s > integrand se1l_rls_shifted
  619. 212.15 s > span warm_up{integrand.name=se1l_rls_shifted}
  620. 212.15 s > threshold_status above threshold
  621. 212.15 s > [2026-08-28 19:13:32.425] @process::amplitude INFO : overlap structure of group 0: [1: [0(2,3)]]
  622. 212.15 s > field value
  623. 212.15 s > span warm_up{integrand.name=se1l_rls_shifted}
  624. 212.15 s > [2026-08-28 19:13:32.432] @process::amplitude WARNING : External state 0 ('g', PDG 21, helicity +) is off shell: p^2 = +2.5e5, expected m^2 = +0e0 (|Δ| = +2.5e5). Fixed-helicity spinor/vector/tensor external states may be ill-defined at this kinematic point.
  625. 212.15 s > field value
  626. 212.15 s > span warm_up{integrand.name=se1l}
  627. 212.15 s > [2026-08-28 19:13:32.433] @process::amplitude WARNING : External state 1 ('g', PDG 21, helicity -) is off shell: p^2 = +2.5e5, expected m^2 = +0e0 (|Δ| = +2.5e5). Fixed-helicity spinor/vector/tensor external states may be ill-defined at this kinematic point.
  628. 212.15 s > field value
  629. 212.15 s > span warm_up{integrand.name=se1l}
  630. 212.15 s > [2026-08-28 19:13:32.433] @process::amplitude INFO : Input is above threshold: 1 existing threshold E-surfaces across 1/1 graph groups
  631. 212.15 s > field value
  632. 212.15 s > existing_esurfaces 1
  633. 212.15 s > group_count 1
  634. 212.15 s > groups_above_threshold 1
  635. 212.15 s > integrand se1l
  636. 212.15 s > span warm_up{integrand.name=se1l}
  637. 212.15 s > threshold_status above threshold
  638. 212.15 s > [2026-08-28 19:13:32.433] @process::amplitude INFO : overlap structure of group 0: [1: [0(2,3)]]
  639. 212.15 s > field value
  640. 212.15 s > span warm_up{integrand.name=se1l}
  641. 212.15 s > [2026-08-28 19:13:32.440] @process::amplitude WARNING : External state 0 ('g', PDG 21, helicity +) is off shell: p^2 = +2.5e5, expected m^2 = +0e0 (|Δ| = +2.5e5). Fixed-helicity spinor/vector/tensor external states may be ill-defined at this kinematic point.
  642. 212.15 s > field value
  643. 212.15 s > span warm_up{integrand.name=se1l_rls_shifted}
  644. 212.15 s > [2026-08-28 19:13:32.440] @process::amplitude WARNING : External state 1 ('g', PDG 21, helicity -) is off shell: p^2 = +2.5e5, expected m^2 = +0e0 (|Δ| = +2.5e5). Fixed-helicity spinor/vector/tensor external states may be ill-defined at this kinematic point.
  645. 212.15 s > field value
  646. 212.15 s > span warm_up{integrand.name=se1l_rls_shifted}
  647. 212.15 s > [2026-08-28 19:13:32.441] @process::amplitude INFO : Input is above threshold: 1 existing threshold E-surfaces across 1/1 graph groups
  648. 212.15 s > field value
  649. 212.15 s > existing_esurfaces 1
  650. 212.15 s > group_count 1
  651. 212.15 s > groups_above_threshold 1
  652. 212.15 s > integrand se1l_rls_shifted
  653. 212.15 s > span warm_up{integrand.name=se1l_rls_shifted}
  654. 212.15 s > threshold_status above threshold
  655. 212.15 s > [2026-08-28 19:13:32.441] @process::amplitude INFO : overlap structure of group 0: [1: [0(2,3)]]
  656. 212.15 s > field value
  657. 212.15 s > span warm_up{integrand.name=se1l_rls_shifted}
  658. 212.15 s > [2026-08-28 19:13:32.448] @process::amplitude WARNING : External state 0 ('g', PDG 21, helicity +) is off shell: p^2 = +2.5e5, expected m^2 = +0e0 (|Δ| = +2.5e5). Fixed-helicity spinor/vector/tensor external states may be ill-defined at this kinematic point.
  659. 212.15 s > field value
  660. 212.15 s > span warm_up{integrand.name=se1l}
  661. 212.15 s > [2026-08-28 19:13:32.449] @process::amplitude WARNING : External state 1 ('g', PDG 21, helicity -) is off shell: p^2 = +2.5e5, expected m^2 = +0e0 (|Δ| = +2.5e5). Fixed-helicity spinor/vector/tensor external states may be ill-defined at this kinematic point.
  662. 212.15 s > field value
  663. 212.15 s > span warm_up{integrand.name=se1l}
  664. 212.15 s > [2026-08-28 19:13:32.449] @process::amplitude INFO : Input is above threshold: 1 existing threshold E-surfaces across 1/1 graph groups
  665. 212.15 s > field value
  666. 212.15 s > existing_esurfaces 1
  667. 212.15 s > group_count 1
  668. 212.15 s > groups_above_threshold 1
  669. 212.15 s > integrand se1l
  670. 212.15 s > span warm_up{integrand.name=se1l}
  671. 212.15 s > threshold_status above threshold
  672. 212.15 s > [2026-08-28 19:13:32.449] @process::amplitude INFO : overlap structure of group 0: [1: [0(2,3)]]
  673. 212.15 s > field value
  674. 212.15 s > span warm_up{integrand.name=se1l}
  675. 212.15 s > [2026-08-28 19:13:32.457] @process::amplitude WARNING : External state 0 ('g', PDG 21, helicity +) is off shell: p^2 = +2.5e5, expected m^2 = +0e0 (|Δ| = +2.5e5). Fixed-helicity spinor/vector/tensor external states may be ill-defined at this kinematic point.
  676. 212.15 s > field value
  677. 212.15 s > span warm_up{integrand.name=se1l_rls_shifted}
  678. 212.15 s > [2026-08-28 19:13:32.457] @process::amplitude WARNING : External state 1 ('g', PDG 21, helicity -) is off shell: p^2 = +2.5e5, expected m^2 = +0e0 (|Δ| = +2.5e5). Fixed-helicity spinor/vector/tensor external states may be ill-defined at this kinematic point.
  679. 212.15 s > field value
  680. 212.15 s > span warm_up{integrand.name=se1l_rls_shifted}
  681. 212.15 s > [2026-08-28 19:13:32.457] @process::amplitude INFO : Input is above threshold: 1 existing threshold E-surfaces across 1/1 graph groups
  682. 212.15 s > field value
  683. 212.15 s > existing_esurfaces 1
  684. 212.15 s > group_count 1
  685. 212.15 s > groups_above_threshold 1
  686. 212.15 s > integrand se1l_rls_shifted
  687. 212.15 s > span warm_up{integrand.name=se1l_rls_shifted}
  688. 212.15 s > threshold_status above threshold
  689. 212.15 s > [2026-08-28 19:13:32.457] @process::amplitude INFO : overlap structure of group 0: [1: [0(2,3)]]
  690. 212.15 s > field value
  691. 212.15 s > span warm_up{integrand.name=se1l_rls_shifted}
  692. 212.15 s > [2026-08-28 19:13:32.465] @process::amplitude WARNING : External state 0 ('g', PDG 21, helicity +) is off shell: p^2 = +2.5e5, expected m^2 = +0e0 (|Δ| = +2.5e5). Fixed-helicity spinor/vector/tensor external states may be ill-defined at this kinematic point.
  693. 212.15 s > field value
  694. 212.15 s > span warm_up{integrand.name=se1l}
  695. 212.15 s > [2026-08-28 19:13:32.465] @process::amplitude WARNING : External state 1 ('g', PDG 21, helicity -) is off shell: p^2 = +2.5e5, expected m^2 = +0e0 (|Δ| = +2.5e5). Fixed-helicity spinor/vector/tensor external states may be ill-defined at this kinematic point.
  696. 212.15 s > field value
  697. 212.15 s > span warm_up{integrand.name=se1l}
  698. 212.15 s > [2026-08-28 19:13:32.465] @process::amplitude INFO : Input is above threshold: 1 existing threshold E-surfaces across 1/1 graph groups
  699. 212.15 s > field value
  700. 212.15 s > existing_esurfaces 1
  701. 212.15 s > group_count 1
  702. 212.15 s > groups_above_threshold 1
  703. 212.15 s > integrand se1l
  704. 212.15 s > span warm_up{integrand.name=se1l}
  705. 212.15 s > threshold_status above threshold
  706. 212.15 s > [2026-08-28 19:13:32.466] @process::amplitude INFO : overlap structure of group 0: [1: [0(2,3)]]
  707. 212.15 s > field value
  708. 212.15 s > span warm_up{integrand.name=se1l}
  709. 212.15 s > [2026-08-28 19:13:32.473] @process::amplitude WARNING : External state 0 ('g', PDG 21, helicity +) is off shell: p^2 = +2.5e5, expected m^2 = +0e0 (|Δ| = +2.5e5). Fixed-helicity spinor/vector/tensor external states may be ill-defined at this kinematic point.
  710. 212.15 s > field value
  711. 212.15 s > span warm_up{integrand.name=se1l_rls_shifted}
  712. 212.15 s > [2026-08-28 19:13:32.473] @process::amplitude WARNING : External state 1 ('g', PDG 21, helicity -) is off shell: p^2 = +2.5e5, expected m^2 = +0e0 (|Δ| = +2.5e5). Fixed-helicity spinor/vector/tensor external states may be ill-defined at this kinematic point.
  713. 212.15 s > field value
  714. 212.15 s > span warm_up{integrand.name=se1l_rls_shifted}
  715. 212.15 s > [2026-08-28 19:13:32.474] @process::amplitude INFO : Input is above threshold: 1 existing threshold E-surfaces across 1/1 graph groups
  716. 212.15 s > field value
  717. 212.15 s > existing_esurfaces 1
  718. 212.15 s > group_count 1
  719. 212.15 s > groups_above_threshold 1
  720. 212.15 s > integrand se1l_rls_shifted
  721. 212.15 s > span warm_up{integrand.name=se1l_rls_shifted}
  722. 212.15 s > threshold_status above threshold
  723. 212.15 s > [2026-08-28 19:13:32.474] @process::amplitude INFO : overlap structure of group 0: [1: [0(2,3)]]
  724. 212.15 s > field value
  725. 212.15 s > span warm_up{integrand.name=se1l_rls_shifted}
  726. 212.15 s > [2026-08-28 19:13:32.481] @process::amplitude WARNING : External state 0 ('g', PDG 21, helicity +) is off shell: p^2 = +2.5e5, expected m^2 = +0e0 (|Δ| = +2.5e5). Fixed-helicity spinor/vector/tensor external states may be ill-defined at this kinematic point.
  727. 212.15 s > field value
  728. 212.15 s > span warm_up{integrand.name=se1l}
  729. 212.15 s > [2026-08-28 19:13:32.481] @process::amplitude WARNING : External state 1 ('g', PDG 21, helicity -) is off shell: p^2 = +2.5e5, expected m^2 = +0e0 (|Δ| = +2.5e5). Fixed-helicity spinor/vector/tensor external states may be ill-defined at this kinematic point.
  730. 212.15 s > field value
  731. 212.15 s > span warm_up{integrand.name=se1l}
  732. 212.15 s > [2026-08-28 19:13:32.482] @process::amplitude INFO : Input is above threshold: 1 existing threshold E-surfaces across 1/1 graph groups
  733. 212.15 s > field value
  734. 212.15 s > existing_esurfaces 1
  735. 212.15 s > group_count 1
  736. 212.15 s > groups_above_threshold 1
  737. 212.15 s > integrand se1l
  738. 212.15 s > span warm_up{integrand.name=se1l}
  739. 212.15 s > threshold_status above threshold
  740. 212.15 s > [2026-08-28 19:13:32.482] @process::amplitude INFO : overlap structure of group 0: [1: [0(2,3)]]
  741. 212.15 s > field value
  742. 212.15 s > span warm_up{integrand.name=se1l}
  743. 212.15 s > [2026-08-28 19:13:32.490] @process::amplitude WARNING : External state 0 ('g', PDG 21, helicity +) is off shell: p^2 = +2.5e5, expected m^2 = +0e0 (|Δ| = +2.5e5). Fixed-helicity spinor/vector/tensor external states may be ill-defined at this kinematic point.
  744. 212.15 s > field value
  745. 212.15 s > span warm_up{integrand.name=se1l_rls_shifted}
  746. 212.15 s > [2026-08-28 19:13:32.490] @process::amplitude WARNING : External state 1 ('g', PDG 21, helicity -) is off shell: p^2 = +2.5e5, expected m^2 = +0e0 (|Δ| = +2.5e5). Fixed-helicity spinor/vector/tensor external states may be ill-defined at this kinematic point.
  747. 212.15 s > field value
  748. 212.15 s > span warm_up{integrand.name=se1l_rls_shifted}
  749. 212.15 s > [2026-08-28 19:13:32.490] @process::amplitude INFO : Input is above threshold: 1 existing threshold E-surfaces across 1/1 graph groups
  750. 212.15 s > field value
  751. 212.15 s > existing_esurfaces 1
  752. 212.15 s > group_count 1
  753. 212.15 s > groups_above_threshold 1
  754. 212.15 s > integrand se1l_rls_shifted
  755. 212.15 s > span warm_up{integrand.name=se1l_rls_shifted}
  756. 212.15 s > threshold_status above threshold
  757. 212.15 s > [2026-08-28 19:13:32.490] @process::amplitude INFO : overlap structure of group 0: [1: [0(2,3)]]
  758. 212.15 s > field value
  759. 212.15 s > span warm_up{integrand.name=se1l_rls_shifted}
  760. 212.15 s > [2026-08-28 19:13:32.498] @process::amplitude WARNING : External state 0 ('g', PDG 21, helicity +) is off shell: p^2 = +2.5e5, expected m^2 = +0e0 (|Δ| = +2.5e5). Fixed-helicity spinor/vector/tensor external states may be ill-defined at this kinematic point.
  761. 212.15 s > field value
  762. 212.15 s > span warm_up{integrand.name=se1l}
  763. 212.15 s > [2026-08-28 19:13:32.498] @process::amplitude WARNING : External state 1 ('g', PDG 21, helicity -) is off shell: p^2 = +2.5e5, expected m^2 = +0e0 (|Δ| = +2.5e5). Fixed-helicity spinor/vector/tensor external states may be ill-defined at this kinematic point.
  764. 212.15 s > field value
  765. 212.15 s > span warm_up{integrand.name=se1l}
  766. 212.15 s > [2026-08-28 19:13:32.498] @process::amplitude INFO : Input is above threshold: 1 existing threshold E-surfaces across 1/1 graph groups
  767. 212.15 s > field value
  768. 212.15 s > existing_esurfaces 1
  769. 212.15 s > group_count 1
  770. 212.15 s > groups_above_threshold 1
  771. 212.15 s > integrand se1l
  772. 212.15 s > span warm_up{integrand.name=se1l}
  773. 212.15 s > threshold_status above threshold
  774. 212.15 s > [2026-08-28 19:13:32.498] @process::amplitude INFO : overlap structure of group 0: [1: [0(2,3)]]
  775. 212.15 s > field value
  776. 212.15 s > span warm_up{integrand.name=se1l}
  777. 212.15 s > [2026-08-28 19:13:32.506] @process::amplitude WARNING : External state 0 ('g', PDG 21, helicity +) is off shell: p^2 = +2.5e5, expected m^2 = +0e0 (|Δ| = +2.5e5). Fixed-helicity spinor/vector/tensor external states may be ill-defined at this kinematic point.
  778. 212.15 s > field value
  779. 212.15 s > span warm_up{integrand.name=se1l_rls_shifted}
  780. 212.15 s > [2026-08-28 19:13:32.506] @process::amplitude WARNING : External state 1 ('g', PDG 21, helicity -) is off shell: p^2 = +2.5e5, expected m^2 = +0e0 (|Δ| = +2.5e5). Fixed-helicity spinor/vector/tensor external states may be ill-defined at this kinematic point.
  781. 212.15 s > field value
  782. 212.15 s > span warm_up{integrand.name=se1l_rls_shifted}
  783. 212.15 s > [2026-08-28 19:13:32.506] @process::amplitude INFO : Input is above threshold: 1 existing threshold E-surfaces across 1/1 graph groups
  784. 212.15 s > field value
  785. 212.15 s > existing_esurfaces 1
  786. 212.15 s > group_count 1
  787. 212.15 s > groups_above_threshold 1
  788. 212.15 s > integrand se1l_rls_shifted
  789. 212.15 s > span warm_up{integrand.name=se1l_rls_shifted}
  790. 212.15 s > threshold_status above threshold
  791. 212.15 s > [2026-08-28 19:13:32.506] @process::amplitude INFO : overlap structure of group 0: [1: [0(2,3)]]
  792. 212.15 s > field value
  793. 212.15 s > span warm_up{integrand.name=se1l_rls_shifted}
  794. 212.15 s > [2026-08-28 19:13:32.514] @process::amplitude WARNING : External state 0 ('g', PDG 21, helicity +) is off shell: p^2 = +2.5e5, expected m^2 = +0e0 (|Δ| = +2.5e5). Fixed-helicity spinor/vector/tensor external states may be ill-defined at this kinematic point.
  795. 212.15 s > field value
  796. 212.15 s > span warm_up{integrand.name=se1l}
  797. 212.15 s > [2026-08-28 19:13:32.514] @process::amplitude WARNING : External state 1 ('g', PDG 21, helicity -) is off shell: p^2 = +2.5e5, expected m^2 = +0e0 (|Δ| = +2.5e5). Fixed-helicity spinor/vector/tensor external states may be ill-defined at this kinematic point.
  798. 212.15 s > field value
  799. 212.15 s > span warm_up{integrand.name=se1l}
  800. 212.15 s > [2026-08-28 19:13:32.514] @process::amplitude INFO : Input is above threshold: 1 existing threshold E-surfaces across 1/1 graph groups
  801. 212.15 s > field value
  802. 212.15 s > existing_esurfaces 1
  803. 212.15 s > group_count 1
  804. 212.15 s > groups_above_threshold 1
  805. 212.15 s > integrand se1l
  806. 212.15 s > span warm_up{integrand.name=se1l}
  807. 212.15 s > threshold_status above threshold
  808. 212.15 s > [2026-08-28 19:13:32.514] @process::amplitude INFO : overlap structure of group 0: [1: [0(2,3)]]
  809. 212.15 s > field value
  810. 212.15 s > span warm_up{integrand.name=se1l}
  811. 212.15 s > [2026-08-28 19:13:32.521] @process::amplitude WARNING : External state 0 ('g', PDG 21, helicity +) is off shell: p^2 = +2.5e5, expected m^2 = +0e0 (|Δ| = +2.5e5). Fixed-helicity spinor/vector/tensor external states may be ill-defined at this kinematic point.
  812. 212.15 s > field value
  813. 212.15 s > span warm_up{integrand.name=se1l_rls_shifted}
  814. 212.15 s > [2026-08-28 19:13:32.521] @process::amplitude WARNING : External state 1 ('g', PDG 21, helicity -) is off shell: p^2 = +2.5e5, expected m^2 = +0e0 (|Δ| = +2.5e5). Fixed-helicity spinor/vector/tensor external states may be ill-defined at this kinematic point.
  815. 212.15 s > field value
  816. 212.15 s > span warm_up{integrand.name=se1l_rls_shifted}
  817. 212.15 s > [2026-08-28 19:13:32.522] @process::amplitude INFO : Input is above threshold: 1 existing threshold E-surfaces across 1/1 graph groups
  818. 212.15 s > field value
  819. 212.15 s > existing_esurfaces 1
  820. 212.15 s > group_count 1
  821. 212.15 s > groups_above_threshold 1
  822. 212.15 s > integrand se1l_rls_shifted
  823. 212.15 s > span warm_up{integrand.name=se1l_rls_shifted}
  824. 212.15 s > threshold_status above threshold
  825. 212.15 s > [2026-08-28 19:13:32.522] @process::amplitude INFO : overlap structure of group 0: [1: [0(2,3)]]
  826. 212.15 s > field value
  827. 212.15 s > span warm_up{integrand.name=se1l_rls_shifted}
  828. 212.15 s > [2026-08-28 19:13:32.529] @process::amplitude WARNING : External state 0 ('g', PDG 21, helicity +) is off shell: p^2 = +2.5e5, expected m^2 = +0e0 (|Δ| = +2.5e5). Fixed-helicity spinor/vector/tensor external states may be ill-defined at this kinematic point.
  829. 212.15 s > field value
  830. 212.15 s > span warm_up{integrand.name=se1l}
  831. 212.15 s > [2026-08-28 19:13:32.529] @process::amplitude WARNING : External state 1 ('g', PDG 21, helicity -) is off shell: p^2 = +2.5e5, expected m^2 = +0e0 (|Δ| = +2.5e5). Fixed-helicity spinor/vector/tensor external states may be ill-defined at this kinematic point.
  832. 212.15 s > field value
  833. 212.15 s > span warm_up{integrand.name=se1l}
  834. 212.15 s > [2026-08-28 19:13:32.530] @process::amplitude INFO : Input is above threshold: 1 existing threshold E-surfaces across 1/1 graph groups
  835. 212.15 s > field value
  836. 212.15 s > existing_esurfaces 1
  837. 212.15 s > group_count 1
  838. 212.15 s > groups_above_threshold 1
  839. 212.15 s > integrand se1l
  840. 212.15 s > span warm_up{integrand.name=se1l}
  841. 212.15 s > threshold_status above threshold
  842. 212.15 s > [2026-08-28 19:13:32.530] @process::amplitude INFO : overlap structure of group 0: [1: [0(2,3)]]
  843. 212.15 s > field value
  844. 212.15 s > span warm_up{integrand.name=se1l}
  845. 212.15 s > [2026-08-28 19:13:32.537] @process::amplitude WARNING : External state 0 ('g', PDG 21, helicity +) is off shell: p^2 = +2.5e5, expected m^2 = +0e0 (|Δ| = +2.5e5). Fixed-helicity spinor/vector/tensor external states may be ill-defined at this kinematic point.
  846. 212.15 s > field value
  847. 212.15 s > span warm_up{integrand.name=se1l_rls_shifted}
  848. 212.15 s > [2026-08-28 19:13:32.537] @process::amplitude WARNING : External state 1 ('g', PDG 21, helicity -) is off shell: p^2 = +2.5e5, expected m^2 = +0e0 (|Δ| = +2.5e5). Fixed-helicity spinor/vector/tensor external states may be ill-defined at this kinematic point.
  849. 212.15 s > field value
  850. 212.15 s > span warm_up{integrand.name=se1l_rls_shifted}
  851. 212.15 s > [2026-08-28 19:13:32.537] @process::amplitude INFO : Input is above threshold: 1 existing threshold E-surfaces across 1/1 graph groups
  852. 212.15 s > field value
  853. 212.15 s > existing_esurfaces 1
  854. 212.15 s > group_count 1
  855. 212.15 s > groups_above_threshold 1
  856. 212.15 s > integrand se1l_rls_shifted
  857. 212.15 s > span warm_up{integrand.name=se1l_rls_shifted}
  858. 212.15 s > threshold_status above threshold
  859. 212.15 s > [2026-08-28 19:13:32.537] @process::amplitude INFO : overlap structure of group 0: [1: [0(2,3)]]
  860. 212.15 s > field value
  861. 212.15 s > span warm_up{integrand.name=se1l_rls_shifted}
  862. 212.15 s > [2026-08-28 19:13:32.545] @process::amplitude WARNING : External state 0 ('g', PDG 21, helicity +) is off shell: p^2 = +2.5e5, expected m^2 = +0e0 (|Δ| = +2.5e5). Fixed-helicity spinor/vector/tensor external states may be ill-defined at this kinematic point.
  863. 212.15 s > field value
  864. 212.15 s > span warm_up{integrand.name=se1l}
  865. 212.15 s > [2026-08-28 19:13:32.545] @process::amplitude WARNING : External state 1 ('g', PDG 21, helicity -) is off shell: p^2 = +2.5e5, expected m^2 = +0e0 (|Δ| = +2.5e5). Fixed-helicity spinor/vector/tensor external states may be ill-defined at this kinematic point.
  866. 212.15 s > field value
  867. 212.15 s > span warm_up{integrand.name=se1l}
  868. 212.15 s > [2026-08-28 19:13:32.545] @process::amplitude INFO : Input is above threshold: 1 existing threshold E-surfaces across 1/1 graph groups
  869. 212.15 s > field value
  870. 212.15 s > existing_esurfaces 1
  871. 212.15 s > group_count 1
  872. 212.15 s > groups_above_threshold 1
  873. 212.15 s > integrand se1l
  874. 212.15 s > span warm_up{integrand.name=se1l}
  875. 212.15 s > threshold_status above threshold
  876. 212.15 s > [2026-08-28 19:13:32.545] @process::amplitude INFO : overlap structure of group 0: [1: [0(2,3)]]
  877. 212.15 s > field value
  878. 212.15 s > span warm_up{integrand.name=se1l}
  879. 212.15 s > [2026-08-28 19:13:32.553] @process::amplitude WARNING : External state 0 ('g', PDG 21, helicity +) is off shell: p^2 = +2.5e5, expected m^2 = +0e0 (|Δ| = +2.5e5). Fixed-helicity spinor/vector/tensor external states may be ill-defined at this kinematic point.
  880. 212.15 s > field value
  881. 212.15 s > span warm_up{integrand.name=se1l_rls_shifted}
  882. 212.15 s > [2026-08-28 19:13:32.553] @process::amplitude WARNING : External state 1 ('g', PDG 21, helicity -) is off shell: p^2 = +2.5e5, expected m^2 = +0e0 (|Δ| = +2.5e5). Fixed-helicity spinor/vector/tensor external states may be ill-defined at this kinematic point.
  883. 212.15 s > field value
  884. 212.15 s > span warm_up{integrand.name=se1l_rls_shifted}
  885. 212.15 s > [2026-08-28 19:13:32.553] @process::amplitude INFO : Input is above threshold: 1 existing threshold E-surfaces across 1/1 graph groups
  886. 212.15 s > field value
  887. 212.15 s > existing_esurfaces 1
  888. 212.15 s > group_count 1
  889. 212.15 s > groups_above_threshold 1
  890. 212.15 s > integrand se1l_rls_shifted
  891. 212.15 s > span warm_up{integrand.name=se1l_rls_shifted}
  892. 212.15 s > threshold_status above threshold
  893. 212.15 s > [2026-08-28 19:13:32.554] @process::amplitude INFO : overlap structure of group 0: [1: [0(2,3)]]
  894. 212.15 s > field value
  895. 212.15 s > span warm_up{integrand.name=se1l_rls_shifted}
  896. 212.15 s > [2026-08-28 19:13:32.561] @process::amplitude WARNING : External state 0 ('g', PDG 21, helicity +) is off shell: p^2 = +2.5e5, expected m^2 = +0e0 (|Δ| = +2.5e5). Fixed-helicity spinor/vector/tensor external states may be ill-defined at this kinematic point.
  897. 212.15 s > field value
  898. 212.15 s > span warm_up{integrand.name=se1l}
  899. 212.15 s > [2026-08-28 19:13:32.561] @process::amplitude WARNING : External state 1 ('g', PDG 21, helicity -) is off shell: p^2 = +2.5e5, expected m^2 = +0e0 (|Δ| = +2.5e5). Fixed-helicity spinor/vector/tensor external states may be ill-defined at this kinematic point.
  900. 212.15 s > field value
  901. 212.15 s > span warm_up{integrand.name=se1l}
  902. 212.15 s > [2026-08-28 19:13:32.561] @process::amplitude INFO : Input is above threshold: 1 existing threshold E-surfaces across 1/1 graph groups
  903. 212.15 s > field value
  904. 212.15 s > existing_esurfaces 1
  905. 212.15 s > group_count 1
  906. 212.15 s > groups_above_threshold 1
  907. 212.15 s > integrand se1l
  908. 212.15 s > span warm_up{integrand.name=se1l}
  909. 212.15 s > threshold_status above threshold
  910. 212.15 s > [2026-08-28 19:13:32.562] @process::amplitude INFO : overlap structure of group 0: [1: [0(2,3)]]
  911. 212.15 s > field value
  912. 212.15 s > span warm_up{integrand.name=se1l}
  913. 212.15 s > [2026-08-28 19:13:32.569] @process::amplitude WARNING : External state 0 ('g', PDG 21, helicity +) is off shell: p^2 = +2.5e5, expected m^2 = +0e0 (|Δ| = +2.5e5). Fixed-helicity spinor/vector/tensor external states may be ill-defined at this kinematic point.
  914. 212.15 s > field value
  915. 212.15 s > span warm_up{integrand.name=se1l_mur_shifted}
  916. 212.15 s > [2026-08-28 19:13:32.569] @process::amplitude WARNING : External state 1 ('g', PDG 21, helicity -) is off shell: p^2 = +2.5e5, expected m^2 = +0e0 (|Δ| = +2.5e5). Fixed-helicity spinor/vector/tensor external states may be ill-defined at this kinematic point.
  917. 212.15 s > field value
  918. 212.15 s > span warm_up{integrand.name=se1l_mur_shifted}
  919. 212.15 s > [2026-08-28 19:13:32.569] @process::amplitude INFO : Input is above threshold: 1 existing threshold E-surfaces across 1/1 graph groups
  920. 212.15 s > field value
  921. 212.15 s > existing_esurfaces 1
  922. 212.15 s > group_count 1
  923. 212.15 s > groups_above_threshold 1
  924. 212.15 s > integrand se1l_mur_shifted
  925. 212.15 s > span warm_up{integrand.name=se1l_mur_shifted}
  926. 212.15 s > threshold_status above threshold
  927. 212.15 s > [2026-08-28 19:13:32.569] @process::amplitude INFO : overlap structure of group 0: [1: [0(2,3)]]
  928. 212.15 s > field value
  929. 212.15 s > span warm_up{integrand.name=se1l_mur_shifted}
  930. 212.15 s > [2026-08-28 19:13:32.577] @process::amplitude WARNING : External state 0 ('g', PDG 21, helicity +) is off shell: p^2 = +2.5e5, expected m^2 = +0e0 (|Δ| = +2.5e5). Fixed-helicity spinor/vector/tensor external states may be ill-defined at this kinematic point.
  931. 212.15 s > field value
  932. 212.15 s > span warm_up{integrand.name=se1l}
  933. 212.15 s > [2026-08-28 19:13:32.577] @process::amplitude WARNING : External state 1 ('g', PDG 21, helicity -) is off shell: p^2 = +2.5e5, expected m^2 = +0e0 (|Δ| = +2.5e5). Fixed-helicity spinor/vector/tensor external states may be ill-defined at this kinematic point.
  934. 212.15 s > field value
  935. 212.15 s > span warm_up{integrand.name=se1l}
  936. 212.15 s > [2026-08-28 19:13:32.577] @process::amplitude INFO : Input is above threshold: 1 existing threshold E-surfaces across 1/1 graph groups
  937. 212.15 s > field value
  938. 212.15 s > existing_esurfaces 1
  939. 212.15 s > group_count 1
  940. 212.15 s > groups_above_threshold 1
  941. 212.15 s > integrand se1l
  942. 212.15 s > span warm_up{integrand.name=se1l}
  943. 212.15 s > threshold_status above threshold
  944. 212.15 s > [2026-08-28 19:13:32.577] @process::amplitude INFO : overlap structure of group 0: [1: [0(2,3)]]
  945. 212.15 s > field value
  946. 212.15 s > span warm_up{integrand.name=se1l}
  947. 212.15 s > [2026-08-28 19:13:32.585] @process::amplitude WARNING : External state 0 ('g', PDG 21, helicity +) is off shell: p^2 = +2.5e5, expected m^2 = +0e0 (|Δ| = +2.5e5). Fixed-helicity spinor/vector/tensor external states may be ill-defined at this kinematic point.
  948. 212.15 s > field value
  949. 212.15 s > span warm_up{integrand.name=se1l_mur_shifted}
  950. 212.15 s > [2026-08-28 19:13:32.585] @process::amplitude WARNING : External state 1 ('g', PDG 21, helicity -) is off shell: p^2 = +2.5e5, expected m^2 = +0e0 (|Δ| = +2.5e5). Fixed-helicity spinor/vector/tensor external states may be ill-defined at this kinematic point.
  951. 212.15 s > field value
  952. 212.15 s > span warm_up{integrand.name=se1l_mur_shifted}
  953. 212.15 s > [2026-08-28 19:13:32.585] @process::amplitude INFO : Input is above threshold: 1 existing threshold E-surfaces across 1/1 graph groups
  954. 212.15 s > field value
  955. 212.15 s > existing_esurfaces 1
  956. 212.15 s > group_count 1
  957. 212.15 s > groups_above_threshold 1
  958. 212.15 s > integrand se1l_mur_shifted
  959. 212.15 s > span warm_up{integrand.name=se1l_mur_shifted}
  960. 212.15 s > threshold_status above threshold
  961. 212.15 s > [2026-08-28 19:13:32.586] @process::amplitude INFO : overlap structure of group 0: [1: [0(2,3)]]
  962. 212.15 s > field value
  963. 212.15 s > span warm_up{integrand.name=se1l_mur_shifted}
  964. 212.15 s > [2026-08-28 19:13:32.593] @process::amplitude WARNING : External state 0 ('g', PDG 21, helicity +) is off shell: p^2 = +2.5e5, expected m^2 = +0e0 (|Δ| = +2.5e5). Fixed-helicity spinor/vector/tensor external states may be ill-defined at this kinematic point.
  965. 212.15 s > field value
  966. 212.15 s > span warm_up{integrand.name=se1l}
  967. 212.15 s > [2026-08-28 19:13:32.593] @process::amplitude WARNING : External state 1 ('g', PDG 21, helicity -) is off shell: p^2 = +2.5e5, expected m^2 = +0e0 (|Δ| = +2.5e5). Fixed-helicity spinor/vector/tensor external states may be ill-defined at this kinematic point.
  968. 212.15 s > field value
  969. 212.15 s > span warm_up{integrand.name=se1l}
  970. 212.15 s > [2026-08-28 19:13:32.594] @process::amplitude INFO : Input is above threshold: 1 existing threshold E-surfaces across 1/1 graph groups
  971. 212.15 s > field value
  972. 212.15 s > existing_esurfaces 1
  973. 212.15 s > group_count 1
  974. 212.15 s > groups_above_threshold 1
  975. 212.15 s > integrand se1l
  976. 212.15 s > span warm_up{integrand.name=se1l}
  977. 212.15 s > threshold_status above threshold
  978. 212.15 s > [2026-08-28 19:13:32.594] @process::amplitude INFO : overlap structure of group 0: [1: [0(2,3)]]
  979. 212.15 s > field value
  980. 212.15 s > span warm_up{integrand.name=se1l}
  981. 212.15 s > [2026-08-28 19:13:32.602] @process::amplitude WARNING : External state 0 ('g', PDG 21, helicity +) is off shell: p^2 = +2.5e5, expected m^2 = +0e0 (|Δ| = +2.5e5). Fixed-helicity spinor/vector/tensor external states may be ill-defined at this kinematic point.
  982. 212.15 s > field value
  983. 212.15 s > span warm_up{integrand.name=se1l_mur_shifted}
  984. 212.15 s > [2026-08-28 19:13:32.602] @process::amplitude WARNING : External state 1 ('g', PDG 21, helicity -) is off shell: p^2 = +2.5e5, expected m^2 = +0e0 (|Δ| = +2.5e5). Fixed-helicity spinor/vector/tensor external states may be ill-defined at this kinematic point.
  985. 212.15 s > field value
  986. 212.15 s > span warm_up{integrand.name=se1l_mur_shifted}
  987. 212.15 s > [2026-08-28 19:13:32.602] @process::amplitude INFO : Input is above threshold: 1 existing threshold E-surfaces across 1/1 graph groups
  988. 212.15 s > field value
  989. 212.15 s > existing_esurfaces 1
  990. 212.15 s > group_count 1
  991. 212.15 s > groups_above_threshold 1
  992. 212.15 s > integrand se1l_mur_shifted
  993. 212.15 s > span warm_up{integrand.name=se1l_mur_shifted}
  994. 212.15 s > threshold_status above threshold
  995. 212.15 s > [2026-08-28 19:13:32.602] @process::amplitude INFO : overlap structure of group 0: [1: [0(2,3)]]
  996. 212.15 s > field value
  997. 212.15 s > span warm_up{integrand.name=se1l_mur_shifted}
  998. 212.15 s > [2026-08-28 19:13:32.610] @process::amplitude WARNING : External state 0 ('g', PDG 21, helicity +) is off shell: p^2 = +2.5e5, expected m^2 = +0e0 (|Δ| = +2.5e5). Fixed-helicity spinor/vector/tensor external states may be ill-defined at this kinematic point.
  999. 212.15 s > field value
  1000. 212.15 s > span warm_up{integrand.name=se1l}
  1001. 212.15 s > [2026-08-28 19:13:32.610] @process::amplitude WARNING : External state 1 ('g', PDG 21, helicity -) is off shell: p^2 = +2.5e5, expected m^2 = +0e0 (|Δ| = +2.5e5). Fixed-helicity spinor/vector/tensor external states may be ill-defined at this kinematic point.
  1002. 212.15 s > field value
  1003. 212.15 s > span warm_up{integrand.name=se1l}
  1004. 212.15 s > [2026-08-28 19:13:32.610] @process::amplitude INFO : Input is above threshold: 1 existing threshold E-surfaces across 1/1 graph groups
  1005. 212.15 s > field value
  1006. 212.15 s > existing_esurfaces 1
  1007. 212.15 s > group_count 1
  1008. 212.15 s > groups_above_threshold 1
  1009. 212.15 s > integrand se1l
  1010. 212.15 s > span warm_up{integrand.name=se1l}
  1011. 212.15 s > threshold_status above threshold
  1012. 212.15 s > [2026-08-28 19:13:32.611] @process::amplitude INFO : overlap structure of group 0: [1: [0(2,3)]]
  1013. 212.15 s > field value
  1014. 212.15 s > span warm_up{integrand.name=se1l}
  1015. 212.15 s > [2026-08-28 19:13:32.618] @process::amplitude WARNING : External state 0 ('g', PDG 21, helicity +) is off shell: p^2 = +2.5e5, expected m^2 = +0e0 (|Δ| = +2.5e5). Fixed-helicity spinor/vector/tensor external states may be ill-defined at this kinematic point.
  1016. 212.15 s > field value
  1017. 212.15 s > span warm_up{integrand.name=se1l_mur_shifted}
  1018. 212.15 s > [2026-08-28 19:13:32.618] @process::amplitude WARNING : External state 1 ('g', PDG 21, helicity -) is off shell: p^2 = +2.5e5, expected m^2 = +0e0 (|Δ| = +2.5e5). Fixed-helicity spinor/vector/tensor external states may be ill-defined at this kinematic point.
  1019. 212.15 s > field value
  1020. 212.15 s > span warm_up{integrand.name=se1l_mur_shifted}
  1021. 212.15 s > [2026-08-28 19:13:32.618] @process::amplitude INFO : Input is above threshold: 1 existing threshold E-surfaces across 1/1 graph groups
  1022. 212.15 s > field value
  1023. 212.15 s > existing_esurfaces 1
  1024. 212.15 s > group_count 1
  1025. 212.15 s > groups_above_threshold 1
  1026. 212.15 s > integrand se1l_mur_shifted
  1027. 212.15 s > span warm_up{integrand.name=se1l_mur_shifted}
  1028. 212.15 s > threshold_status above threshold
  1029. 212.15 s > [2026-08-28 19:13:32.618] @process::amplitude INFO : overlap structure of group 0: [1: [0(2,3)]]
  1030. 212.15 s > field value
  1031. 212.15 s > span warm_up{integrand.name=se1l_mur_shifted}
  1032. 212.15 s > [2026-08-28 19:13:32.626] @process::amplitude WARNING : External state 0 ('g', PDG 21, helicity +) is off shell: p^2 = +2.5e5, expected m^2 = +0e0 (|Δ| = +2.5e5). Fixed-helicity spinor/vector/tensor external states may be ill-defined at this kinematic point.
  1033. 212.15 s > field value
  1034. 212.15 s > span warm_up{integrand.name=se1l}
  1035. 212.15 s > [2026-08-28 19:13:32.626] @process::amplitude WARNING : External state 1 ('g', PDG 21, helicity -) is off shell: p^2 = +2.5e5, expected m^2 = +0e0 (|Δ| = +2.5e5). Fixed-helicity spinor/vector/tensor external states may be ill-defined at this kinematic point.
  1036. 212.15 s > field value
  1037. 212.15 s > span warm_up{integrand.name=se1l}
  1038. 212.15 s > [2026-08-28 19:13:32.626] @process::amplitude INFO : Input is above threshold: 1 existing threshold E-surfaces across 1/1 graph groups
  1039. 212.15 s > field value
  1040. 212.15 s > existing_esurfaces 1
  1041. 212.15 s > group_count 1
  1042. 212.15 s > groups_above_threshold 1
  1043. 212.15 s > integrand se1l
  1044. 212.15 s > span warm_up{integrand.name=se1l}
  1045. 212.15 s > threshold_status above threshold
  1046. 212.15 s > [2026-08-28 19:13:32.626] @process::amplitude INFO : overlap structure of group 0: [1: [0(2,3)]]
  1047. 212.15 s > field value
  1048. 212.15 s > span warm_up{integrand.name=se1l}
  1049. 212.15 s > [2026-08-28 19:13:32.634] @process::amplitude WARNING : External state 0 ('g', PDG 21, helicity +) is off shell: p^2 = +2.5e5, expected m^2 = +0e0 (|Δ| = +2.5e5). Fixed-helicity spinor/vector/tensor external states may be ill-defined at this kinematic point.
  1050. 212.15 s > field value
  1051. 212.15 s > span warm_up{integrand.name=se1l_mur_shifted}
  1052. 212.15 s > [2026-08-28 19:13:32.634] @process::amplitude WARNING : External state 1 ('g', PDG 21, helicity -) is off shell: p^2 = +2.5e5, expected m^2 = +0e0 (|Δ| = +2.5e5). Fixed-helicity spinor/vector/tensor external states may be ill-defined at this kinematic point.
  1053. 212.15 s > field value
  1054. 212.15 s > span warm_up{integrand.name=se1l_mur_shifted}
  1055. 212.15 s > [2026-08-28 19:13:32.634] @process::amplitude INFO : Input is above threshold: 1 existing threshold E-surfaces across 1/1 graph groups
  1056. 212.15 s > field value
  1057. 212.15 s > existing_esurfaces 1
  1058. 212.15 s > group_count 1
  1059. 212.15 s > groups_above_threshold 1
  1060. 212.15 s > integrand se1l_mur_shifted
  1061. 212.15 s > span warm_up{integrand.name=se1l_mur_shifted}
  1062. 212.15 s > threshold_status above threshold
  1063. 212.15 s > [2026-08-28 19:13:32.634] @process::amplitude INFO : overlap structure of group 0: [1: [0(2,3)]]
  1064. 212.15 s > field value
  1065. 212.15 s > span warm_up{integrand.name=se1l_mur_shifted}
  1066. 212.15 s > [2026-08-28 19:13:32.641] @process::amplitude WARNING : External state 0 ('g', PDG 21, helicity +) is off shell: p^2 = +2.5e5, expected m^2 = +0e0 (|Δ| = +2.5e5). Fixed-helicity spinor/vector/tensor external states may be ill-defined at this kinematic point.
  1067. 212.15 s > field value
  1068. 212.15 s > span warm_up{integrand.name=se1l}
  1069. 212.15 s > [2026-08-28 19:13:32.641] @process::amplitude WARNING : External state 1 ('g', PDG 21, helicity -) is off shell: p^2 = +2.5e5, expected m^2 = +0e0 (|Δ| = +2.5e5). Fixed-helicity spinor/vector/tensor external states may be ill-defined at this kinematic point.
  1070. 212.15 s > field value
  1071. 212.15 s > span warm_up{integrand.name=se1l}
  1072. 212.15 s > [2026-08-28 19:13:32.642] @process::amplitude INFO : Input is above threshold: 1 existing threshold E-surfaces across 1/1 graph groups
  1073. 212.15 s > field value
  1074. 212.15 s > existing_esurfaces 1
  1075. 212.15 s > group_count 1
  1076. 212.15 s > groups_above_threshold 1
  1077. 212.15 s > integrand se1l
  1078. 212.15 s > span warm_up{integrand.name=se1l}
  1079. 212.15 s > threshold_status above threshold
  1080. 212.15 s > [2026-08-28 19:13:32.642] @process::amplitude INFO : overlap structure of group 0: [1: [0(2,3)]]
  1081. 212.15 s > field value
  1082. 212.15 s > span warm_up{integrand.name=se1l}
  1083. 212.15 s > [2026-08-28 19:13:32.649] @process::amplitude WARNING : External state 0 ('g', PDG 21, helicity +) is off shell: p^2 = +2.5e5, expected m^2 = +0e0 (|Δ| = +2.5e5). Fixed-helicity spinor/vector/tensor external states may be ill-defined at this kinematic point.
  1084. 212.15 s > field value
  1085. 212.15 s > span warm_up{integrand.name=se1l_mur_shifted}
  1086. 212.15 s > [2026-08-28 19:13:32.649] @process::amplitude WARNING : External state 1 ('g', PDG 21, helicity -) is off shell: p^2 = +2.5e5, expected m^2 = +0e0 (|Δ| = +2.5e5). Fixed-helicity spinor/vector/tensor external states may be ill-defined at this kinematic point.
  1087. 212.15 s > field value
  1088. 212.15 s > span warm_up{integrand.name=se1l_mur_shifted}
  1089. 212.15 s > [2026-08-28 19:13:32.650] @process::amplitude INFO : Input is above threshold: 1 existing threshold E-surfaces across 1/1 graph groups
  1090. 212.15 s > field value
  1091. 212.15 s > existing_esurfaces 1
  1092. 212.15 s > group_count 1
  1093. 212.15 s > groups_above_threshold 1
  1094. 212.15 s > integrand se1l_mur_shifted
  1095. 212.15 s > span warm_up{integrand.name=se1l_mur_shifted}
  1096. 212.15 s > threshold_status above threshold
  1097. 212.15 s > [2026-08-28 19:13:32.650] @process::amplitude INFO : overlap structure of group 0: [1: [0(2,3)]]
  1098. 212.15 s > field value
  1099. 212.15 s > span warm_up{integrand.name=se1l_mur_shifted}
  1100. 212.15 s > [2026-08-28 19:13:32.657] @process::amplitude WARNING : External state 0 ('g', PDG 21, helicity +) is off shell: p^2 = +2.5e5, expected m^2 = +0e0 (|Δ| = +2.5e5). Fixed-helicity spinor/vector/tensor external states may be ill-defined at this kinematic point.
  1101. 212.15 s > field value
  1102. 212.15 s > span warm_up{integrand.name=se1l}
  1103. 212.15 s > [2026-08-28 19:13:32.657] @process::amplitude WARNING : External state 1 ('g', PDG 21, helicity -) is off shell: p^2 = +2.5e5, expected m^2 = +0e0 (|Δ| = +2.5e5). Fixed-helicity spinor/vector/tensor external states may be ill-defined at this kinematic point.
  1104. 212.15 s > field value
  1105. 212.15 s > span warm_up{integrand.name=se1l}
  1106. 212.15 s > [2026-08-28 19:13:32.657] @process::amplitude INFO : Input is above threshold: 1 existing threshold E-surfaces across 1/1 graph groups
  1107. 212.15 s > field value
  1108. 212.15 s > existing_esurfaces 1
  1109. 212.15 s > group_count 1
  1110. 212.15 s > groups_above_threshold 1
  1111. 212.15 s > integrand se1l
  1112. 212.15 s > span warm_up{integrand.name=se1l}
  1113. 212.15 s > threshold_status above threshold
  1114. 212.15 s > [2026-08-28 19:13:32.658] @process::amplitude INFO : overlap structure of group 0: [1: [0(2,3)]]
  1115. 212.15 s > field value
  1116. 212.15 s > span warm_up{integrand.name=se1l}
  1117. 212.15 s > [2026-08-28 19:13:32.665] @process::amplitude WARNING : External state 0 ('g', PDG 21, helicity +) is off shell: p^2 = +2.5e5, expected m^2 = +0e0 (|Δ| = +2.5e5). Fixed-helicity spinor/vector/tensor external states may be ill-defined at this kinematic point.
  1118. 212.15 s > field value
  1119. 212.15 s > span warm_up{integrand.name=se1l_mur_shifted}
  1120. 212.15 s > [2026-08-28 19:13:32.665] @process::amplitude WARNING : External state 1 ('g', PDG 21, helicity -) is off shell: p^2 = +2.5e5, expected m^2 = +0e0 (|Δ| = +2.5e5). Fixed-helicity spinor/vector/tensor external states may be ill-defined at this kinematic point.
  1121. 212.15 s > field value
  1122. 212.15 s > span warm_up{integrand.name=se1l_mur_shifted}
  1123. 212.15 s > [2026-08-28 19:13:32.665] @process::amplitude INFO : Input is above threshold: 1 existing threshold E-surfaces across 1/1 graph groups
  1124. 212.15 s > field value
  1125. 212.15 s > existing_esurfaces 1
  1126. 212.15 s > group_count 1
  1127. 212.15 s > groups_above_threshold 1
  1128. 212.15 s > integrand se1l_mur_shifted
  1129. 212.15 s > span warm_up{integrand.name=se1l_mur_shifted}
  1130. 212.15 s > threshold_status above threshold
  1131. 212.15 s > [2026-08-28 19:13:32.665] @process::amplitude INFO : overlap structure of group 0: [1: [0(2,3)]]
  1132. 212.15 s > field value
  1133. 212.15 s > span warm_up{integrand.name=se1l_mur_shifted}
  1134. 212.15 s > [2026-08-28 19:13:32.673] @process::amplitude WARNING : External state 0 ('g', PDG 21, helicity +) is off shell: p^2 = +2.5e5, expected m^2 = +0e0 (|Δ| = +2.5e5). Fixed-helicity spinor/vector/tensor external states may be ill-defined at this kinematic point.
  1135. 212.15 s > field value
  1136. 212.15 s > span warm_up{integrand.name=se1l}
  1137. 212.15 s > [2026-08-28 19:13:32.673] @process::amplitude WARNING : External state 1 ('g', PDG 21, helicity -) is off shell: p^2 = +2.5e5, expected m^2 = +0e0 (|Δ| = +2.5e5). Fixed-helicity spinor/vector/tensor external states may be ill-defined at this kinematic point.
  1138. 212.15 s > field value
  1139. 212.15 s > span warm_up{integrand.name=se1l}
  1140. 212.15 s > [2026-08-28 19:13:32.673] @process::amplitude INFO : Input is above threshold: 1 existing threshold E-surfaces across 1/1 graph groups
  1141. 212.15 s > field value
  1142. 212.15 s > existing_esurfaces 1
  1143. 212.15 s > group_count 1
  1144. 212.15 s > groups_above_threshold 1
  1145. 212.15 s > integrand se1l
  1146. 212.15 s > span warm_up{integrand.name=se1l}
  1147. 212.15 s > threshold_status above threshold
  1148. 212.15 s > [2026-08-28 19:13:32.673] @process::amplitude INFO : overlap structure of group 0: [1: [0(2,3)]]
  1149. 212.15 s > field value
  1150. 212.15 s > span warm_up{integrand.name=se1l}
  1151. 212.15 s > [2026-08-28 19:13:32.681] @process::amplitude WARNING : External state 0 ('g', PDG 21, helicity +) is off shell: p^2 = +2.5e5, expected m^2 = +0e0 (|Δ| = +2.5e5). Fixed-helicity spinor/vector/tensor external states may be ill-defined at this kinematic point.
  1152. 212.15 s > field value
  1153. 212.15 s > span warm_up{integrand.name=se1l_mur_shifted}
  1154. 212.15 s > [2026-08-28 19:13:32.681] @process::amplitude WARNING : External state 1 ('g', PDG 21, helicity -) is off shell: p^2 = +2.5e5, expected m^2 = +0e0 (|Δ| = +2.5e5). Fixed-helicity spinor/vector/tensor external states may be ill-defined at this kinematic point.
  1155. 212.15 s > field value
  1156. 212.15 s > span warm_up{integrand.name=se1l_mur_shifted}
  1157. 212.15 s > [2026-08-28 19:13:32.681] @process::amplitude INFO : Input is above threshold: 1 existing threshold E-surfaces across 1/1 graph groups
  1158. 212.15 s > field value
  1159. 212.15 s > existing_esurfaces 1
  1160. 212.15 s > group_count 1
  1161. 212.15 s > groups_above_threshold 1
  1162. 212.15 s > integrand se1l_mur_shifted
  1163. 212.15 s > span warm_up{integrand.name=se1l_mur_shifted}
  1164. 212.15 s > threshold_status above threshold
  1165. 212.15 s > [2026-08-28 19:13:32.681] @process::amplitude INFO : overlap structure of group 0: [1: [0(2,3)]]
  1166. 212.15 s > field value
  1167. 212.15 s > span warm_up{integrand.name=se1l_mur_shifted}
  1168. 212.15 s > [2026-08-28 19:13:32.689] @process::amplitude WARNING : External state 0 ('g', PDG 21, helicity +) is off shell: p^2 = +2.5e5, expected m^2 = +0e0 (|Δ| = +2.5e5). Fixed-helicity spinor/vector/tensor external states may be ill-defined at this kinematic point.
  1169. 212.15 s > field value
  1170. 212.15 s > span warm_up{integrand.name=se1l}
  1171. 212.15 s > [2026-08-28 19:13:32.689] @process::amplitude WARNING : External state 1 ('g', PDG 21, helicity -) is off shell: p^2 = +2.5e5, expected m^2 = +0e0 (|Δ| = +2.5e5). Fixed-helicity spinor/vector/tensor external states may be ill-defined at this kinematic point.
  1172. 212.15 s > field value
  1173. 212.15 s > span warm_up{integrand.name=se1l}
  1174. 212.15 s > [2026-08-28 19:13:32.689] @process::amplitude INFO : Input is above threshold: 1 existing threshold E-surfaces across 1/1 graph groups
  1175. 212.15 s > field value
  1176. 212.15 s > existing_esurfaces 1
  1177. 212.15 s > group_count 1
  1178. 212.15 s > groups_above_threshold 1
  1179. 212.15 s > integrand se1l
  1180. 212.15 s > span warm_up{integrand.name=se1l}
  1181. 212.15 s > threshold_status above threshold
  1182. 212.15 s > [2026-08-28 19:13:32.689] @process::amplitude INFO : overlap structure of group 0: [1: [0(2,3)]]
  1183. 212.15 s > field value
  1184. 212.15 s > span warm_up{integrand.name=se1l}
  1185. 212.15 s > [2026-08-28 19:13:32.696] @process::amplitude WARNING : External state 0 ('g', PDG 21, helicity +) is off shell: p^2 = +2.5e5, expected m^2 = +0e0 (|Δ| = +2.5e5). Fixed-helicity spinor/vector/tensor external states may be ill-defined at this kinematic point.
  1186. 212.15 s > field value
  1187. 212.15 s > span warm_up{integrand.name=se1l_mur_shifted}
  1188. 212.15 s > [2026-08-28 19:13:32.697] @process::amplitude WARNING : External state 1 ('g', PDG 21, helicity -) is off shell: p^2 = +2.5e5, expected m^2 = +0e0 (|Δ| = +2.5e5). Fixed-helicity spinor/vector/tensor external states may be ill-defined at this kinematic point.
  1189. 212.15 s > field value
  1190. 212.15 s > span warm_up{integrand.name=se1l_mur_shifted}
  1191. 212.15 s > [2026-08-28 19:13:32.697] @process::amplitude INFO : Input is above threshold: 1 existing threshold E-surfaces across 1/1 graph groups
  1192. 212.15 s > field value
  1193. 212.15 s > existing_esurfaces 1
  1194. 212.15 s > group_count 1
  1195. 212.15 s > groups_above_threshold 1
  1196. 212.15 s > integrand se1l_mur_shifted
  1197. 212.15 s > span warm_up{integrand.name=se1l_mur_shifted}
  1198. 212.15 s > threshold_status above threshold
  1199. 212.15 s > [2026-08-28 19:13:32.697] @process::amplitude INFO : overlap structure of group 0: [1: [0(2,3)]]
  1200. 212.15 s > field value
  1201. 212.15 s > span warm_up{integrand.name=se1l_mur_shifted}
  1202. 212.15 s > [2026-08-28 19:13:32.704] @process::amplitude WARNING : External state 0 ('g', PDG 21, helicity +) is off shell: p^2 = +2.5e5, expected m^2 = +0e0 (|Δ| = +2.5e5). Fixed-helicity spinor/vector/tensor external states may be ill-defined at this kinematic point.
  1203. 212.15 s > field value
  1204. 212.15 s > span warm_up{integrand.name=se1l}
  1205. 212.15 s > [2026-08-28 19:13:32.704] @process::amplitude WARNING : External state 1 ('g', PDG 21, helicity -) is off shell: p^2 = +2.5e5, expected m^2 = +0e0 (|Δ| = +2.5e5). Fixed-helicity spinor/vector/tensor external states may be ill-defined at this kinematic point.
  1206. 212.15 s > field value
  1207. 212.15 s > span warm_up{integrand.name=se1l}
  1208. 212.15 s > [2026-08-28 19:13:32.705] @process::amplitude INFO : Input is above threshold: 1 existing threshold E-surfaces across 1/1 graph groups
  1209. 212.15 s > field value
  1210. 212.15 s > existing_esurfaces 1
  1211. 212.15 s > group_count 1
  1212. 212.15 s > groups_above_threshold 1
  1213. 212.15 s > integrand se1l
  1214. 212.15 s > span warm_up{integrand.name=se1l}
  1215. 212.15 s > threshold_status above threshold
  1216. 212.15 s > [2026-08-28 19:13:32.705] @process::amplitude INFO : overlap structure of group 0: [1: [0(2,3)]]
  1217. 212.15 s > field value
  1218. 212.15 s > span warm_up{integrand.name=se1l}
  1219. 212.15 s > [2026-08-28 19:13:32.712] @process::amplitude WARNING : External state 0 ('g', PDG 21, helicity +) is off shell: p^2 = +2.5e5, expected m^2 = +0e0 (|Δ| = +2.5e5). Fixed-helicity spinor/vector/tensor external states may be ill-defined at this kinematic point.
  1220. 212.15 s > field value
  1221. 212.15 s > span warm_up{integrand.name=se1l_mur_shifted}
  1222. 212.15 s > [2026-08-28 19:13:32.712] @process::amplitude WARNING : External state 1 ('g', PDG 21, helicity -) is off shell: p^2 = +2.5e5, expected m^2 = +0e0 (|Δ| = +2.5e5). Fixed-helicity spinor/vector/tensor external states may be ill-defined at this kinematic point.
  1223. 212.15 s > field value
  1224. 212.15 s > span warm_up{integrand.name=se1l_mur_shifted}
  1225. 212.15 s > [2026-08-28 19:13:32.713] @process::amplitude INFO : Input is above threshold: 1 existing threshold E-surfaces across 1/1 graph groups
  1226. 212.15 s > field value
  1227. 212.15 s > existing_esurfaces 1
  1228. 212.15 s > group_count 1
  1229. 212.15 s > groups_above_threshold 1
  1230. 212.15 s > integrand se1l_mur_shifted
  1231. 212.15 s > span warm_up{integrand.name=se1l_mur_shifted}
  1232. 212.15 s > threshold_status above threshold
  1233. 212.15 s > [2026-08-28 19:13:32.713] @process::amplitude INFO : overlap structure of group 0: [1: [0(2,3)]]
  1234. 212.15 s > field value
  1235. 212.15 s > span warm_up{integrand.name=se1l_mur_shifted}
  1236. 212.15 s > The application panicked (crashed).
  1237. 212.15 s > Message: Integrated UV case failed: se1l
  1238. 212.15 s > Location: tests/tests/uv.rs:1068
  1239. 212.15 s >
  1240. 212.15 s > ━━━━━━━━━━━━━━━━━━━━━━━━━━━━━━━━━━ BACKTRACE ━━━━━━━━━━━━━━━━━━━━━━━━━━━━━━━━━━━
  1241. 212.15 s > 1: <color_eyre[51793ea62743adbd]::config::PanicHook>::panic_report<unknown>
  1242. 212.15 s > at <unknown source file>:<unknown line>
  1243. 212.15 s > 2: <color_eyre[51793ea62743adbd]::config::PanicHook>::into_panic_hook::{closure#0}<unknown>
  1244. 212.15 s > at <unknown source file>:<unknown line>
  1245. 212.15 s > 3: std[bcb96dfbba0ab899]::panicking::panic_with_hook<unknown>
  1246. 212.15 s > at <unknown source file>:<unknown line>
  1247. 212.15 s > 4: std[bcb96dfbba0ab899]::panicking::panic_handler::{closure#0}<unknown>
  1248. 212.15 s > at <unknown source file>:<unknown line>
  1249. 212.15 s > 5: std[bcb96dfbba0ab899]::sys::backtrace::__rust_end_short_backtrace::<std[bcb96dfbba0ab899]::panicking::panic_handler::{closure#0}, !><unknown>
  1250. 212.15 s > at <unknown source file>:<unknown line>
  1251. 212.15 s > 6: __rustc[6c289b9f9c454d21]::rust_begin_unwind<unknown>
  1252. 212.15 s > at <unknown source file>:<unknown line>
  1253. 212.15 s > 7: core[940e698046960fd5]::panicking::panic_fmt<unknown>
  1254. 212.15 s > at <unknown source file>:<unknown line>
  1255. 212.15 s > 8: uv[52cf2b63f0104e31]::run_single_integrated_uv_case<unknown>
  1256. 212.15 s > at <unknown source file>:<unknown line>
  1257. 212.15 s > 9: <uv[52cf2b63f0104e31]::se1l_uv::{closure#0} as core[940e698046960fd5]::ops::function::FnOnce<()>>::call_once<unknown>
  1258. 212.15 s > at <unknown source file>:<unknown line>
  1259. 212.15 s > 10: test[75d6903177b1d7e9]::__rust_begin_short_backtrace::<core[940e698046960fd5]::result::Result<(), alloc[2ea6bcb46fca0c42]::string::String>, fn() -> core[940e698046960fd5]::result::Result<(), alloc[2ea6bcb46fca0c42]::string::String>><unknown>
  1260. 212.15 s > at <unknown source file>:<unknown line>
  1261. 212.15 s > 11: test[75d6903177b1d7e9]::run_test::{closure#0}<unknown>
  1262. 212.15 s > at <unknown source file>:<unknown line>
  1263. 212.15 s > 12: std[bcb96dfbba0ab899]::sys::backtrace::__rust_begin_short_backtrace::<test[75d6903177b1d7e9]::run_test::{closure#1}, ()><unknown>
  1264. 212.15 s > at <unknown source file>:<unknown line>
  1265. 212.15 s > 13: <std[bcb96dfbba0ab899]::thread::lifecycle::spawn_unchecked<test[75d6903177b1d7e9]::run_test::{closure#1}, ()>::{closure#1} as core[940e698046960fd5]::ops::function::FnOnce<()>>::call_once::{shim:vtable#0}<unknown>
  1266. 212.15 s > at <unknown source file>:<unknown line>
  1267. 212.15 s > 14: <std[bcb96dfbba0ab899]::sys::thread::unix::Thread>::new::thread_start<unknown>
  1268. 212.15 s > at <unknown source file>:<unknown line>
  1269. 212.15 s > 15: start_thread<unknown>
  1270. 212.15 s > at <unknown source file>:<unknown line>
  1271. 212.15 s > 16: __clone3<unknown>
  1272. 212.15 s > at <unknown source file>:<unknown line>
  1273. 212.15 s >
  1274. 212.15 s > Run with COLORBT_SHOW_HIDDEN=1 environment variable to disable frame filtering.
  1275. 212.15 s > Run with RUST_BACKTRACE=full to include source snippets.
  1276. 212.15 s >
  1277. 212.15 s > error: test run failed
  1278. 212.15 s >
  1279. 212.15 s > ========== nextest test summary ==========
  1280. 212.15 s > report: target/nextest/ci_gammaloop/junit.xml
  1281. 212.15 s > tests: 106, failures: 9, errors: 0
  1282. 212.15 s >
  1283. 212.15 s > 1. gammaloop-integration-tests::test_runs::approach::approach_momentum_space_reports_incomplete_triplet_cleanly
  1284. 212.15 s > failure: test failure with exit code 101
  1285. 212.15 s > system-out
  1286. 212.15 s > running 1 test
  1287. 212.15 s > test approach::approach_momentum_space_reports_incomplete_triplet_cleanly ... FAILED
  1288. 212.15 s >
  1289. 212.15 s > failures:
  1290. 212.15 s >
  1291. 212.15 s > failures:
  1292. 212.15 s > approach::approach_momentum_space_reports_incomplete_triplet_cleanly
  1293. 212.15 s >
  1294. 212.15 s > test result: FAILED. 0 passed; 1 failed; 0 ignored; 0 measured; 82 filtered out; finished in 1.64s
  1295. 212.15 s > system-err
  1296. 212.15 s > [2026-08-28 19:10:44.480] @gammaloop_api::se... INFO : Running command import model scalars-default.json
  1297. 212.15 s > [2026-08-28 19:10:44.480] @import::model INFO : Loading built-in JSON model scalars-default
  1298. 212.15 s > [2026-08-28 19:10:44.484] @gammalooprs::model INFO : The following 2 external parameters were forced to zero by the restriction card:
  1299. 212.15 s > width_scalar_1, width_scalar_2
  1300. 212.15 s > [2026-08-28 19:10:44.484] @gammaloop_api::se... INFO : Running command remove processes
  1301. 212.15 s > [2026-08-28 19:10:44.485] @gammaloop_api::se... INFO : Running command generate amp scalar_1 > scalar_0 scalar_0 [{1}] --allowed-vertex-interactions V_3_SCALAR_022 V_3_SCALAR_122 -p triangle -i scalar_tri
  1302. 212.15 s > [2026-08-28 19:10:44.486] @feyngen::diagram_... INFO : 0s | Δ=0s | Starting Feynman graph generation with Symbolica...
  1303. 212.15 s > [2026-08-28 19:10:44.486] @feyngen::diagram_... INFO : 0s | Δ=0s | Number of graphs resulting from Symbolica generation: 1
  1304. 212.15 s > [2026-08-28 19:10:44.487] @feyngen::diagram_... INFO : 0s | Δ=0s | Number of graphs retained after removal of vetoed topologies: 1
  1305. 212.15 s > [2026-08-28 19:10:44.488] @feyngen::diagram_... INFO : 0s | Δ=0s | Number of graphs after vertex info assignment: 1
  1306. 212.15 s > [2026-08-28 19:10:44.488] @feyngen::diagram_... INFO : 0s | Δ=0s | Number of graphs after all complete graphs filters are applied: 1
  1307. 212.15 s > [2026-08-28 19:10:44.488] @feyngen::diagram_... INFO : 0s | Δ=0s | Number of graphs after closed fermion chains analysis: 1
  1308. 212.15 s > [2026-08-28 19:10:44.488] @feyngen::diagram_... INFO : 0s | Δ=0s | Number of graphs after symmetrization of external states: 1
  1309. 212.15 s > [2026-08-28 19:10:44.488] @feyngen::diagram_... INFO : 0s | Δ=0s | Number of graphs after canonization of vertices, edges and flows (graph labels assigned here): 1
  1310. 212.15 s > [2026-08-28 19:10:44.497] @feyngen::diagram_... INFO : 0s | Δ=0s | Number of graphs after numerator-aware grouping with strategy 'up to a scalar rescaling': 1 (1 isomorphically unique graph, 0 color zero, 0 lorentz zero, 0 grouped and 0 cancellation)
  1311. 212.15 s > [2026-08-28 19:10:44.498] @feyngen::diagram_... INFO : ( Sum of the symmetry factors from each graph generated = 1 )
  1312. 212.15 s > [2026-08-28 19:10:44.498] @commands::generate INFO : Generated amplitude 1 graphs.
  1313. 212.15 s > [2026-08-28 19:10:44.551] @settings::runtime WARNING : No external kinematics were provided; using default-generated external momenta and helicities.
  1314. 212.15 s > [2026-08-28 19:10:44.607] @commands::generate INFO :
  1315. 212.15 s > Integrand generation summary
  1316. 212.15 s > peak RAM 65.37 MiB | cores 1
  1317. 212.15 s > ╭────────────┬───────┬─────────┬────────────┬────────────┬────────────────┬─────────────╮
  1318. 212.15 s > │ integrand │ graph │ # evals │ expr build │ spenso │ symbolica eval │ compile │
  1319. 212.15 s > ├────────────┼───────┼─────────┼────────────┼────────────┼────────────────┼─────────────┤
  1320. 212.15 s > │ scalar_tri │ GL0 │ 9 │ 24ms (52%) │ 2ms (5.1%) │ 19ms (43%) │ 0ms (0.00%) │
  1321. 212.15 s > ├────────────┼───────┼─────────┼────────────┼────────────┼────────────────┼─────────────┤
  1322. 212.15 s > │ Total │ │ 9 │ 24ms (52%) │ 2ms (5.1%) │ 19ms (43%) │ 0ms (0.00%) │
  1323. 212.15 s > ╰────────────┴───────┴─────────┴────────────┴────────────┴────────────────┴─────────────╯
  1324. 212.15 s > [2026-08-28 19:10:44.609] @gammaloop_api::se... INFO : Running command generate amp scalar_0 scalar_0 > scalar_0 scalar_0 [{1}] --allowed-vertex-interactions V_3_SCALAR_022 -p box -i scalar_box --select-graphs GL0
  1325. 212.15 s > [2026-08-28 19:10:44.611] @feyngen::diagram_... INFO : 0s | Δ=0s | Starting Feynman graph generation with Symbolica...
  1326. 212.15 s > [2026-08-28 19:10:44.611] @feyngen::diagram_... INFO : 0s | Δ=0s | Number of graphs resulting from Symbolica generation: 3
  1327. 212.15 s > [2026-08-28 19:10:44.618] @feyngen::diagram_... INFO : 0s | Δ=0s | Number of graphs retained after removal of vetoed topologies: 3
  1328. 212.15 s > [2026-08-28 19:10:44.629] @feyngen::diagram_... INFO : 0s | Δ=0s | Number of graphs after vertex info assignment: 3
  1329. 212.15 s > [2026-08-28 19:10:44.629] @feyngen::diagram_... INFO : 0s | Δ=0s | Number of graphs after all complete graphs filters are applied: 3
  1330. 212.15 s > [2026-08-28 19:10:44.639] @feyngen::diagram_... INFO : 0s | Δ=0s | Number of graphs after closed fermion chains analysis: 3
  1331. 212.15 s > [2026-08-28 19:10:44.639] @feyngen::diagram_... INFO : 0s | Δ=0s | Number of graphs after symmetrization of external states: 3
  1332. 212.15 s > [2026-08-28 19:10:44.648] @feyngen::diagram_... INFO : 0s | Δ=0s | Number of graphs after canonization of vertices, edges and flows (graph labels assigned here): 3
  1333. 212.15 s > [2026-08-28 19:10:44.686] @feyngen::diagram_... INFO : 0s | Δ=0s | Number of graphs after numerator-aware grouping with strategy 'up to a scalar rescaling': 1 (1 isomorphically unique graph, 0 color zero, 0 lorentz zero, 0 grouped and 0 cancellation)
  1334. 212.15 s > [2026-08-28 19:10:44.686] @feyngen::diagram_... INFO : ( Sum of the symmetry factors from each graph generated = 1 )
  1335. 212.15 s > [2026-08-28 19:10:44.686] @commands::generate INFO : Generated amplitude 1 graphs.
  1336. 212.15 s > [2026-08-28 19:10:44.888] @settings::runtime WARNING : No external kinematics were provided; using default-generated external momenta and helicities.
  1337. 212.15 s > [2026-08-28 19:10:44.922] @commands::generate INFO :
  1338. 212.15 s > Integrand generation summary
  1339. 212.15 s > peak RAM 68.62 MiB | cores 1
  1340. 212.15 s > ╭────────────┬───────┬─────────┬─────────────┬─────────────┬────────────────┬─────────────╮
  1341. 212.15 s > │ integrand │ graph │ # evals │ expr build │ spenso │ symbolica eval │ compile │
  1342. 212.15 s > ├────────────┼───────┼─────────┼─────────────┼─────────────┼────────────────┼─────────────┤
  1343. 212.15 s > │ scalar_box │ GL0 │ 13 │ 119ms (69%) │ 11ms (6.6%) │ 42ms (24%) │ 0ms (0.00%) │
  1344. 212.15 s > ├────────────┼───────┼─────────┼─────────────┼─────────────┼────────────────┼─────────────┤
  1345. 212.15 s > │ Total │ │ 13 │ 119ms (69%) │ 11ms (6.6%) │ 42ms (24%) │ 0ms (0.00%) │
  1346. 212.15 s > ╰────────────┴───────┴─────────┴─────────────┴─────────────┴────────────────┴─────────────╯
  1347. 212.15 s > [2026-08-28 19:10:44.923] @gammaloop_api::se... INFO : Running command generate
  1348. 212.15 s > [2026-08-28 19:10:45.113] @settings::runtime WARNING : No external kinematics were provided; using default-generated external momenta and helicities.
  1349. 212.15 s > [2026-08-28 19:10:45.500] @settings::runtime WARNING : No external kinematics were provided; using default-generated external momenta and helicities.
  1350. 212.15 s > [2026-08-28 19:10:45.801] @commands::generate INFO :
  1351. 212.15 s > Integrand generation summary
  1352. 212.15 s > peak RAM 71.79 MiB | cores 1
  1353. 212.15 s > ╭────────────┬───────┬─────────┬─────────────┬─────────────┬────────────────┬─────────────╮
  1354. 212.15 s > │ integrand │ graph │ # evals │ expr build │ spenso │ symbolica eval │ compile │
  1355. 212.15 s > ├────────────┼───────┼─────────┼─────────────┼─────────────┼────────────────┼─────────────┤
  1356. 212.15 s > │ scalar_tri │ GL0 │ 9 │ 15ms (42%) │ 3ms (11%) │ 17ms (47%) │ 0ms (0.00%) │
  1357. 212.15 s > │ scalar_box │ GL0 │ 13 │ 149ms (28%) │ 231ms (43%) │ 153ms (29%) │ 0ms (0.00%) │
  1358. 212.15 s > ├────────────┼───────┼─────────┼─────────────┼─────────────┼────────────────┼─────────────┤
  1359. 212.15 s > │ Total │ │ 22 │ 165ms (29%) │ 235ms (41%) │ 170ms (30%) │ 0ms (0.00%) │
  1360. 212.15 s > ╰────────────┴───────┴─────────┴─────────────┴─────────────┴────────────────┴─────────────╯
  1361. 212.15 s > [2026-08-28 19:10:45.802] @gammaloop_api::se... INFO : Running command set model mass_scalar_2=2.0
  1362. 212.15 s > [2026-08-28 19:10:45.803] @gammaloop_api::se... INFO : Running command set model mass_scalar_1=1.0
  1363. 212.15 s > [2026-08-28 19:10:45.807] @gammaloop_api::se... INFO : Running command set process -p triangle -i scalar_tri string '
  1364. 212.15 s > [kinematics.externals]
  1365. 212.15 s > type = "constant"
  1366. 212.15 s >
  1367. 212.15 s > [kinematics.externals.data]
  1368. 212.15 s > [...]
  1369. 212.15 s > [2026-08-28 19:10:45.808] @gammaloop_api::se... INFO : Running command set process -p box -i scalar_box string '
  1370. 212.15 s > [kinematics.externals]
  1371. 212.15 s > type = "constant"
  1372. 212.15 s >
  1373. 212.15 s > [kinematics.externals.data]
  1374. 212.15 s > [...]
  1375. 212.15 s > [2026-08-28 19:10:45.809] @gammaloop_api::se... INFO : Running command approach -x 1.0000000000000001e-1,2.0000000000000001e-1,2.9999999999999999e-1,4.0000000000000002e-1 --approach-axis 1.0000000000000000e-3,0.0000000000000000e0,0.0000000000000000e0,0.0000000000000000e0 --n-points 1 --n-cores 1 --output-results /build/source/tests/artifacts/scalar_box_invalid_momentum_approach/approach_momentum.json --momentum-space --graph-id 0
  1376. 212.15 s > The application panicked (crashed).
  1377. 212.15 s > Message: There are 2 processes available. Please specify a process.
  1378. 212.15 s > Location: tests/tests/test_runs/approach.rs:332
  1379. 212.15 s >
  1380. 212.15 s > ━━━━━━━━━━━━━━━━━━━━━━━━━━━━━━━━━━ BACKTRACE ━━━━━━━━━━━━━━━━━━━━━━━━━━━━━━━━━━━
  1381. 212.15 s > 1: <color_eyre[51793ea62743adbd]::config::PanicHook>::panic_report<unknown>
  1382. 212.15 s > at <unknown source file>:<unknown line>
  1383. 212.15 s > 2: <color_eyre[51793ea62743adbd]::config::PanicHook>::into_panic_hook::{closure#0}<unknown>
  1384. 212.15 s > at <unknown source file>:<unknown line>
  1385. 212.15 s > 3: std[bcb96dfbba0ab899]::panicking::panic_with_hook<unknown>
  1386. 212.15 s > at <unknown source file>:<unknown line>
  1387. 212.15 s > 4: std[bcb96dfbba0ab899]::panicking::panic_handler::{closure#0}<unknown>
  1388. 212.15 s > at <unknown source file>:<unknown line>
  1389. 212.15 s > 5: std[bcb96dfbba0ab899]::sys::backtrace::__rust_end_short_backtrace::<std[bcb96dfbba0ab899]::panicking::panic_handler::{closure#0}, !><unknown>
  1390. 212.15 s > at <unknown source file>:<unknown line>
  1391. 212.15 s > 6: __rustc[6c289b9f9c454d21]::rust_begin_unwind<unknown>
  1392. 212.15 s > at <unknown source file>:<unknown line>
  1393. 212.15 s > 7: core[940e698046960fd5]::panicking::panic_fmt<unknown>
  1394. 212.15 s > at <unknown source file>:<unknown line>
  1395. 212.15 s > 8: test_runs[3e7a390caee4e338]::approach::approach_momentum_space_reports_incomplete_triplet_cleanly<unknown>
  1396. 212.15 s > at <unknown source file>:<unknown line>
  1397. 212.15 s > 9: <test_runs[3e7a390caee4e338]::approach::approach_momentum_space_reports_incomplete_triplet_cleanly::{closure#0} as core[940e698046960fd5]::ops::function::FnOnce<()>>::call_once<unknown>
  1398. 212.15 s > at <unknown source file>:<unknown line>
  1399. 212.15 s > 10: test[75d6903177b1d7e9]::__rust_begin_short_backtrace::<core[940e698046960fd5]::result::Result<(), alloc[2ea6bcb46fca0c42]::string::String>, fn() -> core[940e698046960fd5]::result::Result<(), alloc[2ea6bcb46fca0c42]::string::String>><unknown>
  1400. 212.15 s > at <unknown source file>:<unknown line>
  1401. 212.15 s > 11: test[75d6903177b1d7e9]::run_test::{closure#0}<unknown>
  1402. 212.15 s > at <unknown source file>:<unknown line>
  1403. 212.15 s > 12: std[bcb96dfbba0ab899]::sys::backtrace::__rust_begin_short_backtrace::<test[75d6903177b1d7e9]::run_test::{closure#1}, ()><unknown>
  1404. 212.15 s > at <unknown source file>:<unknown line>
  1405. 212.15 s > 13: <std[bcb96dfbba0ab899]::thread::lifecycle::spawn_unchecked<test[75d6903177b1d7e9]::run_test::{closure#1}, ()>::{closure#1} as core[940e698046960fd5]::ops::function::FnOnce<()>>::call_once::{shim:vtable#0}<unknown>
  1406. 212.15 s > at <unknown source file>:<unknown line>
  1407. 212.15 s > 14: <std[bcb96dfbba0ab899]::sys::thread::unix::Thread>::new::thread_start<unknown>
  1408. 212.15 s > at <unknown source file>:<unknown line>
  1409. 212.15 s > 15: start_thread<unknown>
  1410. 212.15 s > at <unknown source file>:<unknown line>
  1411. 212.15 s > 16: __clone3<unknown>
  1412. 212.15 s > at <unknown source file>:<unknown line>
  1413. 212.15 s >
  1414. 212.15 s > Run with COLORBT_SHOW_HIDDEN=1 environment variable to disable frame filtering.
  1415. 212.15 s > ... omitted 1 more lines; see full nextest output above
  1416. 212.15 s >
  1417. 212.15 s > 2. gammaloop-integration-tests::test_runs::profile_bulk::dotted_bubble_amp_bulk_profile_passes
  1418. 212.15 s > failure: test failure with exit code 101
  1419. 212.15 s > Error:
  1420. 212.15 s > 0: IR profiling requested arbitrary precision but received a quad-precision result
  1421. 212.15 s >
  1422. 212.15 s > Location:
  1423. 212.15 s > crates/gammalooprs/src/integrands/process/ir.rs:2123
  1424. 212.15 s >
  1425. 212.15 s > ━━━━━━━━━━━━━━━━━━━━━━━━━━━━━━━━━━ BACKTRACE ━━━━━━━━━━━━━━━━━━━━━━━━━━━━━━━━━━━
  1426. 212.15 s > 1: <color_eyre[51793ea62743adbd]::config::EyreHook>::into_eyre_hook::{closure#0}<unknown>
  1427. 212.15 s > at <unknown source file>:<unknown line>
  1428. 212.15 s > 2: eyre[cb2fd339c0c40fca]::capture_handler<unknown>
  1429. 212.15 s > at <unknown source file>:<unknown line>
  1430. 212.15 s > 3: eyre[cb2fd339c0c40fca]::private::format_err<unknown>
  1431. 212.15 s > at <unknown source file>:<unknown line>
  1432. 212.15 s > 4: gammalooprs[d7a7c067ebd19583]::integrands::process::ir::evaluate_profile_momentum_point_arb::<gammalooprs[d7a7c067ebd19583]::integrands::process::amplitude::AmplitudeIntegrand><unknown>
  1433. 212.15 s > at <unknown source file>:<unknown line>
  1434. 212.15 s > 5: <gammalooprs[d7a7c067ebd19583]::integrands::process::amplitude::AmplitudeIntegrand>::test_single_ir_limit_impl<unknown>
  1435. 212.15 s > at <unknown source file>:<unknown line>
  1436. 212.15 s > 6: gammalooprs[d7a7c067ebd19583]::integrands::process::ir::run_ir_profile::<gammalooprs[d7a7c067ebd19583]::integrands::process::amplitude::AmplitudeIntegrand, <gammalooprs[d7a7c067ebd19583]::integrands::process::amplitude::AmplitudeIntegrand>::enumerate_ir_limits, <gammalooprs[d7a7c067ebd19583]::integrands::process::amplitude::AmplitudeIntegrand>::graph_cut_definitions, <gammalooprs[d7a7c067ebd19583]::integrands::process::amplitude::AmplitudeIntegrand>::test_single_ir_limit_impl><unknown>
  1437. 212.15 s > at <unknown source file>:<unknown line>
  1438. 212.15 s > 7: <gammalooprs[d7a7c067ebd19583]::integrands::process::amplitude::AmplitudeIntegrand>::test_ir<unknown>
  1439. 212.15 s > at <unknown source file>:<unknown line>
  1440. 212.15 s > 8: <gammaloop_api[92ae732909e47e14]::commands::profile::Profile>::run<unknown>
  1441. 212.15 s > at <unknown source file>:<unknown line>
  1442. 212.15 s > 9: test_runs[3e7a390caee4e338]::profile_bulk::dotted_bubble_amp_bulk_profile_passes<unknown>
  1443. 212.15 s > at <unknown source file>:<unknown line>
  1444. 212.15 s > 10: <test_runs[3e7a390caee4e338]::profile_bulk::dotted_bubble_amp_bulk_profile_passes::{closure#0} as core[940e698046960fd5]::ops::function::FnOnce<()>>::call_once<unknown>
  1445. 212.15 s > at <unknown source file>:<unknown line>
  1446. 212.15 s > 11: test[75d6903177b1d7e9]::__rust_begin_short_backtrace::<core[940e698046960fd5]::result::Result<(), alloc[2ea6bcb46fca0c42]::string::String>, fn() -> core[940e698046960fd5]::result::Result<(), alloc[2ea6bcb46fca0c42]::string::String>><unknown>
  1447. 212.15 s > at <unknown source file>:<unknown line>
  1448. 212.16 s > 12: test[75d6903177b1d7e9]::run_test::{closure#0}<unknown>
  1449. 212.16 s > at <unknown source file>:<unknown line>
  1450. 212.16 s > 13: std[bcb96dfbba0ab899]::sys::backtrace::__rust_begin_short_backtrace::<test[75d6903177b1d7e9]::run_test::{closure#1}, ()><unknown>
  1451. 212.16 s > at <unknown source file>:<unknown line>
  1452. 212.16 s > 14: <std[bcb96dfbba0ab899]::thread::lifecycle::spawn_unchecked<test[75d6903177b1d7e9]::run_test::{closure#1}, ()>::{closure#1} as core[940e698046960fd5]::ops::function::FnOnce<()>>::call_once::{shim:vtable#0}<unknown>
  1453. 212.16 s > at <unknown source file>:<unknown line>
  1454. 212.16 s > 15: <std[bcb96dfbba0ab899]::sys::thread::unix::Thread>::new::thread_start<unknown>
  1455. 212.16 s > at <unknown source file>:<unknown line>
  1456. 212.16 s > 16: start_thread<unknown>
  1457. 212.16 s > at <unknown source file>:<unknown line>
  1458. 212.16 s > 17: __clone3<unknown>
  1459. 212.16 s > at <unknown source file>:<unknown line>
  1460. 212.16 s >
  1461. 212.16 s > Run with COLORBT_SHOW_HIDDEN=1 environment variable to disable frame filtering.
  1462. 212.16 s > Run with RUST_BACKTRACE=full to include source snippets.
  1463. 212.16 s > Warning: SpanTrace capture is Unsupported.
  1464. 212.16 s > Ensure that you've setup a tracing-error ErrorLayer and the semver versions are compatible
  1465. 212.16 s > system-out
  1466. 212.16 s > running 1 test
  1467. 212.16 s > test profile_bulk::dotted_bubble_amp_bulk_profile_passes ... FAILED
  1468. 212.16 s >
  1469. 212.16 s > failures:
  1470. 212.16 s >
  1471. 212.16 s > failures:
  1472. 212.16 s > profile_bulk::dotted_bubble_amp_bulk_profile_passes
  1473. 212.16 s >
  1474. 212.16 s > test result: FAILED. 0 passed; 1 failed; 0 ignored; 0 measured; 82 filtered out; finished in 0.46s
  1475. 212.16 s > system-err
  1476. 212.16 s > [2026-08-28 19:10:50.032] @gammaloop_api::se... INFO : Running command import model ./assets/models/json/scalars/scalars_2p_3p.json
  1477. 212.16 s > [2026-08-28 19:10:50.032] @import::model INFO : Loading JSON model scalars_2p_3p-default from /build/source/assets/models/json/scalars/scalars_2p_3p
  1478. 212.16 s > [2026-08-28 19:10:50.036] @gammaloop_api::se... INFO : Running command import graphs ./tests/resources/graphs/dotted_bubble_amp.dot
  1479. 212.16 s > [2026-08-28 19:10:50.036] @commands::import INFO : Loading graphs from '/build/source/tests/resources/graphs/dotted_bubble_amp.dot'
  1480. 212.16 s > [2026-08-28 19:10:50.044] @gammaloop_api::se... INFO : Running command generate
  1481. 212.16 s > [2026-08-28 19:10:50.171] @commands::generate INFO :
  1482. 212.16 s > Integrand generation summary
  1483. 212.16 s > peak RAM 62.73 MiB | cores 1
  1484. 212.16 s > ╭───────────┬───────────────────┬─────────┬────────────┬────────────┬────────────────┬─────────────╮
  1485. 212.16 s > │ integrand │ graph │ # evals │ expr build │ spenso │ symbolica eval │ compile │
  1486. 212.16 s > ├───────────┼───────────────────┼─────────┼────────────┼────────────┼────────────────┼─────────────┤
  1487. 212.16 s > │ default │ dotted_bubble_amp │ 8 │ 26ms (57%) │ 2ms (5.0%) │ 17ms (38%) │ 0ms (0.00%) │
  1488. 212.16 s > ├───────────┼───────────────────┼─────────┼────────────┼────────────┼────────────────┼─────────────┤
  1489. 212.16 s > │ Total │ │ 8 │ 26ms (57%) │ 2ms (5.0%) │ 17ms (38%) │ 0ms (0.00%) │
  1490. 212.16 s > ╰───────────┴───────────────────┴─────────┴────────────┴────────────┴────────────────┴─────────────╯
  1491. 212.16 s > [2026-08-28 19:10:50.173] @process::amplitude INFO : Input is above threshold: 1 existing threshold E-surfaces across 1/1 graph groups
  1492. 212.16 s > [2026-08-28 19:10:50.173] @process::amplitude INFO : overlap structure of group 0: [1: [1(1,3)]]
  1493. 212.16 s > Error:
  1494. 212.16 s > 0: IR profiling requested arbitrary precision but received a quad-precision result
  1495. 212.16 s >
  1496. 212.16 s > Location:
  1497. 212.16 s > crates/gammalooprs/src/integrands/process/ir.rs:2123
  1498. 212.16 s >
  1499. 212.16 s > ━━━━━━━━━━━━━━━━━━━━━━━━━━━━━━━━━━ BACKTRACE ━━━━━━━━━━━━━━━━━━━━━━━━━━━━━━━━━━━
  1500. 212.16 s > 1: <color_eyre[51793ea62743adbd]::config::EyreHook>::into_eyre_hook::{closure#0}<unknown>
  1501. 212.16 s > at <unknown source file>:<unknown line>
  1502. 212.16 s > 2: eyre[cb2fd339c0c40fca]::capture_handler<unknown>
  1503. 212.16 s > at <unknown source file>:<unknown line>
  1504. 212.16 s > 3: eyre[cb2fd339c0c40fca]::private::format_err<unknown>
  1505. 212.16 s > at <unknown source file>:<unknown line>
  1506. 212.16 s > 4: gammalooprs[d7a7c067ebd19583]::integrands::process::ir::evaluate_profile_momentum_point_arb::<gammalooprs[d7a7c067ebd19583]::integrands::process::amplitude::AmplitudeIntegrand><unknown>
  1507. 212.16 s > at <unknown source file>:<unknown line>
  1508. 212.16 s > 5: <gammalooprs[d7a7c067ebd19583]::integrands::process::amplitude::AmplitudeIntegrand>::test_single_ir_limit_impl<unknown>
  1509. 212.16 s > at <unknown source file>:<unknown line>
  1510. 212.16 s > 6: gammalooprs[d7a7c067ebd19583]::integrands::process::ir::run_ir_profile::<gammalooprs[d7a7c067ebd19583]::integrands::process::amplitude::AmplitudeIntegrand, <gammalooprs[d7a7c067ebd19583]::integrands::process::amplitude::AmplitudeIntegrand>::enumerate_ir_limits, <gammalooprs[d7a7c067ebd19583]::integrands::process::amplitude::AmplitudeIntegrand>::graph_cut_definitions, <gammalooprs[d7a7c067ebd19583]::integrands::process::amplitude::AmplitudeIntegrand>::test_single_ir_limit_impl><unknown>
  1511. 212.16 s > at <unknown source file>:<unknown line>
  1512. 212.16 s > 7: <gammalooprs[d7a7c067ebd19583]::integrands::process::amplitude::AmplitudeIntegrand>::test_ir<unknown>
  1513. 212.16 s > at <unknown source file>:<unknown line>
  1514. 212.16 s > 8: <gammaloop_api[92ae732909e47e14]::commands::profile::Profile>::run<unknown>
  1515. 212.16 s > at <unknown source file>:<unknown line>
  1516. 212.16 s > 9: test_runs[3e7a390caee4e338]::profile_bulk::dotted_bubble_amp_bulk_profile_passes<unknown>
  1517. 212.16 s > at <unknown source file>:<unknown line>
  1518. 212.16 s > 10: <test_runs[3e7a390caee4e338]::profile_bulk::dotted_bubble_amp_bulk_profile_passes::{closure#0} as core[940e698046960fd5]::ops::function::FnOnce<()>>::call_once<unknown>
  1519. 212.16 s > at <unknown source file>:<unknown line>
  1520. 212.16 s > 11: test[75d6903177b1d7e9]::__rust_begin_short_backtrace::<core[940e698046960fd5]::result::Result<(), alloc[2ea6bcb46fca0c42]::string::String>, fn() -> core[940e698046960fd5]::result::Result<(), alloc[2ea6bcb46fca0c42]::string::String>><unknown>
  1521. 212.16 s > at <unknown source file>:<unknown line>
  1522. 212.16 s > 12: test[75d6903177b1d7e9]::run_test::{closure#0}<unknown>
  1523. 212.16 s > at <unknown source file>:<unknown line>
  1524. 212.16 s > 13: std[bcb96dfbba0ab899]::sys::backtrace::__rust_begin_short_backtrace::<test[75d6903177b1d7e9]::run_test::{closure#1}, ()><unknown>
  1525. 212.16 s > at <unknown source file>:<unknown line>
  1526. 212.16 s > 14: <std[bcb96dfbba0ab899]::thread::lifecycle::spawn_unchecked<test[75d6903177b1d7e9]::run_test::{closure#1}, ()>::{closure#1} as core[940e698046960fd5]::ops::function::FnOnce<()>>::call_once::{shim:vtable#0}<unknown>
  1527. 212.16 s > at <unknown source file>:<unknown line>
  1528. 212.16 s > 15: <std[bcb96dfbba0ab899]::sys::thread::unix::Thread>::new::thread_start<unknown>
  1529. 212.16 s > at <unknown source file>:<unknown line>
  1530. 212.16 s > 16: start_thread<unknown>
  1531. 212.16 s > at <unknown source file>:<unknown line>
  1532. 212.16 s > 17: __clone3<unknown>
  1533. 212.16 s > at <unknown source file>:<unknown line>
  1534. 212.16 s >
  1535. 212.16 s > Run with COLORBT_SHOW_HIDDEN=1 environment variable to disable frame filtering.
  1536. 212.16 s > Run with RUST_BACKTRACE=full to include source snippets.
  1537. 212.16 s > Warning: SpanTrace capture is Unsupported.
  1538. 212.16 s > Ensure that you've setup a tracing-error ErrorLayer and the semver versions are compatible
  1539. 212.16 s >
  1540. 212.16 s > 3. gammaloop-integration-tests::test_runs::profile_bulk::double_dotted_bubble_amp_bulk_profile_passes
  1541. 212.16 s > failure: test failure with exit code 101
  1542. 212.16 s > Error:
  1543. 212.16 s > 0: IR profiling requested arbitrary precision but received a quad-precision result
  1544. 212.16 s >
  1545. 212.16 s > Location:
  1546. 212.16 s > crates/gammalooprs/src/integrands/process/ir.rs:2123
  1547. 212.16 s >
  1548. 212.16 s > ━━━━━━━━━━━━━━━━━━━━━━━━━━━━━━━━━━ BACKTRACE ━━━━━━━━━━━━━━━━━━━━━━━━━━━━━━━━━━━
  1549. 212.16 s > 1: <color_eyre[51793ea62743adbd]::config::EyreHook>::into_eyre_hook::{closure#0}<unknown>
  1550. 212.16 s > at <unknown source file>:<unknown line>
  1551. 212.16 s > 2: eyre[cb2fd339c0c40fca]::capture_handler<unknown>
  1552. 212.16 s > at <unknown source file>:<unknown line>
  1553. 212.16 s > 3: eyre[cb2fd339c0c40fca]::private::format_err<unknown>
  1554. 212.16 s > at <unknown source file>:<unknown line>
  1555. 212.16 s > 4: gammalooprs[d7a7c067ebd19583]::integrands::process::ir::evaluate_profile_momentum_point_arb::<gammalooprs[d7a7c067ebd19583]::integrands::process::amplitude::AmplitudeIntegrand><unknown>
  1556. 212.16 s > at <unknown source file>:<unknown line>
  1557. 212.16 s > 5: <gammalooprs[d7a7c067ebd19583]::integrands::process::amplitude::AmplitudeIntegrand>::test_single_ir_limit_impl<unknown>
  1558. 212.16 s > at <unknown source file>:<unknown line>
  1559. 212.16 s > 6: gammalooprs[d7a7c067ebd19583]::integrands::process::ir::run_ir_profile::<gammalooprs[d7a7c067ebd19583]::integrands::process::amplitude::AmplitudeIntegrand, <gammalooprs[d7a7c067ebd19583]::integrands::process::amplitude::AmplitudeIntegrand>::enumerate_ir_limits, <gammalooprs[d7a7c067ebd19583]::integrands::process::amplitude::AmplitudeIntegrand>::graph_cut_definitions, <gammalooprs[d7a7c067ebd19583]::integrands::process::amplitude::AmplitudeIntegrand>::test_single_ir_limit_impl><unknown>
  1560. 212.16 s > at <unknown source file>:<unknown line>
  1561. 212.16 s > 7: <gammalooprs[d7a7c067ebd19583]::integrands::process::amplitude::AmplitudeIntegrand>::test_ir<unknown>
  1562. 212.16 s > at <unknown source file>:<unknown line>
  1563. 212.16 s > 8: <gammaloop_api[92ae732909e47e14]::commands::profile::Profile>::run<unknown>
  1564. 212.16 s > at <unknown source file>:<unknown line>
  1565. 212.16 s > 9: test_runs[3e7a390caee4e338]::profile_bulk::double_dotted_bubble_amp_bulk_profile_passes<unknown>
  1566. 212.16 s > at <unknown source file>:<unknown line>
  1567. 212.16 s > 10: <test_runs[3e7a390caee4e338]::profile_bulk::double_dotted_bubble_amp_bulk_profile_passes::{closure#0} as core[940e698046960fd5]::ops::function::FnOnce<()>>::call_once<unknown>
  1568. 212.16 s > at <unknown source file>:<unknown line>
  1569. 212.16 s > 11: test[75d6903177b1d7e9]::__rust_begin_short_backtrace::<core[940e698046960fd5]::result::Result<(), alloc[2ea6bcb46fca0c42]::string::String>, fn() -> core[940e698046960fd5]::result::Result<(), alloc[2ea6bcb46fca0c42]::string::String>><unknown>
  1570. 212.16 s > at <unknown source file>:<unknown line>
  1571. 212.16 s > 12: test[75d6903177b1d7e9]::run_test::{closure#0}<unknown>
  1572. 212.16 s > at <unknown source file>:<unknown line>
  1573. 212.16 s > 13: std[bcb96dfbba0ab899]::sys::backtrace::__rust_begin_short_backtrace::<test[75d6903177b1d7e9]::run_test::{closure#1}, ()><unknown>
  1574. 212.16 s > at <unknown source file>:<unknown line>
  1575. 212.16 s > 14: <std[bcb96dfbba0ab899]::thread::lifecycle::spawn_unchecked<test[75d6903177b1d7e9]::run_test::{closure#1}, ()>::{closure#1} as core[940e698046960fd5]::ops::function::FnOnce<()>>::call_once::{shim:vtable#0}<unknown>
  1576. 212.16 s > at <unknown source file>:<unknown line>
  1577. 212.16 s > 15: <std[bcb96dfbba0ab899]::sys::thread::unix::Thread>::new::thread_start<unknown>
  1578. 212.16 s > at <unknown source file>:<unknown line>
  1579. 212.16 s > 16: start_thread<unknown>
  1580. 212.16 s > at <unknown source file>:<unknown line>
  1581. 212.16 s > 17: __clone3<unknown>
  1582. 212.16 s > at <unknown source file>:<unknown line>
  1583. 212.16 s >
  1584. 212.16 s > Run with COLORBT_SHOW_HIDDEN=1 environment variable to disable frame filtering.
  1585. 212.16 s > Run with RUST_BACKTRACE=full to include source snippets.
  1586. 212.16 s > Warning: SpanTrace capture is Unsupported.
  1587. 212.16 s > Ensure that you've setup a tracing-error ErrorLayer and the semver versions are compatible
  1588. 212.16 s > system-out
  1589. 212.16 s > running 1 test
  1590. 212.16 s > test profile_bulk::double_dotted_bubble_amp_bulk_profile_passes ... FAILED
  1591. 212.16 s >
  1592. 212.16 s > failures:
  1593. 212.16 s >
  1594. 212.16 s > failures:
  1595. 212.16 s > profile_bulk::double_dotted_bubble_amp_bulk_profile_passes
  1596. 212.16 s >
  1597. 212.16 s > test result: FAILED. 0 passed; 1 failed; 0 ignored; 0 measured; 82 filtered out; finished in 0.73s
  1598. 212.16 s > system-err
  1599. 212.16 s > [2026-08-28 19:10:50.755] @gammaloop_api::se... INFO : Running command import model ./assets/models/json/scalars/scalars_2p_3p.json
  1600. 212.16 s > [2026-08-28 19:10:50.755] @import::model INFO : Loading JSON model scalars_2p_3p-default from /build/source/assets/models/json/scalars/scalars_2p_3p
  1601. 212.16 s > [2026-08-28 19:10:50.760] @gammaloop_api::se... INFO : Running command import graphs ./tests/resources/graphs/double_dotted_bubble_amp.dot
  1602. 212.16 s > [2026-08-28 19:10:50.760] @commands::import INFO : Loading graphs from '/build/source/tests/resources/graphs/double_dotted_bubble_amp.dot'
  1603. 212.16 s > [2026-08-28 19:10:50.778] @gammaloop_api::se... INFO : Running command generate
  1604. 212.16 s > [2026-08-28 19:10:51.009] @commands::generate INFO :
  1605. 212.16 s > Integrand generation summary
  1606. 212.16 s > peak RAM 67.32 MiB | cores 1
  1607. 212.16 s > ╭───────────┬──────────────────────────┬─────────┬────────────┬─────────────┬────────────────┬─────────────╮
  1608. 212.16 s > │ integrand │ graph │ # evals │ expr build │ spenso │ symbolica eval │ compile │
  1609. 212.16 s > ├───────────┼──────────────────────────┼─────────┼────────────┼─────────────┼────────────────┼─────────────┤
  1610. 212.16 s > │ default │ double_dotted_bubble_amp │ 11 │ 69ms (55%) │ 11ms (8.8%) │ 45ms (36%) │ 0ms (0.00%) │
  1611. 212.16 s > ├───────────┼──────────────────────────┼─────────┼────────────┼─────────────┼────────────────┼─────────────┤
  1612. 212.16 s > │ Total │ │ 11 │ 69ms (55%) │ 11ms (8.8%) │ 45ms (36%) │ 0ms (0.00%) │
  1613. 212.16 s > ╰───────────┴──────────────────────────┴─────────┴────────────┴─────────────┴────────────────┴─────────────╯
  1614. 212.16 s > [2026-08-28 19:10:51.011] @process::amplitude INFO : Input is above threshold: 1 existing threshold E-surfaces across 1/1 graph groups
  1615. 212.16 s > [2026-08-28 19:10:51.011] @process::amplitude INFO : overlap structure of group 0: [1: [1(1,4)]]
  1616. 212.16 s > Error:
  1617. 212.16 s > 0: IR profiling requested arbitrary precision but received a quad-precision result
  1618. 212.16 s >
  1619. 212.16 s > Location:
  1620. 212.16 s > crates/gammalooprs/src/integrands/process/ir.rs:2123
  1621. 212.16 s >
  1622. 212.16 s > ━━━━━━━━━━━━━━━━━━━━━━━━━━━━━━━━━━ BACKTRACE ━━━━━━━━━━━━━━━━━━━━━━━━━━━━━━━━━━━
  1623. 212.16 s > 1: <color_eyre[51793ea62743adbd]::config::EyreHook>::into_eyre_hook::{closure#0}<unknown>
  1624. 212.16 s > at <unknown source file>:<unknown line>
  1625. 212.16 s > 2: eyre[cb2fd339c0c40fca]::capture_handler<unknown>
  1626. 212.16 s > at <unknown source file>:<unknown line>
  1627. 212.16 s > 3: eyre[cb2fd339c0c40fca]::private::format_err<unknown>
  1628. 212.16 s > at <unknown source file>:<unknown line>
  1629. 212.16 s > 4: gammalooprs[d7a7c067ebd19583]::integrands::process::ir::evaluate_profile_momentum_point_arb::<gammalooprs[d7a7c067ebd19583]::integrands::process::amplitude::AmplitudeIntegrand><unknown>
  1630. 212.16 s > at <unknown source file>:<unknown line>
  1631. 212.16 s > 5: <gammalooprs[d7a7c067ebd19583]::integrands::process::amplitude::AmplitudeIntegrand>::test_single_ir_limit_impl<unknown>
  1632. 212.16 s > at <unknown source file>:<unknown line>
  1633. 212.16 s > 6: gammalooprs[d7a7c067ebd19583]::integrands::process::ir::run_ir_profile::<gammalooprs[d7a7c067ebd19583]::integrands::process::amplitude::AmplitudeIntegrand, <gammalooprs[d7a7c067ebd19583]::integrands::process::amplitude::AmplitudeIntegrand>::enumerate_ir_limits, <gammalooprs[d7a7c067ebd19583]::integrands::process::amplitude::AmplitudeIntegrand>::graph_cut_definitions, <gammalooprs[d7a7c067ebd19583]::integrands::process::amplitude::AmplitudeIntegrand>::test_single_ir_limit_impl><unknown>
  1634. 212.16 s > at <unknown source file>:<unknown line>
  1635. 212.16 s > 7: <gammalooprs[d7a7c067ebd19583]::integrands::process::amplitude::AmplitudeIntegrand>::test_ir<unknown>
  1636. 212.16 s > at <unknown source file>:<unknown line>
  1637. 212.16 s > 8: <gammaloop_api[92ae732909e47e14]::commands::profile::Profile>::run<unknown>
  1638. 212.16 s > at <unknown source file>:<unknown line>
  1639. 212.16 s > 9: test_runs[3e7a390caee4e338]::profile_bulk::double_dotted_bubble_amp_bulk_profile_passes<unknown>
  1640. 212.16 s > at <unknown source file>:<unknown line>
  1641. 212.16 s > 10: <test_runs[3e7a390caee4e338]::profile_bulk::double_dotted_bubble_amp_bulk_profile_passes::{closure#0} as core[940e698046960fd5]::ops::function::FnOnce<()>>::call_once<unknown>
  1642. 212.16 s > at <unknown source file>:<unknown line>
  1643. 212.16 s > 11: test[75d6903177b1d7e9]::__rust_begin_short_backtrace::<core[940e698046960fd5]::result::Result<(), alloc[2ea6bcb46fca0c42]::string::String>, fn() -> core[940e698046960fd5]::result::Result<(), alloc[2ea6bcb46fca0c42]::string::String>><unknown>
  1644. 212.16 s > at <unknown source file>:<unknown line>
  1645. 212.16 s > 12: test[75d6903177b1d7e9]::run_test::{closure#0}<unknown>
  1646. 212.16 s > at <unknown source file>:<unknown line>
  1647. 212.16 s > 13: std[bcb96dfbba0ab899]::sys::backtrace::__rust_begin_short_backtrace::<test[75d6903177b1d7e9]::run_test::{closure#1}, ()><unknown>
  1648. 212.16 s > at <unknown source file>:<unknown line>
  1649. 212.16 s > 14: <std[bcb96dfbba0ab899]::thread::lifecycle::spawn_unchecked<test[75d6903177b1d7e9]::run_test::{closure#1}, ()>::{closure#1} as core[940e698046960fd5]::ops::function::FnOnce<()>>::call_once::{shim:vtable#0}<unknown>
  1650. 212.16 s > at <unknown source file>:<unknown line>
  1651. 212.16 s > 15: <std[bcb96dfbba0ab899]::sys::thread::unix::Thread>::new::thread_start<unknown>
  1652. 212.16 s > at <unknown source file>:<unknown line>
  1653. 212.16 s > 16: start_thread<unknown>
  1654. 212.16 s > at <unknown source file>:<unknown line>
  1655. 212.16 s > 17: __clone3<unknown>
  1656. 212.16 s > at <unknown source file>:<unknown line>
  1657. 212.16 s >
  1658. 212.16 s > Run with COLORBT_SHOW_HIDDEN=1 environment variable to disable frame filtering.
  1659. 212.16 s > Run with RUST_BACKTRACE=full to include source snippets.
  1660. 212.16 s > Warning: SpanTrace capture is Unsupported.
  1661. 212.16 s > Ensure that you've setup a tracing-error ErrorLayer and the semver versions are compatible
  1662. 212.16 s >
  1663. 212.16 s > 4. gammaloop-integration-tests::test_runs::profile_bulk::box_4e_bulk_profile_passes
  1664. 212.16 s > failure: test failure with exit code 101
  1665. 212.16 s > Error:
  1666. 212.16 s > 0: IR profiling requested arbitrary precision but received a quad-precision result
  1667. 212.16 s >
  1668. 212.16 s > Location:
  1669. 212.16 s > crates/gammalooprs/src/integrands/process/ir.rs:2123
  1670. 212.16 s >
  1671. 212.16 s > ━━━━━━━━━━━━━━━━━━━━━━━━━━━━━━━━━━ BACKTRACE ━━━━━━━━━━━━━━━━━━━━━━━━━━━━━━━━━━━
  1672. 212.16 s > 1: <color_eyre[51793ea62743adbd]::config::EyreHook>::into_eyre_hook::{closure#0}<unknown>
  1673. 212.16 s > at <unknown source file>:<unknown line>
  1674. 212.16 s > 2: eyre[cb2fd339c0c40fca]::capture_handler<unknown>
  1675. 212.16 s > at <unknown source file>:<unknown line>
  1676. 212.16 s > 3: eyre[cb2fd339c0c40fca]::private::format_err<unknown>
  1677. 212.16 s > at <unknown source file>:<unknown line>
  1678. 212.16 s > 4: gammalooprs[d7a7c067ebd19583]::integrands::process::ir::evaluate_profile_momentum_point_arb::<gammalooprs[d7a7c067ebd19583]::integrands::process::amplitude::AmplitudeIntegrand><unknown>
  1679. 212.16 s > at <unknown source file>:<unknown line>
  1680. 212.16 s > 5: <gammalooprs[d7a7c067ebd19583]::integrands::process::amplitude::AmplitudeIntegrand>::test_single_ir_limit_impl<unknown>
  1681. 212.16 s > at <unknown source file>:<unknown line>
  1682. 212.16 s > 6: gammalooprs[d7a7c067ebd19583]::integrands::process::ir::run_ir_profile::<gammalooprs[d7a7c067ebd19583]::integrands::process::amplitude::AmplitudeIntegrand, <gammalooprs[d7a7c067ebd19583]::integrands::process::amplitude::AmplitudeIntegrand>::enumerate_ir_limits, <gammalooprs[d7a7c067ebd19583]::integrands::process::amplitude::AmplitudeIntegrand>::graph_cut_definitions, <gammalooprs[d7a7c067ebd19583]::integrands::process::amplitude::AmplitudeIntegrand>::test_single_ir_limit_impl><unknown>
  1683. 212.16 s > at <unknown source file>:<unknown line>
  1684. 212.16 s > 7: <gammalooprs[d7a7c067ebd19583]::integrands::process::amplitude::AmplitudeIntegrand>::test_ir<unknown>
  1685. 212.16 s > at <unknown source file>:<unknown line>
  1686. 212.16 s > 8: <gammaloop_api[92ae732909e47e14]::commands::profile::Profile>::run<unknown>
  1687. 212.16 s > at <unknown source file>:<unknown line>
  1688. 212.16 s > 9: test_runs[3e7a390caee4e338]::profile_bulk::box_4e_bulk_profile_passes<unknown>
  1689. 212.16 s > at <unknown source file>:<unknown line>
  1690. 212.16 s > 10: <test_runs[3e7a390caee4e338]::profile_bulk::box_4e_bulk_profile_passes::{closure#0} as core[940e698046960fd5]::ops::function::FnOnce<()>>::call_once<unknown>
  1691. 212.16 s > at <unknown source file>:<unknown line>
  1692. 212.16 s > 11: test[75d6903177b1d7e9]::__rust_begin_short_backtrace::<core[940e698046960fd5]::result::Result<(), alloc[2ea6bcb46fca0c42]::string::String>, fn() -> core[940e698046960fd5]::result::Result<(), alloc[2ea6bcb46fca0c42]::string::String>><unknown>
  1693. 212.16 s > at <unknown source file>:<unknown line>
  1694. 212.16 s > 12: test[75d6903177b1d7e9]::run_test::{closure#0}<unknown>
  1695. 212.16 s > at <unknown source file>:<unknown line>
  1696. 212.16 s > 13: std[bcb96dfbba0ab899]::sys::backtrace::__rust_begin_short_backtrace::<test[75d6903177b1d7e9]::run_test::{closure#1}, ()><unknown>
  1697. 212.16 s > at <unknown source file>:<unknown line>
  1698. 212.16 s > 14: <std[bcb96dfbba0ab899]::thread::lifecycle::spawn_unchecked<test[75d6903177b1d7e9]::run_test::{closure#1}, ()>::{closure#1} as core[940e698046960fd5]::ops::function::FnOnce<()>>::call_once::{shim:vtable#0}<unknown>
  1699. 212.16 s > at <unknown source file>:<unknown line>
  1700. 212.16 s > 15: <std[bcb96dfbba0ab899]::sys::thread::unix::Thread>::new::thread_start<unknown>
  1701. 212.16 s > at <unknown source file>:<unknown line>
  1702. 212.16 s > 16: start_thread<unknown>
  1703. 212.16 s > at <unknown source file>:<unknown line>
  1704. 212.16 s > 17: __clone3<unknown>
  1705. 212.16 s > at <unknown source file>:<unknown line>
  1706. 212.16 s >
  1707. 212.16 s > Run with COLORBT_SHOW_HIDDEN=1 environment variable to disable frame filtering.
  1708. 212.16 s > Run with RUST_BACKTRACE=full to include source snippets.
  1709. 212.16 s > Warning: SpanTrace capture is Unsupported.
  1710. 212.16 s > Ensure that you've setup a tracing-error ErrorLayer and the semver versions are compatible
  1711. 212.16 s > system-out
  1712. 212.16 s > running 1 test
  1713. 212.16 s > test profile_bulk::box_4e_bulk_profile_passes ... FAILED
  1714. 212.16 s >
  1715. 212.16 s > failures:
  1716. 212.16 s >
  1717. 212.16 s > failures:
  1718. 212.16 s > profile_bulk::box_4e_bulk_profile_passes
  1719. 212.16 s >
  1720. 212.16 s > test result: FAILED. 0 passed; 1 failed; 0 ignored; 0 measured; 82 filtered out; finished in 2.20s
  1721. 212.16 s > system-err
  1722. 212.16 s > [2026-08-28 19:10:50.329] @gammaloop_api::se... INFO : Running command import model ./assets/models/json/scalars/scalars.json
  1723. 212.16 s > [2026-08-28 19:10:50.329] @import::model INFO : Loading JSON model scalars-default from /build/source/assets/models/json/scalars/scalars
  1724. 212.16 s > [2026-08-28 19:10:50.340] @gammalooprs::model INFO : The following 2 external parameters were forced to zero by the restriction card:
  1725. 212.16 s > width_scalar_1, width_scalar_2
  1726. 212.16 s > [2026-08-28 19:10:50.341] @gammaloop_api::se... INFO : Running command import graphs ./tests/resources/graphs/massless_box.dot
  1727. 212.16 s > [2026-08-28 19:10:50.348] @commands::import INFO : Loading graphs from '/build/source/tests/resources/graphs/massless_box.dot'
  1728. 212.16 s > [2026-08-28 19:10:50.359] @gammaloop_api::se... INFO : Running command generate
  1729. 212.16 s > [2026-08-28 19:10:51.119] @commands::generate INFO :
  1730. 212.16 s > Integrand generation summary
  1731. 212.16 s > peak RAM 68.74 MiB | cores 1
  1732. 212.16 s > ╭───────────┬────────────────┬─────────┬─────────────┬────────────┬────────────────┬─────────────╮
  1733. 212.16 s > │ integrand │ graph │ # evals │ expr build │ spenso │ symbolica eval │ compile │
  1734. 212.16 s > ├───────────┼────────────────┼─────────┼─────────────┼────────────┼────────────────┼─────────────┤
  1735. 212.16 s > │ default │ massless_box_0 │ 14 │ 401ms (77%) │ 81ms (16%) │ 39ms (7.6%) │ 0ms (0.00%) │
  1736. 212.16 s > ├───────────┼────────────────┼─────────┼─────────────┼────────────┼────────────────┼─────────────┤
  1737. 212.16 s > │ Total │ │ 14 │ 401ms (77%) │ 81ms (16%) │ 39ms (7.6%) │ 0ms (0.00%) │
  1738. 212.16 s > ╰───────────┴────────────────┴─────────┴─────────────┴────────────┴────────────────┴─────────────╯
  1739. 212.16 s > [2026-08-28 19:10:51.130] @process::amplitude INFO : Input is above threshold: 4 existing threshold E-surfaces across 1/1 graph groups
  1740. 212.16 s > [2026-08-28 19:10:51.139] @process::amplitude INFO : overlap structure of group 0: [2: [4(3,4), 9(3,5)], 2: [8(4,6), 11(5,6)], 2: [4(3,4), 8(4,6)], 2: [9(3,5), 11(5,6)]]
  1741. 212.16 s > Error:
  1742. 212.16 s > 0: IR profiling requested arbitrary precision but received a quad-precision result
  1743. 212.16 s >
  1744. 212.16 s > Location:
  1745. 212.16 s > crates/gammalooprs/src/integrands/process/ir.rs:2123
  1746. 212.16 s >
  1747. 212.16 s > ━━━━━━━━━━━━━━━━━━━━━━━━━━━━━━━━━━ BACKTRACE ━━━━━━━━━━━━━━━━━━━━━━━━━━━━━━━━━━━
  1748. 212.16 s > 1: <color_eyre[51793ea62743adbd]::config::EyreHook>::into_eyre_hook::{closure#0}<unknown>
  1749. 212.16 s > at <unknown source file>:<unknown line>
  1750. 212.16 s > 2: eyre[cb2fd339c0c40fca]::capture_handler<unknown>
  1751. 212.16 s > at <unknown source file>:<unknown line>
  1752. 212.16 s > 3: eyre[cb2fd339c0c40fca]::private::format_err<unknown>
  1753. 212.16 s > at <unknown source file>:<unknown line>
  1754. 212.16 s > 4: gammalooprs[d7a7c067ebd19583]::integrands::process::ir::evaluate_profile_momentum_point_arb::<gammalooprs[d7a7c067ebd19583]::integrands::process::amplitude::AmplitudeIntegrand><unknown>
  1755. 212.16 s > at <unknown source file>:<unknown line>
  1756. 212.16 s > 5: <gammalooprs[d7a7c067ebd19583]::integrands::process::amplitude::AmplitudeIntegrand>::test_single_ir_limit_impl<unknown>
  1757. 212.16 s > at <unknown source file>:<unknown line>
  1758. 212.16 s > 6: gammalooprs[d7a7c067ebd19583]::integrands::process::ir::run_ir_profile::<gammalooprs[d7a7c067ebd19583]::integrands::process::amplitude::AmplitudeIntegrand, <gammalooprs[d7a7c067ebd19583]::integrands::process::amplitude::AmplitudeIntegrand>::enumerate_ir_limits, <gammalooprs[d7a7c067ebd19583]::integrands::process::amplitude::AmplitudeIntegrand>::graph_cut_definitions, <gammalooprs[d7a7c067ebd19583]::integrands::process::amplitude::AmplitudeIntegrand>::test_single_ir_limit_impl><unknown>
  1759. 212.16 s > at <unknown source file>:<unknown line>
  1760. 212.16 s > 7: <gammalooprs[d7a7c067ebd19583]::integrands::process::amplitude::AmplitudeIntegrand>::test_ir<unknown>
  1761. 212.16 s > at <unknown source file>:<unknown line>
  1762. 212.16 s > 8: <gammaloop_api[92ae732909e47e14]::commands::profile::Profile>::run<unknown>
  1763. 212.16 s > at <unknown source file>:<unknown line>
  1764. 212.16 s > 9: test_runs[3e7a390caee4e338]::profile_bulk::box_4e_bulk_profile_passes<unknown>
  1765. 212.16 s > at <unknown source file>:<unknown line>
  1766. 212.16 s > 10: <test_runs[3e7a390caee4e338]::profile_bulk::box_4e_bulk_profile_passes::{closure#0} as core[940e698046960fd5]::ops::function::FnOnce<()>>::call_once<unknown>
  1767. 212.16 s > at <unknown source file>:<unknown line>
  1768. 212.16 s > 11: test[75d6903177b1d7e9]::__rust_begin_short_backtrace::<core[940e698046960fd5]::result::Result<(), alloc[2ea6bcb46fca0c42]::string::String>, fn() -> core[940e698046960fd5]::result::Result<(), alloc[2ea6bcb46fca0c42]::string::String>><unknown>
  1769. 212.16 s > at <unknown source file>:<unknown line>
  1770. 212.16 s > 12: test[75d6903177b1d7e9]::run_test::{closure#0}<unknown>
  1771. 212.16 s > at <unknown source file>:<unknown line>
  1772. 212.16 s > 13: std[bcb96dfbba0ab899]::sys::backtrace::__rust_begin_short_backtrace::<test[75d6903177b1d7e9]::run_test::{closure#1}, ()><unknown>
  1773. 212.16 s > at <unknown source file>:<unknown line>
  1774. 212.16 s > 14: <std[bcb96dfbba0ab899]::thread::lifecycle::spawn_unchecked<test[75d6903177b1d7e9]::run_test::{closure#1}, ()>::{closure#1} as core[940e698046960fd5]::ops::function::FnOnce<()>>::call_once::{shim:vtable#0}<unknown>
  1775. 212.16 s > at <unknown source file>:<unknown line>
  1776. 212.16 s > 15: <std[bcb96dfbba0ab899]::sys::thread::unix::Thread>::new::thread_start<unknown>
  1777. 212.16 s > at <unknown source file>:<unknown line>
  1778. 212.16 s > 16: start_thread<unknown>
  1779. 212.16 s > at <unknown source file>:<unknown line>
  1780. 212.16 s > 17: __clone3<unknown>
  1781. 212.16 s > at <unknown source file>:<unknown line>
  1782. 212.16 s >
  1783. 212.16 s > Run with COLORBT_SHOW_HIDDEN=1 environment variable to disable frame filtering.
  1784. 212.16 s > Run with RUST_BACKTRACE=full to include source snippets.
  1785. 212.16 s > Warning: SpanTrace capture is Unsupported.
  1786. 212.16 s > Ensure that you've setup a tracing-error ErrorLayer and the semver versions are compatible
  1787. 212.16 s >
  1788. 212.16 s > 5. gammaloop-integration-tests::test_runs::profile_bulk::massless_triangle_bulk_profile_passes
  1789. 212.16 s > failure: test failure with exit code 101
  1790. 212.16 s > Error:
  1791. 212.16 s > 0: IR profiling requested arbitrary precision but received a quad-precision result
  1792. 212.16 s >
  1793. 212.16 s > Location:
  1794. 212.16 s > crates/gammalooprs/src/integrands/process/ir.rs:2123
  1795. 212.16 s >
  1796. 212.16 s > ━━━━━━━━━━━━━━━━━━━━━━━━━━━━━━━━━━ BACKTRACE ━━━━━━━━━━━━━━━━━━━━━━━━━━━━━━━━━━━
  1797. 212.16 s > 1: <color_eyre[51793ea62743adbd]::config::EyreHook>::into_eyre_hook::{closure#0}<unknown>
  1798. 212.16 s > at <unknown source file>:<unknown line>
  1799. 212.16 s > 2: eyre[cb2fd339c0c40fca]::capture_handler<unknown>
  1800. 212.16 s > at <unknown source file>:<unknown line>
  1801. 212.16 s > 3: eyre[cb2fd339c0c40fca]::private::format_err<unknown>
  1802. 212.16 s > at <unknown source file>:<unknown line>
  1803. 212.16 s > 4: gammalooprs[d7a7c067ebd19583]::integrands::process::ir::evaluate_profile_momentum_point_arb::<gammalooprs[d7a7c067ebd19583]::integrands::process::amplitude::AmplitudeIntegrand><unknown>
  1804. 212.16 s > at <unknown source file>:<unknown line>
  1805. 212.16 s > 5: <gammalooprs[d7a7c067ebd19583]::integrands::process::amplitude::AmplitudeIntegrand>::test_single_ir_limit_impl<unknown>
  1806. 212.16 s > at <unknown source file>:<unknown line>
  1807. 212.16 s > 6: gammalooprs[d7a7c067ebd19583]::integrands::process::ir::run_ir_profile::<gammalooprs[d7a7c067ebd19583]::integrands::process::amplitude::AmplitudeIntegrand, <gammalooprs[d7a7c067ebd19583]::integrands::process::amplitude::AmplitudeIntegrand>::enumerate_ir_limits, <gammalooprs[d7a7c067ebd19583]::integrands::process::amplitude::AmplitudeIntegrand>::graph_cut_definitions, <gammalooprs[d7a7c067ebd19583]::integrands::process::amplitude::AmplitudeIntegrand>::test_single_ir_limit_impl><unknown>
  1808. 212.16 s > at <unknown source file>:<unknown line>
  1809. 212.16 s > 7: <gammalooprs[d7a7c067ebd19583]::integrands::process::amplitude::AmplitudeIntegrand>::test_ir<unknown>
  1810. 212.16 s > at <unknown source file>:<unknown line>
  1811. 212.16 s > 8: <gammaloop_api[92ae732909e47e14]::commands::profile::Profile>::run<unknown>
  1812. 212.16 s > at <unknown source file>:<unknown line>
  1813. 212.16 s > 9: test_runs[3e7a390caee4e338]::profile_bulk::massless_triangle_bulk_profile_passes<unknown>
  1814. 212.16 s > at <unknown source file>:<unknown line>
  1815. 212.16 s > 10: <test_runs[3e7a390caee4e338]::profile_bulk::massless_triangle_bulk_profile_passes::{closure#0} as core[940e698046960fd5]::ops::function::FnOnce<()>>::call_once<unknown>
  1816. 212.16 s > at <unknown source file>:<unknown line>
  1817. 212.16 s > 11: test[75d6903177b1d7e9]::__rust_begin_short_backtrace::<core[940e698046960fd5]::result::Result<(), alloc[2ea6bcb46fca0c42]::string::String>, fn() -> core[940e698046960fd5]::result::Result<(), alloc[2ea6bcb46fca0c42]::string::String>><unknown>
  1818. 212.16 s > at <unknown source file>:<unknown line>
  1819. 212.16 s > 12: test[75d6903177b1d7e9]::run_test::{closure#0}<unknown>
  1820. 212.16 s > at <unknown source file>:<unknown line>
  1821. 212.16 s > 13: std[bcb96dfbba0ab899]::sys::backtrace::__rust_begin_short_backtrace::<test[75d6903177b1d7e9]::run_test::{closure#1}, ()><unknown>
  1822. 212.16 s > at <unknown source file>:<unknown line>
  1823. 212.16 s > 14: <std[bcb96dfbba0ab899]::thread::lifecycle::spawn_unchecked<test[75d6903177b1d7e9]::run_test::{closure#1}, ()>::{closure#1} as core[940e698046960fd5]::ops::function::FnOnce<()>>::call_once::{shim:vtable#0}<unknown>
  1824. 212.16 s > at <unknown source file>:<unknown line>
  1825. 212.16 s > 15: <std[bcb96dfbba0ab899]::sys::thread::unix::Thread>::new::thread_start<unknown>
  1826. 212.16 s > at <unknown source file>:<unknown line>
  1827. 212.16 s > 16: start_thread<unknown>
  1828. 212.16 s > at <unknown source file>:<unknown line>
  1829. 212.16 s > 17: __clone3<unknown>
  1830. 212.16 s > at <unknown source file>:<unknown line>
  1831. 212.16 s >
  1832. 212.16 s > Run with COLORBT_SHOW_HIDDEN=1 environment variable to disable frame filtering.
  1833. 212.16 s > Run with RUST_BACKTRACE=full to include source snippets.
  1834. 212.16 s > Warning: SpanTrace capture is Unsupported.
  1835. 212.16 s > Ensure that you've setup a tracing-error ErrorLayer and the semver versions are compatible
  1836. 212.16 s > system-out
  1837. 212.16 s > running 1 test
  1838. 212.16 s > test profile_bulk::massless_triangle_bulk_profile_passes ... FAILED
  1839. 212.16 s >
  1840. 212.16 s > failures:
  1841. 212.16 s >
  1842. 212.16 s > failures:
  1843. 212.16 s > profile_bulk::massless_triangle_bulk_profile_passes
  1844. 212.16 s >
  1845. 212.16 s > test result: FAILED. 0 passed; 1 failed; 0 ignored; 0 measured; 82 filtered out; finished in 1.04s
  1846. 212.16 s > system-err
  1847. 212.16 s > [2026-08-28 19:10:51.691] @gammaloop_api::se... INFO : Running command import model scalars
  1848. 212.16 s > [2026-08-28 19:10:51.693] @import::model INFO : Loading built-in JSON model scalars-default
  1849. 212.16 s > [2026-08-28 19:10:51.735] @gammalooprs::model INFO : The following 2 external parameters were forced to zero by the restriction card:
  1850. 212.16 s > width_scalar_1, width_scalar_2
  1851. 212.16 s > [2026-08-28 19:10:51.745] @gammaloop_api::se... INFO : Running command import graphs ./tests/resources/graphs/massless_triangle.dot
  1852. 212.16 s > [2026-08-28 19:10:51.745] @commands::import INFO : Loading graphs from '/build/source/tests/resources/graphs/massless_triangle.dot'
  1853. 212.16 s > [2026-08-28 19:10:51.769] @gammaloop_api::se... INFO : Running command generate
  1854. 212.16 s > [2026-08-28 19:10:52.100] @commands::generate INFO :
  1855. 212.16 s > Integrand generation summary
  1856. 212.16 s > peak RAM 67.16 MiB | cores 1
  1857. 212.16 s > ╭───────────┬─────────────────────┬─────────┬────────────┬─────────────┬────────────────┬─────────────╮
  1858. 212.16 s > │ integrand │ graph │ # evals │ expr build │ spenso │ symbolica eval │ compile │
  1859. 212.16 s > ├───────────┼─────────────────────┼─────────┼────────────┼─────────────┼────────────────┼─────────────┤
  1860. 212.16 s > │ default │ massless_triangle_0 │ 9 │ 51ms (19%) │ 26ms (9.9%) │ 191ms (71%) │ 0ms (0.00%) │
  1861. 212.16 s > ├───────────┼─────────────────────┼─────────┼────────────┼─────────────┼────────────────┼─────────────┤
  1862. 212.16 s > │ Total │ │ 9 │ 51ms (19%) │ 26ms (9.9%) │ 191ms (71%) │ 0ms (0.00%) │
  1863. 212.16 s > ╰───────────┴─────────────────────┴─────────┴────────────┴─────────────┴────────────────┴─────────────╯
  1864. 212.16 s > [2026-08-28 19:10:52.103] @process::amplitude INFO : Input is above threshold: 2 existing threshold E-surfaces across 1/1 graph groups
  1865. 212.16 s > [2026-08-28 19:10:52.121] @process::amplitude INFO : overlap structure of group 0: [2: [0(1,5), 1(1,3)]]
  1866. 212.16 s > Error:
  1867. 212.16 s > 0: IR profiling requested arbitrary precision but received a quad-precision result
  1868. 212.16 s >
  1869. 212.16 s > Location:
  1870. 212.16 s > crates/gammalooprs/src/integrands/process/ir.rs:2123
  1871. 212.16 s >
  1872. 212.16 s > ━━━━━━━━━━━━━━━━━━━━━━━━━━━━━━━━━━ BACKTRACE ━━━━━━━━━━━━━━━━━━━━━━━━━━━━━━━━━━━
  1873. 212.16 s > 1: <color_eyre[51793ea62743adbd]::config::EyreHook>::into_eyre_hook::{closure#0}<unknown>
  1874. 212.16 s > at <unknown source file>:<unknown line>
  1875. 212.16 s > 2: eyre[cb2fd339c0c40fca]::capture_handler<unknown>
  1876. 212.16 s > at <unknown source file>:<unknown line>
  1877. 212.16 s > 3: eyre[cb2fd339c0c40fca]::private::format_err<unknown>
  1878. 212.16 s > at <unknown source file>:<unknown line>
  1879. 212.16 s > 4: gammalooprs[d7a7c067ebd19583]::integrands::process::ir::evaluate_profile_momentum_point_arb::<gammalooprs[d7a7c067ebd19583]::integrands::process::amplitude::AmplitudeIntegrand><unknown>
  1880. 212.16 s > at <unknown source file>:<unknown line>
  1881. 212.16 s > 5: <gammalooprs[d7a7c067ebd19583]::integrands::process::amplitude::AmplitudeIntegrand>::test_single_ir_limit_impl<unknown>
  1882. 212.16 s > at <unknown source file>:<unknown line>
  1883. 212.16 s > 6: gammalooprs[d7a7c067ebd19583]::integrands::process::ir::run_ir_profile::<gammalooprs[d7a7c067ebd19583]::integrands::process::amplitude::AmplitudeIntegrand, <gammalooprs[d7a7c067ebd19583]::integrands::process::amplitude::AmplitudeIntegrand>::enumerate_ir_limits, <gammalooprs[d7a7c067ebd19583]::integrands::process::amplitude::AmplitudeIntegrand>::graph_cut_definitions, <gammalooprs[d7a7c067ebd19583]::integrands::process::amplitude::AmplitudeIntegrand>::test_single_ir_limit_impl><unknown>
  1884. 212.16 s > at <unknown source file>:<unknown line>
  1885. 212.16 s > 7: <gammalooprs[d7a7c067ebd19583]::integrands::process::amplitude::AmplitudeIntegrand>::test_ir<unknown>
  1886. 212.16 s > at <unknown source file>:<unknown line>
  1887. 212.16 s > 8: <gammaloop_api[92ae732909e47e14]::commands::profile::Profile>::run<unknown>
  1888. 212.16 s > at <unknown source file>:<unknown line>
  1889. 212.16 s > 9: test_runs[3e7a390caee4e338]::profile_bulk::massless_triangle_bulk_profile_passes<unknown>
  1890. 212.16 s > at <unknown source file>:<unknown line>
  1891. 212.16 s > 10: <test_runs[3e7a390caee4e338]::profile_bulk::massless_triangle_bulk_profile_passes::{closure#0} as core[940e698046960fd5]::ops::function::FnOnce<()>>::call_once<unknown>
  1892. 212.16 s > at <unknown source file>:<unknown line>
  1893. 212.16 s > 11: test[75d6903177b1d7e9]::__rust_begin_short_backtrace::<core[940e698046960fd5]::result::Result<(), alloc[2ea6bcb46fca0c42]::string::String>, fn() -> core[940e698046960fd5]::result::Result<(), alloc[2ea6bcb46fca0c42]::string::String>><unknown>
  1894. 212.16 s > at <unknown source file>:<unknown line>
  1895. 212.16 s > 12: test[75d6903177b1d7e9]::run_test::{closure#0}<unknown>
  1896. 212.16 s > at <unknown source file>:<unknown line>
  1897. 212.16 s > 13: std[bcb96dfbba0ab899]::sys::backtrace::__rust_begin_short_backtrace::<test[75d6903177b1d7e9]::run_test::{closure#1}, ()><unknown>
  1898. 212.16 s > at <unknown source file>:<unknown line>
  1899. 212.16 s > 14: <std[bcb96dfbba0ab899]::thread::lifecycle::spawn_unchecked<test[75d6903177b1d7e9]::run_test::{closure#1}, ()>::{closure#1} as core[940e698046960fd5]::ops::function::FnOnce<()>>::call_once::{shim:vtable#0}<unknown>
  1900. 212.16 s > at <unknown source file>:<unknown line>
  1901. 212.16 s > 15: <std[bcb96dfbba0ab899]::sys::thread::unix::Thread>::new::thread_start<unknown>
  1902. 212.16 s > at <unknown source file>:<unknown line>
  1903. 212.16 s > 16: start_thread<unknown>
  1904. 212.16 s > at <unknown source file>:<unknown line>
  1905. 212.16 s > 17: __clone3<unknown>
  1906. 212.16 s > at <unknown source file>:<unknown line>
  1907. 212.16 s >
  1908. 212.16 s > Run with COLORBT_SHOW_HIDDEN=1 environment variable to disable frame filtering.
  1909. 212.16 s > Run with RUST_BACKTRACE=full to include source snippets.
  1910. 212.16 s > Warning: SpanTrace capture is Unsupported.
  1911. 212.16 s > Ensure that you've setup a tracing-error ErrorLayer and the semver versions are compatible
  1912. 212.16 s >
  1913. 212.16 s > 6. gammaloop-integration-tests::test_runs::profile_bulk::scalar_self_energy_amp_bulk_profile_passes
  1914. 212.16 s > failure: test failure with exit code 101
  1915. 212.16 s > Error:
  1916. 212.16 s > 0: IR profiling requested arbitrary precision but received a quad-precision result
  1917. 212.16 s >
  1918. 212.16 s > Location:
  1919. 212.16 s > crates/gammalooprs/src/integrands/process/ir.rs:2123
  1920. 212.16 s >
  1921. 212.16 s > ━━━━━━━━━━━━━━━━━━━━━━━━━━━━━━━━━━ BACKTRACE ━━━━━━━━━━━━━━━━━━━━━━━━━━━━━━━━━━━
  1922. 212.16 s > 1: <color_eyre[51793ea62743adbd]::config::EyreHook>::into_eyre_hook::{closure#0}<unknown>
  1923. 212.16 s > at <unknown source file>:<unknown line>
  1924. 212.16 s > 2: eyre[cb2fd339c0c40fca]::capture_handler<unknown>
  1925. 212.16 s > at <unknown source file>:<unknown line>
  1926. 212.16 s > 3: eyre[cb2fd339c0c40fca]::private::format_err<unknown>
  1927. 212.16 s > at <unknown source file>:<unknown line>
  1928. 212.16 s > 4: gammalooprs[d7a7c067ebd19583]::integrands::process::ir::evaluate_profile_momentum_point_arb::<gammalooprs[d7a7c067ebd19583]::integrands::process::amplitude::AmplitudeIntegrand><unknown>
  1929. 212.16 s > at <unknown source file>:<unknown line>
  1930. 212.16 s > 5: <gammalooprs[d7a7c067ebd19583]::integrands::process::amplitude::AmplitudeIntegrand>::test_single_ir_limit_impl<unknown>
  1931. 212.16 s > at <unknown source file>:<unknown line>
  1932. 212.16 s > 6: gammalooprs[d7a7c067ebd19583]::integrands::process::ir::run_ir_profile::<gammalooprs[d7a7c067ebd19583]::integrands::process::amplitude::AmplitudeIntegrand, <gammalooprs[d7a7c067ebd19583]::integrands::process::amplitude::AmplitudeIntegrand>::enumerate_ir_limits, <gammalooprs[d7a7c067ebd19583]::integrands::process::amplitude::AmplitudeIntegrand>::graph_cut_definitions, <gammalooprs[d7a7c067ebd19583]::integrands::process::amplitude::AmplitudeIntegrand>::test_single_ir_limit_impl><unknown>
  1933. 212.16 s > at <unknown source file>:<unknown line>
  1934. 212.16 s > 7: <gammalooprs[d7a7c067ebd19583]::integrands::process::amplitude::AmplitudeIntegrand>::test_ir<unknown>
  1935. 212.16 s > at <unknown source file>:<unknown line>
  1936. 212.16 s > 8: <gammaloop_api[92ae732909e47e14]::commands::profile::Profile>::run<unknown>
  1937. 212.16 s > at <unknown source file>:<unknown line>
  1938. 212.16 s > 9: test_runs[3e7a390caee4e338]::profile_bulk::scalar_self_energy_amp_bulk_profile_passes<unknown>
  1939. 212.16 s > at <unknown source file>:<unknown line>
  1940. 212.16 s > 10: <test_runs[3e7a390caee4e338]::profile_bulk::scalar_self_energy_amp_bulk_profile_passes::{closure#0} as core[940e698046960fd5]::ops::function::FnOnce<()>>::call_once<unknown>
  1941. 212.16 s > at <unknown source file>:<unknown line>
  1942. 212.16 s > 11: test[75d6903177b1d7e9]::__rust_begin_short_backtrace::<core[940e698046960fd5]::result::Result<(), alloc[2ea6bcb46fca0c42]::string::String>, fn() -> core[940e698046960fd5]::result::Result<(), alloc[2ea6bcb46fca0c42]::string::String>><unknown>
  1943. 212.16 s > at <unknown source file>:<unknown line>
  1944. 212.16 s > 12: test[75d6903177b1d7e9]::run_test::{closure#0}<unknown>
  1945. 212.16 s > at <unknown source file>:<unknown line>
  1946. 212.16 s > 13: std[bcb96dfbba0ab899]::sys::backtrace::__rust_begin_short_backtrace::<test[75d6903177b1d7e9]::run_test::{closure#1}, ()><unknown>
  1947. 212.16 s > at <unknown source file>:<unknown line>
  1948. 212.16 s > 14: <std[bcb96dfbba0ab899]::thread::lifecycle::spawn_unchecked<test[75d6903177b1d7e9]::run_test::{closure#1}, ()>::{closure#1} as core[940e698046960fd5]::ops::function::FnOnce<()>>::call_once::{shim:vtable#0}<unknown>
  1949. 212.16 s > at <unknown source file>:<unknown line>
  1950. 212.16 s > 15: <std[bcb96dfbba0ab899]::sys::thread::unix::Thread>::new::thread_start<unknown>
  1951. 212.16 s > at <unknown source file>:<unknown line>
  1952. 212.16 s > 16: start_thread<unknown>
  1953. 212.16 s > at <unknown source file>:<unknown line>
  1954. 212.16 s > 17: __clone3<unknown>
  1955. 212.16 s > at <unknown source file>:<unknown line>
  1956. 212.16 s >
  1957. 212.16 s > Run with COLORBT_SHOW_HIDDEN=1 environment variable to disable frame filtering.
  1958. 212.16 s > Run with RUST_BACKTRACE=full to include source snippets.
  1959. 212.16 s > Warning: SpanTrace capture is Unsupported.
  1960. 212.16 s > Ensure that you've setup a tracing-error ErrorLayer and the semver versions are compatible
  1961. 212.16 s > system-out
  1962. 212.16 s > running 1 test
  1963. 212.16 s > test profile_bulk::scalar_self_energy_amp_bulk_profile_passes ... FAILED
  1964. 212.16 s >
  1965. 212.16 s > failures:
  1966. 212.16 s >
  1967. 212.16 s > failures:
  1968. 212.16 s > profile_bulk::scalar_self_energy_amp_bulk_profile_passes
  1969. 212.16 s >
  1970. 212.16 s > test result: FAILED. 0 passed; 1 failed; 0 ignored; 0 measured; 82 filtered out; finished in 2.74s
  1971. 212.16 s > system-err
  1972. 212.16 s > [2026-08-28 19:10:52.157] @gammaloop_api::se... INFO : Running command import model ./assets/models/json/scalars/scalars.json
  1973. 212.16 s > [2026-08-28 19:10:52.157] @import::model INFO : Loading JSON model scalars-default from /build/source/assets/models/json/scalars/scalars
  1974. 212.16 s > [2026-08-28 19:10:52.171] @gammalooprs::model INFO : The following 2 external parameters were forced to zero by the restriction card:
  1975. 212.16 s > width_scalar_1, width_scalar_2
  1976. 212.16 s > [2026-08-28 19:10:52.198] @gammaloop_api::se... INFO : Running command import graphs ./tests/resources/graphs/scalar_self_energy_amp.dot
  1977. 212.16 s > [2026-08-28 19:10:52.198] @commands::import INFO : Loading graphs from '/build/source/tests/resources/graphs/scalar_self_energy_amp.dot'
  1978. 212.16 s > [2026-08-28 19:10:52.296] @gammaloop_api::se... INFO : Running command generate
  1979. 212.16 s > [2026-08-28 19:10:54.169] @commands::generate INFO :
  1980. 212.16 s > Integrand generation summary
  1981. 212.16 s > peak RAM 72.06 MiB | cores 1
  1982. 212.16 s > ╭───────────┬────────────────────────┬─────────┬─────────────┬─────────────┬────────────────┬─────────────╮
  1983. 212.16 s > │ integrand │ graph │ # evals │ expr build │ spenso │ symbolica eval │ compile │
  1984. 212.16 s > ├───────────┼────────────────────────┼─────────┼─────────────┼─────────────┼────────────────┼─────────────┤
  1985. 212.16 s > │ default │ scalar_self_energy_amp │ 6 │ 1.41s (79%) │ 318ms (18%) │ 65ms (3.6%) │ 0ms (0.00%) │
  1986. 212.16 s > ├───────────┼────────────────────────┼─────────┼─────────────┼─────────────┼────────────────┼─────────────┤
  1987. 212.16 s > │ Total │ │ 6 │ 1.41s (79%) │ 318ms (18%) │ 65ms (3.6%) │ 0ms (0.00%) │
  1988. 212.16 s > ╰───────────┴────────────────────────┴─────────┴─────────────┴─────────────┴────────────────┴─────────────╯
  1989. 212.16 s > [2026-08-28 19:10:54.171] @process::amplitude INFO : Input is above threshold: 2 existing threshold E-surfaces across 1/1 graph groups
  1990. 212.16 s > [2026-08-28 19:10:54.172] @process::amplitude INFO : overlap structure of group 0: [2: [2(1,5), 4(2,3,5)]]
  1991. 212.16 s > Error:
  1992. 212.16 s > 0: IR profiling requested arbitrary precision but received a quad-precision result
  1993. 212.16 s >
  1994. 212.16 s > Location:
  1995. 212.16 s > crates/gammalooprs/src/integrands/process/ir.rs:2123
  1996. 212.16 s >
  1997. 212.16 s > ━━━━━━━━━━━━━━━━━━━━━━━━━━━━━━━━━━ BACKTRACE ━━━━━━━━━━━━━━━━━━━━━━━━━━━━━━━━━━━
  1998. 212.16 s > 1: <color_eyre[51793ea62743adbd]::config::EyreHook>::into_eyre_hook::{closure#0}<unknown>
  1999. 212.16 s > at <unknown source file>:<unknown line>
  2000. 212.16 s > 2: eyre[cb2fd339c0c40fca]::capture_handler<unknown>
  2001. 212.16 s > at <unknown source file>:<unknown line>
  2002. 212.16 s > 3: eyre[cb2fd339c0c40fca]::private::format_err<unknown>
  2003. 212.16 s > at <unknown source file>:<unknown line>
  2004. 212.16 s > 4: gammalooprs[d7a7c067ebd19583]::integrands::process::ir::evaluate_profile_momentum_point_arb::<gammalooprs[d7a7c067ebd19583]::integrands::process::amplitude::AmplitudeIntegrand><unknown>
  2005. 212.16 s > at <unknown source file>:<unknown line>
  2006. 212.16 s > 5: <gammalooprs[d7a7c067ebd19583]::integrands::process::amplitude::AmplitudeIntegrand>::test_single_ir_limit_impl<unknown>
  2007. 212.16 s > at <unknown source file>:<unknown line>
  2008. 212.16 s > 6: gammalooprs[d7a7c067ebd19583]::integrands::process::ir::run_ir_profile::<gammalooprs[d7a7c067ebd19583]::integrands::process::amplitude::AmplitudeIntegrand, <gammalooprs[d7a7c067ebd19583]::integrands::process::amplitude::AmplitudeIntegrand>::enumerate_ir_limits, <gammalooprs[d7a7c067ebd19583]::integrands::process::amplitude::AmplitudeIntegrand>::graph_cut_definitions, <gammalooprs[d7a7c067ebd19583]::integrands::process::amplitude::AmplitudeIntegrand>::test_single_ir_limit_impl><unknown>
  2009. 212.16 s > at <unknown source file>:<unknown line>
  2010. 212.16 s > 7: <gammalooprs[d7a7c067ebd19583]::integrands::process::amplitude::AmplitudeIntegrand>::test_ir<unknown>
  2011. 212.16 s > at <unknown source file>:<unknown line>
  2012. 212.16 s > 8: <gammaloop_api[92ae732909e47e14]::commands::profile::Profile>::run<unknown>
  2013. 212.16 s > at <unknown source file>:<unknown line>
  2014. 212.16 s > 9: test_runs[3e7a390caee4e338]::profile_bulk::scalar_self_energy_amp_bulk_profile_passes<unknown>
  2015. 212.16 s > at <unknown source file>:<unknown line>
  2016. 212.16 s > 10: <test_runs[3e7a390caee4e338]::profile_bulk::scalar_self_energy_amp_bulk_profile_passes::{closure#0} as core[940e698046960fd5]::ops::function::FnOnce<()>>::call_once<unknown>
  2017. 212.16 s > at <unknown source file>:<unknown line>
  2018. 212.16 s > 11: test[75d6903177b1d7e9]::__rust_begin_short_backtrace::<core[940e698046960fd5]::result::Result<(), alloc[2ea6bcb46fca0c42]::string::String>, fn() -> core[940e698046960fd5]::result::Result<(), alloc[2ea6bcb46fca0c42]::string::String>><unknown>
  2019. 212.16 s > at <unknown source file>:<unknown line>
  2020. 212.16 s > 12: test[75d6903177b1d7e9]::run_test::{closure#0}<unknown>
  2021. 212.16 s > at <unknown source file>:<unknown line>
  2022. 212.16 s > 13: std[bcb96dfbba0ab899]::sys::backtrace::__rust_begin_short_backtrace::<test[75d6903177b1d7e9]::run_test::{closure#1}, ()><unknown>
  2023. 212.16 s > at <unknown source file>:<unknown line>
  2024. 212.16 s > 14: <std[bcb96dfbba0ab899]::thread::lifecycle::spawn_unchecked<test[75d6903177b1d7e9]::run_test::{closure#1}, ()>::{closure#1} as core[940e698046960fd5]::ops::function::FnOnce<()>>::call_once::{shim:vtable#0}<unknown>
  2025. 212.16 s > at <unknown source file>:<unknown line>
  2026. 212.16 s > 15: <std[bcb96dfbba0ab899]::sys::thread::unix::Thread>::new::thread_start<unknown>
  2027. 212.16 s > at <unknown source file>:<unknown line>
  2028. 212.16 s > 16: start_thread<unknown>
  2029. 212.16 s > at <unknown source file>:<unknown line>
  2030. 212.16 s > 17: __clone3<unknown>
  2031. 212.16 s > at <unknown source file>:<unknown line>
  2032. 212.16 s >
  2033. 212.16 s > Run with COLORBT_SHOW_HIDDEN=1 environment variable to disable frame filtering.
  2034. 212.16 s > Run with RUST_BACKTRACE=full to include source snippets.
  2035. 212.16 s > Warning: SpanTrace capture is Unsupported.
  2036. 212.16 s > Ensure that you've setup a tracing-error ErrorLayer and the semver versions are compatible
  2037. 212.16 s >
  2038. 212.16 s > 7. gammaloop-integration-tests::uv::dod2_bubble_uv
  2039. 212.16 s > failure: test failure with exit code 101
  2040. 212.16 s > system-out
  2041. 212.16 s > running 1 test
  2042. 212.16 s > test dod2_bubble_uv has been running for over 60 seconds
  2043. 212.16 s > +-------------+-----------------+---------+--------+----------+-----------------------------------------------------------------------------------------------------------------------+-------+
  2044. 212.16 s > | case | check | graph | status | sigma | threshold | error |
  2045. 212.16 s > +-------------+-----------------+---------+--------+----------+-----------------------------------------------------------------------------------------------------------------------+-------+
  2046. 212.16 s > | dod2_bubble | uv_profile | - | FAIL | - | - | - |
  2047. 212.16 s > +-------------+-----------------+---------+--------+----------+-----------------------------------------------------------------------------------------------------------------------+-------+
  2048. 212.16 s > | dod2_bubble | m_uv.inspect | inspect | pass | - | best inspect relative delta 1.000e0 >= 1000*accuracy 1.000e-7 (accuracy=1.000e-10, exponent=+8.0, seed=0, probes=10) | - |
  2049. 212.16 s > +-------------+-----------------+---------+--------+----------+-----------------------------------------------------------------------------------------------------------------------+-------+
  2050. 212.16 s > | dod2_bubble | m_uv.integrated | GL0 | pass | 0.0sigma | compatible within 2sigma | - |
  2051. 212.16 s > +-------------+-----------------+---------+--------+----------+-----------------------------------------------------------------------------------------------------------------------+-------+
  2052. 212.16 s > | dod2_bubble | rls.inspect | inspect | pass | - | best inspect relative delta 2.822e-3 >= 1000*accuracy 1.000e-7 (accuracy=1.000e-10, exponent=+2.0, seed=1, probes=10) | - |
  2053. 212.16 s > +-------------+-----------------+---------+--------+----------+-----------------------------------------------------------------------------------------------------------------------+-------+
  2054. 212.16 s > | dod2_bubble | rls.integrated | GL0 | pass | 0.0sigma | compatible within 2sigma | - |
  2055. 212.16 s > +-------------+-----------------+---------+--------+----------+-----------------------------------------------------------------------------------------------------------------------+-------+
  2056. 212.16 s > | dod2_bubble | mu_r.inspect | inspect | pass | - | best inspect relative delta 6.951e-1 >= 1000*accuracy 1.000e-7 (accuracy=1.000e-10, exponent=+0.0, seed=0, probes=10) | - |
  2057. 212.16 s > +-------------+-----------------+---------+--------+----------+-----------------------------------------------------------------------------------------------------------------------+-------+
  2058. 212.16 s > | dod2_bubble | target | - | pass | - | 2sigma | - |
  2059. 212.16 s > +-------------+-----------------+---------+--------+----------+-----------------------------------------------------------------------------------------------------------------------+-------+
  2060. 212.16 s > test dod2_bubble_uv ... FAILED
  2061. 212.16 s >
  2062. 212.16 s > failures:
  2063. 212.16 s >
  2064. 212.16 s > failures:
  2065. 212.16 s > dod2_bubble_uv
  2066. 212.16 s >
  2067. 212.16 s > test result: FAILED. 0 passed; 1 failed; 0 ignored; 0 measured; 24 filtered out; finished in 68.42s
  2068. 212.16 s > system-err
  2069. 212.16 s > [2026-08-28 19:10:58.263] @gammaloop_api::se... INFO : Running command run generate
  2070. 212.16 s > [2026-08-28 19:10:58.263] @gammaloop_api::se... INFO : Starting command block generate
  2071. 212.16 s > [2026-08-28 19:10:58.263] @gammaloop_api::se... INFO : Running command import model scalars-default.json
  2072. 212.16 s > [2026-08-28 19:10:58.263] @import::model INFO : Loading built-in JSON model scalars-default
  2073. 212.16 s > [2026-08-28 19:10:58.297] @gammalooprs::model INFO : The following 2 external parameters were forced to zero by the restriction card:
  2074. 212.16 s > width_scalar_1, width_scalar_2
  2075. 212.16 s > [2026-08-28 19:10:58.298] @gammaloop_api::se... INFO : Running command remove processes
  2076. 212.16 s > [2026-08-28 19:10:58.298] @gammaloop_api::se... INFO : Running command set global kv global.generation.uv.generate_integrated=true
  2077. 212.16 s > [2026-08-28 19:10:58.299] @gammaloop_api::se... INFO : Running command import graphs ./tests/resources/graphs/scalar/dod2_bubble.dot -p bubble_dod2 -i scalar_bubble_below_thres
  2078. 212.16 s > [2026-08-28 19:10:58.299] @commands::import INFO : Loading graphs from '/build/source/tests/resources/graphs/scalar/dod2_bubble.dot'
  2079. 212.16 s > [2026-08-28 19:10:58.305] @gammaloop_api::se... INFO : Running command generate existing -p bubble_dod2 -i scalar_bubble_below_thres
  2080. 212.16 s > [2026-08-28 19:10:58.306] @approx::local_4d [{#uv, #inspect, #integrated}] DEBUG : Rescaled momenta expanded
  2081. 212.16 s > field value
  2082. 212.16 s > res n-terms: 1, byte size: 3,expr:
  2083. 212.16 s > 1
  2084. 212.16 s > [2026-08-28 19:10:58.314] @approx::local_4d [{#uv, #inspect, #integrated}] DEBUG : Rescaled momenta expanded
  2085. 212.16 s > field value
  2086. 212.16 s > res n-terms: 1, byte size: 585,expr:
  2087. 212.16 s > -SCALAR_COUPLING²·q₀(αᵉ².¹)·q₀(αᵉ³.¹)·q₂(αᵉ².¹)·q₂(αᵉ³.¹)
  2088. 212.16 s > /(t²·denom(3,-q₀-q₂/t,mass_scalar_2²,-mass_scalar_2²+2·(q₀.q₂)/t+(q₂.q₂)/t²+(q₀.q₀))
  2089. 212.16 s > ·denom(2,q₂/t,mass_scalar_2²,-mass_scalar_2²+(q₂.q₂)/t²))
  2090. 212.16 s > [2026-08-28 19:10:58.324] @approx::final_integrand[{#generation, #profile, #uv, #graph, #summary}] DEBUG : Computed global numerator
  2091. 212.16 s > field value
  2092. 212.16 s > global_num n-terms: 1, byte size: 4,expr:
  2093. 212.16 s > 1/2
  2094. 212.16 s > span build_3d{span_context=true graph=GL0 current=subgraph=0, topo_order=0, dod=0}
  2095. 212.16 s > [2026-08-28 19:10:58.335] @uv::approx [{#generation, #uv, #fourd}] DEBUG : Computing 4D
  2096. 212.16 s > field value
  2097. 212.16 s > simple subgraph(S_11,S_y)*Approx(subgraph(S_y,0)) of GL0
  2098. 212.16 s > span compute_4d{span_context=true graph=GL0 current=subgraph=y, topo_order=1, dod=2 given=subgraph=0, topo_order=0, dod=0 reduced=SubSet { set: BitVec<usize, bitvec::order::Lsb0> { addr: 0x7fffec018010, head: 000000, bits: 6, capacity: 64 } [0, 0, 1, 1, 1, 1], id: PhantomData<linnet::half_edge::involution::Hedge> }}
  2099. 212.16 s > [2026-08-28 19:10:58.336] @approx::local_4d [{#uv, #algebra, #integrated, #start}] DEBUG :
  2100. 212.16 s > field value
  2101. 212.16 s > integrand n-terms: 1, byte size: 409,expr:
  2102. 212.16 s > SCALAR_COUPLING²·(q₀(αᵉ³.¹)+q₃(αᵉ³.¹))·q₀(αᵉ².¹)·q₀(αᵉ³.¹)·q₂(αᵉ².¹)
  2103. 212.16 s > /(denom(2,q₂,mass_scalar_2²,-mass_scalar_2²+(q₂.q₂))·denom(3,q₃,mass_scalar_2²,-mass_scalar_2²+(q₃.q₃)))
  2104. 212.16 s > reduced y
  2105. 212.16 s > span grow{span_context=true current=subgraph=y, topo_order=1, dod=2 given=subgraph=0, topo_order=0, dod=0}
  2106. 212.16 s > [2026-08-28 19:10:58.336] @approx::local_4d [{#uv, #inspect, #integrated}] DEBUG : Rescaled momenta expanded
  2107. 212.16 s > field value
  2108. 212.16 s > res n-terms: 1, byte size: 585,expr:
  2109. 212.16 s > -SCALAR_COUPLING²·q₀(αᵉ².¹)·q₀(αᵉ³.¹)·q₂(αᵉ².¹)·q₂(αᵉ³.¹)
  2110. 212.16 s > /(t²·denom(3,-q₀-q₂/t,mass_scalar_2²,-mass_scalar_2²+2·(q₀.q₂)/t+(q₂.q₂)/t²+(q₀.q₀))
  2111. 212.16 s > ·denom(2,q₂/t,mass_scalar_2²,-mass_scalar_2²+(q₂.q₂)/t²))
  2112. 212.16 s > span t{span_context=true current=subgraph=y, topo_order=1, dod=2 given=subgraph=0, topo_order=0, dod=0}
  2113. 212.16 s > [2026-08-28 19:10:58.336] @approx::local_4d [{#uv, #integrated, #rescaled}] DEBUG : Rescaled expanded
  2114. 212.16 s > field value
  2115. 212.16 s > n_loops 1
  2116. 212.16 s > res n-terms: 1, byte size: 707,expr:
  2117. 212.16 s > -SCALAR_COUPLING²·q₀(αᵉ².¹)·q₀(αᵉ³.¹)·q₂(αᵉ².¹)·q₂(αᵉ³.¹)
  2118. 212.16 s > /(t²·denom(3,-q₂,mUVexp²+t²·mass_scalar_2²,-mUV²+t²·(-mass_scalar_2²+2·(q₀.q₂)/t+(q₂.q₂)/t²+(q₀.q₀))+t²·mUVexp²)
  2119. 212.16 s > ·denom(2,q₂,mUVexp²+t²·mass_scalar_2²,-mUV²+t²·(-mass_scalar_2²+(q₂.q₂)/t²)+t²·mUVexp²))
  2120. 212.16 s > span t{span_context=true current=subgraph=y, topo_order=1, dod=2 given=subgraph=0, topo_order=0, dod=0}
  2121. 212.16 s > [2026-08-28 19:10:58.346] @approx::local_4d [{#uv, #integrated, #series}] DEBUG : Series expanded
  2122. 212.16 s > field value
  2123. 212.16 s > res n-terms: 3, byte size: 1896,expr:
  2124. 212.16 s > (1/2·SCALAR_COUPLING²·(2·mUVexp²-2·mass_scalar_2²)/(denom(2,q₂,mUVexp²,-mUV²+(q₂.q₂))²·denom(3,-q₂,mUVexp²,-mUV²+(q₂.q₂)))
  2125. 212.16 s > -SCALAR_COUPLING²
  2126. 212.16 s > ·(-1/2·(2·mUVexp²-2·mass_scalar_2²+2·(q₀.q₀))/denom(3,-q₂,mUVexp²,-mUV²+(q₂.q₂))
  2127. 212.16 s > +4·(q₀.q₂)²/denom(3,-q₂,mUVexp²,-mUV²+(q₂.q₂))²
  2128. 212.16 s > )/(denom(2,q₂,mUVexp²,-mUV²+(q₂.q₂))·denom(3,-q₂,mUVexp²,-mUV²+(q₂.q₂)))
  2129. 212.16 s > )·q₀(αᵉ².¹)·q₀(αᵉ³.¹)·q₂(αᵉ².¹)·q₂(αᵉ³.¹)
  2130. 212.16 s > +2·SCALAR_COUPLING²·(q₀.q₂)·q₀(αᵉ².¹)·q₀(αᵉ³.¹)·q₂(αᵉ².¹)·q₂(αᵉ³.¹)
  2131. 212.16 s > /(t·denom(2,q₂,mUVexp²,-mUV²+(q₂.q₂))·denom(3,-q₂,mUVexp²,-mUV²+(q₂.q₂))²)
  2132. 212.16 s > -SCALAR_COUPLING²·q₀(αᵉ².¹)·q₀(αᵉ³.¹)·q₂(αᵉ².¹)·q₂(αᵉ³.¹)
  2133. 212.16 s > /(t²·denom(2,q₂,mUVexp²,-mUV²+(q₂.q₂))·denom(3,-q₂,mUVexp²,-mUV²+(q₂.q₂)))
  2134. 212.16 s > span t{span_context=true current=subgraph=y, topo_order=1, dod=2 given=subgraph=0, topo_order=0, dod=0}
  2135. 212.16 s > [2026-08-28 19:10:58.347] @approx::local_4d [{#uv, #integrated, #series}] DEBUG : Evaluated at t = 1
  2136. 212.16 s > field value
  2137. 212.16 s > res n-terms: 3, byte size: 1880,expr:
  2138. 212.16 s > (1/2·SCALAR_COUPLING²·(2·mUVexp²-2·mass_scalar_2²)/(denom(2,q₂,mUVexp²,-mUV²+(q₂.q₂))²·denom(3,-q₂,mUVexp²,-mUV²+(q₂.q₂)))
  2139. 212.16 s > -SCALAR_COUPLING²
  2140. 212.16 s > ·(-1/2·(2·mUVexp²-2·mass_scalar_2²+2·(q₀.q₀))/denom(3,-q₂,mUVexp²,-mUV²+(q₂.q₂))
  2141. 212.16 s > +4·(q₀.q₂)²/denom(3,-q₂,mUVexp²,-mUV²+(q₂.q₂))²
  2142. 212.16 s > )/(denom(2,q₂,mUVexp²,-mUV²+(q₂.q₂))·denom(3,-q₂,mUVexp²,-mUV²+(q₂.q₂)))
  2143. 212.16 s > )·q₀(αᵉ².¹)·q₀(αᵉ³.¹)·q₂(αᵉ².¹)·q₂(αᵉ³.¹)
  2144. 212.16 s > -SCALAR_COUPLING²·q₀(αᵉ².¹)·q₀(αᵉ³.¹)·q₂(αᵉ².¹)·q₂(αᵉ³.¹)
  2145. 212.16 s > /(denom(2,q₂,mUVexp²,-mUV²+(q₂.q₂))·denom(3,-q₂,mUVexp²,-mUV²+(q₂.q₂)))
  2146. 212.16 s > +2·SCALAR_COUPLING²·(q₀.q₂)·q₀(αᵉ².¹)·q₀(αᵉ³.¹)·q₂(αᵉ².¹)·q₂(αᵉ³.¹)
  2147. 212.16 s > /(denom(2,q₂,mUVexp²,-mUV²+(q₂.q₂))·denom(3,-q₂,mUVexp²,-mUV²+(q₂.q₂))²)
  2148. 212.16 s > span t{span_context=true current=subgraph=y, topo_order=1, dod=2 given=subgraph=0, topo_order=0, dod=0}
  2149. 212.16 s > [2026-08-28 19:10:58.356] @approx::local_4d [{#uv, #collect, #integrated}] DEBUG : After gamma chain collection
  2150. 212.16 s > field value
  2151. 212.16 s > expr n-terms: 3, byte size: 1880,expr:
  2152. 212.16 s > (1/2·SCALAR_COUPLING²·(2·mUVexp²-2·mass_scalar_2²)/(denom(2,q₂,mUVexp²,-mUV²+(q₂.q₂))²·denom(3,-q₂,mUVexp²,-mUV²+(q₂.q₂)))
  2153. 212.16 s > -SCALAR_COUPLING²
  2154. 212.16 s > ·(-1/2·(2·mUVexp²-2·mass_scalar_2²+2·(q₀.q₀))/denom(3,-q₂,mUVexp²,-mUV²+(q₂.q₂))
  2155. 212.16 s > +4·(q₀.q₂)²/denom(3,-q₂,mUVexp²,-mUV²+(q₂.q₂))²
  2156. 212.16 s > )/(denom(2,q₂,mUVexp²,-mUV²+(q₂.q₂))·denom(3,-q₂,mUVexp²,-mUV²+(q₂.q₂)))
  2157. 212.16 s > )·q₀(αᵉ².¹)·q₀(αᵉ³.¹)·q₂(αᵉ².¹)·q₂(αᵉ³.¹)
  2158. 212.16 s > -SCALAR_COUPLING²·q₀(αᵉ².¹)·q₀(αᵉ³.¹)·q₂(αᵉ².¹)·q₂(αᵉ³.¹)
  2159. 212.16 s > /(denom(2,q₂,mUVexp²,-mUV²+(q₂.q₂))·denom(3,-q₂,mUVexp²,-mUV²+(q₂.q₂)))
  2160. 212.16 s > +2·SCALAR_COUPLING²·(q₀.q₂)·q₀(αᵉ².¹)·q₀(αᵉ³.¹)·q₂(αᵉ².¹)·q₂(αᵉ³.¹)
  2161. 212.16 s > /(denom(2,q₂,mUVexp²,-mUV²+(q₂.q₂))·denom(3,-q₂,mUVexp²,-mUV²+(q₂.q₂))²)
  2162. 212.16 s > span t{span_context=true current=subgraph=y, topo_order=1, dod=2 given=subgraph=0, topo_order=0, dod=0}
  2163. 212.16 s > [2026-08-28 19:10:58.364] @approx::local_4d [{#profile, #uv, #collect, #integrated, #start, #trace}] DEBUG : After gamma schoonschip
  2164. 212.16 s > field value
  2165. 212.16 s > expr n-terms: 3, byte size: 1631,expr:
  2166. 212.16 s > (1/2·SCALAR_COUPLING²·(2·mUVexp²-2·mass_scalar_2²)/(denom(2,q₂,mUVexp²,-mUV²+(q₂.q₂))²·denom(3,-q₂,mUVexp²,-mUV²+(q₂.q₂)))
  2167. 212.16 s > -SCALAR_COUPLING²
  2168. 212.16 s > ·(-1/2·(2·mUVexp²-2·mass_scalar_2²+2·(q₀.q₀))/denom(3,-q₂,mUVexp²,-mUV²+(q₂.q₂))
  2169. 212.16 s > +4·(q₀.q₂)²/denom(3,-q₂,mUVexp²,-mUV²+(q₂.q₂))²
  2170. 212.16 s > )/(denom(2,q₂,mUVexp²,-mUV²+(q₂.q₂))·denom(3,-q₂,mUVexp²,-mUV²+(q₂.q₂)))
  2171. 212.16 s > )·(q₀.q₂)²
  2172. 212.16 s > -SCALAR_COUPLING²·(q₀.q₂)²/(denom(2,q₂,mUVexp²,-mUV²+(q₂.q₂))·denom(3,-q₂,mUVexp²,-mUV²+(q₂.q₂)))
  2173. 212.16 s > +2·SCALAR_COUPLING²·(q₀.q₂)·(q₀.q₂)²
  2174. 212.16 s > /(denom(2,q₂,mUVexp²,-mUV²+(q₂.q₂))·denom(3,-q₂,mUVexp²,-mUV²+(q₂.q₂))²)
  2175. 212.16 s > span t{span_context=true current=subgraph=y, topo_order=1, dod=2 given=subgraph=0, topo_order=0, dod=0}
  2176. 212.16 s > [2026-08-28 19:10:58.367] @approx::local_4d [{#profile, #uv, #collect, #integrated, #start, #trace}] DEBUG : After gamma collection
  2177. 212.16 s > field value
  2178. 212.16 s > expr n-terms: 1, byte size: 1347,expr:
  2179. 212.16 s > SCALAR_COUPLING²
  2180. 212.16 s > ·(-denom(2,q₂,mUVexp²,-mUV²+(q₂.q₂))·denom(3,-q₂,mUVexp²,-mUV²+(q₂.q₂))²
  2181. 212.16 s > +1/2·(2·mUVexp²-2·mass_scalar_2²)·denom(3,-q₂,mUVexp²,-mUV²+(q₂.q₂))²
  2182. 212.16 s > -(-1/2·(2·mUVexp²-2·mass_scalar_2²+2·(q₀.q₀))·denom(3,-q₂,mUVexp²,-mUV²+(q₂.q₂))+4·(q₀.q₂)²)
  2183. 212.16 s > ·denom(2,q₂,mUVexp²,-mUV²+(q₂.q₂))
  2184. 212.16 s > +2·(q₀.q₂)·denom(2,q₂,mUVexp²,-mUV²+(q₂.q₂))·denom(3,-q₂,mUVexp²,-mUV²+(q₂.q₂))
  2185. 212.16 s > )·(q₀.q₂)²/(denom(2,q₂,mUVexp²,-mUV²+(q₂.q₂))²·denom(3,-q₂,mUVexp²,-mUV²+(q₂.q₂))³)
  2186. 212.16 s > span t{span_context=true current=subgraph=y, topo_order=1, dod=2 given=subgraph=0, topo_order=0, dod=0}
  2187. 212.16 s > [2026-08-28 19:10:58.375] @approx::local_4d [{#profile, #uv, #gamma, #integrated, #start, #trace, #vakint}] DEBUG : After gamma simplification
  2188. 212.16 s > ... omitted 3263 more lines; see full nextest output above
  2189. 212.16 s >
  2190. 212.16 s > 8. gammaloop-integration-tests::uv::sunrise_scalar_1_uv
  2191. 212.16 s > failure: test failure with exit code 101
  2192. 212.16 s > system-out
  2193. 212.16 s > running 1 test
  2194. 212.16 s > test sunrise_scalar_1_uv has been running for over 60 seconds
  2195. 212.16 s > +------------------+------------------------+--------------+--------+----------+----------------------------------------------------------------------------------------------------------------------+-------+
  2196. 212.16 s > | case | check | graph | status | sigma | threshold | error |
  2197. 212.16 s > +------------------+------------------------+--------------+--------+----------+----------------------------------------------------------------------------------------------------------------------+-------+
  2198. 212.16 s > | sunrise_scalar_1 | uv_profile | - | FAIL | - | - | - |
  2199. 212.16 s > +------------------+------------------------+--------------+--------+----------+----------------------------------------------------------------------------------------------------------------------+-------+
  2200. 212.16 s > | sunrise_scalar_1 | m_uv.inspect | inspect | pass | - | best inspect relative delta 1.624e0 >= 1000*accuracy 1.000e-3 (accuracy=1.000e-6, exponent=+1.0, seed=1, probes=10) | - |
  2201. 212.16 s > +------------------+------------------------+--------------+--------+----------+----------------------------------------------------------------------------------------------------------------------+-------+
  2202. 212.16 s > | sunrise_scalar_1 | m_uv.integrated | sunrise | pass | 0.1sigma | compatible within 2sigma | - |
  2203. 212.16 s > +------------------+------------------------+--------------+--------+----------+----------------------------------------------------------------------------------------------------------------------+-------+
  2204. 212.16 s > | sunrise_scalar_1 | rls.inspect | inspect | pass | - | best inspect relative delta 8.682e-1 >= 1000*accuracy 1.000e-3 (accuracy=1.000e-6, exponent=+1.0, seed=1, probes=10) | - |
  2205. 212.16 s > +------------------+------------------------+--------------+--------+----------+----------------------------------------------------------------------------------------------------------------------+-------+
  2206. 212.16 s > | sunrise_scalar_1 | rls.integrated | sunrise | pass | 0.0sigma | compatible within 2sigma | - |
  2207. 212.16 s > +------------------+------------------------+--------------+--------+----------+----------------------------------------------------------------------------------------------------------------------+-------+
  2208. 212.16 s > | sunrise_scalar_1 | mu_r.inspect | inspect | pass | - | best inspect relative delta 1.752e0 >= 1000*accuracy 1.000e-3 (accuracy=1.000e-6, exponent=+1.0, seed=1, probes=10) | - |
  2209. 212.16 s > +------------------+------------------------+--------------+--------+----------+----------------------------------------------------------------------------------------------------------------------+-------+
  2210. 212.16 s > | sunrise_scalar_1 | integrated.relerr | integrated | pass | - | relative error 9.20% <= 10.00% | - |
  2211. 212.16 s > +------------------+------------------------+--------------+--------+----------+----------------------------------------------------------------------------------------------------------------------+-------+
  2212. 212.16 s > | sunrise_scalar_1 | m_uv.integrated.relerr | m_uv-shifted | pass | - | relative error 5.89% <= 10.00% | - |
  2213. 212.16 s > +------------------+------------------------+--------------+--------+----------+----------------------------------------------------------------------------------------------------------------------+-------+
  2214. 212.16 s > | sunrise_scalar_1 | target | - | pass | - | 2sigma | - |
  2215. 212.16 s > +------------------+------------------------+--------------+--------+----------+----------------------------------------------------------------------------------------------------------------------+-------+
  2216. 212.16 s > test sunrise_scalar_1_uv ... FAILED
  2217. 212.16 s >
  2218. 212.16 s > failures:
  2219. 212.16 s >
  2220. 212.16 s > failures:
  2221. 212.16 s > sunrise_scalar_1_uv
  2222. 212.16 s >
  2223. 212.16 s > test result: FAILED. 0 passed; 1 failed; 0 ignored; 0 measured; 24 filtered out; finished in 129.39s
  2224. 212.16 s > system-err
  2225. 212.16 s > [2026-08-28 19:11:08.220] @gammaloop_api::se... INFO : Running command run generate
  2226. 212.16 s > [2026-08-28 19:11:08.220] @gammaloop_api::se... INFO : Starting command block generate
  2227. 212.16 s > [2026-08-28 19:11:08.220] @gammaloop_api::se... INFO : Running command import model scalars-default.json
  2228. 212.16 s > [2026-08-28 19:11:08.220] @import::model INFO : Loading built-in JSON model scalars-default
  2229. 212.16 s > [2026-08-28 19:11:08.233] @gammalooprs::model INFO : The following 2 external parameters were forced to zero by the restriction card:
  2230. 212.16 s > width_scalar_1, width_scalar_2
  2231. 212.16 s > [2026-08-28 19:11:08.234] @gammaloop_api::se... INFO : Running command remove processes
  2232. 212.16 s > [2026-08-28 19:11:08.234] @gammaloop_api::se... INFO : Running command set global kv global.generation.uv.generate_integrated=true
  2233. 212.16 s > [2026-08-28 19:11:08.235] @gammaloop_api::se... INFO : Running command import graphs ./tests/resources/graphs/scalar_sunrise.dot -p sunrise_scalar_1 -i scalar_sunrise
  2234. 212.16 s > [2026-08-28 19:11:08.235] @commands::import INFO : Loading graphs from '/build/source/tests/resources/graphs/scalar_sunrise.dot'
  2235. 212.16 s > [2026-08-28 19:11:08.246] @gammaloop_api::se... INFO : Running command generate existing -p sunrise_scalar_1 -i scalar_sunrise
  2236. 212.16 s > [2026-08-28 19:11:08.252] @approx::local_4d [{#uv, #inspect, #integrated}] DEBUG : Rescaled momenta expanded
  2237. 212.16 s > field value
  2238. 212.16 s > res n-terms: 1, byte size: 777,expr:
  2239. 212.16 s > 1/(denom(0,q₀/t,mass_scalar_1²,-mass_scalar_1²+(q₀.q₀)/t²)·denom(1,q₁/t,mass_scalar_1²,-mass_scalar_1²+(q₁.q₁)/t²)
  2240. 212.16 s > ·denom(2,q₄-q₀/t-q₁/t,mass_scalar_1²,
  2241. 212.16 s > -mass_scalar_1²-2·(q₀.q₄)/t-2·(q₁.q₄)/t+(q₀.q₀)/t²+2·(q₀.q₁)/t²
  2242. 212.16 s > +(q₁.q₁)/t²+(q₄.q₄)
  2243. 212.16 s > ))
  2244. 212.16 s > [2026-08-28 19:11:08.263] @approx::local_4d [{#uv, #inspect, #integrated}] DEBUG : Rescaled momenta expanded
  2245. 212.16 s > field value
  2246. 212.16 s > res n-terms: 1, byte size: 3,expr:
  2247. 212.16 s > 1
  2248. 212.16 s > [2026-08-28 19:11:08.265] @approx::local_4d [{#uv, #inspect, #integrated}] DEBUG : Rescaled momenta expanded
  2249. 212.16 s > field value
  2250. 212.16 s > res n-terms: 1, byte size: 611,expr:
  2251. 212.16 s > 1/(denom(0,q₀/t,mass_scalar_1²,-mass_scalar_1²+(q₀.q₀)/t²)
  2252. 212.16 s > ·denom(2,-q₁+q₃-q₀/t,mass_scalar_1²,
  2253. 212.16 s > -mass_scalar_1²+2·(q₀.q₁)/t-2·(q₀.q₃)/t+(q₀.q₀)/t²+(q₁.q₁)
  2254. 212.16 s > -2·(q₁.q₃)+(q₃.q₃)
  2255. 212.16 s > ))
  2256. 212.16 s > [2026-08-28 19:11:08.273] @approx::local_4d [{#uv, #inspect, #integrated}] DEBUG : Rescaled momenta expanded
  2257. 212.16 s > field value
  2258. 212.16 s > res n-terms: 1, byte size: 611,expr:
  2259. 212.16 s > 1/(denom(0,q₀/t,mass_scalar_1²,-mass_scalar_1²+(q₀.q₀)/t²)
  2260. 212.16 s > ·denom(1,-q₂+q₃-q₀/t,mass_scalar_1²,
  2261. 212.16 s > -mass_scalar_1²+2·(q₀.q₂)/t-2·(q₀.q₃)/t+(q₀.q₀)/t²+(q₂.q₂)
  2262. 212.16 s > -2·(q₂.q₃)+(q₃.q₃)
  2263. 212.16 s > ))
  2264. 212.16 s > [2026-08-28 19:11:08.275] @approx::local_4d [{#uv, #inspect, #integrated}] DEBUG : Rescaled momenta expanded
  2265. 212.16 s > field value
  2266. 212.16 s > res n-terms: 1, byte size: 611,expr:
  2267. 212.16 s > 1/(denom(1,q₁/t,mass_scalar_1²,-mass_scalar_1²+(q₁.q₁)/t²)
  2268. 212.16 s > ·denom(2,-q₀+q₃-q₁/t,mass_scalar_1²,
  2269. 212.16 s > -mass_scalar_1²+2·(q₀.q₁)/t-2·(q₁.q₃)/t+(q₁.q₁)/t²+(q₀.q₀)
  2270. 212.16 s > -2·(q₀.q₃)+(q₃.q₃)
  2271. 212.16 s > ))
  2272. 212.16 s > [2026-08-28 19:11:08.283] @approx::final_integrand[{#generation, #profile, #uv, #graph, #summary}] DEBUG : Computed global numerator
  2273. 212.16 s > field value
  2274. 212.16 s > global_num n-terms: 1, byte size: 3,expr:
  2275. 212.16 s > 1
  2276. 212.16 s > span build_3d{span_context=true graph=sunrise current=subgraph=0, topo_order=0, dod=0}
  2277. 212.16 s > [2026-08-28 19:11:08.293] @uv::approx [{#generation, #uv, #fourd}] DEBUG : Computing 4D
  2278. 212.16 s > field value
  2279. 212.16 s > simple subgraph(S_47,S_44)*Approx(subgraph(S_44,0)) of sunrise
  2280. 212.16 s > span compute_4d{span_context=true graph=sunrise current=subgraph=44, topo_order=1, dod=2 given=subgraph=0, topo_order=0, dod=0 reduced=SubSet { set: BitVec<usize, bitvec::order::Lsb0> { addr: 0x7fffe8010960, head: 000000, bits: 8, capacity: 64 } [0, 0, 1, 1, 1, 1, 1, 1], id: PhantomData<linnet::half_edge::involution::Hedge> }}
  2281. 212.16 s > [2026-08-28 19:11:08.295] @approx::local_4d [{#uv, #algebra, #integrated, #start}] DEBUG :
  2282. 212.16 s > field value
  2283. 212.16 s > integrand n-terms: 1, byte size: 322,expr:
  2284. 212.16 s > 1/(denom(0,q₀,mass_scalar_1²,-mass_scalar_1²+(q₀.q₀))·denom(1,q₁,mass_scalar_1²,-mass_scalar_1²+(q₁.q₁))
  2285. 212.16 s > ·denom(2,q₂,mass_scalar_1²,-mass_scalar_1²+(q₂.q₂)))
  2286. 212.16 s > reduced 44
  2287. 212.16 s > span grow{span_context=true current=subgraph=44, topo_order=1, dod=2 given=subgraph=0, topo_order=0, dod=0}
  2288. 212.16 s > [2026-08-28 19:11:08.295] @approx::local_4d [{#uv, #inspect, #integrated}] DEBUG : Rescaled momenta expanded
  2289. 212.16 s > field value
  2290. 212.16 s > res n-terms: 1, byte size: 777,expr:
  2291. 212.16 s > 1/(denom(0,q₀/t,mass_scalar_1²,-mass_scalar_1²+(q₀.q₀)/t²)·denom(1,q₁/t,mass_scalar_1²,-mass_scalar_1²+(q₁.q₁)/t²)
  2292. 212.16 s > ·denom(2,q₄-q₀/t-q₁/t,mass_scalar_1²,
  2293. 212.16 s > -mass_scalar_1²-2·(q₀.q₄)/t-2·(q₁.q₄)/t+(q₀.q₀)/t²+2·(q₀.q₁)/t²
  2294. 212.16 s > +(q₁.q₁)/t²+(q₄.q₄)
  2295. 212.16 s > ))
  2296. 212.16 s > span t{span_context=true current=subgraph=44, topo_order=1, dod=2 given=subgraph=0, topo_order=0, dod=0}
  2297. 212.16 s > [2026-08-28 19:11:08.302] @approx::local_4d [{#uv, #integrated, #rescaled}] DEBUG : Rescaled expanded
  2298. 212.16 s > field value
  2299. 212.16 s > n_loops 2
  2300. 212.16 s > res n-terms: 1, byte size: 982,expr:
  2301. 212.16 s > 1/(t²
  2302. 212.16 s > ·denom(2,-q₀-q₁,mUVexp²+t²·mass_scalar_1²,
  2303. 212.16 s > -mUV²
  2304. 212.16 s > +t²
  2305. 212.16 s > ·(-mass_scalar_1²-2·(q₀.q₄)/t-2·(q₁.q₄)/t+(q₀.q₀)/t²+2·(q₀.q₁)/t²
  2306. 212.16 s > +(q₁.q₁)/t²+(q₄.q₄)
  2307. 212.16 s > )
  2308. 212.16 s > +t²·mUVexp²
  2309. 212.16 s > )
  2310. 212.16 s > ·denom(0,q₀,mUVexp²+t²·mass_scalar_1²,-mUV²+t²·(-mass_scalar_1²+(q₀.q₀)/t²)+t²·mUVexp²)
  2311. 212.16 s > ·denom(1,q₁,mUVexp²+t²·mass_scalar_1²,-mUV²+t²·(-mass_scalar_1²+(q₁.q₁)/t²)+t²·mUVexp²))
  2312. 212.16 s > span t{span_context=true current=subgraph=44, topo_order=1, dod=2 given=subgraph=0, topo_order=0, dod=0}
  2313. 212.16 s > [2026-08-28 19:11:08.304] @approx::local_4d [{#uv, #integrated, #series}] DEBUG : Series expanded
  2314. 212.16 s > field value
  2315. 212.16 s > res n-terms: 4, byte size: 3187,expr:
  2316. 212.16 s > -1/2·(2·mUVexp²-2·mass_scalar_1²)
  2317. 212.16 s > /(denom(0,q₀,mUVexp²,-mUV²+(q₀.q₀))·denom(1,q₁,mUVexp²,-mUV²+(q₁.q₁))²
  2318. 212.16 s > ·denom(2,-q₀-q₁,mUVexp²,-mUV²+(q₀.q₀)+2·(q₀.q₁)+(q₁.q₁)))
  2319. 212.16 s > +(-1/2·(2·mUVexp²-2·mass_scalar_1²)
  2320. 212.16 s > /(denom(0,q₀,mUVexp²,-mUV²+(q₀.q₀))²
  2321. 212.16 s > ·denom(2,-q₀-q₁,mUVexp²,-mUV²+(q₀.q₀)+2·(q₀.q₁)+(q₁.q₁)))
  2322. 212.16 s > +(-1/2·(2·mUVexp²-2·mass_scalar_1²+2·(q₄.q₄))
  2323. 212.16 s > /denom(2,-q₀-q₁,mUVexp²,-mUV²+(q₀.q₀)+2·(q₀.q₁)+(q₁.q₁))
  2324. 212.16 s > +(-2·(q₀.q₄)-2·(q₁.q₄))²
  2325. 212.16 s > /denom(2,-q₀-q₁,mUVexp²,-mUV²+(q₀.q₀)+2·(q₀.q₁)+(q₁.q₁))²
  2326. 212.16 s > )
  2327. 212.16 s > /(denom(0,q₀,mUVexp²,-mUV²+(q₀.q₀))
  2328. 212.16 s > ·denom(2,-q₀-q₁,mUVexp²,-mUV²+(q₀.q₀)+2·(q₀.q₁)+(q₁.q₁)))
  2329. 212.16 s > )/denom(1,q₁,mUVexp²,-mUV²+(q₁.q₁))
  2330. 212.16 s > -(-2·(q₀.q₄)-2·(q₁.q₄))
  2331. 212.16 s > /(t·denom(0,q₀,mUVexp²,-mUV²+(q₀.q₀))·denom(1,q₁,mUVexp²,-mUV²+(q₁.q₁))
  2332. 212.16 s > ·denom(2,-q₀-q₁,mUVexp²,-mUV²+(q₀.q₀)+2·(q₀.q₁)+(q₁.q₁))²)
  2333. 212.16 s > +1/(t²·denom(0,q₀,mUVexp²,-mUV²+(q₀.q₀))·denom(1,q₁,mUVexp²,-mUV²+(q₁.q₁))
  2334. 212.16 s > ·denom(2,-q₀-q₁,mUVexp²,-mUV²+(q₀.q₀)+2·(q₀.q₁)+(q₁.q₁)))
  2335. 212.16 s > span t{span_context=true current=subgraph=44, topo_order=1, dod=2 given=subgraph=0, topo_order=0, dod=0}
  2336. 212.16 s > [2026-08-28 19:11:08.304] @approx::local_4d [{#uv, #integrated, #series}] DEBUG : Evaluated at t = 1
  2337. 212.16 s > field value
  2338. 212.16 s > res n-terms: 4, byte size: 3171,expr:
  2339. 212.16 s > -1/2·(2·mUVexp²-2·mass_scalar_1²)
  2340. 212.16 s > /(denom(0,q₀,mUVexp²,-mUV²+(q₀.q₀))·denom(1,q₁,mUVexp²,-mUV²+(q₁.q₁))²
  2341. 212.16 s > ·denom(2,-q₀-q₁,mUVexp²,-mUV²+(q₀.q₀)+2·(q₀.q₁)+(q₁.q₁)))
  2342. 212.16 s > -(-2·(q₀.q₄)-2·(q₁.q₄))
  2343. 212.16 s > /(denom(0,q₀,mUVexp²,-mUV²+(q₀.q₀))·denom(1,q₁,mUVexp²,-mUV²+(q₁.q₁))
  2344. 212.16 s > ... omitted 20090 more lines; see full nextest output above
  2345. 212.16 s >
  2346. 212.16 s > 9. gammaloop-integration-tests::uv::se1l_uv
  2347. 212.16 s > failure: test failure with exit code 101
  2348. 212.16 s > system-out
  2349. 212.16 s > running 1 test
  2350. 212.16 s > test se1l_uv has been running for over 60 seconds
  2351. 212.16 s > +------+-----------------+---------+--------+----------+-----------------------------------------------------------------------------------------------------------------------+-------+
  2352. 212.16 s > | case | check | graph | status | sigma | threshold | error |
  2353. 212.16 s > +------+-----------------+---------+--------+----------+-----------------------------------------------------------------------------------------------------------------------+-------+
  2354. 212.16 s > | se1l | uv_profile | - | FAIL | - | - | - |
  2355. 212.16 s > +------+-----------------+---------+--------+----------+-----------------------------------------------------------------------------------------------------------------------+-------+
  2356. 212.16 s > | se1l | m_uv.inspect | inspect | pass | - | best inspect relative delta 1.097e-1 >= 1000*accuracy 1.000e-7 (accuracy=1.000e-10, exponent=+2.0, seed=1, probes=10) | - |
  2357. 212.16 s > +------+-----------------+---------+--------+----------+-----------------------------------------------------------------------------------------------------------------------+-------+
  2358. 212.16 s > | se1l | m_uv.integrated | se1l | pass | 0.1sigma | compatible within 2sigma | - |
  2359. 212.16 s > +------+-----------------+---------+--------+----------+-----------------------------------------------------------------------------------------------------------------------+-------+
  2360. 212.16 s > | se1l | rls.inspect | inspect | pass | - | best inspect relative delta 4.499e-2 >= 1000*accuracy 1.000e-7 (accuracy=1.000e-10, exponent=+2.0, seed=1, probes=10) | - |
  2361. 212.16 s > +------+-----------------+---------+--------+----------+-----------------------------------------------------------------------------------------------------------------------+-------+
  2362. 212.16 s > | se1l | rls.integrated | se1l | pass | 0.0sigma | compatible within 2sigma | - |
  2363. 212.16 s > +------+-----------------+---------+--------+----------+-----------------------------------------------------------------------------------------------------------------------+-------+
  2364. 212.16 s > | se1l | mu_r.inspect | inspect | pass | - | best inspect relative delta 1.424e-1 >= 1000*accuracy 1.000e-7 (accuracy=1.000e-10, exponent=+2.0, seed=1, probes=10) | - |
  2365. 212.16 s > +------+-----------------+---------+--------+----------+-----------------------------------------------------------------------------------------------------------------------+-------+
  2366. 212.16 s > | se1l | target | - | pass | - | 2sigma | - |
  2367. 212.16 s > +------+-----------------+---------+--------+----------+-----------------------------------------------------------------------------------------------------------------------+-------+
  2368. 212.16 s > test se1l_uv ... FAILED
  2369. 212.16 s >
  2370. 212.16 s > failures:
  2371. 212.16 s >
  2372. 212.16 s > failures:
  2373. 212.16 s > se1l_uv
  2374. 212.16 s >
  2375. 212.16 s > test result: FAILED. 0 passed; 1 failed; 0 ignored; 0 measured; 24 filtered out; finished in 145.30s
  2376. 212.16 s > system-err
  2377. 212.16 s > [2026-08-28 19:11:07.893] @gammaloop_api::se... INFO : Running command run generate
  2378. 212.16 s > [2026-08-28 19:11:07.893] @gammaloop_api::se... INFO : Starting command block generate
  2379. 212.16 s > [2026-08-28 19:11:07.893] @gammaloop_api::se... INFO : Running command import model sm-default
  2380. 212.16 s > [2026-08-28 19:11:07.893] @import::model INFO : Loading built-in JSON model sm-default
  2381. 212.16 s > [2026-08-28 19:11:08.018] @gammalooprs::model INFO : The following 11 external parameters were forced to zero by the restriction card:
  2382. 212.16 s > lamWS, AWS, rhoWS, etaWS, ymc, yme, ymm, MC, Me, MM, WTau
  2383. 212.16 s > [2026-08-28 19:11:08.019] @gammalooprs::model INFO : The following 34 vertex rules were removed by the restriction card:
  2384. 212.16 s > V_82 -> (c~, d, G+) | V_83 -> (t~, d, G+) | V_84 -> (c~, s, G+) | V_85 -> (t~, s, G+) | V_86 -> (u~, b, G+) | V_87 -> (c~, b, G+) | V_90 -> (c~, d, W+) | V_91 -> (t~, d, W+) | V_92 -> (u~, s, W+) | V_94 -> (t~, s, W+) | V_95 -> (u~, b, W+) | V_96 -> (c~, b, W+) | V_101 -> (e+, e-, G0) | V_102 -> (mu+, mu-, G0) | V_104 -> (e+, e-, H) | V_105 -> (mu+, mu-, H) | V_110 -> (ve~, e-, G+) | V_111 -> (vm~, mu-, G+) | V_116 -> (b~, u, G-) | V_117 -> (d~, c, G-) | V_118 -> (s~, c, G-) | V_119 -> (b~, c, G-) | V_120 -> (d~, t, G-) | V_121 -> (s~, t, G-) | V_124 -> (s~, u, W-) | V_125 -> (b~, u, W-) | V_126 -> (d~, c, W-) | V_128 -> (b~, c, W-) | V_129 -> (d~, t, W-) | V_130 -> (s~, t, W-) | V_138 -> (c~, c, G0) | V_140 -> (c~, c, H) | V_145 -> (e+, ve, G-) | V_146 -> (mu+, vm, G-)
  2385. 212.16 s > [2026-08-28 19:11:08.019] @gammalooprs::model INFO : The following 36 couplings were removed by the restriction card:
  2386. 212.16 s > GC_13, GC_14, GC_16, GC_17, GC_18, GC_19, GC_20, GC_22, GC_23, GC_24, GC_25, GC_26, GC_28, GC_29, GC_42, GC_43, GC_44, GC_46, GC_47, GC_48, GC_84, GC_85, GC_86, GC_87, GC_88, GC_89, GC_90, GC_91, GC_92, GC_93, GC_101, GC_102, GC_103, GC_105, GC_106, GC_107
  2387. 212.16 s > [2026-08-28 19:11:08.019] @gammaloop_api::se... INFO : Running command remove processes
  2388. 212.16 s > [2026-08-28 19:11:08.020] @gammaloop_api::se... INFO : Running command set global kv global.generation.uv.generate_integrated=true
  2389. 212.16 s > [2026-08-28 19:11:08.020] @gammaloop_api::se... INFO : Running command import graphs ./tests/resources/graphs/uv_tests/se1l.dot -p se1l -i se1l
  2390. 212.16 s > [2026-08-28 19:11:08.026] @commands::import INFO : Loading graphs from '/build/source/tests/resources/graphs/uv_tests/se1l.dot'
  2391. 212.16 s > [2026-08-28 19:11:08.038] @gammaloop_api::se... INFO : Running command generate existing -p se1l -i se1l
  2392. 212.16 s > [2026-08-28 19:11:11.334] @commands::generate INFO :
  2393. 212.16 s > Integrand generation summary
  2394. 212.16 s > peak RAM 90.73 MiB | cores 1
  2395. 212.16 s > ╭───────────┬───────┬─────────┬─────────────┬─────────────┬────────────────┬─────────────╮
  2396. 212.16 s > │ integrand │ graph │ # evals │ expr build │ spenso │ symbolica eval │ compile │
  2397. 212.16 s > ├───────────┼───────┼─────────┼─────────────┼─────────────┼────────────────┼─────────────┤
  2398. 212.16 s > │ se1l │ se1l │ 5 │ 3.04s (95%) │ 55ms (1.7%) │ 105ms (3.3%) │ 0ms (0.00%) │
  2399. 212.16 s > ├───────────┼───────┼─────────┼─────────────┼─────────────┼────────────────┼─────────────┤
  2400. 212.16 s > │ Total │ │ 5 │ 3.04s (95%) │ 55ms (1.7%) │ 105ms (3.3%) │ 0ms (0.00%) │
  2401. 212.16 s > ╰───────────┴───────┴─────────┴─────────────┴─────────────┴────────────────┴─────────────╯
  2402. 212.16 s > [2026-08-28 19:11:11.336] @gammaloop_api::se... INFO : Running command set process -p se1l -i se1l kv general.m_uv=0.2
  2403. 212.16 s > [2026-08-28 19:11:11.337] @gammaloop_api::se... INFO : Running command set process -p se1l -i se1l kv general.mu_r=0.2
  2404. 212.16 s > [2026-08-28 19:11:11.338] @gammaloop_api::se... INFO : Running command set process -p se1l -i se1l kv general.renormalization_localization_scale=0.2
  2405. 212.16 s > [2026-08-28 19:11:11.339] @gammaloop_api::se... INFO : Running command duplicate integrand -p se1l -i se1l --output_process_name se1l --output_integrand_name se1l_muv_shifted
  2406. 212.16 s > [2026-08-28 19:11:11.341] @gammaloop_api::se... INFO : Running command set process -p se1l -i se1l_muv_shifted kv general.m_uv=0.5
  2407. 212.16 s > [2026-08-28 19:11:11.342] @gammaloop_api::se... INFO : Running command duplicate integrand -p se1l -i se1l --output_process_name se1l --output_integrand_name se1l_rls_shifted
  2408. 212.16 s > [2026-08-28 19:11:11.348] @gammaloop_api::se... INFO : Running command set process -p se1l -i se1l_rls_shifted kv general.renormalization_localization_scale=1
  2409. 212.16 s > [2026-08-28 19:11:11.352] @gammaloop_api::se... INFO : Running command duplicate integrand -p se1l -i se1l --output_process_name se1l --output_integrand_name se1l_mur_shifted
  2410. 212.16 s > [2026-08-28 19:11:11.364] @gammaloop_api::se... INFO : Running command set process -p se1l -i se1l_mur_shifted kv general.mu_r=0.8
  2411. 212.16 s > [2026-08-28 19:11:11.408] @process::amplitude WARNING : External state 0 ('g', PDG 21, helicity +) is off shell: p^2 = +2.5e5, expected m^2 = +0e0 (|Δ| = +2.5e5). Fixed-helicity spinor/vector/tensor external states may be ill-defined at this kinematic point.
  2412. 212.16 s > field value
  2413. 212.16 s > span warm_up{integrand.name=se1l}
  2414. 212.16 s > [2026-08-28 19:11:11.408] @process::amplitude WARNING : External state 1 ('g', PDG 21, helicity -) is off shell: p^2 = +2.5e5, expected m^2 = +0e0 (|Δ| = +2.5e5). Fixed-helicity spinor/vector/tensor external states may be ill-defined at this kinematic point.
  2415. 212.16 s > field value
  2416. 212.16 s > span warm_up{integrand.name=se1l}
  2417. 212.16 s > [2026-08-28 19:11:11.413] @process::amplitude INFO : Input is above threshold: 1 existing threshold E-surfaces across 1/1 graph groups
  2418. 212.16 s > field value
  2419. 212.16 s > existing_esurfaces 1
  2420. 212.16 s > group_count 1
  2421. 212.16 s > groups_above_threshold 1
  2422. 212.16 s > integrand se1l
  2423. 212.16 s > span warm_up{integrand.name=se1l}
  2424. 212.16 s > threshold_status above threshold
  2425. 212.16 s > [2026-08-28 19:11:11.414] @process::amplitude INFO : overlap structure of group 0: [1: [0(2,3)]]
  2426. 212.16 s > field value
  2427. 212.16 s > span warm_up{integrand.name=se1l}
  2428. 212.16 s > [2026-08-28 19:11:11.973] @commands::profile INFO :
  2429. 212.16 s > ╭───────┬──────┬──────────┬───────┬─────┬──────────┬───────────╮
  2430. 212.16 s > │ fixed │ → ∞ │ slope │ r2 │ DOD │ bare DOD │ inspect │
  2431. 212.16 s > ├───────┼──────┼──────────┼───────┼─────┼──────────┼───────────┤
  2432. 212.16 s > │ {} │ {e3} │ 1.639236 │ 0.904 │ 2 │ 2 │ arb retry │
  2433. 212.16 s > │ {} │ {e2} │ 1.698834 │ 0.902 │ 2 │ 2 │ arb retry │
  2434. 212.16 s > ╰───────┴──────┴──────────┴───────┴─────┴──────────┴───────────╯
  2435. 212.16 s > [2026-08-28 19:11:11.973] @commands::profile INFO :
  2436. 212.16 s > ╭───────┬──────┬─────────────┬──────────┬───────┬─────┬──────────┬───────────╮
  2437. 212.16 s > │ fixed │ → ∞ │ orientation │ slope │ r2 │ DOD │ bare DOD │ inspect │
  2438. 212.16 s > ├───────┼──────┼─────────────┼──────────┼───────┼─────┼──────────┼───────────┤
  2439. 212.16 s > │ {} │ {e3} │ 00-+ │ 0.343429 │ 0.145 │ 0 │ 2 │ arb retry │
  2440. 212.16 s > │ {} │ {e3} │ 00+- │ 0.342577 │ 0.135 │ 0 │ 2 │ arb retry │
  2441. 212.16 s > │ {} │ {e2} │ 00-+ │ 0.385975 │ 0.161 │ 0 │ 2 │ arb retry │
  2442. 212.16 s > │ {} │ {e2} │ 00+- │ 0.384920 │ 0.192 │ 0 │ 2 │ arb retry │
  2443. 212.16 s > ╰───────┴──────┴─────────────┴──────────┴───────┴─────┴──────────┴───────────╯
  2444. 212.16 s > [2026-08-28 19:11:11.975] @gammaloop_api::se... INFO : Running command set process kv integrator.target_relative_accuracy=0.001 integrator.n_increase=0 integrator.n_start=50000 integrator.n_max=400000 integrator.seed=1337
  2445. 212.16 s > [2026-08-28 19:11:11.976] @commands::integrate INFO : Created workspace directory at /build/source/tests/artifacts/se1l/integration_workspace_se1l
  2446. 212.16 s > [2026-08-28 19:11:12.005] @commands::integrate INFO : No integration state found, starting new integration
  2447. 212.16 s > [2026-08-28 19:11:12.005] @commands::integrate INFO : Gammaloop now integrates se1l@se1l, se1l@se1l_muv_shifted, se1l@se1l_rls_shifted
  2448. 212.16 s > [2026-08-28 19:11:12.005] @process::amplitude WARNING : External state 0 ('g', PDG 21, helicity +) is off shell: p^2 = +2.5e5, expected m^2 = +0e0 (|Δ| = +2.5e5). Fixed-helicity spinor/vector/tensor external states may be ill-defined at this kinematic point.
  2449. 212.16 s > field value
  2450. 212.16 s > span warm_up{integrand.name=se1l}
  2451. 212.16 s > [2026-08-28 19:11:12.005] @process::amplitude WARNING : External state 1 ('g', PDG 21, helicity -) is off shell: p^2 = +2.5e5, expected m^2 = +0e0 (|Δ| = +2.5e5). Fixed-helicity spinor/vector/tensor external states may be ill-defined at this kinematic point.
  2452. 212.16 s > field value
  2453. 212.16 s > span warm_up{integrand.name=se1l}
  2454. 212.16 s > [2026-08-28 19:11:12.006] @process::amplitude INFO : Input is above threshold: 1 existing threshold E-surfaces across 1/1 graph groups
  2455. 212.16 s > field value
  2456. 212.16 s > existing_esurfaces 1
  2457. 212.16 s > group_count 1
  2458. 212.16 s > groups_above_threshold 1
  2459. 212.16 s > integrand se1l
  2460. 212.16 s > span warm_up{integrand.name=se1l}
  2461. 212.16 s > threshold_status above threshold
  2462. 212.16 s > [2026-08-28 19:11:12.006] @process::amplitude INFO : overlap structure of group 0: [1: [0(2,3)]]
  2463. 212.16 s > field value
  2464. 212.16 s > span warm_up{integrand.name=se1l}
  2465. 212.16 s > [2026-08-28 19:11:12.008] @process::amplitude WARNING : External state 0 ('g', PDG 21, helicity +) is off shell: p^2 = +2.5e5, expected m^2 = +0e0 (|Δ| = +2.5e5). Fixed-helicity spinor/vector/tensor external states may be ill-defined at this kinematic point.
  2466. 212.16 s > field value
  2467. 212.16 s > span warm_up{integrand.name=se1l_muv_shifted}
  2468. 212.16 s > [2026-08-28 19:11:12.008] @process::amplitude WARNING : External state 1 ('g', PDG 21, helicity -) is off shell: p^2 = +2.5e5, expected m^2 = +0e0 (|Δ| = +2.5e5). Fixed-helicity spinor/vector/tensor external states may be ill-defined at this kinematic point.
  2469. 212.16 s > field value
  2470. 212.16 s > span warm_up{integrand.name=se1l_muv_shifted}
  2471. 212.16 s > [2026-08-28 19:11:12.008] @process::amplitude INFO : Input is above threshold: 1 existing threshold E-surfaces across 1/1 graph groups
  2472. 212.16 s > field value
  2473. 212.16 s > existing_esurfaces 1
  2474. 212.16 s > group_count 1
  2475. 212.16 s > groups_above_threshold 1
  2476. 212.16 s > integrand se1l_muv_shifted
  2477. 212.16 s > span warm_up{integrand.name=se1l_muv_shifted}
  2478. 212.16 s > threshold_status above threshold
  2479. 212.16 s > [2026-08-28 19:11:12.009] @process::amplitude INFO : overlap structure of group 0: [1: [0(2,3)]]
  2480. 212.16 s > field value
  2481. 212.16 s > span warm_up{integrand.name=se1l_muv_shifted}
  2482. 212.16 s > [2026-08-28 19:11:12.011] @process::amplitude WARNING : External state 0 ('g', PDG 21, helicity +) is off shell: p^2 = +2.5e5, expected m^2 = +0e0 (|Δ| = +2.5e5). Fixed-helicity spinor/vector/tensor external states may be ill-defined at this kinematic point.
  2483. 212.16 s > field value
  2484. 212.16 s > span warm_up{integrand.name=se1l_rls_shifted}
  2485. 212.16 s > [2026-08-28 19:11:12.011] @process::amplitude WARNING : External state 1 ('g', PDG 21, helicity -) is off shell: p^2 = +2.5e5, expected m^2 = +0e0 (|Δ| = +2.5e5). Fixed-helicity spinor/vector/tensor external states may be ill-defined at this kinematic point.
  2486. 212.16 s > field value
  2487. 212.16 s > span warm_up{integrand.name=se1l_rls_shifted}
  2488. 212.16 s > [2026-08-28 19:11:12.011] @process::amplitude INFO : Input is above threshold: 1 existing threshold E-surfaces across 1/1 graph groups
  2489. 212.16 s > field value
  2490. 212.16 s > existing_esurfaces 1
  2491. 212.16 s > group_count 1
  2492. 212.16 s > groups_above_threshold 1
  2493. 212.16 s > integrand se1l_rls_shifted
  2494. 212.16 s > span warm_up{integrand.name=se1l_rls_shifted}
  2495. 212.16 s > threshold_status above threshold
  2496. 212.16 s > ... omitted 1410 more lines; see full nextest output above
  2497. 212.16 s > =========================================
  2498. 212.16 s For full logs, run:
  2499. 212.16 s nix log /nix/store/5lvckp7qh3dqs2nqf61qj4kz6kj46p4q-gammaloop-nextest-integration.drv
  2500. 212.30 s [0 built (1 failed), 0.0Run failed.