test packages.x86_64-linux.nix-ci-check-gammaloop-nextest-integration

Reproduce this run
Retry Run
  1. 202.35 s gammaloop-nextest-integration> | dod2_bubble | rls.integrated | GL0 | pass | 0.0sigma | compatible within 2sigma | - |
  2. 202.35 s gammaloop-nextest-integration> +-------------+-----------------+---------+--------+----------+-----------------------------------------------------------------------------------------------------------------------+-------+
  3. 202.35 s gammaloop-nextest-integration> | dod2_bubble | mu_r.inspect | inspect | pass | - | best inspect relative delta 6.951e-1 >= 1000*accuracy 1.000e-7 (accuracy=1.000e-10, exponent=+0.0, seed=0, probes=10) | - |
  4. 202.35 s gammaloop-nextest-integration> +-------------+-----------------+---------+--------+----------+-----------------------------------------------------------------------------------------------------------------------+-------+
  5. 202.35 s gammaloop-nextest-integration> | dod2_bubble | target | - | pass | - | 2sigma | - |
  6. 202.35 s gammaloop-nextest-integration> +-------------+-----------------+---------+--------+----------+-----------------------------------------------------------------------------------------------------------------------+-------+
  7. 202.35 s gammaloop-nextest-integration> test dod2_bubble_uv ... FAILED
  8. 202.35 s gammaloop-nextest-integration>
  9. 202.35 s gammaloop-nextest-integration> failures:
  10. 202.35 s gammaloop-nextest-integration>
  11. 202.35 s gammaloop-nextest-integration> failures:
  12. 202.35 s gammaloop-nextest-integration> dod2_bubble_uv
  13. 202.35 s gammaloop-nextest-integration>
  14. 202.35 s gammaloop-nextest-integration> test result: FAILED. 0 passed; 1 failed; 0 ignored; 0 measured; 24 filtered out; finished in 70.22s
  15. 202.35 s gammaloop-nextest-integration> system-err
  16. 202.35 s gammaloop-nextest-integration> [2026-08-28 15:45:12.005] @gammaloop_api::se... INFO : Running command run generate
  17. 202.35 s gammaloop-nextest-integration> [2026-08-28 15:45:12.005] @gammaloop_api::se... INFO : Starting command block generate
  18. 202.35 s gammaloop-nextest-integration> [2026-08-28 15:45:12.006] @gammaloop_api::se... INFO : Running command import model scalars-default.json
  19. 202.35 s gammaloop-nextest-integration> [2026-08-28 15:45:12.006] @import::model INFO : Loading built-in JSON model scalars-default
  20. 202.35 s gammaloop-nextest-integration> [2026-08-28 15:45:12.016] @gammalooprs::model INFO : The following 2 external parameters were forced to zero by the restriction card:
  21. 202.35 s gammaloop-nextest-integration> width_scalar_1, width_scalar_2
  22. 202.35 s gammaloop-nextest-integration> [2026-08-28 15:45:12.020] @gammaloop_api::se... INFO : Running command remove processes
  23. 202.35 s gammaloop-nextest-integration> [2026-08-28 15:45:12.020] @gammaloop_api::se... INFO : Running command set global kv global.generation.uv.generate_integrated=true
  24. 202.35 s gammaloop-nextest-integration> [2026-08-28 15:45:12.021] @gammaloop_api::se... INFO : Running command import graphs ./tests/resources/graphs/scalar/dod2_bubble.dot -p bubble_dod2 -i scalar_bubble_below_thres
  25. 202.35 s gammaloop-nextest-integration> [2026-08-28 15:45:12.021] @commands::import INFO : Loading graphs from '/build/source/tests/resources/graphs/scalar/dod2_bubble.dot'
  26. 202.35 s gammaloop-nextest-integration> [2026-08-28 15:45:12.032] @gammaloop_api::se... INFO : Running command generate existing -p bubble_dod2 -i scalar_bubble_below_thres
  27. 202.35 s gammaloop-nextest-integration> [2026-08-28 15:45:12.039] @approx::local_4d [{#uv, #inspect, #integrated}] DEBUG : Rescaled momenta expanded
  28. 202.35 s gammaloop-nextest-integration> field value
  29. 202.35 s gammaloop-nextest-integration> res n-terms: 1, byte size: 585,expr:
  30. 202.35 s gammaloop-nextest-integration> -SCALAR_COUPLING²·q₀(αᵉ².¹)·q₀(αᵉ³.¹)·q₂(αᵉ².¹)·q₂(αᵉ³.¹)
  31. 202.35 s gammaloop-nextest-integration> /(t²·denom(3,-q₀-q₂/t,mass_scalar_2²,-mass_scalar_2²+2·(q₀.q₂)/t+(q₂.q₂)/t²+(q₀.q₀))
  32. 202.35 s gammaloop-nextest-integration> ·denom(2,q₂/t,mass_scalar_2²,-mass_scalar_2²+(q₂.q₂)/t²))
  33. 202.35 s gammaloop-nextest-integration> [2026-08-28 15:45:12.042] @approx::local_4d [{#uv, #inspect, #integrated}] DEBUG : Rescaled momenta expanded
  34. 202.35 s gammaloop-nextest-integration> field value
  35. 202.35 s gammaloop-nextest-integration> res n-terms: 1, byte size: 3,expr:
  36. 202.35 s gammaloop-nextest-integration> 1
  37. 202.35 s gammaloop-nextest-integration> [2026-08-28 15:45:12.043] @approx::final_integrand[{#generation, #profile, #uv, #graph, #summary}] DEBUG : Computed global numerator
  38. 202.35 s gammaloop-nextest-integration> field value
  39. 202.35 s gammaloop-nextest-integration> global_num n-terms: 1, byte size: 4,expr:
  40. 202.35 s gammaloop-nextest-integration> 1/2
  41. 202.35 s gammaloop-nextest-integration> span build_3d{span_context=true graph=GL0 current=subgraph=0, topo_order=0, dod=0}
  42. 202.35 s gammaloop-nextest-integration> [2026-08-28 15:45:12.047] @uv::approx [{#generation, #uv, #fourd}] DEBUG : Computing 4D
  43. 202.35 s gammaloop-nextest-integration> field value
  44. 202.35 s gammaloop-nextest-integration> simple subgraph(S_11,S_y)*Approx(subgraph(S_y,0)) of GL0
  45. 202.35 s gammaloop-nextest-integration> span compute_4d{span_context=true graph=GL0 current=subgraph=y, topo_order=1, dod=2 given=subgraph=0, topo_order=0, dod=0 reduced=SubSet { set: BitVec<usize, bitvec::order::Lsb0> { addr: 0x7fffd8015670, head: 000000, bits: 6, capacity: 64 } [0, 0, 1, 1, 1, 1], id: PhantomData<linnet::half_edge::involution::Hedge> }}
  46. 202.35 s gammaloop-nextest-integration> [2026-08-28 15:45:12.050] @approx::local_4d [{#uv, #algebra, #integrated, #start}] DEBUG :
  47. 202.35 s gammaloop-nextest-integration> field value
  48. 202.35 s gammaloop-nextest-integration> integrand n-terms: 1, byte size: 409,expr:
  49. 202.35 s gammaloop-nextest-integration> SCALAR_COUPLING²·(q₀(αᵉ³.¹)+q₃(αᵉ³.¹))·q₀(αᵉ².¹)·q₀(αᵉ³.¹)·q₂(αᵉ².¹)
  50. 202.35 s gammaloop-nextest-integration> /(denom(2,q₂,mass_scalar_2²,-mass_scalar_2²+(q₂.q₂))·denom(3,q₃,mass_scalar_2²,-mass_scalar_2²+(q₃.q₃)))
  51. 202.35 s gammaloop-nextest-integration> reduced y
  52. 202.35 s gammaloop-nextest-integration> span grow{span_context=true current=subgraph=y, topo_order=1, dod=2 given=subgraph=0, topo_order=0, dod=0}
  53. 202.35 s gammaloop-nextest-integration> [2026-08-28 15:45:12.050] @approx::local_4d [{#uv, #inspect, #integrated}] DEBUG : Rescaled momenta expanded
  54. 202.35 s gammaloop-nextest-integration> field value
  55. 202.35 s gammaloop-nextest-integration> res n-terms: 1, byte size: 585,expr:
  56. 202.35 s gammaloop-nextest-integration> -SCALAR_COUPLING²·q₀(αᵉ².¹)·q₀(αᵉ³.¹)·q₂(αᵉ².¹)·q₂(αᵉ³.¹)
  57. 202.35 s gammaloop-nextest-integration> /(t²·denom(3,-q₀-q₂/t,mass_scalar_2²,-mass_scalar_2²+2·(q₀.q₂)/t+(q₂.q₂)/t²+(q₀.q₀))
  58. 202.35 s gammaloop-nextest-integration> ·denom(2,q₂/t,mass_scalar_2²,-mass_scalar_2²+(q₂.q₂)/t²))
  59. 202.35 s gammaloop-nextest-integration> span t{span_context=true current=subgraph=y, topo_order=1, dod=2 given=subgraph=0, topo_order=0, dod=0}
  60. 202.35 s gammaloop-nextest-integration> [2026-08-28 15:45:12.051] @approx::local_4d [{#uv, #integrated, #rescaled}] DEBUG : Rescaled expanded
  61. 202.35 s gammaloop-nextest-integration> field value
  62. 202.35 s gammaloop-nextest-integration> n_loops 1
  63. 202.35 s gammaloop-nextest-integration> res n-terms: 1, byte size: 707,expr:
  64. 202.35 s gammaloop-nextest-integration> -SCALAR_COUPLING²·q₀(αᵉ².¹)·q₀(αᵉ³.¹)·q₂(αᵉ².¹)·q₂(αᵉ³.¹)
  65. 202.35 s gammaloop-nextest-integration> /(t²·denom(3,-q₂,mUVexp²+t²·mass_scalar_2²,-mUV²+t²·(-mass_scalar_2²+2·(q₀.q₂)/t+(q₂.q₂)/t²+(q₀.q₀))+t²·mUVexp²)
  66. 202.35 s gammaloop-nextest-integration> ·denom(2,q₂,mUVexp²+t²·mass_scalar_2²,-mUV²+t²·(-mass_scalar_2²+(q₂.q₂)/t²)+t²·mUVexp²))
  67. 202.35 s gammaloop-nextest-integration> span t{span_context=true current=subgraph=y, topo_order=1, dod=2 given=subgraph=0, topo_order=0, dod=0}
  68. 202.35 s gammaloop-nextest-integration> [2026-08-28 15:45:12.052] @approx::local_4d [{#uv, #integrated, #series}] DEBUG : Series expanded
  69. 202.35 s gammaloop-nextest-integration> field value
  70. 202.35 s gammaloop-nextest-integration> res n-terms: 3, byte size: 1896,expr:
  71. 202.35 s gammaloop-nextest-integration> (1/2·SCALAR_COUPLING²·(2·mUVexp²-2·mass_scalar_2²)/(denom(2,q₂,mUVexp²,-mUV²+(q₂.q₂))²·denom(3,-q₂,mUVexp²,-mUV²+(q₂.q₂)))
  72. 202.35 s gammaloop-nextest-integration> -SCALAR_COUPLING²
  73. 202.35 s gammaloop-nextest-integration> ·(-1/2·(2·mUVexp²-2·mass_scalar_2²+2·(q₀.q₀))/denom(3,-q₂,mUVexp²,-mUV²+(q₂.q₂))
  74. 202.35 s gammaloop-nextest-integration> +4·(q₀.q₂)²/denom(3,-q₂,mUVexp²,-mUV²+(q₂.q₂))²
  75. 202.35 s gammaloop-nextest-integration> )/(denom(2,q₂,mUVexp²,-mUV²+(q₂.q₂))·denom(3,-q₂,mUVexp²,-mUV²+(q₂.q₂)))
  76. 202.35 s gammaloop-nextest-integration> )·q₀(αᵉ².¹)·q₀(αᵉ³.¹)·q₂(αᵉ².¹)·q₂(αᵉ³.¹)
  77. 202.35 s gammaloop-nextest-integration> +2·SCALAR_COUPLING²·(q₀.q₂)·q₀(αᵉ².¹)·q₀(αᵉ³.¹)·q₂(αᵉ².¹)·q₂(αᵉ³.¹)
  78. 202.35 s gammaloop-nextest-integration> /(t·denom(2,q₂,mUVexp²,-mUV²+(q₂.q₂))·denom(3,-q₂,mUVexp²,-mUV²+(q₂.q₂))²)
  79. 202.35 s gammaloop-nextest-integration> -SCALAR_COUPLING²·q₀(αᵉ².¹)·q₀(αᵉ³.¹)·q₂(αᵉ².¹)·q₂(αᵉ³.¹)
  80. 202.35 s gammaloop-nextest-integration> /(t²·denom(2,q₂,mUVexp²,-mUV²+(q₂.q₂))·denom(3,-q₂,mUVexp²,-mUV²+(q₂.q₂)))
  81. 202.35 s gammaloop-nextest-integration> span t{span_context=true current=subgraph=y, topo_order=1, dod=2 given=subgraph=0, topo_order=0, dod=0}
  82. 202.35 s gammaloop-nextest-integration> [2026-08-28 15:45:12.052] @approx::local_4d [{#uv, #integrated, #series}] DEBUG : Evaluated at t = 1
  83. 202.35 s gammaloop-nextest-integration> field value
  84. 202.35 s gammaloop-nextest-integration> res n-terms: 3, byte size: 1880,expr:
  85. 202.35 s gammaloop-nextest-integration> (1/2·SCALAR_COUPLING²·(2·mUVexp²-2·mass_scalar_2²)/(denom(2,q₂,mUVexp²,-mUV²+(q₂.q₂))²·denom(3,-q₂,mUVexp²,-mUV²+(q₂.q₂)))
  86. 202.35 s gammaloop-nextest-integration> -SCALAR_COUPLING²
  87. 202.35 s gammaloop-nextest-integration> ·(-1/2·(2·mUVexp²-2·mass_scalar_2²+2·(q₀.q₀))/denom(3,-q₂,mUVexp²,-mUV²+(q₂.q₂))
  88. 202.35 s gammaloop-nextest-integration> +4·(q₀.q₂)²/denom(3,-q₂,mUVexp²,-mUV²+(q₂.q₂))²
  89. 202.35 s gammaloop-nextest-integration> )/(denom(2,q₂,mUVexp²,-mUV²+(q₂.q₂))·denom(3,-q₂,mUVexp²,-mUV²+(q₂.q₂)))
  90. 202.35 s gammaloop-nextest-integration> )·q₀(αᵉ².¹)·q₀(αᵉ³.¹)·q₂(αᵉ².¹)·q₂(αᵉ³.¹)
  91. 202.35 s gammaloop-nextest-integration> -SCALAR_COUPLING²·q₀(αᵉ².¹)·q₀(αᵉ³.¹)·q₂(αᵉ².¹)·q₂(αᵉ³.¹)
  92. 202.35 s gammaloop-nextest-integration> /(denom(2,q₂,mUVexp²,-mUV²+(q₂.q₂))·denom(3,-q₂,mUVexp²,-mUV²+(q₂.q₂)))
  93. 202.35 s gammaloop-nextest-integration> +2·SCALAR_COUPLING²·(q₀.q₂)·q₀(αᵉ².¹)·q₀(αᵉ³.¹)·q₂(αᵉ².¹)·q₂(αᵉ³.¹)
  94. 202.35 s gammaloop-nextest-integration> /(denom(2,q₂,mUVexp²,-mUV²+(q₂.q₂))·denom(3,-q₂,mUVexp²,-mUV²+(q₂.q₂))²)
  95. 202.35 s gammaloop-nextest-integration> span t{span_context=true current=subgraph=y, topo_order=1, dod=2 given=subgraph=0, topo_order=0, dod=0}
  96. 202.35 s gammaloop-nextest-integration> [2026-08-28 15:45:12.054] @approx::local_4d [{#uv, #collect, #integrated}] DEBUG : After gamma chain collection
  97. 202.35 s gammaloop-nextest-integration> field value
  98. 202.35 s gammaloop-nextest-integration> expr n-terms: 3, byte size: 1880,expr:
  99. 202.35 s gammaloop-nextest-integration> (1/2·SCALAR_COUPLING²·(2·mUVexp²-2·mass_scalar_2²)/(denom(2,q₂,mUVexp²,-mUV²+(q₂.q₂))²·denom(3,-q₂,mUVexp²,-mUV²+(q₂.q₂)))
  100. 202.35 s gammaloop-nextest-integration> -SCALAR_COUPLING²
  101. 202.35 s gammaloop-nextest-integration> ·(-1/2·(2·mUVexp²-2·mass_scalar_2²+2·(q₀.q₀))/denom(3,-q₂,mUVexp²,-mUV²+(q₂.q₂))
  102. 202.35 s gammaloop-nextest-integration> +4·(q₀.q₂)²/denom(3,-q₂,mUVexp²,-mUV²+(q₂.q₂))²
  103. 202.35 s gammaloop-nextest-integration> )/(denom(2,q₂,mUVexp²,-mUV²+(q₂.q₂))·denom(3,-q₂,mUVexp²,-mUV²+(q₂.q₂)))
  104. 202.35 s gammaloop-nextest-integration> )·q₀(αᵉ².¹)·q₀(αᵉ³.¹)·q₂(αᵉ².¹)·q₂(αᵉ³.¹)
  105. 202.35 s gammaloop-nextest-integration> -SCALAR_COUPLING²·q₀(αᵉ².¹)·q₀(αᵉ³.¹)·q₂(αᵉ².¹)·q₂(αᵉ³.¹)
  106. 202.35 s gammaloop-nextest-integration> /(denom(2,q₂,mUVexp²,-mUV²+(q₂.q₂))·denom(3,-q₂,mUVexp²,-mUV²+(q₂.q₂)))
  107. 202.35 s gammaloop-nextest-integration> +2·SCALAR_COUPLING²·(q₀.q₂)·q₀(αᵉ².¹)·q₀(αᵉ³.¹)·q₂(αᵉ².¹)·q₂(αᵉ³.¹)
  108. 202.35 s gammaloop-nextest-integration> /(denom(2,q₂,mUVexp²,-mUV²+(q₂.q₂))·denom(3,-q₂,mUVexp²,-mUV²+(q₂.q₂))²)
  109. 202.35 s gammaloop-nextest-integration> span t{span_context=true current=subgraph=y, topo_order=1, dod=2 given=subgraph=0, topo_order=0, dod=0}
  110. 202.35 s gammaloop-nextest-integration> [2026-08-28 15:45:12.057] @approx::local_4d [{#profile, #uv, #collect, #integrated, #start, #trace}] DEBUG : After gamma schoonschip
  111. 202.35 s gammaloop-nextest-integration> field value
  112. 202.35 s gammaloop-nextest-integration> expr n-terms: 3, byte size: 1631,expr:
  113. 202.35 s gammaloop-nextest-integration> (1/2·SCALAR_COUPLING²·(2·mUVexp²-2·mass_scalar_2²)/(denom(2,q₂,mUVexp²,-mUV²+(q₂.q₂))²·denom(3,-q₂,mUVexp²,-mUV²+(q₂.q₂)))
  114. 202.35 s gammaloop-nextest-integration> -SCALAR_COUPLING²
  115. 202.35 s gammaloop-nextest-integration> ·(-1/2·(2·mUVexp²-2·mass_scalar_2²+2·(q₀.q₀))/denom(3,-q₂,mUVexp²,-mUV²+(q₂.q₂))
  116. 202.35 s gammaloop-nextest-integration> +4·(q₀.q₂)²/denom(3,-q₂,mUVexp²,-mUV²+(q₂.q₂))²
  117. 202.35 s gammaloop-nextest-integration> )/(denom(2,q₂,mUVexp²,-mUV²+(q₂.q₂))·denom(3,-q₂,mUVexp²,-mUV²+(q₂.q₂)))
  118. 202.35 s gammaloop-nextest-integration> )·(q₀.q₂)²
  119. 202.35 s gammaloop-nextest-integration> -SCALAR_COUPLING²·(q₀.q₂)²/(denom(2,q₂,mUVexp²,-mUV²+(q₂.q₂))·denom(3,-q₂,mUVexp²,-mUV²+(q₂.q₂)))
  120. 202.35 s gammaloop-nextest-integration> +2·SCALAR_COUPLING²·(q₀.q₂)·(q₀.q₂)²
  121. 202.35 s gammaloop-nextest-integration> /(denom(2,q₂,mUVexp²,-mUV²+(q₂.q₂))·denom(3,-q₂,mUVexp²,-mUV²+(q₂.q₂))²)
  122. 202.35 s gammaloop-nextest-integration> span t{span_context=true current=subgraph=y, topo_order=1, dod=2 given=subgraph=0, topo_order=0, dod=0}
  123. 202.35 s gammaloop-nextest-integration> [2026-08-28 15:45:12.059] @approx::local_4d [{#profile, #uv, #collect, #integrated, #start, #trace}] DEBUG : After gamma collection
  124. 202.35 s gammaloop-nextest-integration> field value
  125. 202.35 s gammaloop-nextest-integration> expr n-terms: 1, byte size: 1347,expr:
  126. 202.35 s gammaloop-nextest-integration> SCALAR_COUPLING²
  127. 202.35 s gammaloop-nextest-integration> ·(-denom(2,q₂,mUVexp²,-mUV²+(q₂.q₂))·denom(3,-q₂,mUVexp²,-mUV²+(q₂.q₂))²
  128. 202.35 s gammaloop-nextest-integration> +1/2·(2·mUVexp²-2·mass_scalar_2²)·denom(3,-q₂,mUVexp²,-mUV²+(q₂.q₂))²
  129. 202.35 s gammaloop-nextest-integration> -(-1/2·(2·mUVexp²-2·mass_scalar_2²+2·(q₀.q₀))·denom(3,-q₂,mUVexp²,-mUV²+(q₂.q₂))+4·(q₀.q₂)²)
  130. 202.35 s gammaloop-nextest-integration> ·denom(2,q₂,mUVexp²,-mUV²+(q₂.q₂))
  131. 202.35 s gammaloop-nextest-integration> +2·(q₀.q₂)·denom(2,q₂,mUVexp²,-mUV²+(q₂.q₂))·denom(3,-q₂,mUVexp²,-mUV²+(q₂.q₂))
  132. 202.35 s gammaloop-nextest-integration> )·(q₀.q₂)²/(denom(2,q₂,mUVexp²,-mUV²+(q₂.q₂))²·denom(3,-q₂,mUVexp²,-mUV²+(q₂.q₂))³)
  133. 202.35 s gammaloop-nextest-integration> span t{span_context=true current=subgraph=y, topo_order=1, dod=2 given=subgraph=0, topo_order=0, dod=0}
  134. 202.35 s gammaloop-nextest-integration> [2026-08-28 15:45:12.061] @approx::local_4d [{#profile, #uv, #gamma, #integrated, #start, #trace, #vakint}] DEBUG : After gamma simplification
  135. 202.35 s gammaloop-nextest-integration> ... omitted 3263 more lines; see full nextest output above
  136. 202.35 s gammaloop-nextest-integration>
  137. 202.35 s gammaloop-nextest-integration> 8. gammaloop-integration-tests::uv::sunrise_scalar_1_uv
  138. 202.40 s gammaloop-nextest-integration> failure: test failure with exit code 101
  139. 202.40 s gammaloop-nextest-integration> system-out
  140. 202.40 s gammaloop-nextest-integration> running 1 test
  141. 202.40 s gammaloop-nextest-integration> test sunrise_scalar_1_uv has been running for over 60 seconds
  142. 202.40 s gammaloop-nextest-integration> +------------------+------------------------+--------------+--------+----------+----------------------------------------------------------------------------------------------------------------------+-------+
  143. 202.40 s gammaloop-nextest-integration> | case | check | graph | status | sigma | threshold | error |
  144. 202.40 s gammaloop-nextest-integration> +------------------+------------------------+--------------+--------+----------+----------------------------------------------------------------------------------------------------------------------+-------+
  145. 202.40 s gammaloop-nextest-integration> | sunrise_scalar_1 | uv_profile | - | FAIL | - | - | - |
  146. 202.40 s gammaloop-nextest-integration> +------------------+------------------------+--------------+--------+----------+----------------------------------------------------------------------------------------------------------------------+-------+
  147. 202.40 s gammaloop-nextest-integration> | sunrise_scalar_1 | m_uv.inspect | inspect | pass | - | best inspect relative delta 1.624e0 >= 1000*accuracy 1.000e-3 (accuracy=1.000e-6, exponent=+1.0, seed=1, probes=10) | - |
  148. 202.40 s gammaloop-nextest-integration> +------------------+------------------------+--------------+--------+----------+----------------------------------------------------------------------------------------------------------------------+-------+
  149. 202.40 s gammaloop-nextest-integration> | sunrise_scalar_1 | m_uv.integrated | sunrise | pass | 0.1sigma | compatible within 2sigma | - |
  150. 202.40 s gammaloop-nextest-integration> +------------------+------------------------+--------------+--------+----------+----------------------------------------------------------------------------------------------------------------------+-------+
  151. 202.40 s gammaloop-nextest-integration> | sunrise_scalar_1 | rls.inspect | inspect | pass | - | best inspect relative delta 8.682e-1 >= 1000*accuracy 1.000e-3 (accuracy=1.000e-6, exponent=+1.0, seed=1, probes=10) | - |
  152. 202.40 s gammaloop-nextest-integration> +------------------+------------------------+--------------+--------+----------+----------------------------------------------------------------------------------------------------------------------+-------+
  153. 202.40 s gammaloop-nextest-integration> | sunrise_scalar_1 | rls.integrated | sunrise | pass | 0.0sigma | compatible within 2sigma | - |
  154. 202.40 s gammaloop-nextest-integration> +------------------+------------------------+--------------+--------+----------+----------------------------------------------------------------------------------------------------------------------+-------+
  155. 202.40 s gammaloop-nextest-integration> | sunrise_scalar_1 | mu_r.inspect | inspect | pass | - | best inspect relative delta 1.752e0 >= 1000*accuracy 1.000e-3 (accuracy=1.000e-6, exponent=+1.0, seed=1, probes=10) | - |
  156. 202.40 s gammaloop-nextest-integration> +------------------+------------------------+--------------+--------+----------+----------------------------------------------------------------------------------------------------------------------+-------+
  157. 202.40 s gammaloop-nextest-integration> | sunrise_scalar_1 | integrated.relerr | integrated | pass | - | relative error 9.20% <= 10.00% | - |
  158. 202.40 s gammaloop-nextest-integration> +------------------+------------------------+--------------+--------+----------+----------------------------------------------------------------------------------------------------------------------+-------+
  159. 202.40 s gammaloop-nextest-integration> | sunrise_scalar_1 | m_uv.integrated.relerr | m_uv-shifted | pass | - | relative error 5.89% <= 10.00% | - |
  160. 202.40 s gammaloop-nextest-integration> +------------------+------------------------+--------------+--------+----------+----------------------------------------------------------------------------------------------------------------------+-------+
  161. 202.40 s gammaloop-nextest-integration> | sunrise_scalar_1 | target | - | pass | - | 2sigma | - |
  162. 202.41 s gammaloop-nextest-integration> +------------------+------------------------+--------------+--------+----------+----------------------------------------------------------------------------------------------------------------------+-------+
  163. 202.41 s gammaloop-nextest-integration> test sunrise_scalar_1_uv ... FAILED
  164. 202.41 s gammaloop-nextest-integration>
  165. 202.41 s gammaloop-nextest-integration> failures:
  166. 202.41 s gammaloop-nextest-integration>
  167. 202.41 s gammaloop-nextest-integration> failures:
  168. 202.41 s gammaloop-nextest-integration> sunrise_scalar_1_uv
  169. 202.41 s gammaloop-nextest-integration>
  170. 202.41 s gammaloop-nextest-integration> test result: FAILED. 0 passed; 1 failed; 0 ignored; 0 measured; 24 filtered out; finished in 137.60s
  171. 202.41 s gammaloop-nextest-integration> system-err
  172. 202.41 s gammaloop-nextest-integration> [2026-08-28 15:45:21.265] @gammaloop_api::se... INFO : Running command run generate
  173. 202.41 s gammaloop-nextest-integration> [2026-08-28 15:45:21.265] @gammaloop_api::se... INFO : Starting command block generate
  174. 202.41 s gammaloop-nextest-integration> [2026-08-28 15:45:21.265] @gammaloop_api::se... INFO : Running command import model scalars-default.json
  175. 202.41 s gammaloop-nextest-integration> [2026-08-28 15:45:21.265] @import::model INFO : Loading built-in JSON model scalars-default
  176. 202.41 s gammaloop-nextest-integration> [2026-08-28 15:45:21.295] @gammalooprs::model INFO : The following 2 external parameters were forced to zero by the restriction card:
  177. 202.41 s gammaloop-nextest-integration> width_scalar_1, width_scalar_2
  178. 202.41 s gammaloop-nextest-integration> [2026-08-28 15:45:21.302] @gammaloop_api::se... INFO : Running command remove processes
  179. 202.41 s gammaloop-nextest-integration> [2026-08-28 15:45:21.306] @gammaloop_api::se... INFO : Running command set global kv global.generation.uv.generate_integrated=true
  180. 202.41 s gammaloop-nextest-integration> [2026-08-28 15:45:21.310] @gammaloop_api::se... INFO : Running command import graphs ./tests/resources/graphs/scalar_sunrise.dot -p sunrise_scalar_1 -i scalar_sunrise
  181. 202.41 s gammaloop-nextest-integration> [2026-08-28 15:45:21.310] @commands::import INFO : Loading graphs from '/build/source/tests/resources/graphs/scalar_sunrise.dot'
  182. 202.41 s gammaloop-nextest-integration> [2026-08-28 15:45:21.326] @gammaloop_api::se... INFO : Running command generate existing -p sunrise_scalar_1 -i scalar_sunrise
  183. 202.41 s gammaloop-nextest-integration> [2026-08-28 15:45:21.346] @approx::local_4d [{#uv, #inspect, #integrated}] DEBUG : Rescaled momenta expanded
  184. 202.41 s gammaloop-nextest-integration> field value
  185. 202.41 s gammaloop-nextest-integration> res n-terms: 1, byte size: 611,expr:
  186. 202.41 s gammaloop-nextest-integration> 1/(denom(1,q₁/t,mass_scalar_1²,-mass_scalar_1²+(q₁.q₁)/t²)
  187. 202.41 s gammaloop-nextest-integration> ·denom(2,-q₀+q₃-q₁/t,mass_scalar_1²,
  188. 202.41 s gammaloop-nextest-integration> -mass_scalar_1²+2·(q₀.q₁)/t-2·(q₁.q₃)/t+(q₁.q₁)/t²+(q₀.q₀)
  189. 202.41 s gammaloop-nextest-integration> -2·(q₀.q₃)+(q₃.q₃)
  190. 202.41 s gammaloop-nextest-integration> ))
  191. 202.41 s gammaloop-nextest-integration> [2026-08-28 15:45:21.348] @approx::local_4d [{#uv, #inspect, #integrated}] DEBUG : Rescaled momenta expanded
  192. 202.41 s gammaloop-nextest-integration> field value
  193. 202.41 s gammaloop-nextest-integration> res n-terms: 1, byte size: 611,expr:
  194. 202.41 s gammaloop-nextest-integration> 1/(denom(0,q₀/t,mass_scalar_1²,-mass_scalar_1²+(q₀.q₀)/t²)
  195. 202.41 s gammaloop-nextest-integration> ·denom(1,-q₂+q₃-q₀/t,mass_scalar_1²,
  196. 202.41 s gammaloop-nextest-integration> -mass_scalar_1²+2·(q₀.q₂)/t-2·(q₀.q₃)/t+(q₀.q₀)/t²+(q₂.q₂)
  197. 202.41 s gammaloop-nextest-integration> -2·(q₂.q₃)+(q₃.q₃)
  198. 202.41 s gammaloop-nextest-integration> ))
  199. 202.41 s gammaloop-nextest-integration> [2026-08-28 15:45:21.349] @approx::local_4d [{#uv, #inspect, #integrated}] DEBUG : Rescaled momenta expanded
  200. 202.41 s gammaloop-nextest-integration> field value
  201. 202.41 s gammaloop-nextest-integration> res n-terms: 1, byte size: 611,expr:
  202. 202.41 s gammaloop-nextest-integration> 1/(denom(0,q₀/t,mass_scalar_1²,-mass_scalar_1²+(q₀.q₀)/t²)
  203. 202.41 s gammaloop-nextest-integration> ·denom(2,-q₁+q₃-q₀/t,mass_scalar_1²,
  204. 202.41 s gammaloop-nextest-integration> -mass_scalar_1²+2·(q₀.q₁)/t-2·(q₀.q₃)/t+(q₀.q₀)/t²+(q₁.q₁)
  205. 202.41 s gammaloop-nextest-integration> -2·(q₁.q₃)+(q₃.q₃)
  206. 202.41 s gammaloop-nextest-integration> ))
  207. 202.41 s gammaloop-nextest-integration> [2026-08-28 15:45:21.349] @approx::local_4d [{#uv, #inspect, #integrated}] DEBUG : Rescaled momenta expanded
  208. 202.41 s gammaloop-nextest-integration> field value
  209. 202.41 s gammaloop-nextest-integration> res n-terms: 1, byte size: 3,expr:
  210. 202.41 s gammaloop-nextest-integration> 1
  211. 202.41 s gammaloop-nextest-integration> [2026-08-28 15:45:21.350] @approx::local_4d [{#uv, #inspect, #integrated}] DEBUG : Rescaled momenta expanded
  212. 202.41 s gammaloop-nextest-integration> field value
  213. 202.41 s gammaloop-nextest-integration> res n-terms: 1, byte size: 777,expr:
  214. 202.41 s gammaloop-nextest-integration> 1/(denom(0,q₀/t,mass_scalar_1²,-mass_scalar_1²+(q₀.q₀)/t²)·denom(1,q₁/t,mass_scalar_1²,-mass_scalar_1²+(q₁.q₁)/t²)
  215. 202.41 s gammaloop-nextest-integration> ·denom(2,q₄-q₀/t-q₁/t,mass_scalar_1²,
  216. 202.41 s gammaloop-nextest-integration> -mass_scalar_1²-2·(q₀.q₄)/t-2·(q₁.q₄)/t+(q₀.q₀)/t²+2·(q₀.q₁)/t²
  217. 202.41 s gammaloop-nextest-integration> +(q₁.q₁)/t²+(q₄.q₄)
  218. 202.41 s gammaloop-nextest-integration> ))
  219. 202.41 s gammaloop-nextest-integration> [2026-08-28 15:45:21.352] @approx::final_integrand[{#generation, #profile, #uv, #graph, #summary}] DEBUG : Computed global numerator
  220. 202.41 s gammaloop-nextest-integration> field value
  221. 202.41 s gammaloop-nextest-integration> global_num n-terms: 1, byte size: 3,expr:
  222. 202.41 s gammaloop-nextest-integration> 1
  223. 202.41 s gammaloop-nextest-integration> span build_3d{span_context=true graph=sunrise current=subgraph=0, topo_order=0, dod=0}
  224. 202.41 s gammaloop-nextest-integration> [2026-08-28 15:45:21.354] @uv::approx [{#generation, #uv, #fourd}] DEBUG : Computing 4D
  225. 202.41 s gammaloop-nextest-integration> field value
  226. 202.41 s gammaloop-nextest-integration> simple subgraph(S_47,S_3s)*Approx(subgraph(S_3s,0)) of sunrise
  227. 202.41 s gammaloop-nextest-integration> span compute_4d{span_context=true graph=sunrise current=subgraph=3s, topo_order=1, dod=0 given=subgraph=0, topo_order=0, dod=0 reduced=SubSet { set: BitVec<usize, bitvec::order::Lsb0> { addr: 0x7fffec00c8a0, head: 000000, bits: 8, capacity: 64 } [0, 0, 0, 0, 1, 1, 1, 1], id: PhantomData<linnet::half_edge::involution::Hedge> }}
  228. 202.41 s gammaloop-nextest-integration> [2026-08-28 15:45:21.354] @approx::local_4d [{#uv, #algebra, #integrated, #start}] DEBUG :
  229. 202.41 s gammaloop-nextest-integration> field value
  230. 202.41 s gammaloop-nextest-integration> integrand n-terms: 1, byte size: 217,expr:
  231. 202.41 s gammaloop-nextest-integration> 1/(denom(1,q₁,mass_scalar_1²,-mass_scalar_1²+(q₁.q₁))·denom(2,q₂,mass_scalar_1²,-mass_scalar_1²+(q₂.q₂)))
  232. 202.41 s gammaloop-nextest-integration> reduced 3s
  233. 202.41 s gammaloop-nextest-integration> span grow{span_context=true current=subgraph=3s, topo_order=1, dod=0 given=subgraph=0, topo_order=0, dod=0}
  234. 202.41 s gammaloop-nextest-integration> [2026-08-28 15:45:21.354] @approx::local_4d [{#uv, #inspect, #integrated}] DEBUG : Rescaled momenta expanded
  235. 202.41 s gammaloop-nextest-integration> field value
  236. 202.41 s gammaloop-nextest-integration> res n-terms: 1, byte size: 611,expr:
  237. 202.41 s gammaloop-nextest-integration> 1/(denom(1,q₁/t,mass_scalar_1²,-mass_scalar_1²+(q₁.q₁)/t²)
  238. 202.41 s gammaloop-nextest-integration> ·denom(2,-q₀+q₃-q₁/t,mass_scalar_1²,
  239. 202.41 s gammaloop-nextest-integration> -mass_scalar_1²+2·(q₀.q₁)/t-2·(q₁.q₃)/t+(q₁.q₁)/t²+(q₀.q₀)
  240. 202.41 s gammaloop-nextest-integration> -2·(q₀.q₃)+(q₃.q₃)
  241. 202.41 s gammaloop-nextest-integration> ))
  242. 202.41 s gammaloop-nextest-integration> span t{span_context=true current=subgraph=3s, topo_order=1, dod=0 given=subgraph=0, topo_order=0, dod=0}
  243. 202.41 s gammaloop-nextest-integration> [2026-08-28 15:45:21.355] @approx::local_4d [{#uv, #integrated, #rescaled}] DEBUG : Rescaled expanded
  244. 202.41 s gammaloop-nextest-integration> field value
  245. 202.41 s gammaloop-nextest-integration> n_loops 1
  246. 202.41 s gammaloop-nextest-integration> res n-terms: 1, byte size: 723,expr:
  247. 202.41 s gammaloop-nextest-integration> 1/(denom(1,q₁,mUVexp²+t²·mass_scalar_1²,-mUV²+t²·(-mass_scalar_1²+(q₁.q₁)/t²)+t²·mUVexp²)
  248. 202.41 s gammaloop-nextest-integration> ·denom(2,-q₁,mUVexp²+t²·mass_scalar_1²,
  249. 202.41 s gammaloop-nextest-integration> -mUV²
  250. 202.41 s gammaloop-nextest-integration> +t²
  251. 202.41 s gammaloop-nextest-integration> ·(-mass_scalar_1²+2·(q₀.q₁)/t-2·(q₁.q₃)/t+(q₁.q₁)/t²+(q₀.q₀)
  252. 202.41 s gammaloop-nextest-integration> -2·(q₀.q₃)+(q₃.q₃)
  253. 202.41 s gammaloop-nextest-integration> )
  254. 202.41 s gammaloop-nextest-integration> +t²·mUVexp²
  255. 202.41 s gammaloop-nextest-integration> ))
  256. 202.41 s gammaloop-nextest-integration> span t{span_context=true current=subgraph=3s, topo_order=1, dod=0 given=subgraph=0, topo_order=0, dod=0}
  257. 202.41 s gammaloop-nextest-integration> [2026-08-28 15:45:21.355] @approx::local_4d [{#uv, #integrated, #series}] DEBUG : Series expanded
  258. 202.41 s gammaloop-nextest-integration> field value
  259. 202.41 s gammaloop-nextest-integration> res n-terms: 1, byte size: 223,expr:
  260. 202.41 s gammaloop-nextest-integration> 1/(denom(1,q₁,mUVexp²,-mUV²+(q₁.q₁))·denom(2,-q₁,mUVexp²,-mUV²+(q₁.q₁)))
  261. 202.41 s gammaloop-nextest-integration> span t{span_context=true current=subgraph=3s, topo_order=1, dod=0 given=subgraph=0, topo_order=0, dod=0}
  262. 202.41 s gammaloop-nextest-integration> [2026-08-28 15:45:21.355] @approx::local_4d [{#uv, #integrated, #series}] DEBUG : Evaluated at t = 1
  263. 202.41 s gammaloop-nextest-integration> field value
  264. 202.41 s gammaloop-nextest-integration> res n-terms: 1, byte size: 223,expr:
  265. 202.41 s gammaloop-nextest-integration> 1/(denom(1,q₁,mUVexp²,-mUV²+(q₁.q₁))·denom(2,-q₁,mUVexp²,-mUV²+(q₁.q₁)))
  266. 202.41 s gammaloop-nextest-integration> span t{span_context=true current=subgraph=3s, topo_order=1, dod=0 given=subgraph=0, topo_order=0, dod=0}
  267. 202.41 s gammaloop-nextest-integration> [2026-08-28 15:45:21.355] @approx::local_4d [{#uv, #collect, #integrated}] DEBUG : After gamma chain collection
  268. 202.41 s gammaloop-nextest-integration> field value
  269. 202.41 s gammaloop-nextest-integration> expr n-terms: 1, byte size: 223,expr:
  270. 202.41 s gammaloop-nextest-integration> 1/(denom(1,q₁,mUVexp²,-mUV²+(q₁.q₁))·denom(2,-q₁,mUVexp²,-mUV²+(q₁.q₁)))
  271. 202.41 s gammaloop-nextest-integration> span t{span_context=true current=subgraph=3s, topo_order=1, dod=0 given=subgraph=0, topo_order=0, dod=0}
  272. 202.41 s gammaloop-nextest-integration> [2026-08-28 15:45:21.355] @approx::local_4d [{#profile, #uv, #collect, #integrated, #start, #trace}] DEBUG : After gamma schoonschip
  273. 202.41 s gammaloop-nextest-integration> field value
  274. 202.41 s gammaloop-nextest-integration> expr n-terms: 1, byte size: 223,expr:
  275. 202.41 s gammaloop-nextest-integration> 1/(denom(1,q₁,mUVexp²,-mUV²+(q₁.q₁))·denom(2,-q₁,mUVexp²,-mUV²+(q₁.q₁)))
  276. 202.41 s gammaloop-nextest-integration> span t{span_context=true current=subgraph=3s, topo_order=1, dod=0 given=subgraph=0, topo_order=0, dod=0}
  277. 202.41 s gammaloop-nextest-integration> [2026-08-28 15:45:21.356] @approx::local_4d [{#profile, #uv, #collect, #integrated, #start, #trace}] DEBUG : After gamma collection
  278. 202.41 s gammaloop-nextest-integration> field value
  279. 202.41 s gammaloop-nextest-integration> expr n-terms: 1, byte size: 223,expr:
  280. 202.41 s gammaloop-nextest-integration> 1/(denom(1,q₁,mUVexp²,-mUV²+(q₁.q₁))·denom(2,-q₁,mUVexp²,-mUV²+(q₁.q₁)))
  281. 202.41 s gammaloop-nextest-integration> span t{span_context=true current=subgraph=3s, topo_order=1, dod=0 given=subgraph=0, topo_order=0, dod=0}
  282. 202.41 s gammaloop-nextest-integration> [2026-08-28 15:45:21.356] @approx::local_4d [{#profile, #uv, #gamma, #integrated, #start, #trace, #vakint}] DEBUG : After gamma simplification
  283. 202.41 s gammaloop-nextest-integration> field value
  284. 202.41 s gammaloop-nextest-integration> expr n-terms: 1, byte size: 223,expr:
  285. 202.41 s gammaloop-nextest-integration> 1/(denom(1,q₁,mUVexp²,-mUV²+(q₁.q₁))·denom(2,-q₁,mUVexp²,-mUV²+(q₁.q₁)))
  286. 202.41 s gammaloop-nextest-integration> span t{span_context=true current=subgraph=3s, topo_order=1, dod=0 given=subgraph=0, topo_order=0, dod=0}
  287. 202.41 s gammaloop-nextest-integration> [2026-08-28 15:45:21.356] @approx::local_4d [{#profile, #uv, #integrated, #schoonschip, #start, #trace, #vakint}] DEBUG : After Schoonschip net
  288. 202.41 s gammaloop-nextest-integration> field value
  289. 202.41 s gammaloop-nextest-integration> expr n-terms: 1, byte size: 223,expr:
  290. 202.41 s gammaloop-nextest-integration> 1/(denom(1,q₁,mUVexp²,-mUV²+(q₁.q₁))·denom(2,-q₁,mUVexp²,-mUV²+(q₁.q₁)))
  291. 202.41 s gammaloop-nextest-integration> ... omitted 20090 more lines; see full nextest output above
  292. 202.41 s gammaloop-nextest-integration>
  293. 202.41 s gammaloop-nextest-integration> 9. gammaloop-integration-tests::uv::se1l_uv
  294. 202.41 s gammaloop-nextest-integration> failure: test failure with exit code 101
  295. 202.41 s gammaloop-nextest-integration> system-out
  296. 202.41 s gammaloop-nextest-integration> running 1 test
  297. 202.41 s gammaloop-nextest-integration> test se1l_uv has been running for over 60 seconds
  298. 202.41 s gammaloop-nextest-integration> +------+-----------------+---------+--------+----------+-----------------------------------------------------------------------------------------------------------------------+-------+
  299. 202.41 s gammaloop-nextest-integration> | case | check | graph | status | sigma | threshold | error |
  300. 202.41 s gammaloop-nextest-integration> +------+-----------------+---------+--------+----------+-----------------------------------------------------------------------------------------------------------------------+-------+
  301. 202.41 s gammaloop-nextest-integration> | se1l | uv_profile | - | FAIL | - | - | - |
  302. 202.41 s gammaloop-nextest-integration> +------+-----------------+---------+--------+----------+-----------------------------------------------------------------------------------------------------------------------+-------+
  303. 202.41 s gammaloop-nextest-integration> | se1l | m_uv.inspect | inspect | pass | - | best inspect relative delta 1.097e-1 >= 1000*accuracy 1.000e-7 (accuracy=1.000e-10, exponent=+2.0, seed=1, probes=10) | - |
  304. 202.41 s gammaloop-nextest-integration> +------+-----------------+---------+--------+----------+-----------------------------------------------------------------------------------------------------------------------+-------+
  305. 202.41 s gammaloop-nextest-integration> | se1l | m_uv.integrated | se1l | pass | 0.1sigma | compatible within 2sigma | - |
  306. 202.41 s gammaloop-nextest-integration> +------+-----------------+---------+--------+----------+-----------------------------------------------------------------------------------------------------------------------+-------+
  307. 202.41 s gammaloop-nextest-integration> | se1l | rls.inspect | inspect | pass | - | best inspect relative delta 4.499e-2 >= 1000*accuracy 1.000e-7 (accuracy=1.000e-10, exponent=+2.0, seed=1, probes=10) | - |
  308. 202.41 s gammaloop-nextest-integration> +------+-----------------+---------+--------+----------+-----------------------------------------------------------------------------------------------------------------------+-------+
  309. 202.41 s gammaloop-nextest-integration> | se1l | rls.integrated | se1l | pass | 0.0sigma | compatible within 2sigma | - |
  310. 202.41 s gammaloop-nextest-integration> +------+-----------------+---------+--------+----------+-----------------------------------------------------------------------------------------------------------------------+-------+
  311. 202.41 s gammaloop-nextest-integration> | se1l | mu_r.inspect | inspect | pass | - | best inspect relative delta 1.424e-1 >= 1000*accuracy 1.000e-7 (accuracy=1.000e-10, exponent=+2.0, seed=1, probes=10) | - |
  312. 202.41 s gammaloop-nextest-integration> +------+-----------------+---------+--------+----------+-----------------------------------------------------------------------------------------------------------------------+-------+
  313. 202.41 s gammaloop-nextest-integration> | se1l | target | - | pass | - | 2sigma | - |
  314. 202.41 s gammaloop-nextest-integration> +------+-----------------+---------+--------+----------+-----------------------------------------------------------------------------------------------------------------------+-------+
  315. 202.41 s gammaloop-nextest-integration> test se1l_uv ... FAILED
  316. 202.41 s gammaloop-nextest-integration>
  317. 202.41 s gammaloop-nextest-integration> failures:
  318. 202.41 s gammaloop-nextest-integration>
  319. 202.41 s gammaloop-nextest-integration> failures:
  320. 202.41 s gammaloop-nextest-integration> se1l_uv
  321. 202.41 s gammaloop-nextest-integration>
  322. 202.41 s gammaloop-nextest-integration> test result: FAILED. 0 passed; 1 failed; 0 ignored; 0 measured; 24 filtered out; finished in 142.86s
  323. 202.41 s gammaloop-nextest-integration> system-err
  324. 202.41 s gammaloop-nextest-integration> [2026-08-28 15:45:21.038] @gammaloop_api::se... INFO : Running command run generate
  325. 202.41 s gammaloop-nextest-integration> [2026-08-28 15:45:21.039] @gammaloop_api::se... INFO : Starting command block generate
  326. 202.41 s gammaloop-nextest-integration> [2026-08-28 15:45:21.039] @gammaloop_api::se... INFO : Running command import model sm-default
  327. 202.41 s gammaloop-nextest-integration> [2026-08-28 15:45:21.039] @import::model INFO : Loading built-in JSON model sm-default
  328. 202.41 s gammaloop-nextest-integration> [2026-08-28 15:45:21.064] @gammalooprs::model INFO : The following 11 external parameters were forced to zero by the restriction card:
  329. 202.41 s gammaloop-nextest-integration> lamWS, AWS, rhoWS, etaWS, ymc, yme, ymm, MC, Me, MM, WTau
  330. 202.41 s gammaloop-nextest-integration> [2026-08-28 15:45:21.064] @gammalooprs::model INFO : The following 34 vertex rules were removed by the restriction card:
  331. 202.41 s gammaloop-nextest-integration> V_82 -> (c~, d, G+) | V_83 -> (t~, d, G+) | V_84 -> (c~, s, G+) | V_85 -> (t~, s, G+) | V_86 -> (u~, b, G+) | V_87 -> (c~, b, G+) | V_90 -> (c~, d, W+) | V_91 -> (t~, d, W+) | V_92 -> (u~, s, W+) | V_94 -> (t~, s, W+) | V_95 -> (u~, b, W+) | V_96 -> (c~, b, W+) | V_101 -> (e+, e-, G0) | V_102 -> (mu+, mu-, G0) | V_104 -> (e+, e-, H) | V_105 -> (mu+, mu-, H) | V_110 -> (ve~, e-, G+) | V_111 -> (vm~, mu-, G+) | V_116 -> (b~, u, G-) | V_117 -> (d~, c, G-) | V_118 -> (s~, c, G-) | V_119 -> (b~, c, G-) | V_120 -> (d~, t, G-) | V_121 -> (s~, t, G-) | V_124 -> (s~, u, W-) | V_125 -> (b~, u, W-) | V_126 -> (d~, c, W-) | V_128 -> (b~, c, W-) | V_129 -> (d~, t, W-) | V_130 -> (s~, t, W-) | V_138 -> (c~, c, G0) | V_140 -> (c~, c, H) | V_145 -> (e+, ve, G-) | V_146 -> (mu+, vm, G-)
  332. 202.41 s gammaloop-nextest-integration> [2026-08-28 15:45:21.064] @gammalooprs::model INFO : The following 36 couplings were removed by the restriction card:
  333. 202.41 s gammaloop-nextest-integration> GC_13, GC_14, GC_16, GC_17, GC_18, GC_19, GC_20, GC_22, GC_23, GC_24, GC_25, GC_26, GC_28, GC_29, GC_42, GC_43, GC_44, GC_46, GC_47, GC_48, GC_84, GC_85, GC_86, GC_87, GC_88, GC_89, GC_90, GC_91, GC_92, GC_93, GC_101, GC_102, GC_103, GC_105, GC_106, GC_107
  334. 202.41 s gammaloop-nextest-integration> [2026-08-28 15:45:21.065] @gammaloop_api::se... INFO : Running command remove processes
  335. 202.41 s gammaloop-nextest-integration> [2026-08-28 15:45:21.065] @gammaloop_api::se... INFO : Running command set global kv global.generation.uv.generate_integrated=true
  336. 202.41 s gammaloop-nextest-integration> [2026-08-28 15:45:21.066] @gammaloop_api::se... INFO : Running command import graphs ./tests/resources/graphs/uv_tests/se1l.dot -p se1l -i se1l
  337. 202.41 s gammaloop-nextest-integration> [2026-08-28 15:45:21.066] @commands::import INFO : Loading graphs from '/build/source/tests/resources/graphs/uv_tests/se1l.dot'
  338. 202.41 s gammaloop-nextest-integration> [2026-08-28 15:45:21.074] @gammaloop_api::se... INFO : Running command generate existing -p se1l -i se1l
  339. 202.41 s gammaloop-nextest-integration> [2026-08-28 15:45:23.335] @commands::generate INFO :
  340. 202.41 s gammaloop-nextest-integration> Integrand generation summary
  341. 202.41 s gammaloop-nextest-integration> peak RAM 63.20 MiB | cores 1
  342. 202.41 s gammaloop-nextest-integration> ╭───────────┬───────┬─────────┬─────────────┬─────────────┬────────────────┬─────────────╮
  343. 202.41 s gammaloop-nextest-integration> │ integrand │ graph │ # evals │ expr build │ spenso │ symbolica eval │ compile │
  344. 202.41 s gammaloop-nextest-integration> ├───────────┼───────┼─────────┼─────────────┼─────────────┼────────────────┼─────────────┤
  345. 202.41 s gammaloop-nextest-integration> │ se1l │ se1l │ 5 │ 2.05s (95%) │ 41ms (1.9%) │ 56ms (2.6%) │ 0ms (0.00%) │
  346. 202.41 s gammaloop-nextest-integration> ├───────────┼───────┼─────────┼─────────────┼─────────────┼────────────────┼─────────────┤
  347. 202.41 s gammaloop-nextest-integration> │ Total │ │ 5 │ 2.05s (95%) │ 41ms (1.9%) │ 56ms (2.6%) │ 0ms (0.00%) │
  348. 202.41 s gammaloop-nextest-integration> ╰───────────┴───────┴─────────┴─────────────┴─────────────┴────────────────┴─────────────╯
  349. 202.41 s gammaloop-nextest-integration> [2026-08-28 15:45:23.338] @gammaloop_api::se... INFO : Running command set process -p se1l -i se1l kv general.m_uv=0.2
  350. 202.41 s gammaloop-nextest-integration> [2026-08-28 15:45:23.339] @gammaloop_api::se... INFO : Running command set process -p se1l -i se1l kv general.mu_r=0.2
  351. 202.41 s gammaloop-nextest-integration> [2026-08-28 15:45:23.355] @gammaloop_api::se... INFO : Running command set process -p se1l -i se1l kv general.renormalization_localization_scale=0.2
  352. 202.41 s gammaloop-nextest-integration> [2026-08-28 15:45:23.361] @gammaloop_api::se... INFO : Running command duplicate integrand -p se1l -i se1l --output_process_name se1l --output_integrand_name se1l_muv_shifted
  353. 202.41 s gammaloop-nextest-integration> [2026-08-28 15:45:23.374] @gammaloop_api::se... INFO : Running command set process -p se1l -i se1l_muv_shifted kv general.m_uv=0.5
  354. 202.41 s gammaloop-nextest-integration> [2026-08-28 15:45:23.375] @gammaloop_api::se... INFO : Running command duplicate integrand -p se1l -i se1l --output_process_name se1l --output_integrand_name se1l_rls_shifted
  355. 202.41 s gammaloop-nextest-integration> [2026-08-28 15:45:23.398] @gammaloop_api::se... INFO : Running command set process -p se1l -i se1l_rls_shifted kv general.renormalization_localization_scale=1
  356. 202.41 s gammaloop-nextest-integration> [2026-08-28 15:45:23.420] @gammaloop_api::se... INFO : Running command duplicate integrand -p se1l -i se1l --output_process_name se1l --output_integrand_name se1l_mur_shifted
  357. 202.41 s gammaloop-nextest-integration> [2026-08-28 15:45:23.437] @gammaloop_api::se... INFO : Running command set process -p se1l -i se1l_mur_shifted kv general.mu_r=0.8
  358. 202.41 s gammaloop-nextest-integration> [2026-08-28 15:45:23.487] @process::amplitude WARNING : External state 0 ('g', PDG 21, helicity +) is off shell: p^2 = +2.5e5, expected m^2 = +0e0 (|Δ| = +2.5e5). Fixed-helicity spinor/vector/tensor external states may be ill-defined at this kinematic point.
  359. 202.41 s gammaloop-nextest-integration> field value
  360. 202.41 s gammaloop-nextest-integration> span warm_up{integrand.name=se1l}
  361. 202.41 s gammaloop-nextest-integration> [2026-08-28 15:45:23.487] @process::amplitude WARNING : External state 1 ('g', PDG 21, helicity -) is off shell: p^2 = +2.5e5, expected m^2 = +0e0 (|Δ| = +2.5e5). Fixed-helicity spinor/vector/tensor external states may be ill-defined at this kinematic point.
  362. 202.41 s gammaloop-nextest-integration> field value
  363. 202.41 s gammaloop-nextest-integration> span warm_up{integrand.name=se1l}
  364. 202.41 s gammaloop-nextest-integration> [2026-08-28 15:45:23.487] @process::amplitude INFO : Input is above threshold: 1 existing threshold E-surfaces across 1/1 graph groups
  365. 202.41 s gammaloop-nextest-integration> field value
  366. 202.41 s gammaloop-nextest-integration> existing_esurfaces 1
  367. 202.41 s gammaloop-nextest-integration> group_count 1
  368. 202.41 s gammaloop-nextest-integration> groups_above_threshold 1
  369. 202.41 s gammaloop-nextest-integration> integrand se1l
  370. 202.41 s gammaloop-nextest-integration> span warm_up{integrand.name=se1l}
  371. 202.41 s gammaloop-nextest-integration> threshold_status above threshold
  372. 202.41 s gammaloop-nextest-integration> [2026-08-28 15:45:23.487] @process::amplitude INFO : overlap structure of group 0: [1: [0(2,3)]]
  373. 202.41 s gammaloop-nextest-integration> field value
  374. 202.41 s gammaloop-nextest-integration> span warm_up{integrand.name=se1l}
  375. 202.41 s gammaloop-nextest-integration> [2026-08-28 15:45:24.237] @commands::profile INFO :
  376. 202.41 s gammaloop-nextest-integration> ╭───────┬──────┬──────────┬───────┬─────┬──────────┬───────────╮
  377. 202.41 s gammaloop-nextest-integration> │ fixed │ → ∞ │ slope │ r2 │ DOD │ bare DOD │ inspect │
  378. 202.41 s gammaloop-nextest-integration> ├───────┼──────┼──────────┼───────┼─────┼──────────┼───────────┤
  379. 202.41 s gammaloop-nextest-integration> │ {} │ {e3} │ 1.639236 │ 0.904 │ 2 │ 2 │ arb retry │
  380. 202.41 s gammaloop-nextest-integration> │ {} │ {e2} │ 1.698834 │ 0.902 │ 2 │ 2 │ arb retry │
  381. 202.41 s gammaloop-nextest-integration> ╰───────┴──────┴──────────┴───────┴─────┴──────────┴───────────╯
  382. 202.41 s gammaloop-nextest-integration> [2026-08-28 15:45:24.237] @commands::profile INFO :
  383. 202.41 s gammaloop-nextest-integration> ╭───────┬──────┬─────────────┬──────────┬───────┬─────┬──────────┬───────────╮
  384. 202.41 s gammaloop-nextest-integration> │ fixed │ → ∞ │ orientation │ slope │ r2 │ DOD │ bare DOD │ inspect │
  385. 202.41 s gammaloop-nextest-integration> ├───────┼──────┼─────────────┼──────────┼───────┼─────┼──────────┼───────────┤
  386. 202.41 s gammaloop-nextest-integration> │ {} │ {e3} │ 00-+ │ 0.343429 │ 0.145 │ 0 │ 2 │ arb retry │
  387. 202.41 s gammaloop-nextest-integration> │ {} │ {e3} │ 00+- │ 0.342577 │ 0.135 │ 0 │ 2 │ arb retry │
  388. 202.41 s gammaloop-nextest-integration> │ {} │ {e2} │ 00-+ │ 0.385975 │ 0.161 │ 0 │ 2 │ arb retry │
  389. 202.41 s gammaloop-nextest-integration> │ {} │ {e2} │ 00+- │ 0.384920 │ 0.192 │ 0 │ 2 │ arb retry │
  390. 202.41 s gammaloop-nextest-integration> ╰───────┴──────┴─────────────┴──────────┴───────┴─────┴──────────┴───────────╯
  391. 202.41 s gammaloop-nextest-integration> [2026-08-28 15:45:24.238] @gammaloop_api::se... INFO : Running command set process kv integrator.target_relative_accuracy=0.001 integrator.n_increase=0 integrator.n_start=50000 integrator.n_max=400000 integrator.seed=1337
  392. 202.41 s gammaloop-nextest-integration> [2026-08-28 15:45:24.244] @commands::integrate INFO : Created workspace directory at /build/source/tests/artifacts/se1l/integration_workspace_se1l
  393. 202.41 s gammaloop-nextest-integration> [2026-08-28 15:45:24.301] @commands::integrate INFO : No integration state found, starting new integration
  394. 202.41 s gammaloop-nextest-integration> [2026-08-28 15:45:24.301] @commands::integrate INFO : Gammaloop now integrates se1l@se1l, se1l@se1l_muv_shifted, se1l@se1l_rls_shifted
  395. 202.41 s gammaloop-nextest-integration> [2026-08-28 15:45:24.301] @process::amplitude WARNING : External state 0 ('g', PDG 21, helicity +) is off shell: p^2 = +2.5e5, expected m^2 = +0e0 (|Δ| = +2.5e5). Fixed-helicity spinor/vector/tensor external states may be ill-defined at this kinematic point.
  396. 202.41 s gammaloop-nextest-integration> field value
  397. 202.41 s gammaloop-nextest-integration> span warm_up{integrand.name=se1l}
  398. 202.41 s gammaloop-nextest-integration> [2026-08-28 15:45:24.301] @process::amplitude WARNING : External state 1 ('g', PDG 21, helicity -) is off shell: p^2 = +2.5e5, expected m^2 = +0e0 (|Δ| = +2.5e5). Fixed-helicity spinor/vector/tensor external states may be ill-defined at this kinematic point.
  399. 202.41 s gammaloop-nextest-integration> field value
  400. 202.41 s gammaloop-nextest-integration> span warm_up{integrand.name=se1l}
  401. 202.41 s gammaloop-nextest-integration> [2026-08-28 15:45:24.302] @process::amplitude INFO : Input is above threshold: 1 existing threshold E-surfaces across 1/1 graph groups
  402. 202.41 s gammaloop-nextest-integration> field value
  403. 202.41 s gammaloop-nextest-integration> existing_esurfaces 1
  404. 202.41 s gammaloop-nextest-integration> group_count 1
  405. 202.41 s gammaloop-nextest-integration> groups_above_threshold 1
  406. 202.41 s gammaloop-nextest-integration> integrand se1l
  407. 202.41 s gammaloop-nextest-integration> span warm_up{integrand.name=se1l}
  408. 202.41 s gammaloop-nextest-integration> threshold_status above threshold
  409. 202.41 s gammaloop-nextest-integration> [2026-08-28 15:45:24.302] @process::amplitude INFO : overlap structure of group 0: [1: [0(2,3)]]
  410. 202.41 s gammaloop-nextest-integration> field value
  411. 202.41 s gammaloop-nextest-integration> span warm_up{integrand.name=se1l}
  412. 202.41 s gammaloop-nextest-integration> [2026-08-28 15:45:24.308] @process::amplitude WARNING : External state 0 ('g', PDG 21, helicity +) is off shell: p^2 = +2.5e5, expected m^2 = +0e0 (|Δ| = +2.5e5). Fixed-helicity spinor/vector/tensor external states may be ill-defined at this kinematic point.
  413. 202.41 s gammaloop-nextest-integration> field value
  414. 202.41 s gammaloop-nextest-integration> span warm_up{integrand.name=se1l_muv_shifted}
  415. 202.41 s gammaloop-nextest-integration> [2026-08-28 15:45:24.308] @process::amplitude WARNING : External state 1 ('g', PDG 21, helicity -) is off shell: p^2 = +2.5e5, expected m^2 = +0e0 (|Δ| = +2.5e5). Fixed-helicity spinor/vector/tensor external states may be ill-defined at this kinematic point.
  416. 202.41 s gammaloop-nextest-integration> field value
  417. 202.41 s gammaloop-nextest-integration> span warm_up{integrand.name=se1l_muv_shifted}
  418. 202.41 s gammaloop-nextest-integration> [2026-08-28 15:45:24.309] @process::amplitude INFO : Input is above threshold: 1 existing threshold E-surfaces across 1/1 graph groups
  419. 202.41 s gammaloop-nextest-integration> field value
  420. 202.41 s gammaloop-nextest-integration> existing_esurfaces 1
  421. 202.41 s gammaloop-nextest-integration> group_count 1
  422. 202.41 s gammaloop-nextest-integration> groups_above_threshold 1
  423. 202.41 s gammaloop-nextest-integration> integrand se1l_muv_shifted
  424. 202.41 s gammaloop-nextest-integration> span warm_up{integrand.name=se1l_muv_shifted}
  425. 202.41 s gammaloop-nextest-integration> threshold_status above threshold
  426. 202.42 s gammaloop-nextest-integration> [2026-08-28 15:45:24.309] @process::amplitude INFO : overlap structure of group 0: [1: [0(2,3)]]
  427. 202.42 s gammaloop-nextest-integration> field value
  428. 202.42 s gammaloop-nextest-integration> span warm_up{integrand.name=se1l_muv_shifted}
  429. 202.42 s gammaloop-nextest-integration> [2026-08-28 15:45:24.311] @process::amplitude WARNING : External state 0 ('g', PDG 21, helicity +) is off shell: p^2 = +2.5e5, expected m^2 = +0e0 (|Δ| = +2.5e5). Fixed-helicity spinor/vector/tensor external states may be ill-defined at this kinematic point.
  430. 202.42 s gammaloop-nextest-integration> field value
  431. 202.42 s gammaloop-nextest-integration> span warm_up{integrand.name=se1l_rls_shifted}
  432. 202.42 s gammaloop-nextest-integration> [2026-08-28 15:45:24.311] @process::amplitude WARNING : External state 1 ('g', PDG 21, helicity -) is off shell: p^2 = +2.5e5, expected m^2 = +0e0 (|Δ| = +2.5e5). Fixed-helicity spinor/vector/tensor external states may be ill-defined at this kinematic point.
  433. 202.42 s gammaloop-nextest-integration> field value
  434. 202.42 s gammaloop-nextest-integration> span warm_up{integrand.name=se1l_rls_shifted}
  435. 202.42 s gammaloop-nextest-integration> [2026-08-28 15:45:24.318] @process::amplitude INFO : Input is above threshold: 1 existing threshold E-surfaces across 1/1 graph groups
  436. 202.42 s gammaloop-nextest-integration> field value
  437. 202.42 s gammaloop-nextest-integration> existing_esurfaces 1
  438. 202.42 s gammaloop-nextest-integration> group_count 1
  439. 202.42 s gammaloop-nextest-integration> groups_above_threshold 1
  440. 202.42 s gammaloop-nextest-integration> integrand se1l_rls_shifted
  441. 202.42 s gammaloop-nextest-integration> span warm_up{integrand.name=se1l_rls_shifted}
  442. 202.42 s gammaloop-nextest-integration> threshold_status above threshold
  443. 202.42 s gammaloop-nextest-integration> ... omitted 1410 more lines; see full nextest output above
  444. 202.42 s gammaloop-nextest-integration> =========================================
  445. 203.01 s [0 built (1 failed), 0.0error: Cannot build '/nix/store/5lvckp7qh3dqs2nqf61qj4kz6kj46p4q-gammaloop-nextest-integration.drv'.
  446. 203.01 s Reason: builder failed with exit code 100.
  447. 203.01 s Output paths:
  448. 203.01 s /nix/store/q9ndadp0vb7l2ihf07rjiriv26fb03g2-gammaloop-nextest-integration
  449. 203.01 s Last 2048 log lines:
  450. 203.01 s > threshold_status above threshold
  451. 203.01 s > [2026-08-28 15:47:43.427] @process::amplitude INFO : overlap structure of group 0: [1: [0(2,3)]]
  452. 203.01 s > field value
  453. 203.01 s > span warm_up{integrand.name=se1l_muv_shifted}
  454. 203.01 s > [2026-08-28 15:47:43.431] @process::amplitude WARNING : External state 0 ('g', PDG 21, helicity +) is off shell: p^2 = +2.5e5, expected m^2 = +0e0 (|Δ| = +2.5e5). Fixed-helicity spinor/vector/tensor external states may be ill-defined at this kinematic point.
  455. 203.01 s > field value
  456. 203.01 s > span warm_up{integrand.name=se1l}
  457. 203.01 s > [2026-08-28 15:47:43.431] @process::amplitude WARNING : External state 1 ('g', PDG 21, helicity -) is off shell: p^2 = +2.5e5, expected m^2 = +0e0 (|Δ| = +2.5e5). Fixed-helicity spinor/vector/tensor external states may be ill-defined at this kinematic point.
  458. 203.01 s > field value
  459. 203.01 s > span warm_up{integrand.name=se1l}
  460. 203.01 s > [2026-08-28 15:47:43.432] @process::amplitude INFO : Input is above threshold: 1 existing threshold E-surfaces across 1/1 graph groups
  461. 203.01 s > field value
  462. 203.01 s > existing_esurfaces 1
  463. 203.01 s > group_count 1
  464. 203.01 s > groups_above_threshold 1
  465. 203.01 s > integrand se1l
  466. 203.01 s > span warm_up{integrand.name=se1l}
  467. 203.01 s > threshold_status above threshold
  468. 203.01 s > [2026-08-28 15:47:43.432] @process::amplitude INFO : overlap structure of group 0: [1: [0(2,3)]]
  469. 203.01 s > field value
  470. 203.01 s > span warm_up{integrand.name=se1l}
  471. 203.01 s > [2026-08-28 15:47:43.436] @process::amplitude WARNING : External state 0 ('g', PDG 21, helicity +) is off shell: p^2 = +2.5e5, expected m^2 = +0e0 (|Δ| = +2.5e5). Fixed-helicity spinor/vector/tensor external states may be ill-defined at this kinematic point.
  472. 203.01 s > field value
  473. 203.01 s > span warm_up{integrand.name=se1l_muv_shifted}
  474. 203.01 s > [2026-08-28 15:47:43.436] @process::amplitude WARNING : External state 1 ('g', PDG 21, helicity -) is off shell: p^2 = +2.5e5, expected m^2 = +0e0 (|Δ| = +2.5e5). Fixed-helicity spinor/vector/tensor external states may be ill-defined at this kinematic point.
  475. 203.01 s > field value
  476. 203.01 s > span warm_up{integrand.name=se1l_muv_shifted}
  477. 203.01 s > [2026-08-28 15:47:43.437] @process::amplitude INFO : Input is above threshold: 1 existing threshold E-surfaces across 1/1 graph groups
  478. 203.01 s > field value
  479. 203.01 s > existing_esurfaces 1
  480. 203.01 s > group_count 1
  481. 203.01 s > groups_above_threshold 1
  482. 203.01 s > integrand se1l_muv_shifted
  483. 203.01 s > span warm_up{integrand.name=se1l_muv_shifted}
  484. 203.01 s > threshold_status above threshold
  485. 203.01 s > [2026-08-28 15:47:43.437] @process::amplitude INFO : overlap structure of group 0: [1: [0(2,3)]]
  486. 203.01 s > field value
  487. 203.01 s > span warm_up{integrand.name=se1l_muv_shifted}
  488. 203.01 s > [2026-08-28 15:47:43.441] @process::amplitude WARNING : External state 0 ('g', PDG 21, helicity +) is off shell: p^2 = +2.5e5, expected m^2 = +0e0 (|Δ| = +2.5e5). Fixed-helicity spinor/vector/tensor external states may be ill-defined at this kinematic point.
  489. 203.01 s > field value
  490. 203.01 s > span warm_up{integrand.name=se1l}
  491. 203.01 s > [2026-08-28 15:47:43.441] @process::amplitude WARNING : External state 1 ('g', PDG 21, helicity -) is off shell: p^2 = +2.5e5, expected m^2 = +0e0 (|Δ| = +2.5e5). Fixed-helicity spinor/vector/tensor external states may be ill-defined at this kinematic point.
  492. 203.01 s > field value
  493. 203.01 s > span warm_up{integrand.name=se1l}
  494. 203.01 s > [2026-08-28 15:47:43.442] @process::amplitude INFO : Input is above threshold: 1 existing threshold E-surfaces across 1/1 graph groups
  495. 203.01 s > field value
  496. 203.01 s > existing_esurfaces 1
  497. 203.01 s > group_count 1
  498. 203.01 s > groups_above_threshold 1
  499. 203.01 s > integrand se1l
  500. 203.01 s > span warm_up{integrand.name=se1l}
  501. 203.01 s > threshold_status above threshold
  502. 203.01 s > [2026-08-28 15:47:43.442] @process::amplitude INFO : overlap structure of group 0: [1: [0(2,3)]]
  503. 203.01 s > field value
  504. 203.01 s > span warm_up{integrand.name=se1l}
  505. 203.01 s > [2026-08-28 15:47:43.446] @process::amplitude WARNING : External state 0 ('g', PDG 21, helicity +) is off shell: p^2 = +2.5e5, expected m^2 = +0e0 (|Δ| = +2.5e5). Fixed-helicity spinor/vector/tensor external states may be ill-defined at this kinematic point.
  506. 203.01 s > field value
  507. 203.01 s > span warm_up{integrand.name=se1l_muv_shifted}
  508. 203.01 s > [2026-08-28 15:47:43.446] @process::amplitude WARNING : External state 1 ('g', PDG 21, helicity -) is off shell: p^2 = +2.5e5, expected m^2 = +0e0 (|Δ| = +2.5e5). Fixed-helicity spinor/vector/tensor external states may be ill-defined at this kinematic point.
  509. 203.01 s > field value
  510. 203.01 s > span warm_up{integrand.name=se1l_muv_shifted}
  511. 203.01 s > [2026-08-28 15:47:43.446] @process::amplitude INFO : Input is above threshold: 1 existing threshold E-surfaces across 1/1 graph groups
  512. 203.01 s > field value
  513. 203.01 s > existing_esurfaces 1
  514. 203.01 s > group_count 1
  515. 203.01 s > groups_above_threshold 1
  516. 203.01 s > integrand se1l_muv_shifted
  517. 203.01 s > span warm_up{integrand.name=se1l_muv_shifted}
  518. 203.01 s > threshold_status above threshold
  519. 203.01 s > [2026-08-28 15:47:43.447] @process::amplitude INFO : overlap structure of group 0: [1: [0(2,3)]]
  520. 203.01 s > field value
  521. 203.01 s > span warm_up{integrand.name=se1l_muv_shifted}
  522. 203.01 s > [2026-08-28 15:47:43.451] @process::amplitude WARNING : External state 0 ('g', PDG 21, helicity +) is off shell: p^2 = +2.5e5, expected m^2 = +0e0 (|Δ| = +2.5e5). Fixed-helicity spinor/vector/tensor external states may be ill-defined at this kinematic point.
  523. 203.01 s > field value
  524. 203.01 s > span warm_up{integrand.name=se1l}
  525. 203.01 s > [2026-08-28 15:47:43.451] @process::amplitude WARNING : External state 1 ('g', PDG 21, helicity -) is off shell: p^2 = +2.5e5, expected m^2 = +0e0 (|Δ| = +2.5e5). Fixed-helicity spinor/vector/tensor external states may be ill-defined at this kinematic point.
  526. 203.01 s > field value
  527. 203.01 s > span warm_up{integrand.name=se1l}
  528. 203.01 s > [2026-08-28 15:47:43.451] @process::amplitude INFO : Input is above threshold: 1 existing threshold E-surfaces across 1/1 graph groups
  529. 203.01 s > field value
  530. 203.01 s > existing_esurfaces 1
  531. 203.01 s > group_count 1
  532. 203.01 s > groups_above_threshold 1
  533. 203.01 s > integrand se1l
  534. 203.01 s > span warm_up{integrand.name=se1l}
  535. 203.01 s > threshold_status above threshold
  536. 203.01 s > [2026-08-28 15:47:43.451] @process::amplitude INFO : overlap structure of group 0: [1: [0(2,3)]]
  537. 203.01 s > field value
  538. 203.01 s > span warm_up{integrand.name=se1l}
  539. 203.01 s > [2026-08-28 15:47:43.456] @process::amplitude WARNING : External state 0 ('g', PDG 21, helicity +) is off shell: p^2 = +2.5e5, expected m^2 = +0e0 (|Δ| = +2.5e5). Fixed-helicity spinor/vector/tensor external states may be ill-defined at this kinematic point.
  540. 203.01 s > field value
  541. 203.01 s > span warm_up{integrand.name=se1l_muv_shifted}
  542. 203.01 s > [2026-08-28 15:47:43.456] @process::amplitude WARNING : External state 1 ('g', PDG 21, helicity -) is off shell: p^2 = +2.5e5, expected m^2 = +0e0 (|Δ| = +2.5e5). Fixed-helicity spinor/vector/tensor external states may be ill-defined at this kinematic point.
  543. 203.01 s > field value
  544. 203.01 s > span warm_up{integrand.name=se1l_muv_shifted}
  545. 203.01 s > [2026-08-28 15:47:43.456] @process::amplitude INFO : Input is above threshold: 1 existing threshold E-surfaces across 1/1 graph groups
  546. 203.01 s > field value
  547. 203.01 s > existing_esurfaces 1
  548. 203.01 s > group_count 1
  549. 203.01 s > groups_above_threshold 1
  550. 203.01 s > integrand se1l_muv_shifted
  551. 203.01 s > span warm_up{integrand.name=se1l_muv_shifted}
  552. 203.01 s > threshold_status above threshold
  553. 203.01 s > [2026-08-28 15:47:43.456] @process::amplitude INFO : overlap structure of group 0: [1: [0(2,3)]]
  554. 203.01 s > field value
  555. 203.01 s > span warm_up{integrand.name=se1l_muv_shifted}
  556. 203.01 s > [2026-08-28 15:47:43.461] @process::amplitude WARNING : External state 0 ('g', PDG 21, helicity +) is off shell: p^2 = +2.5e5, expected m^2 = +0e0 (|Δ| = +2.5e5). Fixed-helicity spinor/vector/tensor external states may be ill-defined at this kinematic point.
  557. 203.01 s > field value
  558. 203.01 s > span warm_up{integrand.name=se1l}
  559. 203.01 s > [2026-08-28 15:47:43.461] @process::amplitude WARNING : External state 1 ('g', PDG 21, helicity -) is off shell: p^2 = +2.5e5, expected m^2 = +0e0 (|Δ| = +2.5e5). Fixed-helicity spinor/vector/tensor external states may be ill-defined at this kinematic point.
  560. 203.01 s > field value
  561. 203.01 s > span warm_up{integrand.name=se1l}
  562. 203.01 s > [2026-08-28 15:47:43.461] @process::amplitude INFO : Input is above threshold: 1 existing threshold E-surfaces across 1/1 graph groups
  563. 203.01 s > field value
  564. 203.01 s > existing_esurfaces 1
  565. 203.01 s > group_count 1
  566. 203.01 s > groups_above_threshold 1
  567. 203.01 s > integrand se1l
  568. 203.01 s > span warm_up{integrand.name=se1l}
  569. 203.01 s > threshold_status above threshold
  570. 203.01 s > [2026-08-28 15:47:43.461] @process::amplitude INFO : overlap structure of group 0: [1: [0(2,3)]]
  571. 203.01 s > field value
  572. 203.01 s > span warm_up{integrand.name=se1l}
  573. 203.01 s > [2026-08-28 15:47:43.466] @process::amplitude WARNING : External state 0 ('g', PDG 21, helicity +) is off shell: p^2 = +2.5e5, expected m^2 = +0e0 (|Δ| = +2.5e5). Fixed-helicity spinor/vector/tensor external states may be ill-defined at this kinematic point.
  574. 203.01 s > field value
  575. 203.01 s > span warm_up{integrand.name=se1l_rls_shifted}
  576. 203.01 s > [2026-08-28 15:47:43.466] @process::amplitude WARNING : External state 1 ('g', PDG 21, helicity -) is off shell: p^2 = +2.5e5, expected m^2 = +0e0 (|Δ| = +2.5e5). Fixed-helicity spinor/vector/tensor external states may be ill-defined at this kinematic point.
  577. 203.01 s > field value
  578. 203.01 s > span warm_up{integrand.name=se1l_rls_shifted}
  579. 203.01 s > [2026-08-28 15:47:43.466] @process::amplitude INFO : Input is above threshold: 1 existing threshold E-surfaces across 1/1 graph groups
  580. 203.01 s > field value
  581. 203.01 s > existing_esurfaces 1
  582. 203.01 s > group_count 1
  583. 203.01 s > groups_above_threshold 1
  584. 203.01 s > integrand se1l_rls_shifted
  585. 203.01 s > span warm_up{integrand.name=se1l_rls_shifted}
  586. 203.01 s > threshold_status above threshold
  587. 203.01 s > [2026-08-28 15:47:43.466] @process::amplitude INFO : overlap structure of group 0: [1: [0(2,3)]]
  588. 203.01 s > field value
  589. 203.01 s > span warm_up{integrand.name=se1l_rls_shifted}
  590. 203.01 s > [2026-08-28 15:47:43.470] @process::amplitude WARNING : External state 0 ('g', PDG 21, helicity +) is off shell: p^2 = +2.5e5, expected m^2 = +0e0 (|Δ| = +2.5e5). Fixed-helicity spinor/vector/tensor external states may be ill-defined at this kinematic point.
  591. 203.01 s > field value
  592. 203.01 s > span warm_up{integrand.name=se1l}
  593. 203.01 s > [2026-08-28 15:47:43.471] @process::amplitude WARNING : External state 1 ('g', PDG 21, helicity -) is off shell: p^2 = +2.5e5, expected m^2 = +0e0 (|Δ| = +2.5e5). Fixed-helicity spinor/vector/tensor external states may be ill-defined at this kinematic point.
  594. 203.01 s > field value
  595. 203.01 s > span warm_up{integrand.name=se1l}
  596. 203.01 s > [2026-08-28 15:47:43.471] @process::amplitude INFO : Input is above threshold: 1 existing threshold E-surfaces across 1/1 graph groups
  597. 203.01 s > field value
  598. 203.01 s > existing_esurfaces 1
  599. 203.01 s > group_count 1
  600. 203.01 s > groups_above_threshold 1
  601. 203.01 s > integrand se1l
  602. 203.01 s > span warm_up{integrand.name=se1l}
  603. 203.01 s > threshold_status above threshold
  604. 203.01 s > [2026-08-28 15:47:43.471] @process::amplitude INFO : overlap structure of group 0: [1: [0(2,3)]]
  605. 203.01 s > field value
  606. 203.01 s > span warm_up{integrand.name=se1l}
  607. 203.01 s > [2026-08-28 15:47:43.475] @process::amplitude WARNING : External state 0 ('g', PDG 21, helicity +) is off shell: p^2 = +2.5e5, expected m^2 = +0e0 (|Δ| = +2.5e5). Fixed-helicity spinor/vector/tensor external states may be ill-defined at this kinematic point.
  608. 203.01 s > field value
  609. 203.01 s > span warm_up{integrand.name=se1l_rls_shifted}
  610. 203.01 s > [2026-08-28 15:47:43.475] @process::amplitude WARNING : External state 1 ('g', PDG 21, helicity -) is off shell: p^2 = +2.5e5, expected m^2 = +0e0 (|Δ| = +2.5e5). Fixed-helicity spinor/vector/tensor external states may be ill-defined at this kinematic point.
  611. 203.01 s > field value
  612. 203.01 s > span warm_up{integrand.name=se1l_rls_shifted}
  613. 203.01 s > [2026-08-28 15:47:43.476] @process::amplitude INFO : Input is above threshold: 1 existing threshold E-surfaces across 1/1 graph groups
  614. 203.01 s > field value
  615. 203.01 s > existing_esurfaces 1
  616. 203.01 s > group_count 1
  617. 203.01 s > groups_above_threshold 1
  618. 203.01 s > integrand se1l_rls_shifted
  619. 203.01 s > span warm_up{integrand.name=se1l_rls_shifted}
  620. 203.01 s > threshold_status above threshold
  621. 203.01 s > [2026-08-28 15:47:43.476] @process::amplitude INFO : overlap structure of group 0: [1: [0(2,3)]]
  622. 203.01 s > field value
  623. 203.01 s > span warm_up{integrand.name=se1l_rls_shifted}
  624. 203.01 s > [2026-08-28 15:47:43.480] @process::amplitude WARNING : External state 0 ('g', PDG 21, helicity +) is off shell: p^2 = +2.5e5, expected m^2 = +0e0 (|Δ| = +2.5e5). Fixed-helicity spinor/vector/tensor external states may be ill-defined at this kinematic point.
  625. 203.01 s > field value
  626. 203.01 s > span warm_up{integrand.name=se1l}
  627. 203.01 s > [2026-08-28 15:47:43.480] @process::amplitude WARNING : External state 1 ('g', PDG 21, helicity -) is off shell: p^2 = +2.5e5, expected m^2 = +0e0 (|Δ| = +2.5e5). Fixed-helicity spinor/vector/tensor external states may be ill-defined at this kinematic point.
  628. 203.01 s > field value
  629. 203.01 s > span warm_up{integrand.name=se1l}
  630. 203.01 s > [2026-08-28 15:47:43.480] @process::amplitude INFO : Input is above threshold: 1 existing threshold E-surfaces across 1/1 graph groups
  631. 203.01 s > field value
  632. 203.01 s > existing_esurfaces 1
  633. 203.01 s > group_count 1
  634. 203.01 s > groups_above_threshold 1
  635. 203.01 s > integrand se1l
  636. 203.01 s > span warm_up{integrand.name=se1l}
  637. 203.01 s > threshold_status above threshold
  638. 203.01 s > [2026-08-28 15:47:43.481] @process::amplitude INFO : overlap structure of group 0: [1: [0(2,3)]]
  639. 203.01 s > field value
  640. 203.01 s > span warm_up{integrand.name=se1l}
  641. 203.01 s > [2026-08-28 15:47:43.485] @process::amplitude WARNING : External state 0 ('g', PDG 21, helicity +) is off shell: p^2 = +2.5e5, expected m^2 = +0e0 (|Δ| = +2.5e5). Fixed-helicity spinor/vector/tensor external states may be ill-defined at this kinematic point.
  642. 203.01 s > field value
  643. 203.01 s > span warm_up{integrand.name=se1l_rls_shifted}
  644. 203.01 s > [2026-08-28 15:47:43.485] @process::amplitude WARNING : External state 1 ('g', PDG 21, helicity -) is off shell: p^2 = +2.5e5, expected m^2 = +0e0 (|Δ| = +2.5e5). Fixed-helicity spinor/vector/tensor external states may be ill-defined at this kinematic point.
  645. 203.01 s > field value
  646. 203.01 s > span warm_up{integrand.name=se1l_rls_shifted}
  647. 203.01 s > [2026-08-28 15:47:43.485] @process::amplitude INFO : Input is above threshold: 1 existing threshold E-surfaces across 1/1 graph groups
  648. 203.01 s > field value
  649. 203.01 s > existing_esurfaces 1
  650. 203.01 s > group_count 1
  651. 203.01 s > groups_above_threshold 1
  652. 203.01 s > integrand se1l_rls_shifted
  653. 203.01 s > span warm_up{integrand.name=se1l_rls_shifted}
  654. 203.01 s > threshold_status above threshold
  655. 203.01 s > [2026-08-28 15:47:43.485] @process::amplitude INFO : overlap structure of group 0: [1: [0(2,3)]]
  656. 203.01 s > field value
  657. 203.01 s > span warm_up{integrand.name=se1l_rls_shifted}
  658. 203.01 s > [2026-08-28 15:47:43.490] @process::amplitude WARNING : External state 0 ('g', PDG 21, helicity +) is off shell: p^2 = +2.5e5, expected m^2 = +0e0 (|Δ| = +2.5e5). Fixed-helicity spinor/vector/tensor external states may be ill-defined at this kinematic point.
  659. 203.01 s > field value
  660. 203.01 s > span warm_up{integrand.name=se1l}
  661. 203.01 s > [2026-08-28 15:47:43.490] @process::amplitude WARNING : External state 1 ('g', PDG 21, helicity -) is off shell: p^2 = +2.5e5, expected m^2 = +0e0 (|Δ| = +2.5e5). Fixed-helicity spinor/vector/tensor external states may be ill-defined at this kinematic point.
  662. 203.01 s > field value
  663. 203.01 s > span warm_up{integrand.name=se1l}
  664. 203.01 s > [2026-08-28 15:47:43.490] @process::amplitude INFO : Input is above threshold: 1 existing threshold E-surfaces across 1/1 graph groups
  665. 203.01 s > field value
  666. 203.01 s > existing_esurfaces 1
  667. 203.01 s > group_count 1
  668. 203.01 s > groups_above_threshold 1
  669. 203.01 s > integrand se1l
  670. 203.01 s > span warm_up{integrand.name=se1l}
  671. 203.01 s > threshold_status above threshold
  672. 203.01 s > [2026-08-28 15:47:43.490] @process::amplitude INFO : overlap structure of group 0: [1: [0(2,3)]]
  673. 203.01 s > field value
  674. 203.01 s > span warm_up{integrand.name=se1l}
  675. 203.01 s > [2026-08-28 15:47:43.495] @process::amplitude WARNING : External state 0 ('g', PDG 21, helicity +) is off shell: p^2 = +2.5e5, expected m^2 = +0e0 (|Δ| = +2.5e5). Fixed-helicity spinor/vector/tensor external states may be ill-defined at this kinematic point.
  676. 203.01 s > field value
  677. 203.01 s > span warm_up{integrand.name=se1l_rls_shifted}
  678. 203.01 s > [2026-08-28 15:47:43.495] @process::amplitude WARNING : External state 1 ('g', PDG 21, helicity -) is off shell: p^2 = +2.5e5, expected m^2 = +0e0 (|Δ| = +2.5e5). Fixed-helicity spinor/vector/tensor external states may be ill-defined at this kinematic point.
  679. 203.01 s > field value
  680. 203.01 s > span warm_up{integrand.name=se1l_rls_shifted}
  681. 203.01 s > [2026-08-28 15:47:43.495] @process::amplitude INFO : Input is above threshold: 1 existing threshold E-surfaces across 1/1 graph groups
  682. 203.01 s > field value
  683. 203.01 s > existing_esurfaces 1
  684. 203.01 s > group_count 1
  685. 203.01 s > groups_above_threshold 1
  686. 203.01 s > integrand se1l_rls_shifted
  687. 203.01 s > span warm_up{integrand.name=se1l_rls_shifted}
  688. 203.01 s > threshold_status above threshold
  689. 203.01 s > [2026-08-28 15:47:43.495] @process::amplitude INFO : overlap structure of group 0: [1: [0(2,3)]]
  690. 203.01 s > field value
  691. 203.01 s > span warm_up{integrand.name=se1l_rls_shifted}
  692. 203.01 s > [2026-08-28 15:47:43.500] @process::amplitude WARNING : External state 0 ('g', PDG 21, helicity +) is off shell: p^2 = +2.5e5, expected m^2 = +0e0 (|Δ| = +2.5e5). Fixed-helicity spinor/vector/tensor external states may be ill-defined at this kinematic point.
  693. 203.01 s > field value
  694. 203.01 s > span warm_up{integrand.name=se1l}
  695. 203.01 s > [2026-08-28 15:47:43.500] @process::amplitude WARNING : External state 1 ('g', PDG 21, helicity -) is off shell: p^2 = +2.5e5, expected m^2 = +0e0 (|Δ| = +2.5e5). Fixed-helicity spinor/vector/tensor external states may be ill-defined at this kinematic point.
  696. 203.01 s > field value
  697. 203.01 s > span warm_up{integrand.name=se1l}
  698. 203.01 s > [2026-08-28 15:47:43.500] @process::amplitude INFO : Input is above threshold: 1 existing threshold E-surfaces across 1/1 graph groups
  699. 203.01 s > field value
  700. 203.01 s > existing_esurfaces 1
  701. 203.01 s > group_count 1
  702. 203.01 s > groups_above_threshold 1
  703. 203.01 s > integrand se1l
  704. 203.01 s > span warm_up{integrand.name=se1l}
  705. 203.01 s > threshold_status above threshold
  706. 203.01 s > [2026-08-28 15:47:43.500] @process::amplitude INFO : overlap structure of group 0: [1: [0(2,3)]]
  707. 203.01 s > field value
  708. 203.01 s > span warm_up{integrand.name=se1l}
  709. 203.01 s > [2026-08-28 15:47:43.505] @process::amplitude WARNING : External state 0 ('g', PDG 21, helicity +) is off shell: p^2 = +2.5e5, expected m^2 = +0e0 (|Δ| = +2.5e5). Fixed-helicity spinor/vector/tensor external states may be ill-defined at this kinematic point.
  710. 203.01 s > field value
  711. 203.01 s > span warm_up{integrand.name=se1l_rls_shifted}
  712. 203.01 s > [2026-08-28 15:47:43.505] @process::amplitude WARNING : External state 1 ('g', PDG 21, helicity -) is off shell: p^2 = +2.5e5, expected m^2 = +0e0 (|Δ| = +2.5e5). Fixed-helicity spinor/vector/tensor external states may be ill-defined at this kinematic point.
  713. 203.01 s > field value
  714. 203.01 s > span warm_up{integrand.name=se1l_rls_shifted}
  715. 203.01 s > [2026-08-28 15:47:43.505] @process::amplitude INFO : Input is above threshold: 1 existing threshold E-surfaces across 1/1 graph groups
  716. 203.01 s > field value
  717. 203.01 s > existing_esurfaces 1
  718. 203.01 s > group_count 1
  719. 203.01 s > groups_above_threshold 1
  720. 203.01 s > integrand se1l_rls_shifted
  721. 203.01 s > span warm_up{integrand.name=se1l_rls_shifted}
  722. 203.01 s > threshold_status above threshold
  723. 203.01 s > [2026-08-28 15:47:43.505] @process::amplitude INFO : overlap structure of group 0: [1: [0(2,3)]]
  724. 203.01 s > field value
  725. 203.01 s > span warm_up{integrand.name=se1l_rls_shifted}
  726. 203.01 s > [2026-08-28 15:47:43.509] @process::amplitude WARNING : External state 0 ('g', PDG 21, helicity +) is off shell: p^2 = +2.5e5, expected m^2 = +0e0 (|Δ| = +2.5e5). Fixed-helicity spinor/vector/tensor external states may be ill-defined at this kinematic point.
  727. 203.01 s > field value
  728. 203.01 s > span warm_up{integrand.name=se1l}
  729. 203.01 s > [2026-08-28 15:47:43.510] @process::amplitude WARNING : External state 1 ('g', PDG 21, helicity -) is off shell: p^2 = +2.5e5, expected m^2 = +0e0 (|Δ| = +2.5e5). Fixed-helicity spinor/vector/tensor external states may be ill-defined at this kinematic point.
  730. 203.01 s > field value
  731. 203.01 s > span warm_up{integrand.name=se1l}
  732. 203.01 s > [2026-08-28 15:47:43.510] @process::amplitude INFO : Input is above threshold: 1 existing threshold E-surfaces across 1/1 graph groups
  733. 203.01 s > field value
  734. 203.01 s > existing_esurfaces 1
  735. 203.01 s > group_count 1
  736. 203.01 s > groups_above_threshold 1
  737. 203.01 s > integrand se1l
  738. 203.01 s > span warm_up{integrand.name=se1l}
  739. 203.01 s > threshold_status above threshold
  740. 203.01 s > [2026-08-28 15:47:43.510] @process::amplitude INFO : overlap structure of group 0: [1: [0(2,3)]]
  741. 203.01 s > field value
  742. 203.01 s > span warm_up{integrand.name=se1l}
  743. 203.01 s > [2026-08-28 15:47:43.515] @process::amplitude WARNING : External state 0 ('g', PDG 21, helicity +) is off shell: p^2 = +2.5e5, expected m^2 = +0e0 (|Δ| = +2.5e5). Fixed-helicity spinor/vector/tensor external states may be ill-defined at this kinematic point.
  744. 203.01 s > field value
  745. 203.01 s > span warm_up{integrand.name=se1l_rls_shifted}
  746. 203.01 s > [2026-08-28 15:47:43.515] @process::amplitude WARNING : External state 1 ('g', PDG 21, helicity -) is off shell: p^2 = +2.5e5, expected m^2 = +0e0 (|Δ| = +2.5e5). Fixed-helicity spinor/vector/tensor external states may be ill-defined at this kinematic point.
  747. 203.01 s > field value
  748. 203.01 s > span warm_up{integrand.name=se1l_rls_shifted}
  749. 203.01 s > [2026-08-28 15:47:43.515] @process::amplitude INFO : Input is above threshold: 1 existing threshold E-surfaces across 1/1 graph groups
  750. 203.01 s > field value
  751. 203.01 s > existing_esurfaces 1
  752. 203.01 s > group_count 1
  753. 203.01 s > groups_above_threshold 1
  754. 203.01 s > integrand se1l_rls_shifted
  755. 203.01 s > span warm_up{integrand.name=se1l_rls_shifted}
  756. 203.01 s > threshold_status above threshold
  757. 203.01 s > [2026-08-28 15:47:43.515] @process::amplitude INFO : overlap structure of group 0: [1: [0(2,3)]]
  758. 203.01 s > field value
  759. 203.01 s > span warm_up{integrand.name=se1l_rls_shifted}
  760. 203.01 s > [2026-08-28 15:47:43.519] @process::amplitude WARNING : External state 0 ('g', PDG 21, helicity +) is off shell: p^2 = +2.5e5, expected m^2 = +0e0 (|Δ| = +2.5e5). Fixed-helicity spinor/vector/tensor external states may be ill-defined at this kinematic point.
  761. 203.01 s > field value
  762. 203.01 s > span warm_up{integrand.name=se1l}
  763. 203.01 s > [2026-08-28 15:47:43.520] @process::amplitude WARNING : External state 1 ('g', PDG 21, helicity -) is off shell: p^2 = +2.5e5, expected m^2 = +0e0 (|Δ| = +2.5e5). Fixed-helicity spinor/vector/tensor external states may be ill-defined at this kinematic point.
  764. 203.01 s > field value
  765. 203.01 s > span warm_up{integrand.name=se1l}
  766. 203.01 s > [2026-08-28 15:47:43.520] @process::amplitude INFO : Input is above threshold: 1 existing threshold E-surfaces across 1/1 graph groups
  767. 203.01 s > field value
  768. 203.01 s > existing_esurfaces 1
  769. 203.01 s > group_count 1
  770. 203.01 s > groups_above_threshold 1
  771. 203.01 s > integrand se1l
  772. 203.01 s > span warm_up{integrand.name=se1l}
  773. 203.01 s > threshold_status above threshold
  774. 203.01 s > [2026-08-28 15:47:43.520] @process::amplitude INFO : overlap structure of group 0: [1: [0(2,3)]]
  775. 203.01 s > field value
  776. 203.01 s > span warm_up{integrand.name=se1l}
  777. 203.01 s > [2026-08-28 15:47:43.525] @process::amplitude WARNING : External state 0 ('g', PDG 21, helicity +) is off shell: p^2 = +2.5e5, expected m^2 = +0e0 (|Δ| = +2.5e5). Fixed-helicity spinor/vector/tensor external states may be ill-defined at this kinematic point.
  778. 203.01 s > field value
  779. 203.01 s > span warm_up{integrand.name=se1l_rls_shifted}
  780. 203.01 s > [2026-08-28 15:47:43.525] @process::amplitude WARNING : External state 1 ('g', PDG 21, helicity -) is off shell: p^2 = +2.5e5, expected m^2 = +0e0 (|Δ| = +2.5e5). Fixed-helicity spinor/vector/tensor external states may be ill-defined at this kinematic point.
  781. 203.01 s > field value
  782. 203.01 s > span warm_up{integrand.name=se1l_rls_shifted}
  783. 203.01 s > [2026-08-28 15:47:43.525] @process::amplitude INFO : Input is above threshold: 1 existing threshold E-surfaces across 1/1 graph groups
  784. 203.01 s > field value
  785. 203.01 s > existing_esurfaces 1
  786. 203.01 s > group_count 1
  787. 203.01 s > groups_above_threshold 1
  788. 203.01 s > integrand se1l_rls_shifted
  789. 203.01 s > span warm_up{integrand.name=se1l_rls_shifted}
  790. 203.01 s > threshold_status above threshold
  791. 203.01 s > [2026-08-28 15:47:43.525] @process::amplitude INFO : overlap structure of group 0: [1: [0(2,3)]]
  792. 203.01 s > field value
  793. 203.01 s > span warm_up{integrand.name=se1l_rls_shifted}
  794. 203.01 s > [2026-08-28 15:47:43.530] @process::amplitude WARNING : External state 0 ('g', PDG 21, helicity +) is off shell: p^2 = +2.5e5, expected m^2 = +0e0 (|Δ| = +2.5e5). Fixed-helicity spinor/vector/tensor external states may be ill-defined at this kinematic point.
  795. 203.01 s > field value
  796. 203.01 s > span warm_up{integrand.name=se1l}
  797. 203.01 s > [2026-08-28 15:47:43.530] @process::amplitude WARNING : External state 1 ('g', PDG 21, helicity -) is off shell: p^2 = +2.5e5, expected m^2 = +0e0 (|Δ| = +2.5e5). Fixed-helicity spinor/vector/tensor external states may be ill-defined at this kinematic point.
  798. 203.01 s > field value
  799. 203.01 s > span warm_up{integrand.name=se1l}
  800. 203.01 s > [2026-08-28 15:47:43.530] @process::amplitude INFO : Input is above threshold: 1 existing threshold E-surfaces across 1/1 graph groups
  801. 203.01 s > field value
  802. 203.01 s > existing_esurfaces 1
  803. 203.01 s > group_count 1
  804. 203.01 s > groups_above_threshold 1
  805. 203.01 s > integrand se1l
  806. 203.01 s > span warm_up{integrand.name=se1l}
  807. 203.01 s > threshold_status above threshold
  808. 203.01 s > [2026-08-28 15:47:43.530] @process::amplitude INFO : overlap structure of group 0: [1: [0(2,3)]]
  809. 203.01 s > field value
  810. 203.01 s > span warm_up{integrand.name=se1l}
  811. 203.01 s > [2026-08-28 15:47:43.535] @process::amplitude WARNING : External state 0 ('g', PDG 21, helicity +) is off shell: p^2 = +2.5e5, expected m^2 = +0e0 (|Δ| = +2.5e5). Fixed-helicity spinor/vector/tensor external states may be ill-defined at this kinematic point.
  812. 203.01 s > field value
  813. 203.01 s > span warm_up{integrand.name=se1l_rls_shifted}
  814. 203.01 s > [2026-08-28 15:47:43.535] @process::amplitude WARNING : External state 1 ('g', PDG 21, helicity -) is off shell: p^2 = +2.5e5, expected m^2 = +0e0 (|Δ| = +2.5e5). Fixed-helicity spinor/vector/tensor external states may be ill-defined at this kinematic point.
  815. 203.01 s > field value
  816. 203.01 s > span warm_up{integrand.name=se1l_rls_shifted}
  817. 203.01 s > [2026-08-28 15:47:43.535] @process::amplitude INFO : Input is above threshold: 1 existing threshold E-surfaces across 1/1 graph groups
  818. 203.01 s > field value
  819. 203.01 s > existing_esurfaces 1
  820. 203.01 s > group_count 1
  821. 203.01 s > groups_above_threshold 1
  822. 203.01 s > integrand se1l_rls_shifted
  823. 203.01 s > span warm_up{integrand.name=se1l_rls_shifted}
  824. 203.01 s > threshold_status above threshold
  825. 203.01 s > [2026-08-28 15:47:43.535] @process::amplitude INFO : overlap structure of group 0: [1: [0(2,3)]]
  826. 203.01 s > field value
  827. 203.01 s > span warm_up{integrand.name=se1l_rls_shifted}
  828. 203.01 s > [2026-08-28 15:47:43.540] @process::amplitude WARNING : External state 0 ('g', PDG 21, helicity +) is off shell: p^2 = +2.5e5, expected m^2 = +0e0 (|Δ| = +2.5e5). Fixed-helicity spinor/vector/tensor external states may be ill-defined at this kinematic point.
  829. 203.01 s > field value
  830. 203.01 s > span warm_up{integrand.name=se1l}
  831. 203.01 s > [2026-08-28 15:47:43.540] @process::amplitude WARNING : External state 1 ('g', PDG 21, helicity -) is off shell: p^2 = +2.5e5, expected m^2 = +0e0 (|Δ| = +2.5e5). Fixed-helicity spinor/vector/tensor external states may be ill-defined at this kinematic point.
  832. 203.01 s > field value
  833. 203.01 s > span warm_up{integrand.name=se1l}
  834. 203.01 s > [2026-08-28 15:47:43.540] @process::amplitude INFO : Input is above threshold: 1 existing threshold E-surfaces across 1/1 graph groups
  835. 203.01 s > field value
  836. 203.01 s > existing_esurfaces 1
  837. 203.01 s > group_count 1
  838. 203.01 s > groups_above_threshold 1
  839. 203.01 s > integrand se1l
  840. 203.01 s > span warm_up{integrand.name=se1l}
  841. 203.01 s > threshold_status above threshold
  842. 203.01 s > [2026-08-28 15:47:43.540] @process::amplitude INFO : overlap structure of group 0: [1: [0(2,3)]]
  843. 203.01 s > field value
  844. 203.01 s > span warm_up{integrand.name=se1l}
  845. 203.01 s > [2026-08-28 15:47:43.545] @process::amplitude WARNING : External state 0 ('g', PDG 21, helicity +) is off shell: p^2 = +2.5e5, expected m^2 = +0e0 (|Δ| = +2.5e5). Fixed-helicity spinor/vector/tensor external states may be ill-defined at this kinematic point.
  846. 203.01 s > field value
  847. 203.01 s > span warm_up{integrand.name=se1l_rls_shifted}
  848. 203.01 s > [2026-08-28 15:47:43.545] @process::amplitude WARNING : External state 1 ('g', PDG 21, helicity -) is off shell: p^2 = +2.5e5, expected m^2 = +0e0 (|Δ| = +2.5e5). Fixed-helicity spinor/vector/tensor external states may be ill-defined at this kinematic point.
  849. 203.01 s > field value
  850. 203.01 s > span warm_up{integrand.name=se1l_rls_shifted}
  851. 203.01 s > [2026-08-28 15:47:43.545] @process::amplitude INFO : Input is above threshold: 1 existing threshold E-surfaces across 1/1 graph groups
  852. 203.01 s > field value
  853. 203.01 s > existing_esurfaces 1
  854. 203.01 s > group_count 1
  855. 203.01 s > groups_above_threshold 1
  856. 203.01 s > integrand se1l_rls_shifted
  857. 203.01 s > span warm_up{integrand.name=se1l_rls_shifted}
  858. 203.01 s > threshold_status above threshold
  859. 203.01 s > [2026-08-28 15:47:43.546] @process::amplitude INFO : overlap structure of group 0: [1: [0(2,3)]]
  860. 203.01 s > field value
  861. 203.01 s > span warm_up{integrand.name=se1l_rls_shifted}
  862. 203.01 s > [2026-08-28 15:47:43.550] @process::amplitude WARNING : External state 0 ('g', PDG 21, helicity +) is off shell: p^2 = +2.5e5, expected m^2 = +0e0 (|Δ| = +2.5e5). Fixed-helicity spinor/vector/tensor external states may be ill-defined at this kinematic point.
  863. 203.01 s > field value
  864. 203.01 s > span warm_up{integrand.name=se1l}
  865. 203.01 s > [2026-08-28 15:47:43.550] @process::amplitude WARNING : External state 1 ('g', PDG 21, helicity -) is off shell: p^2 = +2.5e5, expected m^2 = +0e0 (|Δ| = +2.5e5). Fixed-helicity spinor/vector/tensor external states may be ill-defined at this kinematic point.
  866. 203.01 s > field value
  867. 203.01 s > span warm_up{integrand.name=se1l}
  868. 203.01 s > [2026-08-28 15:47:43.550] @process::amplitude INFO : Input is above threshold: 1 existing threshold E-surfaces across 1/1 graph groups
  869. 203.01 s > field value
  870. 203.01 s > existing_esurfaces 1
  871. 203.01 s > group_count 1
  872. 203.01 s > groups_above_threshold 1
  873. 203.01 s > integrand se1l
  874. 203.01 s > span warm_up{integrand.name=se1l}
  875. 203.01 s > threshold_status above threshold
  876. 203.01 s > [2026-08-28 15:47:43.551] @process::amplitude INFO : overlap structure of group 0: [1: [0(2,3)]]
  877. 203.01 s > field value
  878. 203.01 s > span warm_up{integrand.name=se1l}
  879. 203.01 s > [2026-08-28 15:47:43.555] @process::amplitude WARNING : External state 0 ('g', PDG 21, helicity +) is off shell: p^2 = +2.5e5, expected m^2 = +0e0 (|Δ| = +2.5e5). Fixed-helicity spinor/vector/tensor external states may be ill-defined at this kinematic point.
  880. 203.01 s > field value
  881. 203.01 s > span warm_up{integrand.name=se1l_rls_shifted}
  882. 203.01 s > [2026-08-28 15:47:43.555] @process::amplitude WARNING : External state 1 ('g', PDG 21, helicity -) is off shell: p^2 = +2.5e5, expected m^2 = +0e0 (|Δ| = +2.5e5). Fixed-helicity spinor/vector/tensor external states may be ill-defined at this kinematic point.
  883. 203.01 s > field value
  884. 203.01 s > span warm_up{integrand.name=se1l_rls_shifted}
  885. 203.01 s > [2026-08-28 15:47:43.556] @process::amplitude INFO : Input is above threshold: 1 existing threshold E-surfaces across 1/1 graph groups
  886. 203.01 s > field value
  887. 203.01 s > existing_esurfaces 1
  888. 203.01 s > group_count 1
  889. 203.01 s > groups_above_threshold 1
  890. 203.01 s > integrand se1l_rls_shifted
  891. 203.01 s > span warm_up{integrand.name=se1l_rls_shifted}
  892. 203.01 s > threshold_status above threshold
  893. 203.01 s > [2026-08-28 15:47:43.556] @process::amplitude INFO : overlap structure of group 0: [1: [0(2,3)]]
  894. 203.01 s > field value
  895. 203.01 s > span warm_up{integrand.name=se1l_rls_shifted}
  896. 203.01 s > [2026-08-28 15:47:43.561] @process::amplitude WARNING : External state 0 ('g', PDG 21, helicity +) is off shell: p^2 = +2.5e5, expected m^2 = +0e0 (|Δ| = +2.5e5). Fixed-helicity spinor/vector/tensor external states may be ill-defined at this kinematic point.
  897. 203.01 s > field value
  898. 203.01 s > span warm_up{integrand.name=se1l}
  899. 203.01 s > [2026-08-28 15:47:43.561] @process::amplitude WARNING : External state 1 ('g', PDG 21, helicity -) is off shell: p^2 = +2.5e5, expected m^2 = +0e0 (|Δ| = +2.5e5). Fixed-helicity spinor/vector/tensor external states may be ill-defined at this kinematic point.
  900. 203.01 s > field value
  901. 203.01 s > span warm_up{integrand.name=se1l}
  902. 203.01 s > [2026-08-28 15:47:43.561] @process::amplitude INFO : Input is above threshold: 1 existing threshold E-surfaces across 1/1 graph groups
  903. 203.01 s > field value
  904. 203.01 s > existing_esurfaces 1
  905. 203.01 s > group_count 1
  906. 203.01 s > groups_above_threshold 1
  907. 203.01 s > integrand se1l
  908. 203.01 s > span warm_up{integrand.name=se1l}
  909. 203.01 s > threshold_status above threshold
  910. 203.01 s > [2026-08-28 15:47:43.561] @process::amplitude INFO : overlap structure of group 0: [1: [0(2,3)]]
  911. 203.01 s > field value
  912. 203.01 s > span warm_up{integrand.name=se1l}
  913. 203.01 s > [2026-08-28 15:47:43.566] @process::amplitude WARNING : External state 0 ('g', PDG 21, helicity +) is off shell: p^2 = +2.5e5, expected m^2 = +0e0 (|Δ| = +2.5e5). Fixed-helicity spinor/vector/tensor external states may be ill-defined at this kinematic point.
  914. 203.01 s > field value
  915. 203.01 s > span warm_up{integrand.name=se1l_mur_shifted}
  916. 203.01 s > [2026-08-28 15:47:43.566] @process::amplitude WARNING : External state 1 ('g', PDG 21, helicity -) is off shell: p^2 = +2.5e5, expected m^2 = +0e0 (|Δ| = +2.5e5). Fixed-helicity spinor/vector/tensor external states may be ill-defined at this kinematic point.
  917. 203.01 s > field value
  918. 203.01 s > span warm_up{integrand.name=se1l_mur_shifted}
  919. 203.01 s > [2026-08-28 15:47:43.566] @process::amplitude INFO : Input is above threshold: 1 existing threshold E-surfaces across 1/1 graph groups
  920. 203.01 s > field value
  921. 203.01 s > existing_esurfaces 1
  922. 203.01 s > group_count 1
  923. 203.01 s > groups_above_threshold 1
  924. 203.01 s > integrand se1l_mur_shifted
  925. 203.01 s > span warm_up{integrand.name=se1l_mur_shifted}
  926. 203.01 s > threshold_status above threshold
  927. 203.01 s > [2026-08-28 15:47:43.566] @process::amplitude INFO : overlap structure of group 0: [1: [0(2,3)]]
  928. 203.01 s > field value
  929. 203.01 s > span warm_up{integrand.name=se1l_mur_shifted}
  930. 203.01 s > [2026-08-28 15:47:43.571] @process::amplitude WARNING : External state 0 ('g', PDG 21, helicity +) is off shell: p^2 = +2.5e5, expected m^2 = +0e0 (|Δ| = +2.5e5). Fixed-helicity spinor/vector/tensor external states may be ill-defined at this kinematic point.
  931. 203.01 s > field value
  932. 203.01 s > span warm_up{integrand.name=se1l}
  933. 203.01 s > [2026-08-28 15:47:43.571] @process::amplitude WARNING : External state 1 ('g', PDG 21, helicity -) is off shell: p^2 = +2.5e5, expected m^2 = +0e0 (|Δ| = +2.5e5). Fixed-helicity spinor/vector/tensor external states may be ill-defined at this kinematic point.
  934. 203.01 s > field value
  935. 203.01 s > span warm_up{integrand.name=se1l}
  936. 203.01 s > [2026-08-28 15:47:43.571] @process::amplitude INFO : Input is above threshold: 1 existing threshold E-surfaces across 1/1 graph groups
  937. 203.01 s > field value
  938. 203.01 s > existing_esurfaces 1
  939. 203.01 s > group_count 1
  940. 203.01 s > groups_above_threshold 1
  941. 203.01 s > integrand se1l
  942. 203.01 s > span warm_up{integrand.name=se1l}
  943. 203.01 s > threshold_status above threshold
  944. 203.01 s > [2026-08-28 15:47:43.571] @process::amplitude INFO : overlap structure of group 0: [1: [0(2,3)]]
  945. 203.01 s > field value
  946. 203.01 s > span warm_up{integrand.name=se1l}
  947. 203.01 s > [2026-08-28 15:47:43.576] @process::amplitude WARNING : External state 0 ('g', PDG 21, helicity +) is off shell: p^2 = +2.5e5, expected m^2 = +0e0 (|Δ| = +2.5e5). Fixed-helicity spinor/vector/tensor external states may be ill-defined at this kinematic point.
  948. 203.01 s > field value
  949. 203.01 s > span warm_up{integrand.name=se1l_mur_shifted}
  950. 203.01 s > [2026-08-28 15:47:43.576] @process::amplitude WARNING : External state 1 ('g', PDG 21, helicity -) is off shell: p^2 = +2.5e5, expected m^2 = +0e0 (|Δ| = +2.5e5). Fixed-helicity spinor/vector/tensor external states may be ill-defined at this kinematic point.
  951. 203.01 s > field value
  952. 203.01 s > span warm_up{integrand.name=se1l_mur_shifted}
  953. 203.01 s > [2026-08-28 15:47:43.576] @process::amplitude INFO : Input is above threshold: 1 existing threshold E-surfaces across 1/1 graph groups
  954. 203.01 s > field value
  955. 203.01 s > existing_esurfaces 1
  956. 203.01 s > group_count 1
  957. 203.01 s > groups_above_threshold 1
  958. 203.01 s > integrand se1l_mur_shifted
  959. 203.01 s > span warm_up{integrand.name=se1l_mur_shifted}
  960. 203.01 s > threshold_status above threshold
  961. 203.01 s > [2026-08-28 15:47:43.576] @process::amplitude INFO : overlap structure of group 0: [1: [0(2,3)]]
  962. 203.01 s > field value
  963. 203.01 s > span warm_up{integrand.name=se1l_mur_shifted}
  964. 203.01 s > [2026-08-28 15:47:43.581] @process::amplitude WARNING : External state 0 ('g', PDG 21, helicity +) is off shell: p^2 = +2.5e5, expected m^2 = +0e0 (|Δ| = +2.5e5). Fixed-helicity spinor/vector/tensor external states may be ill-defined at this kinematic point.
  965. 203.01 s > field value
  966. 203.01 s > span warm_up{integrand.name=se1l}
  967. 203.01 s > [2026-08-28 15:47:43.581] @process::amplitude WARNING : External state 1 ('g', PDG 21, helicity -) is off shell: p^2 = +2.5e5, expected m^2 = +0e0 (|Δ| = +2.5e5). Fixed-helicity spinor/vector/tensor external states may be ill-defined at this kinematic point.
  968. 203.01 s > field value
  969. 203.01 s > span warm_up{integrand.name=se1l}
  970. 203.01 s > [2026-08-28 15:47:43.581] @process::amplitude INFO : Input is above threshold: 1 existing threshold E-surfaces across 1/1 graph groups
  971. 203.01 s > field value
  972. 203.01 s > existing_esurfaces 1
  973. 203.01 s > group_count 1
  974. 203.01 s > groups_above_threshold 1
  975. 203.01 s > integrand se1l
  976. 203.01 s > span warm_up{integrand.name=se1l}
  977. 203.01 s > threshold_status above threshold
  978. 203.01 s > [2026-08-28 15:47:43.582] @process::amplitude INFO : overlap structure of group 0: [1: [0(2,3)]]
  979. 203.01 s > field value
  980. 203.01 s > span warm_up{integrand.name=se1l}
  981. 203.01 s > [2026-08-28 15:47:43.586] @process::amplitude WARNING : External state 0 ('g', PDG 21, helicity +) is off shell: p^2 = +2.5e5, expected m^2 = +0e0 (|Δ| = +2.5e5). Fixed-helicity spinor/vector/tensor external states may be ill-defined at this kinematic point.
  982. 203.01 s > field value
  983. 203.01 s > span warm_up{integrand.name=se1l_mur_shifted}
  984. 203.01 s > [2026-08-28 15:47:43.586] @process::amplitude WARNING : External state 1 ('g', PDG 21, helicity -) is off shell: p^2 = +2.5e5, expected m^2 = +0e0 (|Δ| = +2.5e5). Fixed-helicity spinor/vector/tensor external states may be ill-defined at this kinematic point.
  985. 203.01 s > field value
  986. 203.01 s > span warm_up{integrand.name=se1l_mur_shifted}
  987. 203.01 s > [2026-08-28 15:47:43.587] @process::amplitude INFO : Input is above threshold: 1 existing threshold E-surfaces across 1/1 graph groups
  988. 203.01 s > field value
  989. 203.01 s > existing_esurfaces 1
  990. 203.01 s > group_count 1
  991. 203.01 s > groups_above_threshold 1
  992. 203.01 s > integrand se1l_mur_shifted
  993. 203.01 s > span warm_up{integrand.name=se1l_mur_shifted}
  994. 203.01 s > threshold_status above threshold
  995. 203.01 s > [2026-08-28 15:47:43.587] @process::amplitude INFO : overlap structure of group 0: [1: [0(2,3)]]
  996. 203.01 s > field value
  997. 203.01 s > span warm_up{integrand.name=se1l_mur_shifted}
  998. 203.01 s > [2026-08-28 15:47:43.591] @process::amplitude WARNING : External state 0 ('g', PDG 21, helicity +) is off shell: p^2 = +2.5e5, expected m^2 = +0e0 (|Δ| = +2.5e5). Fixed-helicity spinor/vector/tensor external states may be ill-defined at this kinematic point.
  999. 203.01 s > field value
  1000. 203.01 s > span warm_up{integrand.name=se1l}
  1001. 203.01 s > [2026-08-28 15:47:43.591] @process::amplitude WARNING : External state 1 ('g', PDG 21, helicity -) is off shell: p^2 = +2.5e5, expected m^2 = +0e0 (|Δ| = +2.5e5). Fixed-helicity spinor/vector/tensor external states may be ill-defined at this kinematic point.
  1002. 203.01 s > field value
  1003. 203.01 s > span warm_up{integrand.name=se1l}
  1004. 203.01 s > [2026-08-28 15:47:43.592] @process::amplitude INFO : Input is above threshold: 1 existing threshold E-surfaces across 1/1 graph groups
  1005. 203.01 s > field value
  1006. 203.01 s > existing_esurfaces 1
  1007. 203.01 s > group_count 1
  1008. 203.01 s > groups_above_threshold 1
  1009. 203.01 s > integrand se1l
  1010. 203.01 s > span warm_up{integrand.name=se1l}
  1011. 203.01 s > threshold_status above threshold
  1012. 203.01 s > [2026-08-28 15:47:43.592] @process::amplitude INFO : overlap structure of group 0: [1: [0(2,3)]]
  1013. 203.01 s > field value
  1014. 203.01 s > span warm_up{integrand.name=se1l}
  1015. 203.01 s > [2026-08-28 15:47:43.597] @process::amplitude WARNING : External state 0 ('g', PDG 21, helicity +) is off shell: p^2 = +2.5e5, expected m^2 = +0e0 (|Δ| = +2.5e5). Fixed-helicity spinor/vector/tensor external states may be ill-defined at this kinematic point.
  1016. 203.01 s > field value
  1017. 203.01 s > span warm_up{integrand.name=se1l_mur_shifted}
  1018. 203.01 s > [2026-08-28 15:47:43.597] @process::amplitude WARNING : External state 1 ('g', PDG 21, helicity -) is off shell: p^2 = +2.5e5, expected m^2 = +0e0 (|Δ| = +2.5e5). Fixed-helicity spinor/vector/tensor external states may be ill-defined at this kinematic point.
  1019. 203.01 s > field value
  1020. 203.01 s > span warm_up{integrand.name=se1l_mur_shifted}
  1021. 203.01 s > [2026-08-28 15:47:43.597] @process::amplitude INFO : Input is above threshold: 1 existing threshold E-surfaces across 1/1 graph groups
  1022. 203.01 s > field value
  1023. 203.01 s > existing_esurfaces 1
  1024. 203.01 s > group_count 1
  1025. 203.01 s > groups_above_threshold 1
  1026. 203.01 s > integrand se1l_mur_shifted
  1027. 203.01 s > span warm_up{integrand.name=se1l_mur_shifted}
  1028. 203.01 s > threshold_status above threshold
  1029. 203.01 s > [2026-08-28 15:47:43.597] @process::amplitude INFO : overlap structure of group 0: [1: [0(2,3)]]
  1030. 203.01 s > field value
  1031. 203.01 s > span warm_up{integrand.name=se1l_mur_shifted}
  1032. 203.01 s > [2026-08-28 15:47:43.602] @process::amplitude WARNING : External state 0 ('g', PDG 21, helicity +) is off shell: p^2 = +2.5e5, expected m^2 = +0e0 (|Δ| = +2.5e5). Fixed-helicity spinor/vector/tensor external states may be ill-defined at this kinematic point.
  1033. 203.01 s > field value
  1034. 203.01 s > span warm_up{integrand.name=se1l}
  1035. 203.01 s > [2026-08-28 15:47:43.602] @process::amplitude WARNING : External state 1 ('g', PDG 21, helicity -) is off shell: p^2 = +2.5e5, expected m^2 = +0e0 (|Δ| = +2.5e5). Fixed-helicity spinor/vector/tensor external states may be ill-defined at this kinematic point.
  1036. 203.01 s > field value
  1037. 203.01 s > span warm_up{integrand.name=se1l}
  1038. 203.01 s > [2026-08-28 15:47:43.602] @process::amplitude INFO : Input is above threshold: 1 existing threshold E-surfaces across 1/1 graph groups
  1039. 203.01 s > field value
  1040. 203.01 s > existing_esurfaces 1
  1041. 203.01 s > group_count 1
  1042. 203.01 s > groups_above_threshold 1
  1043. 203.01 s > integrand se1l
  1044. 203.01 s > span warm_up{integrand.name=se1l}
  1045. 203.01 s > threshold_status above threshold
  1046. 203.01 s > [2026-08-28 15:47:43.602] @process::amplitude INFO : overlap structure of group 0: [1: [0(2,3)]]
  1047. 203.01 s > field value
  1048. 203.01 s > span warm_up{integrand.name=se1l}
  1049. 203.01 s > [2026-08-28 15:47:43.607] @process::amplitude WARNING : External state 0 ('g', PDG 21, helicity +) is off shell: p^2 = +2.5e5, expected m^2 = +0e0 (|Δ| = +2.5e5). Fixed-helicity spinor/vector/tensor external states may be ill-defined at this kinematic point.
  1050. 203.01 s > field value
  1051. 203.01 s > span warm_up{integrand.name=se1l_mur_shifted}
  1052. 203.01 s > [2026-08-28 15:47:43.607] @process::amplitude WARNING : External state 1 ('g', PDG 21, helicity -) is off shell: p^2 = +2.5e5, expected m^2 = +0e0 (|Δ| = +2.5e5). Fixed-helicity spinor/vector/tensor external states may be ill-defined at this kinematic point.
  1053. 203.01 s > field value
  1054. 203.01 s > span warm_up{integrand.name=se1l_mur_shifted}
  1055. 203.01 s > [2026-08-28 15:47:43.607] @process::amplitude INFO : Input is above threshold: 1 existing threshold E-surfaces across 1/1 graph groups
  1056. 203.01 s > field value
  1057. 203.01 s > existing_esurfaces 1
  1058. 203.01 s > group_count 1
  1059. 203.01 s > groups_above_threshold 1
  1060. 203.01 s > integrand se1l_mur_shifted
  1061. 203.01 s > span warm_up{integrand.name=se1l_mur_shifted}
  1062. 203.01 s > threshold_status above threshold
  1063. 203.01 s > [2026-08-28 15:47:43.607] @process::amplitude INFO : overlap structure of group 0: [1: [0(2,3)]]
  1064. 203.01 s > field value
  1065. 203.01 s > span warm_up{integrand.name=se1l_mur_shifted}
  1066. 203.01 s > [2026-08-28 15:47:43.612] @process::amplitude WARNING : External state 0 ('g', PDG 21, helicity +) is off shell: p^2 = +2.5e5, expected m^2 = +0e0 (|Δ| = +2.5e5). Fixed-helicity spinor/vector/tensor external states may be ill-defined at this kinematic point.
  1067. 203.01 s > field value
  1068. 203.01 s > span warm_up{integrand.name=se1l}
  1069. 203.01 s > [2026-08-28 15:47:43.612] @process::amplitude WARNING : External state 1 ('g', PDG 21, helicity -) is off shell: p^2 = +2.5e5, expected m^2 = +0e0 (|Δ| = +2.5e5). Fixed-helicity spinor/vector/tensor external states may be ill-defined at this kinematic point.
  1070. 203.01 s > field value
  1071. 203.01 s > span warm_up{integrand.name=se1l}
  1072. 203.01 s > [2026-08-28 15:47:43.613] @process::amplitude INFO : Input is above threshold: 1 existing threshold E-surfaces across 1/1 graph groups
  1073. 203.01 s > field value
  1074. 203.01 s > existing_esurfaces 1
  1075. 203.01 s > group_count 1
  1076. 203.01 s > groups_above_threshold 1
  1077. 203.01 s > integrand se1l
  1078. 203.01 s > span warm_up{integrand.name=se1l}
  1079. 203.01 s > threshold_status above threshold
  1080. 203.01 s > [2026-08-28 15:47:43.613] @process::amplitude INFO : overlap structure of group 0: [1: [0(2,3)]]
  1081. 203.01 s > field value
  1082. 203.01 s > span warm_up{integrand.name=se1l}
  1083. 203.01 s > [2026-08-28 15:47:43.618] @process::amplitude WARNING : External state 0 ('g', PDG 21, helicity +) is off shell: p^2 = +2.5e5, expected m^2 = +0e0 (|Δ| = +2.5e5). Fixed-helicity spinor/vector/tensor external states may be ill-defined at this kinematic point.
  1084. 203.01 s > field value
  1085. 203.01 s > span warm_up{integrand.name=se1l_mur_shifted}
  1086. 203.01 s > [2026-08-28 15:47:43.618] @process::amplitude WARNING : External state 1 ('g', PDG 21, helicity -) is off shell: p^2 = +2.5e5, expected m^2 = +0e0 (|Δ| = +2.5e5). Fixed-helicity spinor/vector/tensor external states may be ill-defined at this kinematic point.
  1087. 203.01 s > field value
  1088. 203.01 s > span warm_up{integrand.name=se1l_mur_shifted}
  1089. 203.01 s > [2026-08-28 15:47:43.618] @process::amplitude INFO : Input is above threshold: 1 existing threshold E-surfaces across 1/1 graph groups
  1090. 203.01 s > field value
  1091. 203.01 s > existing_esurfaces 1
  1092. 203.01 s > group_count 1
  1093. 203.01 s > groups_above_threshold 1
  1094. 203.01 s > integrand se1l_mur_shifted
  1095. 203.01 s > span warm_up{integrand.name=se1l_mur_shifted}
  1096. 203.01 s > threshold_status above threshold
  1097. 203.01 s > [2026-08-28 15:47:43.618] @process::amplitude INFO : overlap structure of group 0: [1: [0(2,3)]]
  1098. 203.01 s > field value
  1099. 203.01 s > span warm_up{integrand.name=se1l_mur_shifted}
  1100. 203.01 s > [2026-08-28 15:47:43.623] @process::amplitude WARNING : External state 0 ('g', PDG 21, helicity +) is off shell: p^2 = +2.5e5, expected m^2 = +0e0 (|Δ| = +2.5e5). Fixed-helicity spinor/vector/tensor external states may be ill-defined at this kinematic point.
  1101. 203.01 s > field value
  1102. 203.01 s > span warm_up{integrand.name=se1l}
  1103. 203.01 s > [2026-08-28 15:47:43.623] @process::amplitude WARNING : External state 1 ('g', PDG 21, helicity -) is off shell: p^2 = +2.5e5, expected m^2 = +0e0 (|Δ| = +2.5e5). Fixed-helicity spinor/vector/tensor external states may be ill-defined at this kinematic point.
  1104. 203.01 s > field value
  1105. 203.01 s > span warm_up{integrand.name=se1l}
  1106. 203.01 s > [2026-08-28 15:47:43.623] @process::amplitude INFO : Input is above threshold: 1 existing threshold E-surfaces across 1/1 graph groups
  1107. 203.01 s > field value
  1108. 203.01 s > existing_esurfaces 1
  1109. 203.01 s > group_count 1
  1110. 203.01 s > groups_above_threshold 1
  1111. 203.01 s > integrand se1l
  1112. 203.01 s > span warm_up{integrand.name=se1l}
  1113. 203.01 s > threshold_status above threshold
  1114. 203.01 s > [2026-08-28 15:47:43.623] @process::amplitude INFO : overlap structure of group 0: [1: [0(2,3)]]
  1115. 203.01 s > field value
  1116. 203.01 s > span warm_up{integrand.name=se1l}
  1117. 203.01 s > [2026-08-28 15:47:43.628] @process::amplitude WARNING : External state 0 ('g', PDG 21, helicity +) is off shell: p^2 = +2.5e5, expected m^2 = +0e0 (|Δ| = +2.5e5). Fixed-helicity spinor/vector/tensor external states may be ill-defined at this kinematic point.
  1118. 203.01 s > field value
  1119. 203.01 s > span warm_up{integrand.name=se1l_mur_shifted}
  1120. 203.01 s > [2026-08-28 15:47:43.628] @process::amplitude WARNING : External state 1 ('g', PDG 21, helicity -) is off shell: p^2 = +2.5e5, expected m^2 = +0e0 (|Δ| = +2.5e5). Fixed-helicity spinor/vector/tensor external states may be ill-defined at this kinematic point.
  1121. 203.01 s > field value
  1122. 203.01 s > span warm_up{integrand.name=se1l_mur_shifted}
  1123. 203.01 s > [2026-08-28 15:47:43.628] @process::amplitude INFO : Input is above threshold: 1 existing threshold E-surfaces across 1/1 graph groups
  1124. 203.01 s > field value
  1125. 203.01 s > existing_esurfaces 1
  1126. 203.01 s > group_count 1
  1127. 203.01 s > groups_above_threshold 1
  1128. 203.01 s > integrand se1l_mur_shifted
  1129. 203.01 s > span warm_up{integrand.name=se1l_mur_shifted}
  1130. 203.01 s > threshold_status above threshold
  1131. 203.01 s > [2026-08-28 15:47:43.629] @process::amplitude INFO : overlap structure of group 0: [1: [0(2,3)]]
  1132. 203.01 s > field value
  1133. 203.01 s > span warm_up{integrand.name=se1l_mur_shifted}
  1134. 203.01 s > [2026-08-28 15:47:43.633] @process::amplitude WARNING : External state 0 ('g', PDG 21, helicity +) is off shell: p^2 = +2.5e5, expected m^2 = +0e0 (|Δ| = +2.5e5). Fixed-helicity spinor/vector/tensor external states may be ill-defined at this kinematic point.
  1135. 203.01 s > field value
  1136. 203.01 s > span warm_up{integrand.name=se1l}
  1137. 203.01 s > [2026-08-28 15:47:43.634] @process::amplitude WARNING : External state 1 ('g', PDG 21, helicity -) is off shell: p^2 = +2.5e5, expected m^2 = +0e0 (|Δ| = +2.5e5). Fixed-helicity spinor/vector/tensor external states may be ill-defined at this kinematic point.
  1138. 203.01 s > field value
  1139. 203.01 s > span warm_up{integrand.name=se1l}
  1140. 203.01 s > [2026-08-28 15:47:43.634] @process::amplitude INFO : Input is above threshold: 1 existing threshold E-surfaces across 1/1 graph groups
  1141. 203.01 s > field value
  1142. 203.01 s > existing_esurfaces 1
  1143. 203.01 s > group_count 1
  1144. 203.01 s > groups_above_threshold 1
  1145. 203.01 s > integrand se1l
  1146. 203.01 s > span warm_up{integrand.name=se1l}
  1147. 203.01 s > threshold_status above threshold
  1148. 203.01 s > [2026-08-28 15:47:43.634] @process::amplitude INFO : overlap structure of group 0: [1: [0(2,3)]]
  1149. 203.01 s > field value
  1150. 203.01 s > span warm_up{integrand.name=se1l}
  1151. 203.01 s > [2026-08-28 15:47:43.639] @process::amplitude WARNING : External state 0 ('g', PDG 21, helicity +) is off shell: p^2 = +2.5e5, expected m^2 = +0e0 (|Δ| = +2.5e5). Fixed-helicity spinor/vector/tensor external states may be ill-defined at this kinematic point.
  1152. 203.01 s > field value
  1153. 203.01 s > span warm_up{integrand.name=se1l_mur_shifted}
  1154. 203.01 s > [2026-08-28 15:47:43.639] @process::amplitude WARNING : External state 1 ('g', PDG 21, helicity -) is off shell: p^2 = +2.5e5, expected m^2 = +0e0 (|Δ| = +2.5e5). Fixed-helicity spinor/vector/tensor external states may be ill-defined at this kinematic point.
  1155. 203.01 s > field value
  1156. 203.01 s > span warm_up{integrand.name=se1l_mur_shifted}
  1157. 203.01 s > [2026-08-28 15:47:43.639] @process::amplitude INFO : Input is above threshold: 1 existing threshold E-surfaces across 1/1 graph groups
  1158. 203.01 s > field value
  1159. 203.01 s > existing_esurfaces 1
  1160. 203.01 s > group_count 1
  1161. 203.01 s > groups_above_threshold 1
  1162. 203.01 s > integrand se1l_mur_shifted
  1163. 203.01 s > span warm_up{integrand.name=se1l_mur_shifted}
  1164. 203.01 s > threshold_status above threshold
  1165. 203.01 s > [2026-08-28 15:47:43.639] @process::amplitude INFO : overlap structure of group 0: [1: [0(2,3)]]
  1166. 203.01 s > field value
  1167. 203.01 s > span warm_up{integrand.name=se1l_mur_shifted}
  1168. 203.01 s > [2026-08-28 15:47:43.644] @process::amplitude WARNING : External state 0 ('g', PDG 21, helicity +) is off shell: p^2 = +2.5e5, expected m^2 = +0e0 (|Δ| = +2.5e5). Fixed-helicity spinor/vector/tensor external states may be ill-defined at this kinematic point.
  1169. 203.01 s > field value
  1170. 203.01 s > span warm_up{integrand.name=se1l}
  1171. 203.01 s > [2026-08-28 15:47:43.644] @process::amplitude WARNING : External state 1 ('g', PDG 21, helicity -) is off shell: p^2 = +2.5e5, expected m^2 = +0e0 (|Δ| = +2.5e5). Fixed-helicity spinor/vector/tensor external states may be ill-defined at this kinematic point.
  1172. 203.01 s > field value
  1173. 203.01 s > span warm_up{integrand.name=se1l}
  1174. 203.01 s > [2026-08-28 15:47:43.644] @process::amplitude INFO : Input is above threshold: 1 existing threshold E-surfaces across 1/1 graph groups
  1175. 203.02 s > field value
  1176. 203.02 s > existing_esurfaces 1
  1177. 203.02 s > group_count 1
  1178. 203.02 s > groups_above_threshold 1
  1179. 203.02 s > integrand se1l
  1180. 203.02 s > span warm_up{integrand.name=se1l}
  1181. 203.02 s > threshold_status above threshold
  1182. 203.02 s > [2026-08-28 15:47:43.644] @process::amplitude INFO : overlap structure of group 0: [1: [0(2,3)]]
  1183. 203.02 s > field value
  1184. 203.02 s > span warm_up{integrand.name=se1l}
  1185. 203.02 s > [2026-08-28 15:47:43.649] @process::amplitude WARNING : External state 0 ('g', PDG 21, helicity +) is off shell: p^2 = +2.5e5, expected m^2 = +0e0 (|Δ| = +2.5e5). Fixed-helicity spinor/vector/tensor external states may be ill-defined at this kinematic point.
  1186. 203.02 s > field value
  1187. 203.02 s > span warm_up{integrand.name=se1l_mur_shifted}
  1188. 203.02 s > [2026-08-28 15:47:43.649] @process::amplitude WARNING : External state 1 ('g', PDG 21, helicity -) is off shell: p^2 = +2.5e5, expected m^2 = +0e0 (|Δ| = +2.5e5). Fixed-helicity spinor/vector/tensor external states may be ill-defined at this kinematic point.
  1189. 203.02 s > field value
  1190. 203.02 s > span warm_up{integrand.name=se1l_mur_shifted}
  1191. 203.02 s > [2026-08-28 15:47:43.649] @process::amplitude INFO : Input is above threshold: 1 existing threshold E-surfaces across 1/1 graph groups
  1192. 203.02 s > field value
  1193. 203.02 s > existing_esurfaces 1
  1194. 203.02 s > group_count 1
  1195. 203.02 s > groups_above_threshold 1
  1196. 203.02 s > integrand se1l_mur_shifted
  1197. 203.02 s > span warm_up{integrand.name=se1l_mur_shifted}
  1198. 203.02 s > threshold_status above threshold
  1199. 203.02 s > [2026-08-28 15:47:43.650] @process::amplitude INFO : overlap structure of group 0: [1: [0(2,3)]]
  1200. 203.02 s > field value
  1201. 203.02 s > span warm_up{integrand.name=se1l_mur_shifted}
  1202. 203.02 s > [2026-08-28 15:47:43.654] @process::amplitude WARNING : External state 0 ('g', PDG 21, helicity +) is off shell: p^2 = +2.5e5, expected m^2 = +0e0 (|Δ| = +2.5e5). Fixed-helicity spinor/vector/tensor external states may be ill-defined at this kinematic point.
  1203. 203.02 s > field value
  1204. 203.02 s > span warm_up{integrand.name=se1l}
  1205. 203.02 s > [2026-08-28 15:47:43.655] @process::amplitude WARNING : External state 1 ('g', PDG 21, helicity -) is off shell: p^2 = +2.5e5, expected m^2 = +0e0 (|Δ| = +2.5e5). Fixed-helicity spinor/vector/tensor external states may be ill-defined at this kinematic point.
  1206. 203.02 s > field value
  1207. 203.02 s > span warm_up{integrand.name=se1l}
  1208. 203.02 s > [2026-08-28 15:47:43.655] @process::amplitude INFO : Input is above threshold: 1 existing threshold E-surfaces across 1/1 graph groups
  1209. 203.02 s > field value
  1210. 203.02 s > existing_esurfaces 1
  1211. 203.02 s > group_count 1
  1212. 203.02 s > groups_above_threshold 1
  1213. 203.02 s > integrand se1l
  1214. 203.02 s > span warm_up{integrand.name=se1l}
  1215. 203.02 s > threshold_status above threshold
  1216. 203.02 s > [2026-08-28 15:47:43.655] @process::amplitude INFO : overlap structure of group 0: [1: [0(2,3)]]
  1217. 203.02 s > field value
  1218. 203.02 s > span warm_up{integrand.name=se1l}
  1219. 203.02 s > [2026-08-28 15:47:43.660] @process::amplitude WARNING : External state 0 ('g', PDG 21, helicity +) is off shell: p^2 = +2.5e5, expected m^2 = +0e0 (|Δ| = +2.5e5). Fixed-helicity spinor/vector/tensor external states may be ill-defined at this kinematic point.
  1220. 203.02 s > field value
  1221. 203.02 s > span warm_up{integrand.name=se1l_mur_shifted}
  1222. 203.02 s > [2026-08-28 15:47:43.660] @process::amplitude WARNING : External state 1 ('g', PDG 21, helicity -) is off shell: p^2 = +2.5e5, expected m^2 = +0e0 (|Δ| = +2.5e5). Fixed-helicity spinor/vector/tensor external states may be ill-defined at this kinematic point.
  1223. 203.02 s > field value
  1224. 203.02 s > span warm_up{integrand.name=se1l_mur_shifted}
  1225. 203.02 s > [2026-08-28 15:47:43.660] @process::amplitude INFO : Input is above threshold: 1 existing threshold E-surfaces across 1/1 graph groups
  1226. 203.02 s > field value
  1227. 203.02 s > existing_esurfaces 1
  1228. 203.02 s > group_count 1
  1229. 203.02 s > groups_above_threshold 1
  1230. 203.02 s > integrand se1l_mur_shifted
  1231. 203.02 s > span warm_up{integrand.name=se1l_mur_shifted}
  1232. 203.02 s > threshold_status above threshold
  1233. 203.02 s > [2026-08-28 15:47:43.660] @process::amplitude INFO : overlap structure of group 0: [1: [0(2,3)]]
  1234. 203.02 s > field value
  1235. 203.02 s > span warm_up{integrand.name=se1l_mur_shifted}
  1236. 203.02 s > The application panicked (crashed).
  1237. 203.02 s > Message: Integrated UV case failed: se1l
  1238. 203.02 s > Location: tests/tests/uv.rs:1068
  1239. 203.02 s >
  1240. 203.02 s > ━━━━━━━━━━━━━━━━━━━━━━━━━━━━━━━━━━ BACKTRACE ━━━━━━━━━━━━━━━━━━━━━━━━━━━━━━━━━━━
  1241. 203.02 s > 1: <color_eyre[51793ea62743adbd]::config::PanicHook>::panic_report<unknown>
  1242. 203.02 s > at <unknown source file>:<unknown line>
  1243. 203.02 s > 2: <color_eyre[51793ea62743adbd]::config::PanicHook>::into_panic_hook::{closure#0}<unknown>
  1244. 203.02 s > at <unknown source file>:<unknown line>
  1245. 203.02 s > 3: std[bcb96dfbba0ab899]::panicking::panic_with_hook<unknown>
  1246. 203.02 s > at <unknown source file>:<unknown line>
  1247. 203.02 s > 4: std[bcb96dfbba0ab899]::panicking::panic_handler::{closure#0}<unknown>
  1248. 203.02 s > at <unknown source file>:<unknown line>
  1249. 203.02 s > 5: std[bcb96dfbba0ab899]::sys::backtrace::__rust_end_short_backtrace::<std[bcb96dfbba0ab899]::panicking::panic_handler::{closure#0}, !><unknown>
  1250. 203.02 s > at <unknown source file>:<unknown line>
  1251. 203.02 s > 6: __rustc[6c289b9f9c454d21]::rust_begin_unwind<unknown>
  1252. 203.02 s > at <unknown source file>:<unknown line>
  1253. 203.02 s > 7: core[940e698046960fd5]::panicking::panic_fmt<unknown>
  1254. 203.02 s > at <unknown source file>:<unknown line>
  1255. 203.02 s > 8: uv[52cf2b63f0104e31]::run_single_integrated_uv_case<unknown>
  1256. 203.02 s > at <unknown source file>:<unknown line>
  1257. 203.02 s > 9: <uv[52cf2b63f0104e31]::se1l_uv::{closure#0} as core[940e698046960fd5]::ops::function::FnOnce<()>>::call_once<unknown>
  1258. 203.02 s > at <unknown source file>:<unknown line>
  1259. 203.02 s > 10: test[75d6903177b1d7e9]::__rust_begin_short_backtrace::<core[940e698046960fd5]::result::Result<(), alloc[2ea6bcb46fca0c42]::string::String>, fn() -> core[940e698046960fd5]::result::Result<(), alloc[2ea6bcb46fca0c42]::string::String>><unknown>
  1260. 203.02 s > at <unknown source file>:<unknown line>
  1261. 203.02 s > 11: test[75d6903177b1d7e9]::run_test::{closure#0}<unknown>
  1262. 203.02 s > at <unknown source file>:<unknown line>
  1263. 203.02 s > 12: std[bcb96dfbba0ab899]::sys::backtrace::__rust_begin_short_backtrace::<test[75d6903177b1d7e9]::run_test::{closure#1}, ()><unknown>
  1264. 203.02 s > at <unknown source file>:<unknown line>
  1265. 203.02 s > 13: <std[bcb96dfbba0ab899]::thread::lifecycle::spawn_unchecked<test[75d6903177b1d7e9]::run_test::{closure#1}, ()>::{closure#1} as core[940e698046960fd5]::ops::function::FnOnce<()>>::call_once::{shim:vtable#0}<unknown>
  1266. 203.02 s > at <unknown source file>:<unknown line>
  1267. 203.02 s > 14: <std[bcb96dfbba0ab899]::sys::thread::unix::Thread>::new::thread_start<unknown>
  1268. 203.02 s > at <unknown source file>:<unknown line>
  1269. 203.02 s > 15: start_thread<unknown>
  1270. 203.02 s > at <unknown source file>:<unknown line>
  1271. 203.02 s > 16: __clone3<unknown>
  1272. 203.02 s > at <unknown source file>:<unknown line>
  1273. 203.02 s >
  1274. 203.02 s > Run with COLORBT_SHOW_HIDDEN=1 environment variable to disable frame filtering.
  1275. 203.02 s > Run with RUST_BACKTRACE=full to include source snippets.
  1276. 203.02 s >
  1277. 203.02 s > error: test run failed
  1278. 203.02 s >
  1279. 203.02 s > ========== nextest test summary ==========
  1280. 203.02 s > report: target/nextest/ci_gammaloop/junit.xml
  1281. 203.02 s > tests: 106, failures: 9, errors: 0
  1282. 203.02 s >
  1283. 203.02 s > 1. gammaloop-integration-tests::test_runs::approach::approach_momentum_space_reports_incomplete_triplet_cleanly
  1284. 203.02 s > failure: test failure with exit code 101
  1285. 203.02 s > system-out
  1286. 203.02 s > running 1 test
  1287. 203.02 s > test approach::approach_momentum_space_reports_incomplete_triplet_cleanly ... FAILED
  1288. 203.02 s >
  1289. 203.02 s > failures:
  1290. 203.02 s >
  1291. 203.02 s > failures:
  1292. 203.02 s > approach::approach_momentum_space_reports_incomplete_triplet_cleanly
  1293. 203.02 s >
  1294. 203.02 s > test result: FAILED. 0 passed; 1 failed; 0 ignored; 0 measured; 82 filtered out; finished in 2.13s
  1295. 203.02 s > system-err
  1296. 203.02 s > [2026-08-28 15:45:02.035] @gammaloop_api::se... INFO : Running command import model scalars-default.json
  1297. 203.02 s > [2026-08-28 15:45:02.035] @import::model INFO : Loading built-in JSON model scalars-default
  1298. 203.02 s > [2026-08-28 15:45:02.055] @gammalooprs::model INFO : The following 2 external parameters were forced to zero by the restriction card:
  1299. 203.02 s > width_scalar_1, width_scalar_2
  1300. 203.02 s > [2026-08-28 15:45:02.055] @gammaloop_api::se... INFO : Running command remove processes
  1301. 203.02 s > [2026-08-28 15:45:02.080] @gammaloop_api::se... INFO : Running command generate amp scalar_1 > scalar_0 scalar_0 [{1}] --allowed-vertex-interactions V_3_SCALAR_022 V_3_SCALAR_122 -p triangle -i scalar_tri
  1302. 203.02 s > [2026-08-28 15:45:02.085] @feyngen::diagram_... INFO : 0s | Δ=0s | Starting Feynman graph generation with Symbolica...
  1303. 203.02 s > [2026-08-28 15:45:02.085] @feyngen::diagram_... INFO : 0s | Δ=0s | Number of graphs resulting from Symbolica generation: 1
  1304. 203.02 s > [2026-08-28 15:45:02.093] @feyngen::diagram_... INFO : 0s | Δ=0s | Number of graphs retained after removal of vetoed topologies: 1
  1305. 203.02 s > [2026-08-28 15:45:02.102] @feyngen::diagram_... INFO : 0s | Δ=0s | Number of graphs after vertex info assignment: 1
  1306. 203.02 s > [2026-08-28 15:45:02.102] @feyngen::diagram_... INFO : 0s | Δ=0s | Number of graphs after all complete graphs filters are applied: 1
  1307. 203.02 s > [2026-08-28 15:45:02.107] @feyngen::diagram_... INFO : 0s | Δ=0s | Number of graphs after closed fermion chains analysis: 1
  1308. 203.02 s > [2026-08-28 15:45:02.107] @feyngen::diagram_... INFO : 0s | Δ=0s | Number of graphs after symmetrization of external states: 1
  1309. 203.02 s > [2026-08-28 15:45:02.114] @feyngen::diagram_... INFO : 0s | Δ=0s | Number of graphs after canonization of vertices, edges and flows (graph labels assigned here): 1
  1310. 203.02 s > [2026-08-28 15:45:02.142] @feyngen::diagram_... INFO : 0s | Δ=0s | Number of graphs after numerator-aware grouping with strategy 'up to a scalar rescaling': 1 (1 isomorphically unique graph, 0 color zero, 0 lorentz zero, 0 grouped and 0 cancellation)
  1311. 203.02 s > [2026-08-28 15:45:02.142] @feyngen::diagram_... INFO : ( Sum of the symmetry factors from each graph generated = 1 )
  1312. 203.02 s > [2026-08-28 15:45:02.142] @commands::generate INFO : Generated amplitude 1 graphs.
  1313. 203.02 s > [2026-08-28 15:45:02.270] @settings::runtime WARNING : No external kinematics were provided; using default-generated external momenta and helicities.
  1314. 203.02 s > [2026-08-28 15:45:02.363] @commands::generate INFO :
  1315. 203.02 s > Integrand generation summary
  1316. 203.02 s > peak RAM 67.36 MiB | cores 1
  1317. 203.02 s > ╭────────────┬───────┬─────────┬────────────┬─────────────┬────────────────┬─────────────╮
  1318. 203.02 s > │ integrand │ graph │ # evals │ expr build │ spenso │ symbolica eval │ compile │
  1319. 203.02 s > ├────────────┼───────┼─────────┼────────────┼─────────────┼────────────────┼─────────────┤
  1320. 203.02 s > │ scalar_tri │ GL0 │ 9 │ 56ms (51%) │ 10ms (9.1%) │ 45ms (40%) │ 0ms (0.00%) │
  1321. 203.02 s > ├────────────┼───────┼─────────┼────────────┼─────────────┼────────────────┼─────────────┤
  1322. 203.02 s > │ Total │ │ 9 │ 56ms (51%) │ 10ms (9.1%) │ 45ms (40%) │ 0ms (0.00%) │
  1323. 203.02 s > ╰────────────┴───────┴─────────┴────────────┴─────────────┴────────────────┴─────────────╯
  1324. 203.02 s > [2026-08-28 15:45:02.364] @gammaloop_api::se... INFO : Running command generate amp scalar_0 scalar_0 > scalar_0 scalar_0 [{1}] --allowed-vertex-interactions V_3_SCALAR_022 -p box -i scalar_box --select-graphs GL0
  1325. 203.02 s > [2026-08-28 15:45:02.370] @feyngen::diagram_... INFO : 0s | Δ=0s | Starting Feynman graph generation with Symbolica...
  1326. 203.02 s > [2026-08-28 15:45:02.370] @feyngen::diagram_... INFO : 0s | Δ=0s | Number of graphs resulting from Symbolica generation: 3
  1327. 203.02 s > [2026-08-28 15:45:02.374] @feyngen::diagram_... INFO : 0s | Δ=0s | Number of graphs retained after removal of vetoed topologies: 3
  1328. 203.02 s > [2026-08-28 15:45:02.378] @feyngen::diagram_... INFO : 0s | Δ=0s | Number of graphs after vertex info assignment: 3
  1329. 203.02 s > [2026-08-28 15:45:02.378] @feyngen::diagram_... INFO : 0s | Δ=0s | Number of graphs after all complete graphs filters are applied: 3
  1330. 203.02 s > [2026-08-28 15:45:02.381] @feyngen::diagram_... INFO : 0s | Δ=0s | Number of graphs after closed fermion chains analysis: 3
  1331. 203.02 s > [2026-08-28 15:45:02.381] @feyngen::diagram_... INFO : 0s | Δ=0s | Number of graphs after symmetrization of external states: 3
  1332. 203.02 s > [2026-08-28 15:45:02.381] @feyngen::diagram_... INFO : 0s | Δ=0s | Number of graphs after canonization of vertices, edges and flows (graph labels assigned here): 3
  1333. 203.02 s > [2026-08-28 15:45:02.418] @feyngen::diagram_... INFO : 0s | Δ=0s | Number of graphs after numerator-aware grouping with strategy 'up to a scalar rescaling': 1 (1 isomorphically unique graph, 0 color zero, 0 lorentz zero, 0 grouped and 0 cancellation)
  1334. 203.02 s > [2026-08-28 15:45:02.418] @feyngen::diagram_... INFO : ( Sum of the symmetry factors from each graph generated = 1 )
  1335. 203.02 s > [2026-08-28 15:45:02.418] @commands::generate INFO : Generated amplitude 1 graphs.
  1336. 203.02 s > [2026-08-28 15:45:02.693] @settings::runtime WARNING : No external kinematics were provided; using default-generated external momenta and helicities.
  1337. 203.02 s > [2026-08-28 15:45:02.742] @commands::generate INFO :
  1338. 203.02 s > Integrand generation summary
  1339. 203.02 s > peak RAM 68.76 MiB | cores 1
  1340. 203.02 s > ╭────────────┬───────┬─────────┬─────────────┬─────────────┬────────────────┬─────────────╮
  1341. 203.02 s > │ integrand │ graph │ # evals │ expr build │ spenso │ symbolica eval │ compile │
  1342. 203.02 s > ├────────────┼───────┼─────────┼─────────────┼─────────────┼────────────────┼─────────────┤
  1343. 203.02 s > │ scalar_box │ GL0 │ 13 │ 188ms (71%) │ 16ms (6.2%) │ 60ms (23%) │ 0ms (0.00%) │
  1344. 203.02 s > ├────────────┼───────┼─────────┼─────────────┼─────────────┼────────────────┼─────────────┤
  1345. 203.02 s > │ Total │ │ 13 │ 188ms (71%) │ 16ms (6.2%) │ 60ms (23%) │ 0ms (0.00%) │
  1346. 203.02 s > ╰────────────┴───────┴─────────┴─────────────┴─────────────┴────────────────┴─────────────╯
  1347. 203.02 s > [2026-08-28 15:45:02.743] @gammaloop_api::se... INFO : Running command generate
  1348. 203.02 s > [2026-08-28 15:45:03.003] @settings::runtime WARNING : No external kinematics were provided; using default-generated external momenta and helicities.
  1349. 203.02 s > [2026-08-28 15:45:03.213] @settings::runtime WARNING : No external kinematics were provided; using default-generated external momenta and helicities.
  1350. 203.02 s > [2026-08-28 15:45:03.294] @commands::generate INFO :
  1351. 203.02 s > Integrand generation summary
  1352. 203.02 s > peak RAM 71.11 MiB | cores 1
  1353. 203.02 s > ╭────────────┬───────┬─────────┬─────────────┬─────────────┬────────────────┬─────────────╮
  1354. 203.02 s > │ integrand │ graph │ # evals │ expr build │ spenso │ symbolica eval │ compile │
  1355. 203.02 s > ├────────────┼───────┼─────────┼─────────────┼─────────────┼────────────────┼─────────────┤
  1356. 203.02 s > │ scalar_tri │ GL0 │ 9 │ 110ms (86%) │ 5ms (3.9%) │ 12ms (9.9%) │ 0ms (0.00%) │
  1357. 203.02 s > │ scalar_box │ GL0 │ 13 │ 119ms (36%) │ 36ms (11%) │ 172ms (53%) │ 0ms (0.00%) │
  1358. 203.02 s > ├────────────┼───────┼─────────┼─────────────┼─────────────┼────────────────┼─────────────┤
  1359. 203.02 s > │ Total │ │ 22 │ 229ms (50%) │ 41ms (9.1%) │ 184ms (41%) │ 0ms (0.00%) │
  1360. 203.02 s > ╰────────────┴───────┴─────────┴─────────────┴─────────────┴────────────────┴─────────────╯
  1361. 203.02 s > [2026-08-28 15:45:03.295] @gammaloop_api::se... INFO : Running command set model mass_scalar_2=2.0
  1362. 203.02 s > [2026-08-28 15:45:03.296] @gammaloop_api::se... INFO : Running command set model mass_scalar_1=1.0
  1363. 203.02 s > [2026-08-28 15:45:03.296] @gammaloop_api::se... INFO : Running command set process -p triangle -i scalar_tri string '
  1364. 203.02 s > [kinematics.externals]
  1365. 203.02 s > type = "constant"
  1366. 203.02 s >
  1367. 203.02 s > [kinematics.externals.data]
  1368. 203.02 s > [...]
  1369. 203.02 s > [2026-08-28 15:45:03.300] @gammaloop_api::se... INFO : Running command set process -p box -i scalar_box string '
  1370. 203.02 s > [kinematics.externals]
  1371. 203.02 s > type = "constant"
  1372. 203.02 s >
  1373. 203.02 s > [kinematics.externals.data]
  1374. 203.02 s > [...]
  1375. 203.02 s > [2026-08-28 15:45:03.301] @gammaloop_api::se... INFO : Running command approach -x 1.0000000000000001e-1,2.0000000000000001e-1,2.9999999999999999e-1,4.0000000000000002e-1 --approach-axis 1.0000000000000000e-3,0.0000000000000000e0,0.0000000000000000e0,0.0000000000000000e0 --n-points 1 --n-cores 1 --output-results /build/source/tests/artifacts/scalar_box_invalid_momentum_approach/approach_momentum.json --momentum-space --graph-id 0
  1376. 203.02 s > The application panicked (crashed).
  1377. 203.02 s > Message: There are 2 processes available. Please specify a process.
  1378. 203.02 s > Location: tests/tests/test_runs/approach.rs:332
  1379. 203.02 s >
  1380. 203.02 s > ━━━━━━━━━━━━━━━━━━━━━━━━━━━━━━━━━━ BACKTRACE ━━━━━━━━━━━━━━━━━━━━━━━━━━━━━━━━━━━
  1381. 203.02 s > 1: <color_eyre[51793ea62743adbd]::config::PanicHook>::panic_report<unknown>
  1382. 203.02 s > at <unknown source file>:<unknown line>
  1383. 203.02 s > 2: <color_eyre[51793ea62743adbd]::config::PanicHook>::into_panic_hook::{closure#0}<unknown>
  1384. 203.02 s > at <unknown source file>:<unknown line>
  1385. 203.02 s > 3: std[bcb96dfbba0ab899]::panicking::panic_with_hook<unknown>
  1386. 203.02 s > at <unknown source file>:<unknown line>
  1387. 203.02 s > 4: std[bcb96dfbba0ab899]::panicking::panic_handler::{closure#0}<unknown>
  1388. 203.02 s > at <unknown source file>:<unknown line>
  1389. 203.02 s > 5: std[bcb96dfbba0ab899]::sys::backtrace::__rust_end_short_backtrace::<std[bcb96dfbba0ab899]::panicking::panic_handler::{closure#0}, !><unknown>
  1390. 203.02 s > at <unknown source file>:<unknown line>
  1391. 203.02 s > 6: __rustc[6c289b9f9c454d21]::rust_begin_unwind<unknown>
  1392. 203.02 s > at <unknown source file>:<unknown line>
  1393. 203.02 s > 7: core[940e698046960fd5]::panicking::panic_fmt<unknown>
  1394. 203.02 s > at <unknown source file>:<unknown line>
  1395. 203.02 s > 8: test_runs[3e7a390caee4e338]::approach::approach_momentum_space_reports_incomplete_triplet_cleanly<unknown>
  1396. 203.02 s > at <unknown source file>:<unknown line>
  1397. 203.02 s > 9: <test_runs[3e7a390caee4e338]::approach::approach_momentum_space_reports_incomplete_triplet_cleanly::{closure#0} as core[940e698046960fd5]::ops::function::FnOnce<()>>::call_once<unknown>
  1398. 203.02 s > at <unknown source file>:<unknown line>
  1399. 203.02 s > 10: test[75d6903177b1d7e9]::__rust_begin_short_backtrace::<core[940e698046960fd5]::result::Result<(), alloc[2ea6bcb46fca0c42]::string::String>, fn() -> core[940e698046960fd5]::result::Result<(), alloc[2ea6bcb46fca0c42]::string::String>><unknown>
  1400. 203.02 s > at <unknown source file>:<unknown line>
  1401. 203.02 s > 11: test[75d6903177b1d7e9]::run_test::{closure#0}<unknown>
  1402. 203.02 s > at <unknown source file>:<unknown line>
  1403. 203.02 s > 12: std[bcb96dfbba0ab899]::sys::backtrace::__rust_begin_short_backtrace::<test[75d6903177b1d7e9]::run_test::{closure#1}, ()><unknown>
  1404. 203.02 s > at <unknown source file>:<unknown line>
  1405. 203.02 s > 13: <std[bcb96dfbba0ab899]::thread::lifecycle::spawn_unchecked<test[75d6903177b1d7e9]::run_test::{closure#1}, ()>::{closure#1} as core[940e698046960fd5]::ops::function::FnOnce<()>>::call_once::{shim:vtable#0}<unknown>
  1406. 203.02 s > at <unknown source file>:<unknown line>
  1407. 203.02 s > 14: <std[bcb96dfbba0ab899]::sys::thread::unix::Thread>::new::thread_start<unknown>
  1408. 203.02 s > at <unknown source file>:<unknown line>
  1409. 203.02 s > 15: start_thread<unknown>
  1410. 203.02 s > at <unknown source file>:<unknown line>
  1411. 203.02 s > 16: __clone3<unknown>
  1412. 203.02 s > at <unknown source file>:<unknown line>
  1413. 203.02 s >
  1414. 203.02 s > Run with COLORBT_SHOW_HIDDEN=1 environment variable to disable frame filtering.
  1415. 203.02 s > ... omitted 1 more lines; see full nextest output above
  1416. 203.02 s >
  1417. 203.02 s > 2. gammaloop-integration-tests::test_runs::profile_bulk::box_4e_bulk_profile_passes
  1418. 203.02 s > failure: test failure with exit code 101
  1419. 203.02 s > Error:
  1420. 203.02 s > 0: IR profiling requested arbitrary precision but received a quad-precision result
  1421. 203.02 s >
  1422. 203.02 s > Location:
  1423. 203.02 s > crates/gammalooprs/src/integrands/process/ir.rs:2123
  1424. 203.02 s >
  1425. 203.02 s > ━━━━━━━━━━━━━━━━━━━━━━━━━━━━━━━━━━ BACKTRACE ━━━━━━━━━━━━━━━━━━━━━━━━━━━━━━━━━━━
  1426. 203.02 s > 1: <color_eyre[51793ea62743adbd]::config::EyreHook>::into_eyre_hook::{closure#0}<unknown>
  1427. 203.02 s > at <unknown source file>:<unknown line>
  1428. 203.02 s > 2: eyre[cb2fd339c0c40fca]::capture_handler<unknown>
  1429. 203.02 s > at <unknown source file>:<unknown line>
  1430. 203.02 s > 3: eyre[cb2fd339c0c40fca]::private::format_err<unknown>
  1431. 203.02 s > at <unknown source file>:<unknown line>
  1432. 203.02 s > 4: gammalooprs[d7a7c067ebd19583]::integrands::process::ir::evaluate_profile_momentum_point_arb::<gammalooprs[d7a7c067ebd19583]::integrands::process::amplitude::AmplitudeIntegrand><unknown>
  1433. 203.02 s > at <unknown source file>:<unknown line>
  1434. 203.02 s > 5: <gammalooprs[d7a7c067ebd19583]::integrands::process::amplitude::AmplitudeIntegrand>::test_single_ir_limit_impl<unknown>
  1435. 203.02 s > at <unknown source file>:<unknown line>
  1436. 203.02 s > 6: gammalooprs[d7a7c067ebd19583]::integrands::process::ir::run_ir_profile::<gammalooprs[d7a7c067ebd19583]::integrands::process::amplitude::AmplitudeIntegrand, <gammalooprs[d7a7c067ebd19583]::integrands::process::amplitude::AmplitudeIntegrand>::enumerate_ir_limits, <gammalooprs[d7a7c067ebd19583]::integrands::process::amplitude::AmplitudeIntegrand>::graph_cut_definitions, <gammalooprs[d7a7c067ebd19583]::integrands::process::amplitude::AmplitudeIntegrand>::test_single_ir_limit_impl><unknown>
  1437. 203.02 s > at <unknown source file>:<unknown line>
  1438. 203.02 s > 7: <gammalooprs[d7a7c067ebd19583]::integrands::process::amplitude::AmplitudeIntegrand>::test_ir<unknown>
  1439. 203.02 s > at <unknown source file>:<unknown line>
  1440. 203.02 s > 8: <gammaloop_api[92ae732909e47e14]::commands::profile::Profile>::run<unknown>
  1441. 203.02 s > at <unknown source file>:<unknown line>
  1442. 203.02 s > 9: test_runs[3e7a390caee4e338]::profile_bulk::box_4e_bulk_profile_passes<unknown>
  1443. 203.02 s > at <unknown source file>:<unknown line>
  1444. 203.02 s > 10: <test_runs[3e7a390caee4e338]::profile_bulk::box_4e_bulk_profile_passes::{closure#0} as core[940e698046960fd5]::ops::function::FnOnce<()>>::call_once<unknown>
  1445. 203.02 s > at <unknown source file>:<unknown line>
  1446. 203.02 s > 11: test[75d6903177b1d7e9]::__rust_begin_short_backtrace::<core[940e698046960fd5]::result::Result<(), alloc[2ea6bcb46fca0c42]::string::String>, fn() -> core[940e698046960fd5]::result::Result<(), alloc[2ea6bcb46fca0c42]::string::String>><unknown>
  1447. 203.02 s > at <unknown source file>:<unknown line>
  1448. 203.02 s > 12: test[75d6903177b1d7e9]::run_test::{closure#0}<unknown>
  1449. 203.02 s > at <unknown source file>:<unknown line>
  1450. 203.02 s > 13: std[bcb96dfbba0ab899]::sys::backtrace::__rust_begin_short_backtrace::<test[75d6903177b1d7e9]::run_test::{closure#1}, ()><unknown>
  1451. 203.02 s > at <unknown source file>:<unknown line>
  1452. 203.02 s > 14: <std[bcb96dfbba0ab899]::thread::lifecycle::spawn_unchecked<test[75d6903177b1d7e9]::run_test::{closure#1}, ()>::{closure#1} as core[940e698046960fd5]::ops::function::FnOnce<()>>::call_once::{shim:vtable#0}<unknown>
  1453. 203.02 s > at <unknown source file>:<unknown line>
  1454. 203.02 s > 15: <std[bcb96dfbba0ab899]::sys::thread::unix::Thread>::new::thread_start<unknown>
  1455. 203.02 s > at <unknown source file>:<unknown line>
  1456. 203.02 s > 16: start_thread<unknown>
  1457. 203.02 s > at <unknown source file>:<unknown line>
  1458. 203.02 s > 17: __clone3<unknown>
  1459. 203.02 s > at <unknown source file>:<unknown line>
  1460. 203.02 s >
  1461. 203.02 s > Run with COLORBT_SHOW_HIDDEN=1 environment variable to disable frame filtering.
  1462. 203.02 s > Run with RUST_BACKTRACE=full to include source snippets.
  1463. 203.02 s > Warning: SpanTrace capture is Unsupported.
  1464. 203.02 s > Ensure that you've setup a tracing-error ErrorLayer and the semver versions are compatible
  1465. 203.02 s > system-out
  1466. 203.02 s > running 1 test
  1467. 203.02 s > test profile_bulk::box_4e_bulk_profile_passes ... FAILED
  1468. 203.02 s >
  1469. 203.02 s > failures:
  1470. 203.02 s >
  1471. 203.02 s > failures:
  1472. 203.02 s > profile_bulk::box_4e_bulk_profile_passes
  1473. 203.02 s >
  1474. 203.02 s > test result: FAILED. 0 passed; 1 failed; 0 ignored; 0 measured; 82 filtered out; finished in 0.99s
  1475. 203.02 s > system-err
  1476. 203.02 s > [2026-08-28 15:45:06.916] @gammaloop_api::se... INFO : Running command import model ./assets/models/json/scalars/scalars.json
  1477. 203.02 s > [2026-08-28 15:45:06.916] @import::model INFO : Loading JSON model scalars-default from /build/source/assets/models/json/scalars/scalars
  1478. 203.02 s > [2026-08-28 15:45:06.940] @gammalooprs::model INFO : The following 2 external parameters were forced to zero by the restriction card:
  1479. 203.02 s > width_scalar_1, width_scalar_2
  1480. 203.02 s > [2026-08-28 15:45:06.942] @gammaloop_api::se... INFO : Running command import graphs ./tests/resources/graphs/massless_box.dot
  1481. 203.02 s > [2026-08-28 15:45:06.942] @commands::import INFO : Loading graphs from '/build/source/tests/resources/graphs/massless_box.dot'
  1482. 203.02 s > [2026-08-28 15:45:06.968] @gammaloop_api::se... INFO : Running command generate
  1483. 203.02 s > [2026-08-28 15:45:07.435] @commands::generate INFO :
  1484. 203.02 s > Integrand generation summary
  1485. 203.02 s > peak RAM 67.04 MiB | cores 1
  1486. 203.02 s > ╭───────────┬────────────────┬─────────┬─────────────┬─────────────┬────────────────┬─────────────╮
  1487. 203.02 s > │ integrand │ graph │ # evals │ expr build │ spenso │ symbolica eval │ compile │
  1488. 203.02 s > ├───────────┼────────────────┼─────────┼─────────────┼─────────────┼────────────────┼─────────────┤
  1489. 203.02 s > │ default │ massless_box_0 │ 14 │ 351ms (83%) │ 37ms (8.9%) │ 33ms (7.9%) │ 0ms (0.00%) │
  1490. 203.02 s > ├───────────┼────────────────┼─────────┼─────────────┼─────────────┼────────────────┼─────────────┤
  1491. 203.02 s > │ Total │ │ 14 │ 351ms (83%) │ 37ms (8.9%) │ 33ms (7.9%) │ 0ms (0.00%) │
  1492. 203.02 s > ╰───────────┴────────────────┴─────────┴─────────────┴─────────────┴────────────────┴─────────────╯
  1493. 203.02 s > [2026-08-28 15:45:07.446] @process::amplitude INFO : Input is above threshold: 4 existing threshold E-surfaces across 1/1 graph groups
  1494. 203.02 s > [2026-08-28 15:45:07.455] @process::amplitude INFO : overlap structure of group 0: [2: [8(4,6), 11(5,6)], 2: [4(3,4), 9(3,5)], 2: [9(3,5), 11(5,6)], 2: [4(3,4), 8(4,6)]]
  1495. 203.02 s > Error:
  1496. 203.02 s > 0: IR profiling requested arbitrary precision but received a quad-precision result
  1497. 203.02 s >
  1498. 203.02 s > Location:
  1499. 203.02 s > crates/gammalooprs/src/integrands/process/ir.rs:2123
  1500. 203.02 s >
  1501. 203.02 s > ━━━━━━━━━━━━━━━━━━━━━━━━━━━━━━━━━━ BACKTRACE ━━━━━━━━━━━━━━━━━━━━━━━━━━━━━━━━━━━
  1502. 203.02 s > 1: <color_eyre[51793ea62743adbd]::config::EyreHook>::into_eyre_hook::{closure#0}<unknown>
  1503. 203.02 s > at <unknown source file>:<unknown line>
  1504. 203.02 s > 2: eyre[cb2fd339c0c40fca]::capture_handler<unknown>
  1505. 203.02 s > at <unknown source file>:<unknown line>
  1506. 203.02 s > 3: eyre[cb2fd339c0c40fca]::private::format_err<unknown>
  1507. 203.02 s > at <unknown source file>:<unknown line>
  1508. 203.02 s > 4: gammalooprs[d7a7c067ebd19583]::integrands::process::ir::evaluate_profile_momentum_point_arb::<gammalooprs[d7a7c067ebd19583]::integrands::process::amplitude::AmplitudeIntegrand><unknown>
  1509. 203.02 s > at <unknown source file>:<unknown line>
  1510. 203.02 s > 5: <gammalooprs[d7a7c067ebd19583]::integrands::process::amplitude::AmplitudeIntegrand>::test_single_ir_limit_impl<unknown>
  1511. 203.02 s > at <unknown source file>:<unknown line>
  1512. 203.02 s > 6: gammalooprs[d7a7c067ebd19583]::integrands::process::ir::run_ir_profile::<gammalooprs[d7a7c067ebd19583]::integrands::process::amplitude::AmplitudeIntegrand, <gammalooprs[d7a7c067ebd19583]::integrands::process::amplitude::AmplitudeIntegrand>::enumerate_ir_limits, <gammalooprs[d7a7c067ebd19583]::integrands::process::amplitude::AmplitudeIntegrand>::graph_cut_definitions, <gammalooprs[d7a7c067ebd19583]::integrands::process::amplitude::AmplitudeIntegrand>::test_single_ir_limit_impl><unknown>
  1513. 203.02 s > at <unknown source file>:<unknown line>
  1514. 203.02 s > 7: <gammalooprs[d7a7c067ebd19583]::integrands::process::amplitude::AmplitudeIntegrand>::test_ir<unknown>
  1515. 203.02 s > at <unknown source file>:<unknown line>
  1516. 203.02 s > 8: <gammaloop_api[92ae732909e47e14]::commands::profile::Profile>::run<unknown>
  1517. 203.02 s > at <unknown source file>:<unknown line>
  1518. 203.02 s > 9: test_runs[3e7a390caee4e338]::profile_bulk::box_4e_bulk_profile_passes<unknown>
  1519. 203.02 s > at <unknown source file>:<unknown line>
  1520. 203.02 s > 10: <test_runs[3e7a390caee4e338]::profile_bulk::box_4e_bulk_profile_passes::{closure#0} as core[940e698046960fd5]::ops::function::FnOnce<()>>::call_once<unknown>
  1521. 203.02 s > at <unknown source file>:<unknown line>
  1522. 203.02 s > 11: test[75d6903177b1d7e9]::__rust_begin_short_backtrace::<core[940e698046960fd5]::result::Result<(), alloc[2ea6bcb46fca0c42]::string::String>, fn() -> core[940e698046960fd5]::result::Result<(), alloc[2ea6bcb46fca0c42]::string::String>><unknown>
  1523. 203.02 s > at <unknown source file>:<unknown line>
  1524. 203.02 s > 12: test[75d6903177b1d7e9]::run_test::{closure#0}<unknown>
  1525. 203.02 s > at <unknown source file>:<unknown line>
  1526. 203.02 s > 13: std[bcb96dfbba0ab899]::sys::backtrace::__rust_begin_short_backtrace::<test[75d6903177b1d7e9]::run_test::{closure#1}, ()><unknown>
  1527. 203.02 s > at <unknown source file>:<unknown line>
  1528. 203.02 s > 14: <std[bcb96dfbba0ab899]::thread::lifecycle::spawn_unchecked<test[75d6903177b1d7e9]::run_test::{closure#1}, ()>::{closure#1} as core[940e698046960fd5]::ops::function::FnOnce<()>>::call_once::{shim:vtable#0}<unknown>
  1529. 203.02 s > at <unknown source file>:<unknown line>
  1530. 203.02 s > 15: <std[bcb96dfbba0ab899]::sys::thread::unix::Thread>::new::thread_start<unknown>
  1531. 203.02 s > at <unknown source file>:<unknown line>
  1532. 203.02 s > 16: start_thread<unknown>
  1533. 203.02 s > at <unknown source file>:<unknown line>
  1534. 203.02 s > 17: __clone3<unknown>
  1535. 203.02 s > at <unknown source file>:<unknown line>
  1536. 203.02 s >
  1537. 203.02 s > Run with COLORBT_SHOW_HIDDEN=1 environment variable to disable frame filtering.
  1538. 203.02 s > Run with RUST_BACKTRACE=full to include source snippets.
  1539. 203.02 s > Warning: SpanTrace capture is Unsupported.
  1540. 203.02 s > Ensure that you've setup a tracing-error ErrorLayer and the semver versions are compatible
  1541. 203.02 s >
  1542. 203.02 s > 3. gammaloop-integration-tests::test_runs::profile_bulk::dotted_bubble_amp_bulk_profile_passes
  1543. 203.02 s > failure: test failure with exit code 101
  1544. 203.02 s > Error:
  1545. 203.02 s > 0: IR profiling requested arbitrary precision but received a quad-precision result
  1546. 203.02 s >
  1547. 203.02 s > Location:
  1548. 203.02 s > crates/gammalooprs/src/integrands/process/ir.rs:2123
  1549. 203.02 s >
  1550. 203.02 s > ━━━━━━━━━━━━━━━━━━━━━━━━━━━━━━━━━━ BACKTRACE ━━━━━━━━━━━━━━━━━━━━━━━━━━━━━━━━━━━
  1551. 203.02 s > 1: <color_eyre[51793ea62743adbd]::config::EyreHook>::into_eyre_hook::{closure#0}<unknown>
  1552. 203.02 s > at <unknown source file>:<unknown line>
  1553. 203.02 s > 2: eyre[cb2fd339c0c40fca]::capture_handler<unknown>
  1554. 203.02 s > at <unknown source file>:<unknown line>
  1555. 203.02 s > 3: eyre[cb2fd339c0c40fca]::private::format_err<unknown>
  1556. 203.02 s > at <unknown source file>:<unknown line>
  1557. 203.02 s > 4: gammalooprs[d7a7c067ebd19583]::integrands::process::ir::evaluate_profile_momentum_point_arb::<gammalooprs[d7a7c067ebd19583]::integrands::process::amplitude::AmplitudeIntegrand><unknown>
  1558. 203.02 s > at <unknown source file>:<unknown line>
  1559. 203.02 s > 5: <gammalooprs[d7a7c067ebd19583]::integrands::process::amplitude::AmplitudeIntegrand>::test_single_ir_limit_impl<unknown>
  1560. 203.02 s > at <unknown source file>:<unknown line>
  1561. 203.02 s > 6: gammalooprs[d7a7c067ebd19583]::integrands::process::ir::run_ir_profile::<gammalooprs[d7a7c067ebd19583]::integrands::process::amplitude::AmplitudeIntegrand, <gammalooprs[d7a7c067ebd19583]::integrands::process::amplitude::AmplitudeIntegrand>::enumerate_ir_limits, <gammalooprs[d7a7c067ebd19583]::integrands::process::amplitude::AmplitudeIntegrand>::graph_cut_definitions, <gammalooprs[d7a7c067ebd19583]::integrands::process::amplitude::AmplitudeIntegrand>::test_single_ir_limit_impl><unknown>
  1562. 203.02 s > at <unknown source file>:<unknown line>
  1563. 203.02 s > 7: <gammalooprs[d7a7c067ebd19583]::integrands::process::amplitude::AmplitudeIntegrand>::test_ir<unknown>
  1564. 203.02 s > at <unknown source file>:<unknown line>
  1565. 203.02 s > 8: <gammaloop_api[92ae732909e47e14]::commands::profile::Profile>::run<unknown>
  1566. 203.02 s > at <unknown source file>:<unknown line>
  1567. 203.02 s > 9: test_runs[3e7a390caee4e338]::profile_bulk::dotted_bubble_amp_bulk_profile_passes<unknown>
  1568. 203.02 s > at <unknown source file>:<unknown line>
  1569. 203.02 s > 10: <test_runs[3e7a390caee4e338]::profile_bulk::dotted_bubble_amp_bulk_profile_passes::{closure#0} as core[940e698046960fd5]::ops::function::FnOnce<()>>::call_once<unknown>
  1570. 203.02 s > at <unknown source file>:<unknown line>
  1571. 203.02 s > 11: test[75d6903177b1d7e9]::__rust_begin_short_backtrace::<core[940e698046960fd5]::result::Result<(), alloc[2ea6bcb46fca0c42]::string::String>, fn() -> core[940e698046960fd5]::result::Result<(), alloc[2ea6bcb46fca0c42]::string::String>><unknown>
  1572. 203.02 s > at <unknown source file>:<unknown line>
  1573. 203.02 s > 12: test[75d6903177b1d7e9]::run_test::{closure#0}<unknown>
  1574. 203.02 s > at <unknown source file>:<unknown line>
  1575. 203.02 s > 13: std[bcb96dfbba0ab899]::sys::backtrace::__rust_begin_short_backtrace::<test[75d6903177b1d7e9]::run_test::{closure#1}, ()><unknown>
  1576. 203.02 s > at <unknown source file>:<unknown line>
  1577. 203.02 s > 14: <std[bcb96dfbba0ab899]::thread::lifecycle::spawn_unchecked<test[75d6903177b1d7e9]::run_test::{closure#1}, ()>::{closure#1} as core[940e698046960fd5]::ops::function::FnOnce<()>>::call_once::{shim:vtable#0}<unknown>
  1578. 203.02 s > at <unknown source file>:<unknown line>
  1579. 203.02 s > 15: <std[bcb96dfbba0ab899]::sys::thread::unix::Thread>::new::thread_start<unknown>
  1580. 203.02 s > at <unknown source file>:<unknown line>
  1581. 203.02 s > 16: start_thread<unknown>
  1582. 203.02 s > at <unknown source file>:<unknown line>
  1583. 203.02 s > 17: __clone3<unknown>
  1584. 203.02 s > at <unknown source file>:<unknown line>
  1585. 203.02 s >
  1586. 203.02 s > Run with COLORBT_SHOW_HIDDEN=1 environment variable to disable frame filtering.
  1587. 203.02 s > Run with RUST_BACKTRACE=full to include source snippets.
  1588. 203.02 s > Warning: SpanTrace capture is Unsupported.
  1589. 203.02 s > Ensure that you've setup a tracing-error ErrorLayer and the semver versions are compatible
  1590. 203.02 s > system-out
  1591. 203.02 s > running 1 test
  1592. 203.02 s > test profile_bulk::dotted_bubble_amp_bulk_profile_passes ... FAILED
  1593. 203.02 s >
  1594. 203.02 s > failures:
  1595. 203.02 s >
  1596. 203.02 s > failures:
  1597. 203.02 s > profile_bulk::dotted_bubble_amp_bulk_profile_passes
  1598. 203.02 s >
  1599. 203.02 s > test result: FAILED. 0 passed; 1 failed; 0 ignored; 0 measured; 82 filtered out; finished in 0.78s
  1600. 203.02 s > system-err
  1601. 203.02 s > [2026-08-28 15:45:07.387] @gammaloop_api::se... INFO : Running command import model ./assets/models/json/scalars/scalars_2p_3p.json
  1602. 203.02 s > [2026-08-28 15:45:07.387] @import::model INFO : Loading JSON model scalars_2p_3p-default from /build/source/assets/models/json/scalars/scalars_2p_3p
  1603. 203.02 s > [2026-08-28 15:45:07.390] @gammaloop_api::se... INFO : Running command import graphs ./tests/resources/graphs/dotted_bubble_amp.dot
  1604. 203.02 s > [2026-08-28 15:45:07.390] @commands::import INFO : Loading graphs from '/build/source/tests/resources/graphs/dotted_bubble_amp.dot'
  1605. 203.02 s > [2026-08-28 15:45:07.409] @gammaloop_api::se... INFO : Running command generate
  1606. 203.02 s > [2026-08-28 15:45:07.830] @commands::generate INFO :
  1607. 203.02 s > Integrand generation summary
  1608. 203.02 s > peak RAM 67.18 MiB | cores 1
  1609. 203.02 s > ╭───────────┬───────────────────┬─────────┬─────────────┬────────────┬────────────────┬─────────────╮
  1610. 203.02 s > │ integrand │ graph │ # evals │ expr build │ spenso │ symbolica eval │ compile │
  1611. 203.02 s > ├───────────┼───────────────────┼─────────┼─────────────┼────────────┼────────────────┼─────────────┤
  1612. 203.02 s > │ default │ dotted_bubble_amp │ 8 │ 283ms (87%) │ 8ms (2.6%) │ 34ms (11%) │ 0ms (0.00%) │
  1613. 203.02 s > ├───────────┼───────────────────┼─────────┼─────────────┼────────────┼────────────────┼─────────────┤
  1614. 203.02 s > │ Total │ │ 8 │ 283ms (87%) │ 8ms (2.6%) │ 34ms (11%) │ 0ms (0.00%) │
  1615. 203.02 s > ╰───────────┴───────────────────┴─────────┴─────────────┴────────────┴────────────────┴─────────────╯
  1616. 203.02 s > [2026-08-28 15:45:07.832] @process::amplitude INFO : Input is above threshold: 1 existing threshold E-surfaces across 1/1 graph groups
  1617. 203.02 s > [2026-08-28 15:45:07.832] @process::amplitude INFO : overlap structure of group 0: [1: [1(1,3)]]
  1618. 203.02 s > Error:
  1619. 203.02 s > 0: IR profiling requested arbitrary precision but received a quad-precision result
  1620. 203.02 s >
  1621. 203.02 s > Location:
  1622. 203.02 s > crates/gammalooprs/src/integrands/process/ir.rs:2123
  1623. 203.02 s >
  1624. 203.02 s > ━━━━━━━━━━━━━━━━━━━━━━━━━━━━━━━━━━ BACKTRACE ━━━━━━━━━━━━━━━━━━━━━━━━━━━━━━━━━━━
  1625. 203.02 s > 1: <color_eyre[51793ea62743adbd]::config::EyreHook>::into_eyre_hook::{closure#0}<unknown>
  1626. 203.02 s > at <unknown source file>:<unknown line>
  1627. 203.02 s > 2: eyre[cb2fd339c0c40fca]::capture_handler<unknown>
  1628. 203.02 s > at <unknown source file>:<unknown line>
  1629. 203.02 s > 3: eyre[cb2fd339c0c40fca]::private::format_err<unknown>
  1630. 203.02 s > at <unknown source file>:<unknown line>
  1631. 203.02 s > 4: gammalooprs[d7a7c067ebd19583]::integrands::process::ir::evaluate_profile_momentum_point_arb::<gammalooprs[d7a7c067ebd19583]::integrands::process::amplitude::AmplitudeIntegrand><unknown>
  1632. 203.02 s > at <unknown source file>:<unknown line>
  1633. 203.02 s > 5: <gammalooprs[d7a7c067ebd19583]::integrands::process::amplitude::AmplitudeIntegrand>::test_single_ir_limit_impl<unknown>
  1634. 203.02 s > at <unknown source file>:<unknown line>
  1635. 203.02 s > 6: gammalooprs[d7a7c067ebd19583]::integrands::process::ir::run_ir_profile::<gammalooprs[d7a7c067ebd19583]::integrands::process::amplitude::AmplitudeIntegrand, <gammalooprs[d7a7c067ebd19583]::integrands::process::amplitude::AmplitudeIntegrand>::enumerate_ir_limits, <gammalooprs[d7a7c067ebd19583]::integrands::process::amplitude::AmplitudeIntegrand>::graph_cut_definitions, <gammalooprs[d7a7c067ebd19583]::integrands::process::amplitude::AmplitudeIntegrand>::test_single_ir_limit_impl><unknown>
  1636. 203.02 s > at <unknown source file>:<unknown line>
  1637. 203.02 s > 7: <gammalooprs[d7a7c067ebd19583]::integrands::process::amplitude::AmplitudeIntegrand>::test_ir<unknown>
  1638. 203.02 s > at <unknown source file>:<unknown line>
  1639. 203.02 s > 8: <gammaloop_api[92ae732909e47e14]::commands::profile::Profile>::run<unknown>
  1640. 203.02 s > at <unknown source file>:<unknown line>
  1641. 203.02 s > 9: test_runs[3e7a390caee4e338]::profile_bulk::dotted_bubble_amp_bulk_profile_passes<unknown>
  1642. 203.02 s > at <unknown source file>:<unknown line>
  1643. 203.02 s > 10: <test_runs[3e7a390caee4e338]::profile_bulk::dotted_bubble_amp_bulk_profile_passes::{closure#0} as core[940e698046960fd5]::ops::function::FnOnce<()>>::call_once<unknown>
  1644. 203.02 s > at <unknown source file>:<unknown line>
  1645. 203.02 s > 11: test[75d6903177b1d7e9]::__rust_begin_short_backtrace::<core[940e698046960fd5]::result::Result<(), alloc[2ea6bcb46fca0c42]::string::String>, fn() -> core[940e698046960fd5]::result::Result<(), alloc[2ea6bcb46fca0c42]::string::String>><unknown>
  1646. 203.02 s > at <unknown source file>:<unknown line>
  1647. 203.02 s > 12: test[75d6903177b1d7e9]::run_test::{closure#0}<unknown>
  1648. 203.02 s > at <unknown source file>:<unknown line>
  1649. 203.02 s > 13: std[bcb96dfbba0ab899]::sys::backtrace::__rust_begin_short_backtrace::<test[75d6903177b1d7e9]::run_test::{closure#1}, ()><unknown>
  1650. 203.02 s > at <unknown source file>:<unknown line>
  1651. 203.02 s > 14: <std[bcb96dfbba0ab899]::thread::lifecycle::spawn_unchecked<test[75d6903177b1d7e9]::run_test::{closure#1}, ()>::{closure#1} as core[940e698046960fd5]::ops::function::FnOnce<()>>::call_once::{shim:vtable#0}<unknown>
  1652. 203.02 s > at <unknown source file>:<unknown line>
  1653. 203.02 s > 15: <std[bcb96dfbba0ab899]::sys::thread::unix::Thread>::new::thread_start<unknown>
  1654. 203.02 s > at <unknown source file>:<unknown line>
  1655. 203.02 s > 16: start_thread<unknown>
  1656. 203.02 s > at <unknown source file>:<unknown line>
  1657. 203.02 s > 17: __clone3<unknown>
  1658. 203.02 s > at <unknown source file>:<unknown line>
  1659. 203.02 s >
  1660. 203.02 s > Run with COLORBT_SHOW_HIDDEN=1 environment variable to disable frame filtering.
  1661. 203.02 s > Run with RUST_BACKTRACE=full to include source snippets.
  1662. 203.02 s > Warning: SpanTrace capture is Unsupported.
  1663. 203.02 s > Ensure that you've setup a tracing-error ErrorLayer and the semver versions are compatible
  1664. 203.02 s >
  1665. 203.02 s > 4. gammaloop-integration-tests::test_runs::profile_bulk::massless_triangle_bulk_profile_passes
  1666. 203.02 s > failure: test failure with exit code 101
  1667. 203.02 s > Error:
  1668. 203.02 s > 0: IR profiling requested arbitrary precision but received a quad-precision result
  1669. 203.02 s >
  1670. 203.02 s > Location:
  1671. 203.02 s > crates/gammalooprs/src/integrands/process/ir.rs:2123
  1672. 203.02 s >
  1673. 203.02 s > ━━━━━━━━━━━━━━━━━━━━━━━━━━━━━━━━━━ BACKTRACE ━━━━━━━━━━━━━━━━━━━━━━━━━━━━━━━━━━━
  1674. 203.02 s > 1: <color_eyre[51793ea62743adbd]::config::EyreHook>::into_eyre_hook::{closure#0}<unknown>
  1675. 203.02 s > at <unknown source file>:<unknown line>
  1676. 203.02 s > 2: eyre[cb2fd339c0c40fca]::capture_handler<unknown>
  1677. 203.02 s > at <unknown source file>:<unknown line>
  1678. 203.02 s > 3: eyre[cb2fd339c0c40fca]::private::format_err<unknown>
  1679. 203.02 s > at <unknown source file>:<unknown line>
  1680. 203.02 s > 4: gammalooprs[d7a7c067ebd19583]::integrands::process::ir::evaluate_profile_momentum_point_arb::<gammalooprs[d7a7c067ebd19583]::integrands::process::amplitude::AmplitudeIntegrand><unknown>
  1681. 203.02 s > at <unknown source file>:<unknown line>
  1682. 203.02 s > 5: <gammalooprs[d7a7c067ebd19583]::integrands::process::amplitude::AmplitudeIntegrand>::test_single_ir_limit_impl<unknown>
  1683. 203.02 s > at <unknown source file>:<unknown line>
  1684. 203.02 s > 6: gammalooprs[d7a7c067ebd19583]::integrands::process::ir::run_ir_profile::<gammalooprs[d7a7c067ebd19583]::integrands::process::amplitude::AmplitudeIntegrand, <gammalooprs[d7a7c067ebd19583]::integrands::process::amplitude::AmplitudeIntegrand>::enumerate_ir_limits, <gammalooprs[d7a7c067ebd19583]::integrands::process::amplitude::AmplitudeIntegrand>::graph_cut_definitions, <gammalooprs[d7a7c067ebd19583]::integrands::process::amplitude::AmplitudeIntegrand>::test_single_ir_limit_impl><unknown>
  1685. 203.02 s > at <unknown source file>:<unknown line>
  1686. 203.02 s > 7: <gammalooprs[d7a7c067ebd19583]::integrands::process::amplitude::AmplitudeIntegrand>::test_ir<unknown>
  1687. 203.02 s > at <unknown source file>:<unknown line>
  1688. 203.02 s > 8: <gammaloop_api[92ae732909e47e14]::commands::profile::Profile>::run<unknown>
  1689. 203.02 s > at <unknown source file>:<unknown line>
  1690. 203.02 s > 9: test_runs[3e7a390caee4e338]::profile_bulk::massless_triangle_bulk_profile_passes<unknown>
  1691. 203.02 s > at <unknown source file>:<unknown line>
  1692. 203.02 s > 10: <test_runs[3e7a390caee4e338]::profile_bulk::massless_triangle_bulk_profile_passes::{closure#0} as core[940e698046960fd5]::ops::function::FnOnce<()>>::call_once<unknown>
  1693. 203.02 s > at <unknown source file>:<unknown line>
  1694. 203.02 s > 11: test[75d6903177b1d7e9]::__rust_begin_short_backtrace::<core[940e698046960fd5]::result::Result<(), alloc[2ea6bcb46fca0c42]::string::String>, fn() -> core[940e698046960fd5]::result::Result<(), alloc[2ea6bcb46fca0c42]::string::String>><unknown>
  1695. 203.02 s > at <unknown source file>:<unknown line>
  1696. 203.02 s > 12: test[75d6903177b1d7e9]::run_test::{closure#0}<unknown>
  1697. 203.02 s > at <unknown source file>:<unknown line>
  1698. 203.02 s > 13: std[bcb96dfbba0ab899]::sys::backtrace::__rust_begin_short_backtrace::<test[75d6903177b1d7e9]::run_test::{closure#1}, ()><unknown>
  1699. 203.02 s > at <unknown source file>:<unknown line>
  1700. 203.02 s > 14: <std[bcb96dfbba0ab899]::thread::lifecycle::spawn_unchecked<test[75d6903177b1d7e9]::run_test::{closure#1}, ()>::{closure#1} as core[940e698046960fd5]::ops::function::FnOnce<()>>::call_once::{shim:vtable#0}<unknown>
  1701. 203.02 s > at <unknown source file>:<unknown line>
  1702. 203.02 s > 15: <std[bcb96dfbba0ab899]::sys::thread::unix::Thread>::new::thread_start<unknown>
  1703. 203.02 s > at <unknown source file>:<unknown line>
  1704. 203.02 s > 16: start_thread<unknown>
  1705. 203.02 s > at <unknown source file>:<unknown line>
  1706. 203.02 s > 17: __clone3<unknown>
  1707. 203.02 s > at <unknown source file>:<unknown line>
  1708. 203.02 s >
  1709. 203.02 s > Run with COLORBT_SHOW_HIDDEN=1 environment variable to disable frame filtering.
  1710. 203.02 s > Run with RUST_BACKTRACE=full to include source snippets.
  1711. 203.02 s > Warning: SpanTrace capture is Unsupported.
  1712. 203.02 s > Ensure that you've setup a tracing-error ErrorLayer and the semver versions are compatible
  1713. 203.02 s > system-out
  1714. 203.02 s > running 1 test
  1715. 203.02 s > test profile_bulk::massless_triangle_bulk_profile_passes ... FAILED
  1716. 203.02 s >
  1717. 203.02 s > failures:
  1718. 203.02 s >
  1719. 203.02 s > failures:
  1720. 203.02 s > profile_bulk::massless_triangle_bulk_profile_passes
  1721. 203.02 s >
  1722. 203.02 s > test result: FAILED. 0 passed; 1 failed; 0 ignored; 0 measured; 82 filtered out; finished in 1.05s
  1723. 203.02 s > system-err
  1724. 203.02 s > [2026-08-28 15:45:08.017] @gammaloop_api::se... INFO : Running command import model scalars
  1725. 203.02 s > [2026-08-28 15:45:08.018] @import::model INFO : Loading built-in JSON model scalars-default
  1726. 203.02 s > [2026-08-28 15:45:08.036] @gammalooprs::model INFO : The following 2 external parameters were forced to zero by the restriction card:
  1727. 203.02 s > width_scalar_1, width_scalar_2
  1728. 203.02 s > [2026-08-28 15:45:08.038] @gammaloop_api::se... INFO : Running command import graphs ./tests/resources/graphs/massless_triangle.dot
  1729. 203.02 s > [2026-08-28 15:45:08.038] @commands::import INFO : Loading graphs from '/build/source/tests/resources/graphs/massless_triangle.dot'
  1730. 203.02 s > [2026-08-28 15:45:08.065] @gammaloop_api::se... INFO : Running command generate
  1731. 203.02 s > [2026-08-28 15:45:08.397] @commands::generate INFO :
  1732. 203.02 s > Integrand generation summary
  1733. 203.02 s > peak RAM 65.54 MiB | cores 1
  1734. 203.02 s > ╭───────────┬─────────────────────┬─────────┬─────────────┬────────────┬────────────────┬─────────────╮
  1735. 203.02 s > │ integrand │ graph │ # evals │ expr build │ spenso │ symbolica eval │ compile │
  1736. 203.02 s > ├───────────┼─────────────────────┼─────────┼─────────────┼────────────┼────────────────┼─────────────┤
  1737. 203.02 s > │ default │ massless_triangle_0 │ 9 │ 286ms (92%) │ 6ms (2.2%) │ 17ms (5.6%) │ 0ms (0.00%) │
  1738. 203.02 s > ├───────────┼─────────────────────┼─────────┼─────────────┼────────────┼────────────────┼─────────────┤
  1739. 203.02 s > │ Total │ │ 9 │ 286ms (92%) │ 6ms (2.2%) │ 17ms (5.6%) │ 0ms (0.00%) │
  1740. 203.02 s > ╰───────────┴─────────────────────┴─────────┴─────────────┴────────────┴────────────────┴─────────────╯
  1741. 203.02 s > [2026-08-28 15:45:08.400] @process::amplitude INFO : Input is above threshold: 2 existing threshold E-surfaces across 1/1 graph groups
  1742. 203.02 s > [2026-08-28 15:45:08.404] @process::amplitude INFO : overlap structure of group 0: [2: [0(1,5), 1(1,3)]]
  1743. 203.02 s > Error:
  1744. 203.02 s > 0: IR profiling requested arbitrary precision but received a quad-precision result
  1745. 203.02 s >
  1746. 203.02 s > Location:
  1747. 203.02 s > crates/gammalooprs/src/integrands/process/ir.rs:2123
  1748. 203.02 s >
  1749. 203.02 s > ━━━━━━━━━━━━━━━━━━━━━━━━━━━━━━━━━━ BACKTRACE ━━━━━━━━━━━━━━━━━━━━━━━━━━━━━━━━━━━
  1750. 203.02 s > 1: <color_eyre[51793ea62743adbd]::config::EyreHook>::into_eyre_hook::{closure#0}<unknown>
  1751. 203.02 s > at <unknown source file>:<unknown line>
  1752. 203.02 s > 2: eyre[cb2fd339c0c40fca]::capture_handler<unknown>
  1753. 203.02 s > at <unknown source file>:<unknown line>
  1754. 203.02 s > 3: eyre[cb2fd339c0c40fca]::private::format_err<unknown>
  1755. 203.02 s > at <unknown source file>:<unknown line>
  1756. 203.02 s > 4: gammalooprs[d7a7c067ebd19583]::integrands::process::ir::evaluate_profile_momentum_point_arb::<gammalooprs[d7a7c067ebd19583]::integrands::process::amplitude::AmplitudeIntegrand><unknown>
  1757. 203.02 s > at <unknown source file>:<unknown line>
  1758. 203.02 s > 5: <gammalooprs[d7a7c067ebd19583]::integrands::process::amplitude::AmplitudeIntegrand>::test_single_ir_limit_impl<unknown>
  1759. 203.02 s > at <unknown source file>:<unknown line>
  1760. 203.02 s > 6: gammalooprs[d7a7c067ebd19583]::integrands::process::ir::run_ir_profile::<gammalooprs[d7a7c067ebd19583]::integrands::process::amplitude::AmplitudeIntegrand, <gammalooprs[d7a7c067ebd19583]::integrands::process::amplitude::AmplitudeIntegrand>::enumerate_ir_limits, <gammalooprs[d7a7c067ebd19583]::integrands::process::amplitude::AmplitudeIntegrand>::graph_cut_definitions, <gammalooprs[d7a7c067ebd19583]::integrands::process::amplitude::AmplitudeIntegrand>::test_single_ir_limit_impl><unknown>
  1761. 203.02 s > at <unknown source file>:<unknown line>
  1762. 203.02 s > 7: <gammalooprs[d7a7c067ebd19583]::integrands::process::amplitude::AmplitudeIntegrand>::test_ir<unknown>
  1763. 203.02 s > at <unknown source file>:<unknown line>
  1764. 203.02 s > 8: <gammaloop_api[92ae732909e47e14]::commands::profile::Profile>::run<unknown>
  1765. 203.02 s > at <unknown source file>:<unknown line>
  1766. 203.02 s > 9: test_runs[3e7a390caee4e338]::profile_bulk::massless_triangle_bulk_profile_passes<unknown>
  1767. 203.02 s > at <unknown source file>:<unknown line>
  1768. 203.02 s > 10: <test_runs[3e7a390caee4e338]::profile_bulk::massless_triangle_bulk_profile_passes::{closure#0} as core[940e698046960fd5]::ops::function::FnOnce<()>>::call_once<unknown>
  1769. 203.02 s > at <unknown source file>:<unknown line>
  1770. 203.02 s > 11: test[75d6903177b1d7e9]::__rust_begin_short_backtrace::<core[940e698046960fd5]::result::Result<(), alloc[2ea6bcb46fca0c42]::string::String>, fn() -> core[940e698046960fd5]::result::Result<(), alloc[2ea6bcb46fca0c42]::string::String>><unknown>
  1771. 203.02 s > at <unknown source file>:<unknown line>
  1772. 203.02 s > 12: test[75d6903177b1d7e9]::run_test::{closure#0}<unknown>
  1773. 203.02 s > at <unknown source file>:<unknown line>
  1774. 203.02 s > 13: std[bcb96dfbba0ab899]::sys::backtrace::__rust_begin_short_backtrace::<test[75d6903177b1d7e9]::run_test::{closure#1}, ()><unknown>
  1775. 203.02 s > at <unknown source file>:<unknown line>
  1776. 203.02 s > 14: <std[bcb96dfbba0ab899]::thread::lifecycle::spawn_unchecked<test[75d6903177b1d7e9]::run_test::{closure#1}, ()>::{closure#1} as core[940e698046960fd5]::ops::function::FnOnce<()>>::call_once::{shim:vtable#0}<unknown>
  1777. 203.02 s > at <unknown source file>:<unknown line>
  1778. 203.02 s > 15: <std[bcb96dfbba0ab899]::sys::thread::unix::Thread>::new::thread_start<unknown>
  1779. 203.02 s > at <unknown source file>:<unknown line>
  1780. 203.02 s > 16: start_thread<unknown>
  1781. 203.02 s > at <unknown source file>:<unknown line>
  1782. 203.02 s > 17: __clone3<unknown>
  1783. 203.02 s > at <unknown source file>:<unknown line>
  1784. 203.02 s >
  1785. 203.02 s > Run with COLORBT_SHOW_HIDDEN=1 environment variable to disable frame filtering.
  1786. 203.02 s > Run with RUST_BACKTRACE=full to include source snippets.
  1787. 203.02 s > Warning: SpanTrace capture is Unsupported.
  1788. 203.02 s > Ensure that you've setup a tracing-error ErrorLayer and the semver versions are compatible
  1789. 203.02 s >
  1790. 203.02 s > 5. gammaloop-integration-tests::test_runs::profile_bulk::scalar_self_energy_amp_bulk_profile_passes
  1791. 203.02 s > failure: test failure with exit code 101
  1792. 203.02 s > Error:
  1793. 203.02 s > 0: IR profiling requested arbitrary precision but received a quad-precision result
  1794. 203.02 s >
  1795. 203.02 s > Location:
  1796. 203.02 s > crates/gammalooprs/src/integrands/process/ir.rs:2123
  1797. 203.02 s >
  1798. 203.02 s > ━━━━━━━━━━━━━━━━━━━━━━━━━━━━━━━━━━ BACKTRACE ━━━━━━━━━━━━━━━━━━━━━━━━━━━━━━━━━━━
  1799. 203.02 s > 1: <color_eyre[51793ea62743adbd]::config::EyreHook>::into_eyre_hook::{closure#0}<unknown>
  1800. 203.02 s > at <unknown source file>:<unknown line>
  1801. 203.02 s > 2: eyre[cb2fd339c0c40fca]::capture_handler<unknown>
  1802. 203.02 s > at <unknown source file>:<unknown line>
  1803. 203.02 s > 3: eyre[cb2fd339c0c40fca]::private::format_err<unknown>
  1804. 203.02 s > at <unknown source file>:<unknown line>
  1805. 203.02 s > 4: gammalooprs[d7a7c067ebd19583]::integrands::process::ir::evaluate_profile_momentum_point_arb::<gammalooprs[d7a7c067ebd19583]::integrands::process::amplitude::AmplitudeIntegrand><unknown>
  1806. 203.02 s > at <unknown source file>:<unknown line>
  1807. 203.02 s > 5: <gammalooprs[d7a7c067ebd19583]::integrands::process::amplitude::AmplitudeIntegrand>::test_single_ir_limit_impl<unknown>
  1808. 203.02 s > at <unknown source file>:<unknown line>
  1809. 203.02 s > 6: gammalooprs[d7a7c067ebd19583]::integrands::process::ir::run_ir_profile::<gammalooprs[d7a7c067ebd19583]::integrands::process::amplitude::AmplitudeIntegrand, <gammalooprs[d7a7c067ebd19583]::integrands::process::amplitude::AmplitudeIntegrand>::enumerate_ir_limits, <gammalooprs[d7a7c067ebd19583]::integrands::process::amplitude::AmplitudeIntegrand>::graph_cut_definitions, <gammalooprs[d7a7c067ebd19583]::integrands::process::amplitude::AmplitudeIntegrand>::test_single_ir_limit_impl><unknown>
  1810. 203.02 s > at <unknown source file>:<unknown line>
  1811. 203.02 s > 7: <gammalooprs[d7a7c067ebd19583]::integrands::process::amplitude::AmplitudeIntegrand>::test_ir<unknown>
  1812. 203.02 s > at <unknown source file>:<unknown line>
  1813. 203.02 s > 8: <gammaloop_api[92ae732909e47e14]::commands::profile::Profile>::run<unknown>
  1814. 203.02 s > at <unknown source file>:<unknown line>
  1815. 203.02 s > 9: test_runs[3e7a390caee4e338]::profile_bulk::scalar_self_energy_amp_bulk_profile_passes<unknown>
  1816. 203.02 s > at <unknown source file>:<unknown line>
  1817. 203.02 s > 10: <test_runs[3e7a390caee4e338]::profile_bulk::scalar_self_energy_amp_bulk_profile_passes::{closure#0} as core[940e698046960fd5]::ops::function::FnOnce<()>>::call_once<unknown>
  1818. 203.02 s > at <unknown source file>:<unknown line>
  1819. 203.02 s > 11: test[75d6903177b1d7e9]::__rust_begin_short_backtrace::<core[940e698046960fd5]::result::Result<(), alloc[2ea6bcb46fca0c42]::string::String>, fn() -> core[940e698046960fd5]::result::Result<(), alloc[2ea6bcb46fca0c42]::string::String>><unknown>
  1820. 203.02 s > at <unknown source file>:<unknown line>
  1821. 203.02 s > 12: test[75d6903177b1d7e9]::run_test::{closure#0}<unknown>
  1822. 203.02 s > at <unknown source file>:<unknown line>
  1823. 203.02 s > 13: std[bcb96dfbba0ab899]::sys::backtrace::__rust_begin_short_backtrace::<test[75d6903177b1d7e9]::run_test::{closure#1}, ()><unknown>
  1824. 203.02 s > at <unknown source file>:<unknown line>
  1825. 203.02 s > 14: <std[bcb96dfbba0ab899]::thread::lifecycle::spawn_unchecked<test[75d6903177b1d7e9]::run_test::{closure#1}, ()>::{closure#1} as core[940e698046960fd5]::ops::function::FnOnce<()>>::call_once::{shim:vtable#0}<unknown>
  1826. 203.02 s > at <unknown source file>:<unknown line>
  1827. 203.02 s > 15: <std[bcb96dfbba0ab899]::sys::thread::unix::Thread>::new::thread_start<unknown>
  1828. 203.02 s > at <unknown source file>:<unknown line>
  1829. 203.02 s > 16: start_thread<unknown>
  1830. 203.02 s > at <unknown source file>:<unknown line>
  1831. 203.02 s > 17: __clone3<unknown>
  1832. 203.02 s > at <unknown source file>:<unknown line>
  1833. 203.02 s >
  1834. 203.02 s > Run with COLORBT_SHOW_HIDDEN=1 environment variable to disable frame filtering.
  1835. 203.02 s > Run with RUST_BACKTRACE=full to include source snippets.
  1836. 203.02 s > Warning: SpanTrace capture is Unsupported.
  1837. 203.02 s > Ensure that you've setup a tracing-error ErrorLayer and the semver versions are compatible
  1838. 203.02 s > system-out
  1839. 203.02 s > running 1 test
  1840. 203.02 s > test profile_bulk::scalar_self_energy_amp_bulk_profile_passes ... FAILED
  1841. 203.02 s >
  1842. 203.02 s > failures:
  1843. 203.02 s >
  1844. 203.02 s > failures:
  1845. 203.02 s > profile_bulk::scalar_self_energy_amp_bulk_profile_passes
  1846. 203.02 s >
  1847. 203.02 s > test result: FAILED. 0 passed; 1 failed; 0 ignored; 0 measured; 82 filtered out; finished in 0.88s
  1848. 203.02 s > system-err
  1849. 203.02 s > [2026-08-28 15:45:08.095] @gammaloop_api::se... INFO : Running command import model ./assets/models/json/scalars/scalars.json
  1850. 203.02 s > [2026-08-28 15:45:08.095] @import::model INFO : Loading JSON model scalars-default from /build/source/assets/models/json/scalars/scalars
  1851. 203.02 s > [2026-08-28 15:45:08.105] @gammalooprs::model INFO : The following 2 external parameters were forced to zero by the restriction card:
  1852. 203.02 s > width_scalar_1, width_scalar_2
  1853. 203.02 s > [2026-08-28 15:45:08.106] @gammaloop_api::se... INFO : Running command import graphs ./tests/resources/graphs/scalar_self_energy_amp.dot
  1854. 203.02 s > [2026-08-28 15:45:08.106] @commands::import INFO : Loading graphs from '/build/source/tests/resources/graphs/scalar_self_energy_amp.dot'
  1855. 203.02 s > [2026-08-28 15:45:08.121] @gammaloop_api::se... INFO : Running command generate
  1856. 203.02 s > [2026-08-28 15:45:08.443] @commands::generate INFO :
  1857. 203.02 s > Integrand generation summary
  1858. 203.02 s > peak RAM 71.08 MiB | cores 1
  1859. 203.02 s > ╭───────────┬────────────────────────┬─────────┬─────────────┬─────────────┬────────────────┬─────────────╮
  1860. 203.02 s > │ integrand │ graph │ # evals │ expr build │ spenso │ symbolica eval │ compile │
  1861. 203.02 s > ├───────────┼────────────────────────┼─────────┼─────────────┼─────────────┼────────────────┼─────────────┤
  1862. 203.02 s > │ default │ scalar_self_energy_amp │ 6 │ 255ms (89%) │ 16ms (5.7%) │ 16ms (5.6%) │ 0ms (0.00%) │
  1863. 203.02 s > ├───────────┼────────────────────────┼─────────┼─────────────┼─────────────┼────────────────┼─────────────┤
  1864. 203.02 s > │ Total │ │ 6 │ 255ms (89%) │ 16ms (5.7%) │ 16ms (5.6%) │ 0ms (0.00%) │
  1865. 203.02 s > ╰───────────┴────────────────────────┴─────────┴─────────────┴─────────────┴────────────────┴─────────────╯
  1866. 203.02 s > [2026-08-28 15:45:08.446] @process::amplitude INFO : Input is above threshold: 2 existing threshold E-surfaces across 1/1 graph groups
  1867. 203.02 s > [2026-08-28 15:45:08.446] @process::amplitude INFO : overlap structure of group 0: [2: [2(1,5), 4(2,3,5)]]
  1868. 203.02 s > Error:
  1869. 203.02 s > 0: IR profiling requested arbitrary precision but received a quad-precision result
  1870. 203.02 s >
  1871. 203.02 s > Location:
  1872. 203.02 s > crates/gammalooprs/src/integrands/process/ir.rs:2123
  1873. 203.02 s >
  1874. 203.02 s > ━━━━━━━━━━━━━━━━━━━━━━━━━━━━━━━━━━ BACKTRACE ━━━━━━━━━━━━━━━━━━━━━━━━━━━━━━━━━━━
  1875. 203.02 s > 1: <color_eyre[51793ea62743adbd]::config::EyreHook>::into_eyre_hook::{closure#0}<unknown>
  1876. 203.02 s > at <unknown source file>:<unknown line>
  1877. 203.02 s > 2: eyre[cb2fd339c0c40fca]::capture_handler<unknown>
  1878. 203.02 s > at <unknown source file>:<unknown line>
  1879. 203.02 s > 3: eyre[cb2fd339c0c40fca]::private::format_err<unknown>
  1880. 203.02 s > at <unknown source file>:<unknown line>
  1881. 203.02 s > 4: gammalooprs[d7a7c067ebd19583]::integrands::process::ir::evaluate_profile_momentum_point_arb::<gammalooprs[d7a7c067ebd19583]::integrands::process::amplitude::AmplitudeIntegrand><unknown>
  1882. 203.02 s > at <unknown source file>:<unknown line>
  1883. 203.02 s > 5: <gammalooprs[d7a7c067ebd19583]::integrands::process::amplitude::AmplitudeIntegrand>::test_single_ir_limit_impl<unknown>
  1884. 203.02 s > at <unknown source file>:<unknown line>
  1885. 203.02 s > 6: gammalooprs[d7a7c067ebd19583]::integrands::process::ir::run_ir_profile::<gammalooprs[d7a7c067ebd19583]::integrands::process::amplitude::AmplitudeIntegrand, <gammalooprs[d7a7c067ebd19583]::integrands::process::amplitude::AmplitudeIntegrand>::enumerate_ir_limits, <gammalooprs[d7a7c067ebd19583]::integrands::process::amplitude::AmplitudeIntegrand>::graph_cut_definitions, <gammalooprs[d7a7c067ebd19583]::integrands::process::amplitude::AmplitudeIntegrand>::test_single_ir_limit_impl><unknown>
  1886. 203.02 s > at <unknown source file>:<unknown line>
  1887. 203.02 s > 7: <gammalooprs[d7a7c067ebd19583]::integrands::process::amplitude::AmplitudeIntegrand>::test_ir<unknown>
  1888. 203.02 s > at <unknown source file>:<unknown line>
  1889. 203.02 s > 8: <gammaloop_api[92ae732909e47e14]::commands::profile::Profile>::run<unknown>
  1890. 203.02 s > at <unknown source file>:<unknown line>
  1891. 203.02 s > 9: test_runs[3e7a390caee4e338]::profile_bulk::scalar_self_energy_amp_bulk_profile_passes<unknown>
  1892. 203.02 s > at <unknown source file>:<unknown line>
  1893. 203.02 s > 10: <test_runs[3e7a390caee4e338]::profile_bulk::scalar_self_energy_amp_bulk_profile_passes::{closure#0} as core[940e698046960fd5]::ops::function::FnOnce<()>>::call_once<unknown>
  1894. 203.02 s > at <unknown source file>:<unknown line>
  1895. 203.02 s > 11: test[75d6903177b1d7e9]::__rust_begin_short_backtrace::<core[940e698046960fd5]::result::Result<(), alloc[2ea6bcb46fca0c42]::string::String>, fn() -> core[940e698046960fd5]::result::Result<(), alloc[2ea6bcb46fca0c42]::string::String>><unknown>
  1896. 203.02 s > at <unknown source file>:<unknown line>
  1897. 203.02 s > 12: test[75d6903177b1d7e9]::run_test::{closure#0}<unknown>
  1898. 203.02 s > at <unknown source file>:<unknown line>
  1899. 203.02 s > 13: std[bcb96dfbba0ab899]::sys::backtrace::__rust_begin_short_backtrace::<test[75d6903177b1d7e9]::run_test::{closure#1}, ()><unknown>
  1900. 203.02 s > at <unknown source file>:<unknown line>
  1901. 203.02 s > 14: <std[bcb96dfbba0ab899]::thread::lifecycle::spawn_unchecked<test[75d6903177b1d7e9]::run_test::{closure#1}, ()>::{closure#1} as core[940e698046960fd5]::ops::function::FnOnce<()>>::call_once::{shim:vtable#0}<unknown>
  1902. 203.02 s > at <unknown source file>:<unknown line>
  1903. 203.02 s > 15: <std[bcb96dfbba0ab899]::sys::thread::unix::Thread>::new::thread_start<unknown>
  1904. 203.02 s > at <unknown source file>:<unknown line>
  1905. 203.02 s > 16: start_thread<unknown>
  1906. 203.02 s > at <unknown source file>:<unknown line>
  1907. 203.02 s > 17: __clone3<unknown>
  1908. 203.02 s > at <unknown source file>:<unknown line>
  1909. 203.02 s >
  1910. 203.02 s > Run with COLORBT_SHOW_HIDDEN=1 environment variable to disable frame filtering.
  1911. 203.02 s > Run with RUST_BACKTRACE=full to include source snippets.
  1912. 203.02 s > Warning: SpanTrace capture is Unsupported.
  1913. 203.02 s > Ensure that you've setup a tracing-error ErrorLayer and the semver versions are compatible
  1914. 203.02 s >
  1915. 203.02 s > 6. gammaloop-integration-tests::test_runs::profile_bulk::double_dotted_bubble_amp_bulk_profile_passes
  1916. 203.02 s > failure: test failure with exit code 101
  1917. 203.02 s > Error:
  1918. 203.02 s > 0: IR profiling requested arbitrary precision but received a quad-precision result
  1919. 203.02 s >
  1920. 203.02 s > Location:
  1921. 203.02 s > crates/gammalooprs/src/integrands/process/ir.rs:2123
  1922. 203.02 s >
  1923. 203.02 s > ━━━━━━━━━━━━━━━━━━━━━━━━━━━━━━━━━━ BACKTRACE ━━━━━━━━━━━━━━━━━━━━━━━━━━━━━━━━━━━
  1924. 203.02 s > 1: <color_eyre[51793ea62743adbd]::config::EyreHook>::into_eyre_hook::{closure#0}<unknown>
  1925. 203.02 s > at <unknown source file>:<unknown line>
  1926. 203.02 s > 2: eyre[cb2fd339c0c40fca]::capture_handler<unknown>
  1927. 203.02 s > at <unknown source file>:<unknown line>
  1928. 203.02 s > 3: eyre[cb2fd339c0c40fca]::private::format_err<unknown>
  1929. 203.02 s > at <unknown source file>:<unknown line>
  1930. 203.02 s > 4: gammalooprs[d7a7c067ebd19583]::integrands::process::ir::evaluate_profile_momentum_point_arb::<gammalooprs[d7a7c067ebd19583]::integrands::process::amplitude::AmplitudeIntegrand><unknown>
  1931. 203.02 s > at <unknown source file>:<unknown line>
  1932. 203.02 s > 5: <gammalooprs[d7a7c067ebd19583]::integrands::process::amplitude::AmplitudeIntegrand>::test_single_ir_limit_impl<unknown>
  1933. 203.02 s > at <unknown source file>:<unknown line>
  1934. 203.02 s > 6: gammalooprs[d7a7c067ebd19583]::integrands::process::ir::run_ir_profile::<gammalooprs[d7a7c067ebd19583]::integrands::process::amplitude::AmplitudeIntegrand, <gammalooprs[d7a7c067ebd19583]::integrands::process::amplitude::AmplitudeIntegrand>::enumerate_ir_limits, <gammalooprs[d7a7c067ebd19583]::integrands::process::amplitude::AmplitudeIntegrand>::graph_cut_definitions, <gammalooprs[d7a7c067ebd19583]::integrands::process::amplitude::AmplitudeIntegrand>::test_single_ir_limit_impl><unknown>
  1935. 203.02 s > at <unknown source file>:<unknown line>
  1936. 203.02 s > 7: <gammalooprs[d7a7c067ebd19583]::integrands::process::amplitude::AmplitudeIntegrand>::test_ir<unknown>
  1937. 203.02 s > at <unknown source file>:<unknown line>
  1938. 203.02 s > 8: <gammaloop_api[92ae732909e47e14]::commands::profile::Profile>::run<unknown>
  1939. 203.02 s > at <unknown source file>:<unknown line>
  1940. 203.02 s > 9: test_runs[3e7a390caee4e338]::profile_bulk::double_dotted_bubble_amp_bulk_profile_passes<unknown>
  1941. 203.02 s > at <unknown source file>:<unknown line>
  1942. 203.02 s > 10: <test_runs[3e7a390caee4e338]::profile_bulk::double_dotted_bubble_amp_bulk_profile_passes::{closure#0} as core[940e698046960fd5]::ops::function::FnOnce<()>>::call_once<unknown>
  1943. 203.02 s > at <unknown source file>:<unknown line>
  1944. 203.02 s > 11: test[75d6903177b1d7e9]::__rust_begin_short_backtrace::<core[940e698046960fd5]::result::Result<(), alloc[2ea6bcb46fca0c42]::string::String>, fn() -> core[940e698046960fd5]::result::Result<(), alloc[2ea6bcb46fca0c42]::string::String>><unknown>
  1945. 203.02 s > at <unknown source file>:<unknown line>
  1946. 203.02 s > 12: test[75d6903177b1d7e9]::run_test::{closure#0}<unknown>
  1947. 203.02 s > at <unknown source file>:<unknown line>
  1948. 203.02 s > 13: std[bcb96dfbba0ab899]::sys::backtrace::__rust_begin_short_backtrace::<test[75d6903177b1d7e9]::run_test::{closure#1}, ()><unknown>
  1949. 203.02 s > at <unknown source file>:<unknown line>
  1950. 203.02 s > 14: <std[bcb96dfbba0ab899]::thread::lifecycle::spawn_unchecked<test[75d6903177b1d7e9]::run_test::{closure#1}, ()>::{closure#1} as core[940e698046960fd5]::ops::function::FnOnce<()>>::call_once::{shim:vtable#0}<unknown>
  1951. 203.02 s > at <unknown source file>:<unknown line>
  1952. 203.02 s > 15: <std[bcb96dfbba0ab899]::sys::thread::unix::Thread>::new::thread_start<unknown>
  1953. 203.02 s > at <unknown source file>:<unknown line>
  1954. 203.02 s > 16: start_thread<unknown>
  1955. 203.02 s > at <unknown source file>:<unknown line>
  1956. 203.02 s > 17: __clone3<unknown>
  1957. 203.02 s > at <unknown source file>:<unknown line>
  1958. 203.02 s >
  1959. 203.02 s > Run with COLORBT_SHOW_HIDDEN=1 environment variable to disable frame filtering.
  1960. 203.02 s > Run with RUST_BACKTRACE=full to include source snippets.
  1961. 203.02 s > Warning: SpanTrace capture is Unsupported.
  1962. 203.02 s > Ensure that you've setup a tracing-error ErrorLayer and the semver versions are compatible
  1963. 203.02 s > system-out
  1964. 203.02 s > running 1 test
  1965. 203.02 s > test profile_bulk::double_dotted_bubble_amp_bulk_profile_passes ... FAILED
  1966. 203.02 s >
  1967. 203.02 s > failures:
  1968. 203.02 s >
  1969. 203.02 s > failures:
  1970. 203.02 s > profile_bulk::double_dotted_bubble_amp_bulk_profile_passes
  1971. 203.02 s >
  1972. 203.02 s > test result: FAILED. 0 passed; 1 failed; 0 ignored; 0 measured; 82 filtered out; finished in 1.45s
  1973. 203.02 s > system-err
  1974. 203.02 s > [2026-08-28 15:45:08.708] @gammaloop_api::se... INFO : Running command import model ./assets/models/json/scalars/scalars_2p_3p.json
  1975. 203.02 s > [2026-08-28 15:45:08.708] @import::model INFO : Loading JSON model scalars_2p_3p-default from /build/source/assets/models/json/scalars/scalars_2p_3p
  1976. 203.02 s > [2026-08-28 15:45:08.714] @gammaloop_api::se... INFO : Running command import graphs ./tests/resources/graphs/double_dotted_bubble_amp.dot
  1977. 203.02 s > [2026-08-28 15:45:08.714] @commands::import INFO : Loading graphs from '/build/source/tests/resources/graphs/double_dotted_bubble_amp.dot'
  1978. 203.02 s > [2026-08-28 15:45:08.739] @gammaloop_api::se... INFO : Running command generate
  1979. 203.02 s > [2026-08-28 15:45:08.864] @commands::generate INFO :
  1980. 203.02 s > Integrand generation summary
  1981. 203.02 s > peak RAM 62.73 MiB | cores 1
  1982. 203.02 s > ╭───────────┬──────────────────────────┬─────────┬────────────┬────────────┬────────────────┬─────────────╮
  1983. 203.02 s > │ integrand │ graph │ # evals │ expr build │ spenso │ symbolica eval │ compile │
  1984. 203.02 s > ├───────────┼──────────────────────────┼─────────┼────────────┼────────────┼────────────────┼─────────────┤
  1985. 203.02 s > │ default │ double_dotted_bubble_amp │ 11 │ 42ms (53%) │ 10ms (13%) │ 28ms (34%) │ 0ms (0.00%) │
  1986. 203.02 s > ├───────────┼──────────────────────────┼─────────┼────────────┼────────────┼────────────────┼─────────────┤
  1987. 203.02 s > │ Total │ │ 11 │ 42ms (53%) │ 10ms (13%) │ 28ms (34%) │ 0ms (0.00%) │
  1988. 203.02 s > ╰───────────┴──────────────────────────┴─────────┴────────────┴────────────┴────────────────┴─────────────╯
  1989. 203.02 s > [2026-08-28 15:45:08.866] @process::amplitude INFO : Input is above threshold: 1 existing threshold E-surfaces across 1/1 graph groups
  1990. 203.02 s > [2026-08-28 15:45:08.866] @process::amplitude INFO : overlap structure of group 0: [1: [1(1,4)]]
  1991. 203.02 s > Error:
  1992. 203.02 s > 0: IR profiling requested arbitrary precision but received a quad-precision result
  1993. 203.02 s >
  1994. 203.02 s > Location:
  1995. 203.02 s > crates/gammalooprs/src/integrands/process/ir.rs:2123
  1996. 203.02 s >
  1997. 203.02 s > ━━━━━━━━━━━━━━━━━━━━━━━━━━━━━━━━━━ BACKTRACE ━━━━━━━━━━━━━━━━━━━━━━━━━━━━━━━━━━━
  1998. 203.02 s > 1: <color_eyre[51793ea62743adbd]::config::EyreHook>::into_eyre_hook::{closure#0}<unknown>
  1999. 203.02 s > at <unknown source file>:<unknown line>
  2000. 203.02 s > 2: eyre[cb2fd339c0c40fca]::capture_handler<unknown>
  2001. 203.02 s > at <unknown source file>:<unknown line>
  2002. 203.02 s > 3: eyre[cb2fd339c0c40fca]::private::format_err<unknown>
  2003. 203.02 s > at <unknown source file>:<unknown line>
  2004. 203.02 s > 4: gammalooprs[d7a7c067ebd19583]::integrands::process::ir::evaluate_profile_momentum_point_arb::<gammalooprs[d7a7c067ebd19583]::integrands::process::amplitude::AmplitudeIntegrand><unknown>
  2005. 203.02 s > at <unknown source file>:<unknown line>
  2006. 203.02 s > 5: <gammalooprs[d7a7c067ebd19583]::integrands::process::amplitude::AmplitudeIntegrand>::test_single_ir_limit_impl<unknown>
  2007. 203.02 s > at <unknown source file>:<unknown line>
  2008. 203.02 s > 6: gammalooprs[d7a7c067ebd19583]::integrands::process::ir::run_ir_profile::<gammalooprs[d7a7c067ebd19583]::integrands::process::amplitude::AmplitudeIntegrand, <gammalooprs[d7a7c067ebd19583]::integrands::process::amplitude::AmplitudeIntegrand>::enumerate_ir_limits, <gammalooprs[d7a7c067ebd19583]::integrands::process::amplitude::AmplitudeIntegrand>::graph_cut_definitions, <gammalooprs[d7a7c067ebd19583]::integrands::process::amplitude::AmplitudeIntegrand>::test_single_ir_limit_impl><unknown>
  2009. 203.02 s > at <unknown source file>:<unknown line>
  2010. 203.02 s > 7: <gammalooprs[d7a7c067ebd19583]::integrands::process::amplitude::AmplitudeIntegrand>::test_ir<unknown>
  2011. 203.02 s > at <unknown source file>:<unknown line>
  2012. 203.02 s > 8: <gammaloop_api[92ae732909e47e14]::commands::profile::Profile>::run<unknown>
  2013. 203.03 s > at <unknown source file>:<unknown line>
  2014. 203.03 s > 9: test_runs[3e7a390caee4e338]::profile_bulk::double_dotted_bubble_amp_bulk_profile_passes<unknown>
  2015. 203.03 s > at <unknown source file>:<unknown line>
  2016. 203.03 s > 10: <test_runs[3e7a390caee4e338]::profile_bulk::double_dotted_bubble_amp_bulk_profile_passes::{closure#0} as core[940e698046960fd5]::ops::function::FnOnce<()>>::call_once<unknown>
  2017. 203.03 s > at <unknown source file>:<unknown line>
  2018. 203.03 s > 11: test[75d6903177b1d7e9]::__rust_begin_short_backtrace::<core[940e698046960fd5]::result::Result<(), alloc[2ea6bcb46fca0c42]::string::String>, fn() -> core[940e698046960fd5]::result::Result<(), alloc[2ea6bcb46fca0c42]::string::String>><unknown>
  2019. 203.03 s > at <unknown source file>:<unknown line>
  2020. 203.03 s > 12: test[75d6903177b1d7e9]::run_test::{closure#0}<unknown>
  2021. 203.03 s > at <unknown source file>:<unknown line>
  2022. 203.03 s > 13: std[bcb96dfbba0ab899]::sys::backtrace::__rust_begin_short_backtrace::<test[75d6903177b1d7e9]::run_test::{closure#1}, ()><unknown>
  2023. 203.03 s > at <unknown source file>:<unknown line>
  2024. 203.03 s > 14: <std[bcb96dfbba0ab899]::thread::lifecycle::spawn_unchecked<test[75d6903177b1d7e9]::run_test::{closure#1}, ()>::{closure#1} as core[940e698046960fd5]::ops::function::FnOnce<()>>::call_once::{shim:vtable#0}<unknown>
  2025. 203.03 s > at <unknown source file>:<unknown line>
  2026. 203.03 s > 15: <std[bcb96dfbba0ab899]::sys::thread::unix::Thread>::new::thread_start<unknown>
  2027. 203.03 s > at <unknown source file>:<unknown line>
  2028. 203.03 s > 16: start_thread<unknown>
  2029. 203.03 s > at <unknown source file>:<unknown line>
  2030. 203.03 s > 17: __clone3<unknown>
  2031. 203.03 s > at <unknown source file>:<unknown line>
  2032. 203.03 s >
  2033. 203.03 s > Run with COLORBT_SHOW_HIDDEN=1 environment variable to disable frame filtering.
  2034. 203.03 s > Run with RUST_BACKTRACE=full to include source snippets.
  2035. 203.03 s > Warning: SpanTrace capture is Unsupported.
  2036. 203.03 s > Ensure that you've setup a tracing-error ErrorLayer and the semver versions are compatible
  2037. 203.03 s >
  2038. 203.03 s > 7. gammaloop-integration-tests::uv::dod2_bubble_uv
  2039. 203.03 s > failure: test failure with exit code 101
  2040. 203.03 s > system-out
  2041. 203.03 s > running 1 test
  2042. 203.03 s > test dod2_bubble_uv has been running for over 60 seconds
  2043. 203.03 s > +-------------+-----------------+---------+--------+----------+-----------------------------------------------------------------------------------------------------------------------+-------+
  2044. 203.03 s > | case | check | graph | status | sigma | threshold | error |
  2045. 203.03 s > +-------------+-----------------+---------+--------+----------+-----------------------------------------------------------------------------------------------------------------------+-------+
  2046. 203.03 s > | dod2_bubble | uv_profile | - | FAIL | - | - | - |
  2047. 203.03 s > +-------------+-----------------+---------+--------+----------+-----------------------------------------------------------------------------------------------------------------------+-------+
  2048. 203.03 s > | dod2_bubble | m_uv.inspect | inspect | pass | - | best inspect relative delta 1.000e0 >= 1000*accuracy 1.000e-7 (accuracy=1.000e-10, exponent=+8.0, seed=0, probes=10) | - |
  2049. 203.03 s > +-------------+-----------------+---------+--------+----------+-----------------------------------------------------------------------------------------------------------------------+-------+
  2050. 203.03 s > | dod2_bubble | m_uv.integrated | GL0 | pass | 0.0sigma | compatible within 2sigma | - |
  2051. 203.03 s > +-------------+-----------------+---------+--------+----------+-----------------------------------------------------------------------------------------------------------------------+-------+
  2052. 203.03 s > | dod2_bubble | rls.inspect | inspect | pass | - | best inspect relative delta 2.822e-3 >= 1000*accuracy 1.000e-7 (accuracy=1.000e-10, exponent=+2.0, seed=1, probes=10) | - |
  2053. 203.03 s > +-------------+-----------------+---------+--------+----------+-----------------------------------------------------------------------------------------------------------------------+-------+
  2054. 203.03 s > | dod2_bubble | rls.integrated | GL0 | pass | 0.0sigma | compatible within 2sigma | - |
  2055. 203.03 s > +-------------+-----------------+---------+--------+----------+-----------------------------------------------------------------------------------------------------------------------+-------+
  2056. 203.03 s > | dod2_bubble | mu_r.inspect | inspect | pass | - | best inspect relative delta 6.951e-1 >= 1000*accuracy 1.000e-7 (accuracy=1.000e-10, exponent=+0.0, seed=0, probes=10) | - |
  2057. 203.03 s > +-------------+-----------------+---------+--------+----------+-----------------------------------------------------------------------------------------------------------------------+-------+
  2058. 203.03 s > | dod2_bubble | target | - | pass | - | 2sigma | - |
  2059. 203.03 s > +-------------+-----------------+---------+--------+----------+-----------------------------------------------------------------------------------------------------------------------+-------+
  2060. 203.03 s > test dod2_bubble_uv ... FAILED
  2061. 203.03 s >
  2062. 203.03 s > failures:
  2063. 203.03 s >
  2064. 203.03 s > failures:
  2065. 203.03 s > dod2_bubble_uv
  2066. 203.03 s >
  2067. 203.03 s > test result: FAILED. 0 passed; 1 failed; 0 ignored; 0 measured; 24 filtered out; finished in 70.22s
  2068. 203.03 s > system-err
  2069. 203.03 s > [2026-08-28 15:45:12.005] @gammaloop_api::se... INFO : Running command run generate
  2070. 203.03 s > [2026-08-28 15:45:12.005] @gammaloop_api::se... INFO : Starting command block generate
  2071. 203.03 s > [2026-08-28 15:45:12.006] @gammaloop_api::se... INFO : Running command import model scalars-default.json
  2072. 203.03 s > [2026-08-28 15:45:12.006] @import::model INFO : Loading built-in JSON model scalars-default
  2073. 203.03 s > [2026-08-28 15:45:12.016] @gammalooprs::model INFO : The following 2 external parameters were forced to zero by the restriction card:
  2074. 203.03 s > width_scalar_1, width_scalar_2
  2075. 203.03 s > [2026-08-28 15:45:12.020] @gammaloop_api::se... INFO : Running command remove processes
  2076. 203.03 s > [2026-08-28 15:45:12.020] @gammaloop_api::se... INFO : Running command set global kv global.generation.uv.generate_integrated=true
  2077. 203.03 s > [2026-08-28 15:45:12.021] @gammaloop_api::se... INFO : Running command import graphs ./tests/resources/graphs/scalar/dod2_bubble.dot -p bubble_dod2 -i scalar_bubble_below_thres
  2078. 203.03 s > [2026-08-28 15:45:12.021] @commands::import INFO : Loading graphs from '/build/source/tests/resources/graphs/scalar/dod2_bubble.dot'
  2079. 203.03 s > [2026-08-28 15:45:12.032] @gammaloop_api::se... INFO : Running command generate existing -p bubble_dod2 -i scalar_bubble_below_thres
  2080. 203.03 s > [2026-08-28 15:45:12.039] @approx::local_4d [{#uv, #inspect, #integrated}] DEBUG : Rescaled momenta expanded
  2081. 203.03 s > field value
  2082. 203.03 s > res n-terms: 1, byte size: 585,expr:
  2083. 203.03 s > -SCALAR_COUPLING²·q₀(αᵉ².¹)·q₀(αᵉ³.¹)·q₂(αᵉ².¹)·q₂(αᵉ³.¹)
  2084. 203.03 s > /(t²·denom(3,-q₀-q₂/t,mass_scalar_2²,-mass_scalar_2²+2·(q₀.q₂)/t+(q₂.q₂)/t²+(q₀.q₀))
  2085. 203.03 s > ·denom(2,q₂/t,mass_scalar_2²,-mass_scalar_2²+(q₂.q₂)/t²))
  2086. 203.03 s > [2026-08-28 15:45:12.042] @approx::local_4d [{#uv, #inspect, #integrated}] DEBUG : Rescaled momenta expanded
  2087. 203.03 s > field value
  2088. 203.03 s > res n-terms: 1, byte size: 3,expr:
  2089. 203.03 s > 1
  2090. 203.03 s > [2026-08-28 15:45:12.043] @approx::final_integrand[{#generation, #profile, #uv, #graph, #summary}] DEBUG : Computed global numerator
  2091. 203.03 s > field value
  2092. 203.03 s > global_num n-terms: 1, byte size: 4,expr:
  2093. 203.03 s > 1/2
  2094. 203.03 s > span build_3d{span_context=true graph=GL0 current=subgraph=0, topo_order=0, dod=0}
  2095. 203.03 s > [2026-08-28 15:45:12.047] @uv::approx [{#generation, #uv, #fourd}] DEBUG : Computing 4D
  2096. 203.03 s > field value
  2097. 203.03 s > simple subgraph(S_11,S_y)*Approx(subgraph(S_y,0)) of GL0
  2098. 203.03 s > span compute_4d{span_context=true graph=GL0 current=subgraph=y, topo_order=1, dod=2 given=subgraph=0, topo_order=0, dod=0 reduced=SubSet { set: BitVec<usize, bitvec::order::Lsb0> { addr: 0x7fffd8015670, head: 000000, bits: 6, capacity: 64 } [0, 0, 1, 1, 1, 1], id: PhantomData<linnet::half_edge::involution::Hedge> }}
  2099. 203.03 s > [2026-08-28 15:45:12.050] @approx::local_4d [{#uv, #algebra, #integrated, #start}] DEBUG :
  2100. 203.03 s > field value
  2101. 203.03 s > integrand n-terms: 1, byte size: 409,expr:
  2102. 203.03 s > SCALAR_COUPLING²·(q₀(αᵉ³.¹)+q₃(αᵉ³.¹))·q₀(αᵉ².¹)·q₀(αᵉ³.¹)·q₂(αᵉ².¹)
  2103. 203.03 s > /(denom(2,q₂,mass_scalar_2²,-mass_scalar_2²+(q₂.q₂))·denom(3,q₃,mass_scalar_2²,-mass_scalar_2²+(q₃.q₃)))
  2104. 203.03 s > reduced y
  2105. 203.03 s > span grow{span_context=true current=subgraph=y, topo_order=1, dod=2 given=subgraph=0, topo_order=0, dod=0}
  2106. 203.03 s > [2026-08-28 15:45:12.050] @approx::local_4d [{#uv, #inspect, #integrated}] DEBUG : Rescaled momenta expanded
  2107. 203.03 s > field value
  2108. 203.03 s > res n-terms: 1, byte size: 585,expr:
  2109. 203.03 s > -SCALAR_COUPLING²·q₀(αᵉ².¹)·q₀(αᵉ³.¹)·q₂(αᵉ².¹)·q₂(αᵉ³.¹)
  2110. 203.03 s > /(t²·denom(3,-q₀-q₂/t,mass_scalar_2²,-mass_scalar_2²+2·(q₀.q₂)/t+(q₂.q₂)/t²+(q₀.q₀))
  2111. 203.03 s > ·denom(2,q₂/t,mass_scalar_2²,-mass_scalar_2²+(q₂.q₂)/t²))
  2112. 203.03 s > span t{span_context=true current=subgraph=y, topo_order=1, dod=2 given=subgraph=0, topo_order=0, dod=0}
  2113. 203.03 s > [2026-08-28 15:45:12.051] @approx::local_4d [{#uv, #integrated, #rescaled}] DEBUG : Rescaled expanded
  2114. 203.03 s > field value
  2115. 203.03 s > n_loops 1
  2116. 203.03 s > res n-terms: 1, byte size: 707,expr:
  2117. 203.03 s > -SCALAR_COUPLING²·q₀(αᵉ².¹)·q₀(αᵉ³.¹)·q₂(αᵉ².¹)·q₂(αᵉ³.¹)
  2118. 203.03 s > /(t²·denom(3,-q₂,mUVexp²+t²·mass_scalar_2²,-mUV²+t²·(-mass_scalar_2²+2·(q₀.q₂)/t+(q₂.q₂)/t²+(q₀.q₀))+t²·mUVexp²)
  2119. 203.03 s > ·denom(2,q₂,mUVexp²+t²·mass_scalar_2²,-mUV²+t²·(-mass_scalar_2²+(q₂.q₂)/t²)+t²·mUVexp²))
  2120. 203.03 s > span t{span_context=true current=subgraph=y, topo_order=1, dod=2 given=subgraph=0, topo_order=0, dod=0}
  2121. 203.03 s > [2026-08-28 15:45:12.052] @approx::local_4d [{#uv, #integrated, #series}] DEBUG : Series expanded
  2122. 203.03 s > field value
  2123. 203.03 s > res n-terms: 3, byte size: 1896,expr:
  2124. 203.03 s > (1/2·SCALAR_COUPLING²·(2·mUVexp²-2·mass_scalar_2²)/(denom(2,q₂,mUVexp²,-mUV²+(q₂.q₂))²·denom(3,-q₂,mUVexp²,-mUV²+(q₂.q₂)))
  2125. 203.03 s > -SCALAR_COUPLING²
  2126. 203.03 s > ·(-1/2·(2·mUVexp²-2·mass_scalar_2²+2·(q₀.q₀))/denom(3,-q₂,mUVexp²,-mUV²+(q₂.q₂))
  2127. 203.03 s > +4·(q₀.q₂)²/denom(3,-q₂,mUVexp²,-mUV²+(q₂.q₂))²
  2128. 203.03 s > )/(denom(2,q₂,mUVexp²,-mUV²+(q₂.q₂))·denom(3,-q₂,mUVexp²,-mUV²+(q₂.q₂)))
  2129. 203.03 s > )·q₀(αᵉ².¹)·q₀(αᵉ³.¹)·q₂(αᵉ².¹)·q₂(αᵉ³.¹)
  2130. 203.03 s > +2·SCALAR_COUPLING²·(q₀.q₂)·q₀(αᵉ².¹)·q₀(αᵉ³.¹)·q₂(αᵉ².¹)·q₂(αᵉ³.¹)
  2131. 203.03 s > /(t·denom(2,q₂,mUVexp²,-mUV²+(q₂.q₂))·denom(3,-q₂,mUVexp²,-mUV²+(q₂.q₂))²)
  2132. 203.03 s > -SCALAR_COUPLING²·q₀(αᵉ².¹)·q₀(αᵉ³.¹)·q₂(αᵉ².¹)·q₂(αᵉ³.¹)
  2133. 203.03 s > /(t²·denom(2,q₂,mUVexp²,-mUV²+(q₂.q₂))·denom(3,-q₂,mUVexp²,-mUV²+(q₂.q₂)))
  2134. 203.03 s > span t{span_context=true current=subgraph=y, topo_order=1, dod=2 given=subgraph=0, topo_order=0, dod=0}
  2135. 203.03 s > [2026-08-28 15:45:12.052] @approx::local_4d [{#uv, #integrated, #series}] DEBUG : Evaluated at t = 1
  2136. 203.03 s > field value
  2137. 203.03 s > res n-terms: 3, byte size: 1880,expr:
  2138. 203.03 s > (1/2·SCALAR_COUPLING²·(2·mUVexp²-2·mass_scalar_2²)/(denom(2,q₂,mUVexp²,-mUV²+(q₂.q₂))²·denom(3,-q₂,mUVexp²,-mUV²+(q₂.q₂)))
  2139. 203.03 s > -SCALAR_COUPLING²
  2140. 203.03 s > ·(-1/2·(2·mUVexp²-2·mass_scalar_2²+2·(q₀.q₀))/denom(3,-q₂,mUVexp²,-mUV²+(q₂.q₂))
  2141. 203.03 s > +4·(q₀.q₂)²/denom(3,-q₂,mUVexp²,-mUV²+(q₂.q₂))²
  2142. 203.03 s > )/(denom(2,q₂,mUVexp²,-mUV²+(q₂.q₂))·denom(3,-q₂,mUVexp²,-mUV²+(q₂.q₂)))
  2143. 203.03 s > )·q₀(αᵉ².¹)·q₀(αᵉ³.¹)·q₂(αᵉ².¹)·q₂(αᵉ³.¹)
  2144. 203.03 s > -SCALAR_COUPLING²·q₀(αᵉ².¹)·q₀(αᵉ³.¹)·q₂(αᵉ².¹)·q₂(αᵉ³.¹)
  2145. 203.03 s > /(denom(2,q₂,mUVexp²,-mUV²+(q₂.q₂))·denom(3,-q₂,mUVexp²,-mUV²+(q₂.q₂)))
  2146. 203.03 s > +2·SCALAR_COUPLING²·(q₀.q₂)·q₀(αᵉ².¹)·q₀(αᵉ³.¹)·q₂(αᵉ².¹)·q₂(αᵉ³.¹)
  2147. 203.03 s > /(denom(2,q₂,mUVexp²,-mUV²+(q₂.q₂))·denom(3,-q₂,mUVexp²,-mUV²+(q₂.q₂))²)
  2148. 203.03 s > span t{span_context=true current=subgraph=y, topo_order=1, dod=2 given=subgraph=0, topo_order=0, dod=0}
  2149. 203.03 s > [2026-08-28 15:45:12.054] @approx::local_4d [{#uv, #collect, #integrated}] DEBUG : After gamma chain collection
  2150. 203.03 s > field value
  2151. 203.03 s > expr n-terms: 3, byte size: 1880,expr:
  2152. 203.03 s > (1/2·SCALAR_COUPLING²·(2·mUVexp²-2·mass_scalar_2²)/(denom(2,q₂,mUVexp²,-mUV²+(q₂.q₂))²·denom(3,-q₂,mUVexp²,-mUV²+(q₂.q₂)))
  2153. 203.03 s > -SCALAR_COUPLING²
  2154. 203.03 s > ·(-1/2·(2·mUVexp²-2·mass_scalar_2²+2·(q₀.q₀))/denom(3,-q₂,mUVexp²,-mUV²+(q₂.q₂))
  2155. 203.03 s > +4·(q₀.q₂)²/denom(3,-q₂,mUVexp²,-mUV²+(q₂.q₂))²
  2156. 203.03 s > )/(denom(2,q₂,mUVexp²,-mUV²+(q₂.q₂))·denom(3,-q₂,mUVexp²,-mUV²+(q₂.q₂)))
  2157. 203.03 s > )·q₀(αᵉ².¹)·q₀(αᵉ³.¹)·q₂(αᵉ².¹)·q₂(αᵉ³.¹)
  2158. 203.03 s > -SCALAR_COUPLING²·q₀(αᵉ².¹)·q₀(αᵉ³.¹)·q₂(αᵉ².¹)·q₂(αᵉ³.¹)
  2159. 203.03 s > /(denom(2,q₂,mUVexp²,-mUV²+(q₂.q₂))·denom(3,-q₂,mUVexp²,-mUV²+(q₂.q₂)))
  2160. 203.03 s > +2·SCALAR_COUPLING²·(q₀.q₂)·q₀(αᵉ².¹)·q₀(αᵉ³.¹)·q₂(αᵉ².¹)·q₂(αᵉ³.¹)
  2161. 203.03 s > /(denom(2,q₂,mUVexp²,-mUV²+(q₂.q₂))·denom(3,-q₂,mUVexp²,-mUV²+(q₂.q₂))²)
  2162. 203.03 s > span t{span_context=true current=subgraph=y, topo_order=1, dod=2 given=subgraph=0, topo_order=0, dod=0}
  2163. 203.03 s > [2026-08-28 15:45:12.057] @approx::local_4d [{#profile, #uv, #collect, #integrated, #start, #trace}] DEBUG : After gamma schoonschip
  2164. 203.03 s > field value
  2165. 203.03 s > expr n-terms: 3, byte size: 1631,expr:
  2166. 203.03 s > (1/2·SCALAR_COUPLING²·(2·mUVexp²-2·mass_scalar_2²)/(denom(2,q₂,mUVexp²,-mUV²+(q₂.q₂))²·denom(3,-q₂,mUVexp²,-mUV²+(q₂.q₂)))
  2167. 203.03 s > -SCALAR_COUPLING²
  2168. 203.03 s > ·(-1/2·(2·mUVexp²-2·mass_scalar_2²+2·(q₀.q₀))/denom(3,-q₂,mUVexp²,-mUV²+(q₂.q₂))
  2169. 203.03 s > +4·(q₀.q₂)²/denom(3,-q₂,mUVexp²,-mUV²+(q₂.q₂))²
  2170. 203.03 s > )/(denom(2,q₂,mUVexp²,-mUV²+(q₂.q₂))·denom(3,-q₂,mUVexp²,-mUV²+(q₂.q₂)))
  2171. 203.03 s > )·(q₀.q₂)²
  2172. 203.03 s > -SCALAR_COUPLING²·(q₀.q₂)²/(denom(2,q₂,mUVexp²,-mUV²+(q₂.q₂))·denom(3,-q₂,mUVexp²,-mUV²+(q₂.q₂)))
  2173. 203.03 s > +2·SCALAR_COUPLING²·(q₀.q₂)·(q₀.q₂)²
  2174. 203.03 s > /(denom(2,q₂,mUVexp²,-mUV²+(q₂.q₂))·denom(3,-q₂,mUVexp²,-mUV²+(q₂.q₂))²)
  2175. 203.03 s > span t{span_context=true current=subgraph=y, topo_order=1, dod=2 given=subgraph=0, topo_order=0, dod=0}
  2176. 203.03 s > [2026-08-28 15:45:12.059] @approx::local_4d [{#profile, #uv, #collect, #integrated, #start, #trace}] DEBUG : After gamma collection
  2177. 203.03 s > field value
  2178. 203.03 s > expr n-terms: 1, byte size: 1347,expr:
  2179. 203.03 s > SCALAR_COUPLING²
  2180. 203.03 s > ·(-denom(2,q₂,mUVexp²,-mUV²+(q₂.q₂))·denom(3,-q₂,mUVexp²,-mUV²+(q₂.q₂))²
  2181. 203.03 s > +1/2·(2·mUVexp²-2·mass_scalar_2²)·denom(3,-q₂,mUVexp²,-mUV²+(q₂.q₂))²
  2182. 203.03 s > -(-1/2·(2·mUVexp²-2·mass_scalar_2²+2·(q₀.q₀))·denom(3,-q₂,mUVexp²,-mUV²+(q₂.q₂))+4·(q₀.q₂)²)
  2183. 203.03 s > ·denom(2,q₂,mUVexp²,-mUV²+(q₂.q₂))
  2184. 203.03 s > +2·(q₀.q₂)·denom(2,q₂,mUVexp²,-mUV²+(q₂.q₂))·denom(3,-q₂,mUVexp²,-mUV²+(q₂.q₂))
  2185. 203.03 s > )·(q₀.q₂)²/(denom(2,q₂,mUVexp²,-mUV²+(q₂.q₂))²·denom(3,-q₂,mUVexp²,-mUV²+(q₂.q₂))³)
  2186. 203.03 s > span t{span_context=true current=subgraph=y, topo_order=1, dod=2 given=subgraph=0, topo_order=0, dod=0}
  2187. 203.03 s > [2026-08-28 15:45:12.061] @approx::local_4d [{#profile, #uv, #gamma, #integrated, #start, #trace, #vakint}] DEBUG : After gamma simplification
  2188. 203.03 s > ... omitted 3263 more lines; see full nextest output above
  2189. 203.03 s >
  2190. 203.03 s > 8. gammaloop-integration-tests::uv::sunrise_scalar_1_uv
  2191. 203.03 s > failure: test failure with exit code 101
  2192. 203.03 s > system-out
  2193. 203.03 s > running 1 test
  2194. 203.03 s > test sunrise_scalar_1_uv has been running for over 60 seconds
  2195. 203.03 s > +------------------+------------------------+--------------+--------+----------+----------------------------------------------------------------------------------------------------------------------+-------+
  2196. 203.03 s > | case | check | graph | status | sigma | threshold | error |
  2197. 203.03 s > +------------------+------------------------+--------------+--------+----------+----------------------------------------------------------------------------------------------------------------------+-------+
  2198. 203.03 s > | sunrise_scalar_1 | uv_profile | - | FAIL | - | - | - |
  2199. 203.03 s > +------------------+------------------------+--------------+--------+----------+----------------------------------------------------------------------------------------------------------------------+-------+
  2200. 203.03 s > | sunrise_scalar_1 | m_uv.inspect | inspect | pass | - | best inspect relative delta 1.624e0 >= 1000*accuracy 1.000e-3 (accuracy=1.000e-6, exponent=+1.0, seed=1, probes=10) | - |
  2201. 203.03 s > +------------------+------------------------+--------------+--------+----------+----------------------------------------------------------------------------------------------------------------------+-------+
  2202. 203.03 s > | sunrise_scalar_1 | m_uv.integrated | sunrise | pass | 0.1sigma | compatible within 2sigma | - |
  2203. 203.03 s > +------------------+------------------------+--------------+--------+----------+----------------------------------------------------------------------------------------------------------------------+-------+
  2204. 203.03 s > | sunrise_scalar_1 | rls.inspect | inspect | pass | - | best inspect relative delta 8.682e-1 >= 1000*accuracy 1.000e-3 (accuracy=1.000e-6, exponent=+1.0, seed=1, probes=10) | - |
  2205. 203.03 s > +------------------+------------------------+--------------+--------+----------+----------------------------------------------------------------------------------------------------------------------+-------+
  2206. 203.03 s > | sunrise_scalar_1 | rls.integrated | sunrise | pass | 0.0sigma | compatible within 2sigma | - |
  2207. 203.03 s > +------------------+------------------------+--------------+--------+----------+----------------------------------------------------------------------------------------------------------------------+-------+
  2208. 203.03 s > | sunrise_scalar_1 | mu_r.inspect | inspect | pass | - | best inspect relative delta 1.752e0 >= 1000*accuracy 1.000e-3 (accuracy=1.000e-6, exponent=+1.0, seed=1, probes=10) | - |
  2209. 203.03 s > +------------------+------------------------+--------------+--------+----------+----------------------------------------------------------------------------------------------------------------------+-------+
  2210. 203.03 s > | sunrise_scalar_1 | integrated.relerr | integrated | pass | - | relative error 9.20% <= 10.00% | - |
  2211. 203.03 s > +------------------+------------------------+--------------+--------+----------+----------------------------------------------------------------------------------------------------------------------+-------+
  2212. 203.03 s > | sunrise_scalar_1 | m_uv.integrated.relerr | m_uv-shifted | pass | - | relative error 5.89% <= 10.00% | - |
  2213. 203.03 s > +------------------+------------------------+--------------+--------+----------+----------------------------------------------------------------------------------------------------------------------+-------+
  2214. 203.03 s > | sunrise_scalar_1 | target | - | pass | - | 2sigma | - |
  2215. 203.03 s > +------------------+------------------------+--------------+--------+----------+----------------------------------------------------------------------------------------------------------------------+-------+
  2216. 203.03 s > test sunrise_scalar_1_uv ... FAILED
  2217. 203.03 s >
  2218. 203.03 s > failures:
  2219. 203.03 s >
  2220. 203.03 s > failures:
  2221. 203.03 s > sunrise_scalar_1_uv
  2222. 203.03 s >
  2223. 203.03 s > test result: FAILED. 0 passed; 1 failed; 0 ignored; 0 measured; 24 filtered out; finished in 137.60s
  2224. 203.03 s > system-err
  2225. 203.03 s > [2026-08-28 15:45:21.265] @gammaloop_api::se... INFO : Running command run generate
  2226. 203.03 s > [2026-08-28 15:45:21.265] @gammaloop_api::se... INFO : Starting command block generate
  2227. 203.03 s > [2026-08-28 15:45:21.265] @gammaloop_api::se... INFO : Running command import model scalars-default.json
  2228. 203.03 s > [2026-08-28 15:45:21.265] @import::model INFO : Loading built-in JSON model scalars-default
  2229. 203.03 s > [2026-08-28 15:45:21.295] @gammalooprs::model INFO : The following 2 external parameters were forced to zero by the restriction card:
  2230. 203.03 s > width_scalar_1, width_scalar_2
  2231. 203.03 s > [2026-08-28 15:45:21.302] @gammaloop_api::se... INFO : Running command remove processes
  2232. 203.03 s > [2026-08-28 15:45:21.306] @gammaloop_api::se... INFO : Running command set global kv global.generation.uv.generate_integrated=true
  2233. 203.03 s > [2026-08-28 15:45:21.310] @gammaloop_api::se... INFO : Running command import graphs ./tests/resources/graphs/scalar_sunrise.dot -p sunrise_scalar_1 -i scalar_sunrise
  2234. 203.03 s > [2026-08-28 15:45:21.310] @commands::import INFO : Loading graphs from '/build/source/tests/resources/graphs/scalar_sunrise.dot'
  2235. 203.03 s > [2026-08-28 15:45:21.326] @gammaloop_api::se... INFO : Running command generate existing -p sunrise_scalar_1 -i scalar_sunrise
  2236. 203.03 s > [2026-08-28 15:45:21.346] @approx::local_4d [{#uv, #inspect, #integrated}] DEBUG : Rescaled momenta expanded
  2237. 203.03 s > field value
  2238. 203.03 s > res n-terms: 1, byte size: 611,expr:
  2239. 203.03 s > 1/(denom(1,q₁/t,mass_scalar_1²,-mass_scalar_1²+(q₁.q₁)/t²)
  2240. 203.03 s > ·denom(2,-q₀+q₃-q₁/t,mass_scalar_1²,
  2241. 203.03 s > -mass_scalar_1²+2·(q₀.q₁)/t-2·(q₁.q₃)/t+(q₁.q₁)/t²+(q₀.q₀)
  2242. 203.03 s > -2·(q₀.q₃)+(q₃.q₃)
  2243. 203.03 s > ))
  2244. 203.03 s > [2026-08-28 15:45:21.348] @approx::local_4d [{#uv, #inspect, #integrated}] DEBUG : Rescaled momenta expanded
  2245. 203.03 s > field value
  2246. 203.03 s > res n-terms: 1, byte size: 611,expr:
  2247. 203.03 s > 1/(denom(0,q₀/t,mass_scalar_1²,-mass_scalar_1²+(q₀.q₀)/t²)
  2248. 203.03 s > ·denom(1,-q₂+q₃-q₀/t,mass_scalar_1²,
  2249. 203.03 s > -mass_scalar_1²+2·(q₀.q₂)/t-2·(q₀.q₃)/t+(q₀.q₀)/t²+(q₂.q₂)
  2250. 203.03 s > -2·(q₂.q₃)+(q₃.q₃)
  2251. 203.03 s > ))
  2252. 203.03 s > [2026-08-28 15:45:21.349] @approx::local_4d [{#uv, #inspect, #integrated}] DEBUG : Rescaled momenta expanded
  2253. 203.03 s > field value
  2254. 203.03 s > res n-terms: 1, byte size: 611,expr:
  2255. 203.03 s > 1/(denom(0,q₀/t,mass_scalar_1²,-mass_scalar_1²+(q₀.q₀)/t²)
  2256. 203.03 s > ·denom(2,-q₁+q₃-q₀/t,mass_scalar_1²,
  2257. 203.03 s > -mass_scalar_1²+2·(q₀.q₁)/t-2·(q₀.q₃)/t+(q₀.q₀)/t²+(q₁.q₁)
  2258. 203.03 s > -2·(q₁.q₃)+(q₃.q₃)
  2259. 203.03 s > ))
  2260. 203.03 s > [2026-08-28 15:45:21.349] @approx::local_4d [{#uv, #inspect, #integrated}] DEBUG : Rescaled momenta expanded
  2261. 203.03 s > field value
  2262. 203.03 s > res n-terms: 1, byte size: 3,expr:
  2263. 203.03 s > 1
  2264. 203.03 s > [2026-08-28 15:45:21.350] @approx::local_4d [{#uv, #inspect, #integrated}] DEBUG : Rescaled momenta expanded
  2265. 203.03 s > field value
  2266. 203.03 s > res n-terms: 1, byte size: 777,expr:
  2267. 203.03 s > 1/(denom(0,q₀/t,mass_scalar_1²,-mass_scalar_1²+(q₀.q₀)/t²)·denom(1,q₁/t,mass_scalar_1²,-mass_scalar_1²+(q₁.q₁)/t²)
  2268. 203.03 s > ·denom(2,q₄-q₀/t-q₁/t,mass_scalar_1²,
  2269. 203.03 s > -mass_scalar_1²-2·(q₀.q₄)/t-2·(q₁.q₄)/t+(q₀.q₀)/t²+2·(q₀.q₁)/t²
  2270. 203.03 s > +(q₁.q₁)/t²+(q₄.q₄)
  2271. 203.03 s > ))
  2272. 203.03 s > [2026-08-28 15:45:21.352] @approx::final_integrand[{#generation, #profile, #uv, #graph, #summary}] DEBUG : Computed global numerator
  2273. 203.03 s > field value
  2274. 203.03 s > global_num n-terms: 1, byte size: 3,expr:
  2275. 203.03 s > 1
  2276. 203.03 s > span build_3d{span_context=true graph=sunrise current=subgraph=0, topo_order=0, dod=0}
  2277. 203.03 s > [2026-08-28 15:45:21.354] @uv::approx [{#generation, #uv, #fourd}] DEBUG : Computing 4D
  2278. 203.03 s > field value
  2279. 203.03 s > simple subgraph(S_47,S_3s)*Approx(subgraph(S_3s,0)) of sunrise
  2280. 203.03 s > span compute_4d{span_context=true graph=sunrise current=subgraph=3s, topo_order=1, dod=0 given=subgraph=0, topo_order=0, dod=0 reduced=SubSet { set: BitVec<usize, bitvec::order::Lsb0> { addr: 0x7fffec00c8a0, head: 000000, bits: 8, capacity: 64 } [0, 0, 0, 0, 1, 1, 1, 1], id: PhantomData<linnet::half_edge::involution::Hedge> }}
  2281. 203.03 s > [2026-08-28 15:45:21.354] @approx::local_4d [{#uv, #algebra, #integrated, #start}] DEBUG :
  2282. 203.03 s > field value
  2283. 203.03 s > integrand n-terms: 1, byte size: 217,expr:
  2284. 203.03 s > 1/(denom(1,q₁,mass_scalar_1²,-mass_scalar_1²+(q₁.q₁))·denom(2,q₂,mass_scalar_1²,-mass_scalar_1²+(q₂.q₂)))
  2285. 203.03 s > reduced 3s
  2286. 203.03 s > span grow{span_context=true current=subgraph=3s, topo_order=1, dod=0 given=subgraph=0, topo_order=0, dod=0}
  2287. 203.03 s > [2026-08-28 15:45:21.354] @approx::local_4d [{#uv, #inspect, #integrated}] DEBUG : Rescaled momenta expanded
  2288. 203.03 s > field value
  2289. 203.03 s > res n-terms: 1, byte size: 611,expr:
  2290. 203.03 s > 1/(denom(1,q₁/t,mass_scalar_1²,-mass_scalar_1²+(q₁.q₁)/t²)
  2291. 203.03 s > ·denom(2,-q₀+q₃-q₁/t,mass_scalar_1²,
  2292. 203.03 s > -mass_scalar_1²+2·(q₀.q₁)/t-2·(q₁.q₃)/t+(q₁.q₁)/t²+(q₀.q₀)
  2293. 203.03 s > -2·(q₀.q₃)+(q₃.q₃)
  2294. 203.03 s > ))
  2295. 203.03 s > span t{span_context=true current=subgraph=3s, topo_order=1, dod=0 given=subgraph=0, topo_order=0, dod=0}
  2296. 203.03 s > [2026-08-28 15:45:21.355] @approx::local_4d [{#uv, #integrated, #rescaled}] DEBUG : Rescaled expanded
  2297. 203.03 s > field value
  2298. 203.03 s > n_loops 1
  2299. 203.03 s > res n-terms: 1, byte size: 723,expr:
  2300. 203.03 s > 1/(denom(1,q₁,mUVexp²+t²·mass_scalar_1²,-mUV²+t²·(-mass_scalar_1²+(q₁.q₁)/t²)+t²·mUVexp²)
  2301. 203.03 s > ·denom(2,-q₁,mUVexp²+t²·mass_scalar_1²,
  2302. 203.03 s > -mUV²
  2303. 203.03 s > +t²
  2304. 203.03 s > ·(-mass_scalar_1²+2·(q₀.q₁)/t-2·(q₁.q₃)/t+(q₁.q₁)/t²+(q₀.q₀)
  2305. 203.03 s > -2·(q₀.q₃)+(q₃.q₃)
  2306. 203.03 s > )
  2307. 203.03 s > +t²·mUVexp²
  2308. 203.03 s > ))
  2309. 203.03 s > span t{span_context=true current=subgraph=3s, topo_order=1, dod=0 given=subgraph=0, topo_order=0, dod=0}
  2310. 203.03 s > [2026-08-28 15:45:21.355] @approx::local_4d [{#uv, #integrated, #series}] DEBUG : Series expanded
  2311. 203.03 s > field value
  2312. 203.03 s > res n-terms: 1, byte size: 223,expr:
  2313. 203.03 s > 1/(denom(1,q₁,mUVexp²,-mUV²+(q₁.q₁))·denom(2,-q₁,mUVexp²,-mUV²+(q₁.q₁)))
  2314. 203.03 s > span t{span_context=true current=subgraph=3s, topo_order=1, dod=0 given=subgraph=0, topo_order=0, dod=0}
  2315. 203.03 s > [2026-08-28 15:45:21.355] @approx::local_4d [{#uv, #integrated, #series}] DEBUG : Evaluated at t = 1
  2316. 203.03 s > field value
  2317. 203.03 s > res n-terms: 1, byte size: 223,expr:
  2318. 203.03 s > 1/(denom(1,q₁,mUVexp²,-mUV²+(q₁.q₁))·denom(2,-q₁,mUVexp²,-mUV²+(q₁.q₁)))
  2319. 203.03 s > span t{span_context=true current=subgraph=3s, topo_order=1, dod=0 given=subgraph=0, topo_order=0, dod=0}
  2320. 203.03 s > [2026-08-28 15:45:21.355] @approx::local_4d [{#uv, #collect, #integrated}] DEBUG : After gamma chain collection
  2321. 203.03 s > field value
  2322. 203.03 s > expr n-terms: 1, byte size: 223,expr:
  2323. 203.03 s > 1/(denom(1,q₁,mUVexp²,-mUV²+(q₁.q₁))·denom(2,-q₁,mUVexp²,-mUV²+(q₁.q₁)))
  2324. 203.03 s > span t{span_context=true current=subgraph=3s, topo_order=1, dod=0 given=subgraph=0, topo_order=0, dod=0}
  2325. 203.03 s > [2026-08-28 15:45:21.355] @approx::local_4d [{#profile, #uv, #collect, #integrated, #start, #trace}] DEBUG : After gamma schoonschip
  2326. 203.03 s > field value
  2327. 203.03 s > expr n-terms: 1, byte size: 223,expr:
  2328. 203.03 s > 1/(denom(1,q₁,mUVexp²,-mUV²+(q₁.q₁))·denom(2,-q₁,mUVexp²,-mUV²+(q₁.q₁)))
  2329. 203.03 s > span t{span_context=true current=subgraph=3s, topo_order=1, dod=0 given=subgraph=0, topo_order=0, dod=0}
  2330. 203.03 s > [2026-08-28 15:45:21.356] @approx::local_4d [{#profile, #uv, #collect, #integrated, #start, #trace}] DEBUG : After gamma collection
  2331. 203.03 s > field value
  2332. 203.03 s > expr n-terms: 1, byte size: 223,expr:
  2333. 203.03 s > 1/(denom(1,q₁,mUVexp²,-mUV²+(q₁.q₁))·denom(2,-q₁,mUVexp²,-mUV²+(q₁.q₁)))
  2334. 203.03 s > span t{span_context=true current=subgraph=3s, topo_order=1, dod=0 given=subgraph=0, topo_order=0, dod=0}
  2335. 203.03 s > [2026-08-28 15:45:21.356] @approx::local_4d [{#profile, #uv, #gamma, #integrated, #start, #trace, #vakint}] DEBUG : After gamma simplification
  2336. 203.03 s > field value
  2337. 203.03 s > expr n-terms: 1, byte size: 223,expr:
  2338. 203.03 s > 1/(denom(1,q₁,mUVexp²,-mUV²+(q₁.q₁))·denom(2,-q₁,mUVexp²,-mUV²+(q₁.q₁)))
  2339. 203.03 s > span t{span_context=true current=subgraph=3s, topo_order=1, dod=0 given=subgraph=0, topo_order=0, dod=0}
  2340. 203.03 s > [2026-08-28 15:45:21.356] @approx::local_4d [{#profile, #uv, #integrated, #schoonschip, #start, #trace, #vakint}] DEBUG : After Schoonschip net
  2341. 203.03 s > field value
  2342. 203.03 s > expr n-terms: 1, byte size: 223,expr:
  2343. 203.03 s > 1/(denom(1,q₁,mUVexp²,-mUV²+(q₁.q₁))·denom(2,-q₁,mUVexp²,-mUV²+(q₁.q₁)))
  2344. 203.03 s > ... omitted 20090 more lines; see full nextest output above
  2345. 203.03 s >
  2346. 203.03 s > 9. gammaloop-integration-tests::uv::se1l_uv
  2347. 203.03 s > failure: test failure with exit code 101
  2348. 203.03 s > system-out
  2349. 203.03 s > running 1 test
  2350. 203.03 s > test se1l_uv has been running for over 60 seconds
  2351. 203.03 s > +------+-----------------+---------+--------+----------+-----------------------------------------------------------------------------------------------------------------------+-------+
  2352. 203.03 s > | case | check | graph | status | sigma | threshold | error |
  2353. 203.03 s > +------+-----------------+---------+--------+----------+-----------------------------------------------------------------------------------------------------------------------+-------+
  2354. 203.03 s > | se1l | uv_profile | - | FAIL | - | - | - |
  2355. 203.03 s > +------+-----------------+---------+--------+----------+-----------------------------------------------------------------------------------------------------------------------+-------+
  2356. 203.03 s > | se1l | m_uv.inspect | inspect | pass | - | best inspect relative delta 1.097e-1 >= 1000*accuracy 1.000e-7 (accuracy=1.000e-10, exponent=+2.0, seed=1, probes=10) | - |
  2357. 203.03 s > +------+-----------------+---------+--------+----------+-----------------------------------------------------------------------------------------------------------------------+-------+
  2358. 203.03 s > | se1l | m_uv.integrated | se1l | pass | 0.1sigma | compatible within 2sigma | - |
  2359. 203.03 s > +------+-----------------+---------+--------+----------+-----------------------------------------------------------------------------------------------------------------------+-------+
  2360. 203.03 s > | se1l | rls.inspect | inspect | pass | - | best inspect relative delta 4.499e-2 >= 1000*accuracy 1.000e-7 (accuracy=1.000e-10, exponent=+2.0, seed=1, probes=10) | - |
  2361. 203.03 s > +------+-----------------+---------+--------+----------+-----------------------------------------------------------------------------------------------------------------------+-------+
  2362. 203.03 s > | se1l | rls.integrated | se1l | pass | 0.0sigma | compatible within 2sigma | - |
  2363. 203.03 s > +------+-----------------+---------+--------+----------+-----------------------------------------------------------------------------------------------------------------------+-------+
  2364. 203.03 s > | se1l | mu_r.inspect | inspect | pass | - | best inspect relative delta 1.424e-1 >= 1000*accuracy 1.000e-7 (accuracy=1.000e-10, exponent=+2.0, seed=1, probes=10) | - |
  2365. 203.03 s > +------+-----------------+---------+--------+----------+-----------------------------------------------------------------------------------------------------------------------+-------+
  2366. 203.03 s > | se1l | target | - | pass | - | 2sigma | - |
  2367. 203.03 s > +------+-----------------+---------+--------+----------+-----------------------------------------------------------------------------------------------------------------------+-------+
  2368. 203.03 s > test se1l_uv ... FAILED
  2369. 203.03 s >
  2370. 203.03 s > failures:
  2371. 203.03 s >
  2372. 203.03 s > failures:
  2373. 203.03 s > se1l_uv
  2374. 203.03 s >
  2375. 203.03 s > test result: FAILED. 0 passed; 1 failed; 0 ignored; 0 measured; 24 filtered out; finished in 142.86s
  2376. 203.03 s > system-err
  2377. 203.03 s > [2026-08-28 15:45:21.038] @gammaloop_api::se... INFO : Running command run generate
  2378. 203.03 s > [2026-08-28 15:45:21.039] @gammaloop_api::se... INFO : Starting command block generate
  2379. 203.03 s > [2026-08-28 15:45:21.039] @gammaloop_api::se... INFO : Running command import model sm-default
  2380. 203.03 s > [2026-08-28 15:45:21.039] @import::model INFO : Loading built-in JSON model sm-default
  2381. 203.03 s > [2026-08-28 15:45:21.064] @gammalooprs::model INFO : The following 11 external parameters were forced to zero by the restriction card:
  2382. 203.03 s > lamWS, AWS, rhoWS, etaWS, ymc, yme, ymm, MC, Me, MM, WTau
  2383. 203.03 s > [2026-08-28 15:45:21.064] @gammalooprs::model INFO : The following 34 vertex rules were removed by the restriction card:
  2384. 203.03 s > V_82 -> (c~, d, G+) | V_83 -> (t~, d, G+) | V_84 -> (c~, s, G+) | V_85 -> (t~, s, G+) | V_86 -> (u~, b, G+) | V_87 -> (c~, b, G+) | V_90 -> (c~, d, W+) | V_91 -> (t~, d, W+) | V_92 -> (u~, s, W+) | V_94 -> (t~, s, W+) | V_95 -> (u~, b, W+) | V_96 -> (c~, b, W+) | V_101 -> (e+, e-, G0) | V_102 -> (mu+, mu-, G0) | V_104 -> (e+, e-, H) | V_105 -> (mu+, mu-, H) | V_110 -> (ve~, e-, G+) | V_111 -> (vm~, mu-, G+) | V_116 -> (b~, u, G-) | V_117 -> (d~, c, G-) | V_118 -> (s~, c, G-) | V_119 -> (b~, c, G-) | V_120 -> (d~, t, G-) | V_121 -> (s~, t, G-) | V_124 -> (s~, u, W-) | V_125 -> (b~, u, W-) | V_126 -> (d~, c, W-) | V_128 -> (b~, c, W-) | V_129 -> (d~, t, W-) | V_130 -> (s~, t, W-) | V_138 -> (c~, c, G0) | V_140 -> (c~, c, H) | V_145 -> (e+, ve, G-) | V_146 -> (mu+, vm, G-)
  2385. 203.03 s > [2026-08-28 15:45:21.064] @gammalooprs::model INFO : The following 36 couplings were removed by the restriction card:
  2386. 203.03 s > GC_13, GC_14, GC_16, GC_17, GC_18, GC_19, GC_20, GC_22, GC_23, GC_24, GC_25, GC_26, GC_28, GC_29, GC_42, GC_43, GC_44, GC_46, GC_47, GC_48, GC_84, GC_85, GC_86, GC_87, GC_88, GC_89, GC_90, GC_91, GC_92, GC_93, GC_101, GC_102, GC_103, GC_105, GC_106, GC_107
  2387. 203.03 s > [2026-08-28 15:45:21.065] @gammaloop_api::se... INFO : Running command remove processes
  2388. 203.03 s > [2026-08-28 15:45:21.065] @gammaloop_api::se... INFO : Running command set global kv global.generation.uv.generate_integrated=true
  2389. 203.03 s > [2026-08-28 15:45:21.066] @gammaloop_api::se... INFO : Running command import graphs ./tests/resources/graphs/uv_tests/se1l.dot -p se1l -i se1l
  2390. 203.03 s > [2026-08-28 15:45:21.066] @commands::import INFO : Loading graphs from '/build/source/tests/resources/graphs/uv_tests/se1l.dot'
  2391. 203.03 s > [2026-08-28 15:45:21.074] @gammaloop_api::se... INFO : Running command generate existing -p se1l -i se1l
  2392. 203.03 s > [2026-08-28 15:45:23.335] @commands::generate INFO :
  2393. 203.03 s > Integrand generation summary
  2394. 203.03 s > peak RAM 63.20 MiB | cores 1
  2395. 203.03 s > ╭───────────┬───────┬─────────┬─────────────┬─────────────┬────────────────┬─────────────╮
  2396. 203.03 s > │ integrand │ graph │ # evals │ expr build │ spenso │ symbolica eval │ compile │
  2397. 203.03 s > ├───────────┼───────┼─────────┼─────────────┼─────────────┼────────────────┼─────────────┤
  2398. 203.03 s > │ se1l │ se1l │ 5 │ 2.05s (95%) │ 41ms (1.9%) │ 56ms (2.6%) │ 0ms (0.00%) │
  2399. 203.03 s > ├───────────┼───────┼─────────┼─────────────┼─────────────┼────────────────┼─────────────┤
  2400. 203.03 s > │ Total │ │ 5 │ 2.05s (95%) │ 41ms (1.9%) │ 56ms (2.6%) │ 0ms (0.00%) │
  2401. 203.03 s > ╰───────────┴───────┴─────────┴─────────────┴─────────────┴────────────────┴─────────────╯
  2402. 203.03 s > [2026-08-28 15:45:23.338] @gammaloop_api::se... INFO : Running command set process -p se1l -i se1l kv general.m_uv=0.2
  2403. 203.03 s > [2026-08-28 15:45:23.339] @gammaloop_api::se... INFO : Running command set process -p se1l -i se1l kv general.mu_r=0.2
  2404. 203.03 s > [2026-08-28 15:45:23.355] @gammaloop_api::se... INFO : Running command set process -p se1l -i se1l kv general.renormalization_localization_scale=0.2
  2405. 203.03 s > [2026-08-28 15:45:23.361] @gammaloop_api::se... INFO : Running command duplicate integrand -p se1l -i se1l --output_process_name se1l --output_integrand_name se1l_muv_shifted
  2406. 203.03 s > [2026-08-28 15:45:23.374] @gammaloop_api::se... INFO : Running command set process -p se1l -i se1l_muv_shifted kv general.m_uv=0.5
  2407. 203.03 s > [2026-08-28 15:45:23.375] @gammaloop_api::se... INFO : Running command duplicate integrand -p se1l -i se1l --output_process_name se1l --output_integrand_name se1l_rls_shifted
  2408. 203.03 s > [2026-08-28 15:45:23.398] @gammaloop_api::se... INFO : Running command set process -p se1l -i se1l_rls_shifted kv general.renormalization_localization_scale=1
  2409. 203.03 s > [2026-08-28 15:45:23.420] @gammaloop_api::se... INFO : Running command duplicate integrand -p se1l -i se1l --output_process_name se1l --output_integrand_name se1l_mur_shifted
  2410. 203.03 s > [2026-08-28 15:45:23.437] @gammaloop_api::se... INFO : Running command set process -p se1l -i se1l_mur_shifted kv general.mu_r=0.8
  2411. 203.03 s > [2026-08-28 15:45:23.487] @process::amplitude WARNING : External state 0 ('g', PDG 21, helicity +) is off shell: p^2 = +2.5e5, expected m^2 = +0e0 (|Δ| = +2.5e5). Fixed-helicity spinor/vector/tensor external states may be ill-defined at this kinematic point.
  2412. 203.03 s > field value
  2413. 203.03 s > span warm_up{integrand.name=se1l}
  2414. 203.03 s > [2026-08-28 15:45:23.487] @process::amplitude WARNING : External state 1 ('g', PDG 21, helicity -) is off shell: p^2 = +2.5e5, expected m^2 = +0e0 (|Δ| = +2.5e5). Fixed-helicity spinor/vector/tensor external states may be ill-defined at this kinematic point.
  2415. 203.03 s > field value
  2416. 203.03 s > span warm_up{integrand.name=se1l}
  2417. 203.03 s > [2026-08-28 15:45:23.487] @process::amplitude INFO : Input is above threshold: 1 existing threshold E-surfaces across 1/1 graph groups
  2418. 203.03 s > field value
  2419. 203.03 s > existing_esurfaces 1
  2420. 203.03 s > group_count 1
  2421. 203.03 s > groups_above_threshold 1
  2422. 203.03 s > integrand se1l
  2423. 203.03 s > span warm_up{integrand.name=se1l}
  2424. 203.03 s > threshold_status above threshold
  2425. 203.03 s > [2026-08-28 15:45:23.487] @process::amplitude INFO : overlap structure of group 0: [1: [0(2,3)]]
  2426. 203.03 s > field value
  2427. 203.03 s > span warm_up{integrand.name=se1l}
  2428. 203.03 s > [2026-08-28 15:45:24.237] @commands::profile INFO :
  2429. 203.03 s > ╭───────┬──────┬──────────┬───────┬─────┬──────────┬───────────╮
  2430. 203.03 s > │ fixed │ → ∞ │ slope │ r2 │ DOD │ bare DOD │ inspect │
  2431. 203.03 s > ├───────┼──────┼──────────┼───────┼─────┼──────────┼───────────┤
  2432. 203.03 s > │ {} │ {e3} │ 1.639236 │ 0.904 │ 2 │ 2 │ arb retry │
  2433. 203.03 s > │ {} │ {e2} │ 1.698834 │ 0.902 │ 2 │ 2 │ arb retry │
  2434. 203.03 s > ╰───────┴──────┴──────────┴───────┴─────┴──────────┴───────────╯
  2435. 203.03 s > [2026-08-28 15:45:24.237] @commands::profile INFO :
  2436. 203.03 s > ╭───────┬──────┬─────────────┬──────────┬───────┬─────┬──────────┬───────────╮
  2437. 203.03 s > │ fixed │ → ∞ │ orientation │ slope │ r2 │ DOD │ bare DOD │ inspect │
  2438. 203.03 s > ├───────┼──────┼─────────────┼──────────┼───────┼─────┼──────────┼───────────┤
  2439. 203.03 s > │ {} │ {e3} │ 00-+ │ 0.343429 │ 0.145 │ 0 │ 2 │ arb retry │
  2440. 203.03 s > │ {} │ {e3} │ 00+- │ 0.342577 │ 0.135 │ 0 │ 2 │ arb retry │
  2441. 203.03 s > │ {} │ {e2} │ 00-+ │ 0.385975 │ 0.161 │ 0 │ 2 │ arb retry │
  2442. 203.03 s > │ {} │ {e2} │ 00+- │ 0.384920 │ 0.192 │ 0 │ 2 │ arb retry │
  2443. 203.03 s > ╰───────┴──────┴─────────────┴──────────┴───────┴─────┴──────────┴───────────╯
  2444. 203.03 s > [2026-08-28 15:45:24.238] @gammaloop_api::se... INFO : Running command set process kv integrator.target_relative_accuracy=0.001 integrator.n_increase=0 integrator.n_start=50000 integrator.n_max=400000 integrator.seed=1337
  2445. 203.03 s > [2026-08-28 15:45:24.244] @commands::integrate INFO : Created workspace directory at /build/source/tests/artifacts/se1l/integration_workspace_se1l
  2446. 203.03 s > [2026-08-28 15:45:24.301] @commands::integrate INFO : No integration state found, starting new integration
  2447. 203.03 s > [2026-08-28 15:45:24.301] @commands::integrate INFO : Gammaloop now integrates se1l@se1l, se1l@se1l_muv_shifted, se1l@se1l_rls_shifted
  2448. 203.03 s > [2026-08-28 15:45:24.301] @process::amplitude WARNING : External state 0 ('g', PDG 21, helicity +) is off shell: p^2 = +2.5e5, expected m^2 = +0e0 (|Δ| = +2.5e5). Fixed-helicity spinor/vector/tensor external states may be ill-defined at this kinematic point.
  2449. 203.03 s > field value
  2450. 203.03 s > span warm_up{integrand.name=se1l}
  2451. 203.03 s > [2026-08-28 15:45:24.301] @process::amplitude WARNING : External state 1 ('g', PDG 21, helicity -) is off shell: p^2 = +2.5e5, expected m^2 = +0e0 (|Δ| = +2.5e5). Fixed-helicity spinor/vector/tensor external states may be ill-defined at this kinematic point.
  2452. 203.03 s > field value
  2453. 203.03 s > span warm_up{integrand.name=se1l}
  2454. 203.03 s > [2026-08-28 15:45:24.302] @process::amplitude INFO : Input is above threshold: 1 existing threshold E-surfaces across 1/1 graph groups
  2455. 203.03 s > field value
  2456. 203.03 s > existing_esurfaces 1
  2457. 203.03 s > group_count 1
  2458. 203.03 s > groups_above_threshold 1
  2459. 203.03 s > integrand se1l
  2460. 203.03 s > span warm_up{integrand.name=se1l}
  2461. 203.03 s > threshold_status above threshold
  2462. 203.03 s > [2026-08-28 15:45:24.302] @process::amplitude INFO : overlap structure of group 0: [1: [0(2,3)]]
  2463. 203.03 s > field value
  2464. 203.03 s > span warm_up{integrand.name=se1l}
  2465. 203.03 s > [2026-08-28 15:45:24.308] @process::amplitude WARNING : External state 0 ('g', PDG 21, helicity +) is off shell: p^2 = +2.5e5, expected m^2 = +0e0 (|Δ| = +2.5e5). Fixed-helicity spinor/vector/tensor external states may be ill-defined at this kinematic point.
  2466. 203.03 s > field value
  2467. 203.03 s > span warm_up{integrand.name=se1l_muv_shifted}
  2468. 203.03 s > [2026-08-28 15:45:24.308] @process::amplitude WARNING : External state 1 ('g', PDG 21, helicity -) is off shell: p^2 = +2.5e5, expected m^2 = +0e0 (|Δ| = +2.5e5). Fixed-helicity spinor/vector/tensor external states may be ill-defined at this kinematic point.
  2469. 203.03 s > field value
  2470. 203.03 s > span warm_up{integrand.name=se1l_muv_shifted}
  2471. 203.03 s > [2026-08-28 15:45:24.309] @process::amplitude INFO : Input is above threshold: 1 existing threshold E-surfaces across 1/1 graph groups
  2472. 203.03 s > field value
  2473. 203.03 s > existing_esurfaces 1
  2474. 203.03 s > group_count 1
  2475. 203.03 s > groups_above_threshold 1
  2476. 203.03 s > integrand se1l_muv_shifted
  2477. 203.03 s > span warm_up{integrand.name=se1l_muv_shifted}
  2478. 203.03 s > threshold_status above threshold
  2479. 203.03 s > [2026-08-28 15:45:24.309] @process::amplitude INFO : overlap structure of group 0: [1: [0(2,3)]]
  2480. 203.03 s > field value
  2481. 203.03 s > span warm_up{integrand.name=se1l_muv_shifted}
  2482. 203.03 s > [2026-08-28 15:45:24.311] @process::amplitude WARNING : External state 0 ('g', PDG 21, helicity +) is off shell: p^2 = +2.5e5, expected m^2 = +0e0 (|Δ| = +2.5e5). Fixed-helicity spinor/vector/tensor external states may be ill-defined at this kinematic point.
  2483. 203.03 s > field value
  2484. 203.03 s > span warm_up{integrand.name=se1l_rls_shifted}
  2485. 203.03 s > [2026-08-28 15:45:24.311] @process::amplitude WARNING : External state 1 ('g', PDG 21, helicity -) is off shell: p^2 = +2.5e5, expected m^2 = +0e0 (|Δ| = +2.5e5). Fixed-helicity spinor/vector/tensor external states may be ill-defined at this kinematic point.
  2486. 203.03 s > field value
  2487. 203.03 s > span warm_up{integrand.name=se1l_rls_shifted}
  2488. 203.03 s > [2026-08-28 15:45:24.318] @process::amplitude INFO : Input is above threshold: 1 existing threshold E-surfaces across 1/1 graph groups
  2489. 203.03 s > field value
  2490. 203.03 s > existing_esurfaces 1
  2491. 203.03 s > group_count 1
  2492. 203.03 s > groups_above_threshold 1
  2493. 203.03 s > integrand se1l_rls_shifted
  2494. 203.03 s > span warm_up{integrand.name=se1l_rls_shifted}
  2495. 203.03 s > threshold_status above threshold
  2496. 203.03 s > ... omitted 1410 more lines; see full nextest output above
  2497. 203.03 s > =========================================
  2498. 203.03 s For full logs, run:
  2499. 203.03 s nix log /nix/store/5lvckp7qh3dqs2nqf61qj4kz6kj46p4q-gammaloop-nextest-integration.drv
  2500. 203.16 s Run failed.