test packages.x86_64-linux.nix-ci-check-gammaloop-nextest-docs
0.01 s
$ /nix/store/61685rbaxmpigwi3z23i33sv3jyfl70q-coreutils-9.11/bin/timeout --kill-after=15s 7200s /nix/store/wknkybkzrc16r11vk5vrykh4wmw7a353-nix-2.34.8/bin/nix --extra-experimental-features nix-command --extra-experimental-features flakes flake clone git+https://github.com/alphal00p/gammaloop --dest /tmp/nix-ci-worker/stable-pwd/repo/
0.12 s
Cloning into '/tmp/nix-ci-worker/stable-pwd/repo'...
0.92 s
remote: Enumerating objects: 110731, done.
1.16 s
remote: Counting objects: 0% (1/14562)
remote: Counting objects: 1% (146/14562)
remote: Counting objects: 2% (292/14562)
remote: Counting objects: 3% (437/14562)
remote: Counting objects: 4% (583/14562)
remote: Counting objects: 5% (729/14562)
remote: Counting objects: 6% (874/14562)
remote: Counting objects: 7% (1020/14562)
remote: Counting objects: 8% (1165/14562)
remote: Counting objects: 9% (1311/14562)
remote: Counting objects: 10% (1457/14562)
remote: Counting objects: 11% (1602/14562)
remote: Counting objects: 12% (1748/14562)
remote: Counting objects: 13% (1894/14562)
remote: Counting objects: 14% (2039/14562)
remote: Counting objects: 15% (2185/14562)
remote: Counting objects: 16% (2330/14562)
remote: Counting objects: 17% (2476/14562)
remote: Counting objects: 18% (2622/14562)
remote: Counting objects: 19% (2767/14562)
remote: Counting objects: 20% (2913/14562)
remote: Counting objects: 21% (3059/14562)
remote: Counting objects: 22% (3204/14562)
remote: Counting objects: 23% (3350/14562)
remote: Counting objects: 24% (3495/14562)
remote: Counting objects: 25% (3641/14562)
remote: Counting objects: 26% (3787/14562)
remote: Counting objects: 27% (3932/14562)
remote: Counting objects: 28% (4078/14562)
remote: Counting objects: 29% (4223/14562)
remote: Counting objects: 30% (4369/14562)
remote: Counting objects: 31% (4515/14562)
remote: Counting objects: 32% (4660/14562)
remote: Counting objects: 33% (4806/14562)
remote: Counting objects: 34% (4952/14562)
remote: Counting objects: 35% (5097/14562)
remote: Counting objects: 36% (5243/14562)
remote: Counting objects: 37% (5388/14562)
remote: Counting objects: 38% (5534/14562)
remote: Counting objects: 39% (5680/14562)
remote: Counting objects: 40% (5825/14562)
remote: Counting objects: 41% (5971/14562)
remote: Counting objects: 42% (6117/14562)
remote: Counting objects: 43% (6262/14562)
remote: Counting objects: 44% (6408/14562)
remote: Counting objects: 45% (6553/14562)
remote: Counting objects: 46% (6699/14562)
remote: Counting objects: 47% (6845/14562)
remote: Counting objects: 48% (6990/14562)
remote: Counting objects: 49% (7136/14562)
remote: Counting objects: 50% (7281/14562)
remote: Counting objects: 51% (7427/14562)
remote: Counting objects: 52% (7573/14562)
remote: Counting objects: 53% (7718/14562)
remote: Counting objects: 54% (7864/14562)
remote: Counting objects: 55% (8010/14562)
remote: Counting objects: 56% (8155/14562)
remote: Counting objects: 57% (8301/14562)
remote: Counting objects: 58% (8446/14562)
remote: Counting objects: 59% (8592/14562)
remote: Counting objects: 60% (8738/14562)
remote: Counting objects: 61% (8883/14562)
remote: Counting objects: 62% (9029/14562)
remote: Counting objects: 63% (9175/14562)
remote: Counting objects: 64% (9320/14562)
remote: Counting objects: 65% (9466/14562)
remote: Counting objects: 66% (9611/14562)
remote: Counting objects: 67% (9757/14562)
remote: Counting objects: 68% (9903/14562)
remote: Counting objects: 69% (10048/14562)
remote: Counting objects: 70% (10194/14562)
remote: Counting objects: 71% (10340/14562)
remote: Counting objects: 72% (10485/14562)
remote: Counting objects: 73% (10631/14562)
remote: Counting objects: 74% (10776/14562)
remote: Counting objects: 75% (10922/14562)
remote: Counting objects: 76% (11068/14562)
remote: Counting objects: 77% (11213/14562)
remote: Counting objects: 78% (11359/14562)
remote: Counting objects: 79% (11504/14562)
remote: Counting objects: 80% (11650/14562)
remote: Counting objects: 81% (11796/14562)
remote: Counting objects: 82% (11941/14562)
remote: Counting objects: 83% (12087/14562)
remote: Counting objects: 84% (12233/14562)
remote: Counting objects: 85% (12378/14562)
remote: Counting objects: 86% (12524/14562)
remote: Counting objects: 87% (12669/14562)
remote: Counting objects: 88% (12815/14562)
remote: Counting objects: 89% (12961/14562)
remote: Counting objects: 90% (13106/14562)
remote: Counting objects: 91% (13252/14562)
remote: Counting objects: 92% (13398/14562)
remote: Counting objects: 93% (13543/14562)
remote: Counting objects: 94% (13689/14562)
remote: Counting objects: 95% (13834/14562)
remote: Counting objects: 96% (13980/14562)
remote: Counting objects: 97% (14126/14562)
remote: Counting objects: 98% (14271/14562)
remote: Counting objects: 99% (14417/14562)
remote: Counting objects: 100% (14562/14562)
remote: Counting objects: 100% (14562/14562), done.
5.77 s
remote: Compressing objects: 0% (1/2921)
remote: Compressing objects: 1% (30/2921)
remote: Compressing objects: 2% (59/2921)
remote: Compressing objects: 3% (88/2921)
remote: Compressing objects: 4% (117/2921)
remote: Compressing objects: 5% (147/2921)
remote: Compressing objects: 6% (176/2921)
remote: Compressing objects: 7% (205/2921)
remote: Compressing objects: 8% (234/2921)
remote: Compressing objects: 9% (263/2921)
remote: Compressing objects: 10% (293/2921)
remote: Compressing objects: 11% (322/2921)
remote: Compressing objects: 11% (333/2921)
remote: Compressing objects: 12% (351/2921)
remote: Compressing objects: 12% (377/2921)
remote: Compressing objects: 13% (380/2921)
remote: Compressing objects: 14% (409/2921)
remote: Compressing objects: 15% (439/2921)
remote: Compressing objects: 16% (468/2921)
remote: Compressing objects: 16% (486/2921)
remote: Compressing objects: 17% (497/2921)
remote: Compressing objects: 18% (526/2921)
remote: Compressing objects: 19% (555/2921)
remote: Compressing objects: 20% (585/2921)
remote: Compressing objects: 21% (614/2921)
remote: Compressing objects: 22% (643/2921)
remote: Compressing objects: 22% (671/2921)
remote: Compressing objects: 23% (672/2921)
remote: Compressing objects: 24% (702/2921)
remote: Compressing objects: 25% (731/2921)
remote: Compressing objects: 26% (760/2921)
remote: Compressing objects: 27% (789/2921)
remote: Compressing objects: 28% (818/2921)
remote: Compressing objects: 29% (848/2921)
remote: Compressing objects: 30% (877/2921)
remote: Compressing objects: 31% (906/2921)
remote: Compressing objects: 32% (935/2921)
remote: Compressing objects: 33% (964/2921)
remote: Compressing objects: 34% (994/2921)
remote: Compressing objects: 35% (1023/2921)
remote: Compressing objects: 36% (1052/2921)
remote: Compressing objects: 37% (1081/2921)
remote: Compressing objects: 38% (1110/2921)
remote: Compressing objects: 39% (1140/2921)
remote: Compressing objects: 40% (1169/2921)
remote: Compressing objects: 41% (1198/2921)
remote: Compressing objects: 42% (1227/2921)
remote: Compressing objects: 43% (1257/2921)
remote: Compressing objects: 44% (1286/2921)
remote: Compressing objects: 45% (1315/2921)
remote: Compressing objects: 46% (1344/2921)
remote: Compressing objects: 47% (1373/2921)
remote: Compressing objects: 48% (1403/2921)
remote: Compressing objects: 49% (1432/2921)
remote: Compressing objects: 50% (1461/2921)
remote: Compressing objects: 51% (1490/2921)
remote: Compressing objects: 52% (1519/2921)
remote: Compressing objects: 53% (1549/2921)
remote: Compressing objects: 54% (1578/2921)
remote: Compressing objects: 55% (1607/2921)
remote: Compressing objects: 56% (1636/2921)
remote: Compressing objects: 57% (1665/2921)
remote: Compressing objects: 58% (1695/2921)
remote: Compressing objects: 59% (1724/2921)
remote: Compressing objects: 60% (1753/2921)
remote: Compressing objects: 61% (1782/2921)
remote: Compressing objects: 62% (1812/2921)
remote: Compressing objects: 63% (1841/2921)
remote: Compressing objects: 64% (1870/2921)
remote: Compressing objects: 65% (1899/2921)
remote: Compressing objects: 66% (1928/2921)
remote: Compressing objects: 67% (1958/2921)
remote: Compressing objects: 68% (1987/2921)
remote: Compressing objects: 69% (2016/2921)
remote: Compressing objects: 70% (2045/2921)
remote: Compressing objects: 71% (2074/2921)
remote: Compressing objects: 72% (2104/2921)
remote: Compressing objects: 73% (2133/2921)
remote: Compressing objects: 74% (2162/2921)
remote: Compressing objects: 75% (2191/2921)
remote: Compressing objects: 76% (2220/2921)
remote: Compressing objects: 77% (2250/2921)
remote: Compressing objects: 78% (2279/2921)
remote: Compressing objects: 79% (2308/2921)
remote: Compressing objects: 80% (2337/2921)
remote: Compressing objects: 81% (2367/2921)
remote: Compressing objects: 82% (2396/2921)
remote: Compressing objects: 83% (2425/2921)
remote: Compressing objects: 84% (2454/2921)
remote: Compressing objects: 85% (2483/2921)
remote: Compressing objects: 86% (2513/2921)
remote: Compressing objects: 87% (2542/2921)
remote: Compressing objects: 88% (2571/2921)
remote: Compressing objects: 89% (2600/2921)
remote: Compressing objects: 90% (2629/2921)
remote: Compressing objects: 91% (2659/2921)
remote: Compressing objects: 92% (2688/2921)
remote: Compressing objects: 93% (2717/2921)
remote: Compressing objects: 94% (2746/2921)
remote: Compressing objects: 95% (2775/2921)
remote: Compressing objects: 96% (2805/2921)
remote: Compressing objects: 97% (2834/2921)
remote: Compressing objects: 98% (2863/2921)
remote: Compressing objects: 99% (2892/2921)
remote: Compressing objects: 100% (2921/2921)
remote: Compressing objects: 100% (2921/2921), done.
15.97 s
Receiving objects: 0% (1/110731)
Receiving objects: 1% (1108/110731)
Receiving objects: 2% (2215/110731)
Receiving objects: 3% (3322/110731)
Receiving objects: 4% (4430/110731), 16.68 MiB | 33.35 MiB/s
Receiving objects: 5% (5537/110731), 16.68 MiB | 33.35 MiB/s
Receiving objects: 6% (6644/110731), 16.68 MiB | 33.35 MiB/s
Receiving objects: 7% (7752/110731), 16.68 MiB | 33.35 MiB/s
Receiving objects: 7% (8409/110731), 33.73 MiB | 33.73 MiB/s
Receiving objects: 8% (8859/110731), 33.73 MiB | 33.73 MiB/s
Receiving objects: 9% (9966/110731), 33.73 MiB | 33.73 MiB/s
Receiving objects: 10% (11074/110731), 33.73 MiB | 33.73 MiB/s
Receiving objects: 11% (12181/110731), 49.69 MiB | 33.12 MiB/s
Receiving objects: 11% (12538/110731), 66.39 MiB | 32.81 MiB/s
Receiving objects: 12% (13288/110731), 66.39 MiB | 32.81 MiB/s
Receiving objects: 13% (14396/110731), 66.39 MiB | 32.81 MiB/s
Receiving objects: 14% (15503/110731), 66.39 MiB | 32.81 MiB/s
Receiving objects: 15% (16610/110731), 66.39 MiB | 32.81 MiB/s
Receiving objects: 16% (17717/110731), 66.39 MiB | 32.81 MiB/s
Receiving objects: 17% (18825/110731), 66.39 MiB | 32.81 MiB/s
Receiving objects: 18% (19932/110731), 80.22 MiB | 31.79 MiB/s
Receiving objects: 19% (21039/110731), 80.22 MiB | 31.79 MiB/s
Receiving objects: 20% (22147/110731), 80.22 MiB | 31.79 MiB/s
Receiving objects: 21% (23254/110731), 80.22 MiB | 31.79 MiB/s
Receiving objects: 22% (24361/110731), 80.22 MiB | 31.79 MiB/s
Receiving objects: 23% (25469/110731), 80.22 MiB | 31.79 MiB/s
Receiving objects: 24% (26576/110731), 80.22 MiB | 31.79 MiB/s
Receiving objects: 25% (27683/110731), 80.22 MiB | 31.79 MiB/s
Receiving objects: 26% (28791/110731), 80.22 MiB | 31.79 MiB/s
Receiving objects: 27% (29898/110731), 80.22 MiB | 31.79 MiB/s
Receiving objects: 28% (31005/110731), 80.22 MiB | 31.79 MiB/s
Receiving objects: 29% (32112/110731), 80.22 MiB | 31.79 MiB/s
Receiving objects: 30% (33220/110731), 80.22 MiB | 31.79 MiB/s
Receiving objects: 31% (34327/110731), 80.22 MiB | 31.79 MiB/s
Receiving objects: 32% (35434/110731), 80.22 MiB | 31.79 MiB/s
Receiving objects: 33% (36542/110731), 80.22 MiB | 31.79 MiB/s
Receiving objects: 34% (37649/110731), 80.22 MiB | 31.79 MiB/s
Receiving objects: 35% (38756/110731), 80.22 MiB | 31.79 MiB/s
Receiving objects: 36% (39864/110731), 80.22 MiB | 31.79 MiB/s
Receiving objects: 37% (40971/110731), 80.22 MiB | 31.79 MiB/s
Receiving objects: 38% (42078/110731), 80.22 MiB | 31.79 MiB/s
Receiving objects: 39% (43186/110731), 80.22 MiB | 31.79 MiB/s
Receiving objects: 40% (44293/110731), 80.22 MiB | 31.79 MiB/s
Receiving objects: 41% (45400/110731), 80.22 MiB | 31.79 MiB/s
Receiving objects: 41% (45404/110731), 80.22 MiB | 31.79 MiB/s
Receiving objects: 42% (46508/110731), 98.78 MiB | 32.67 MiB/s
Receiving objects: 43% (47615/110731), 98.78 MiB | 32.67 MiB/s
Receiving objects: 44% (48722/110731), 98.78 MiB | 32.67 MiB/s
Receiving objects: 45% (49829/110731), 98.78 MiB | 32.67 MiB/s
Receiving objects: 46% (50937/110731), 98.78 MiB | 32.67 MiB/s
Receiving objects: 47% (52044/110731), 98.78 MiB | 32.67 MiB/s
Receiving objects: 48% (53151/110731), 98.78 MiB | 32.67 MiB/s
Receiving objects: 49% (54259/110731), 98.78 MiB | 32.67 MiB/s
Receiving objects: 50% (55366/110731), 115.46 MiB | 32.77 MiB/s
Receiving objects: 51% (56473/110731), 115.46 MiB | 32.77 MiB/s
Receiving objects: 52% (57581/110731), 115.46 MiB | 32.77 MiB/s
Receiving objects: 53% (58688/110731), 115.46 MiB | 32.77 MiB/s
Receiving objects: 54% (59795/110731), 115.46 MiB | 32.77 MiB/s
Receiving objects: 54% (60169/110731), 115.46 MiB | 32.77 MiB/s
Receiving objects: 55% (60903/110731), 131.84 MiB | 32.54 MiB/s
Receiving objects: 56% (62010/110731), 131.84 MiB | 32.54 MiB/s
Receiving objects: 57% (63117/110731), 131.84 MiB | 32.54 MiB/s
Receiving objects: 58% (64224/110731), 131.84 MiB | 32.54 MiB/s
Receiving objects: 59% (65332/110731), 131.84 MiB | 32.54 MiB/s
Receiving objects: 60% (66439/110731), 131.84 MiB | 32.54 MiB/s
Receiving objects: 61% (67546/110731), 131.84 MiB | 32.54 MiB/s
Receiving objects: 61% (68175/110731), 148.21 MiB | 32.57 MiB/s
Receiving objects: 62% (68654/110731), 164.10 MiB | 32.39 MiB/s
Receiving objects: 63% (69761/110731), 164.10 MiB | 32.39 MiB/s
Receiving objects: 64% (70868/110731), 164.10 MiB | 32.39 MiB/s
Receiving objects: 65% (71976/110731), 164.10 MiB | 32.39 MiB/s
Receiving objects: 66% (73083/110731), 164.10 MiB | 32.39 MiB/s
Receiving objects: 67% (74190/110731), 164.10 MiB | 32.39 MiB/s
Receiving objects: 68% (75298/110731), 180.42 MiB | 32.23 MiB/s
Receiving objects: 69% (76405/110731), 180.42 MiB | 32.23 MiB/s
Receiving objects: 70% (77512/110731), 180.42 MiB | 32.23 MiB/s
Receiving objects: 71% (78620/110731), 180.42 MiB | 32.23 MiB/s
Receiving objects: 72% (79727/110731), 180.42 MiB | 32.23 MiB/s
Receiving objects: 73% (80834/110731), 180.42 MiB | 32.23 MiB/s
Receiving objects: 74% (81941/110731), 180.42 MiB | 32.23 MiB/s
Receiving objects: 75% (83049/110731), 180.42 MiB | 32.23 MiB/s
Receiving objects: 76% (84156/110731), 180.42 MiB | 32.23 MiB/s
Receiving objects: 77% (85263/110731), 180.42 MiB | 32.23 MiB/s
Receiving objects: 77% (85408/110731), 180.42 MiB | 32.23 MiB/s
Receiving objects: 78% (86371/110731), 196.66 MiB | 32.29 MiB/s
Receiving objects: 79% (87478/110731), 196.66 MiB | 32.29 MiB/s
Receiving objects: 80% (88585/110731), 196.66 MiB | 32.29 MiB/s
Receiving objects: 81% (89693/110731), 196.66 MiB | 32.29 MiB/s
Receiving objects: 81% (89726/110731), 229.37 MiB | 32.93 MiB/s
Receiving objects: 81% (90740/110731), 245.95 MiB | 32.49 MiB/s
Receiving objects: 82% (90800/110731), 262.41 MiB | 32.44 MiB/s
Receiving objects: 83% (91907/110731), 262.41 MiB | 32.44 MiB/s
Receiving objects: 84% (93015/110731), 262.41 MiB | 32.44 MiB/s
Receiving objects: 85% (94122/110731), 275.29 MiB | 31.86 MiB/s
Receiving objects: 85% (95145/110731), 291.44 MiB | 31.79 MiB/s
Receiving objects: 86% (95229/110731), 291.44 MiB | 31.79 MiB/s
Receiving objects: 87% (96336/110731), 291.44 MiB | 31.79 MiB/s
Receiving objects: 88% (97444/110731), 291.44 MiB | 31.79 MiB/s
Receiving objects: 89% (98551/110731), 291.44 MiB | 31.79 MiB/s
Receiving objects: 90% (99658/110731), 291.44 MiB | 31.79 MiB/s
Receiving objects: 91% (100766/110731), 291.44 MiB | 31.79 MiB/s
Receiving objects: 92% (101873/110731), 291.44 MiB | 31.79 MiB/s
Receiving objects: 93% (102980/110731), 291.44 MiB | 31.79 MiB/s
Receiving objects: 94% (104088/110731), 291.44 MiB | 31.79 MiB/s
Receiving objects: 95% (105195/110731), 291.44 MiB | 31.79 MiB/s
Receiving objects: 96% (106302/110731), 291.44 MiB | 31.79 MiB/s
Receiving objects: 97% (107410/110731), 291.44 MiB | 31.79 MiB/s
Receiving objects: 98% (108517/110731), 307.38 MiB | 31.80 MiB/s
Receiving objects: 98% (109395/110731), 307.38 MiB | 31.80 MiB/s
Receiving objects: 99% (109624/110731), 321.11 MiB | 31.22 MiB/s
remote: Total 110731 (delta 12254), reused 11928 (delta 11241), pack-reused 96169 (from 2)
15.98 s
Receiving objects: 100% (110731/110731), 321.11 MiB | 31.22 MiB/s
Receiving objects: 100% (110731/110731), 324.99 MiB | 31.88 MiB/s, done.
17.93 s
Resolving deltas: 0% (0/72611)
Resolving deltas: 1% (727/72611)
Resolving deltas: 2% (1453/72611)
Resolving deltas: 3% (2179/72611)
Resolving deltas: 4% (2905/72611)
Resolving deltas: 5% (3631/72611)
Resolving deltas: 6% (4357/72611)
Resolving deltas: 7% (5083/72611)
Resolving deltas: 8% (5809/72611)
Resolving deltas: 9% (6535/72611)
Resolving deltas: 10% (7265/72611)
Resolving deltas: 11% (7988/72611)
Resolving deltas: 12% (8714/72611)
Resolving deltas: 13% (9441/72611)
Resolving deltas: 14% (10166/72611)
Resolving deltas: 15% (10892/72611)
Resolving deltas: 16% (11618/72611)
Resolving deltas: 17% (12344/72611)
Resolving deltas: 18% (13070/72611)
Resolving deltas: 19% (13798/72611)
Resolving deltas: 20% (14523/72611)
Resolving deltas: 21% (15249/72611)
Resolving deltas: 22% (15975/72611)
Resolving deltas: 23% (16701/72611)
Resolving deltas: 24% (17427/72611)
Resolving deltas: 25% (18153/72611)
Resolving deltas: 26% (18879/72611)
Resolving deltas: 27% (19605/72611)
Resolving deltas: 28% (20336/72611)
Resolving deltas: 29% (21058/72611)
Resolving deltas: 30% (21784/72611)
Resolving deltas: 31% (22511/72611)
Resolving deltas: 32% (23237/72611)
Resolving deltas: 33% (23962/72611)
Resolving deltas: 34% (24688/72611)
Resolving deltas: 35% (25415/72611)
Resolving deltas: 36% (26140/72611)
Resolving deltas: 37% (26867/72611)
Resolving deltas: 38% (27593/72611)
Resolving deltas: 39% (28319/72611)
Resolving deltas: 40% (29045/72611)
Resolving deltas: 41% (29771/72611)
Resolving deltas: 42% (30498/72611)
Resolving deltas: 42% (31028/72611)
Resolving deltas: 43% (31223/72611)
Resolving deltas: 44% (31949/72611)
Resolving deltas: 45% (32675/72611)
Resolving deltas: 46% (33402/72611)
Resolving deltas: 47% (34128/72611)
Resolving deltas: 48% (34854/72611)
Resolving deltas: 49% (35581/72611)
Resolving deltas: 50% (36306/72611)
Resolving deltas: 51% (37032/72611)
Resolving deltas: 52% (37758/72611)
Resolving deltas: 53% (38484/72611)
Resolving deltas: 54% (39211/72611)
Resolving deltas: 55% (39937/72611)
Resolving deltas: 56% (40664/72611)
Resolving deltas: 57% (41389/72611)
Resolving deltas: 58% (42115/72611)
Resolving deltas: 59% (42841/72611)
Resolving deltas: 60% (43567/72611)
Resolving deltas: 61% (44293/72611)
Resolving deltas: 62% (45019/72611)
Resolving deltas: 63% (45745/72611)
Resolving deltas: 64% (46472/72611)
Resolving deltas: 65% (47198/72611)
Resolving deltas: 66% (47924/72611)
Resolving deltas: 67% (48652/72611)
Resolving deltas: 68% (49376/72611)
Resolving deltas: 69% (50103/72611)
Resolving deltas: 70% (50829/72611)
Resolving deltas: 71% (51555/72611)
Resolving deltas: 72% (52281/72611)
Resolving deltas: 73% (53007/72611)
Resolving deltas: 74% (53734/72611)
Resolving deltas: 75% (54459/72611)
Resolving deltas: 76% (55185/72611)
Resolving deltas: 77% (55912/72611)
Resolving deltas: 78% (56637/72611)
Resolving deltas: 79% (57363/72611)
Resolving deltas: 80% (58089/72611)
Resolving deltas: 81% (58815/72611)
Resolving deltas: 82% (59542/72611)
Resolving deltas: 83% (60268/72611)
Resolving deltas: 84% (60996/72611)
Resolving deltas: 85% (61721/72611)
Resolving deltas: 86% (62446/72611)
Resolving deltas: 87% (63172/72611)
Resolving deltas: 88% (63898/72611)
Resolving deltas: 89% (64627/72611)
Resolving deltas: 90% (65350/72611)
Resolving deltas: 91% (66077/72611)
Resolving deltas: 92% (66805/72611)
Resolving deltas: 93% (67529/72611)
Resolving deltas: 94% (68257/72611)
Resolving deltas: 95% (68981/72611)
Resolving deltas: 96% (69707/72611)
Resolving deltas: 97% (70433/72611)
Resolving deltas: 98% (71159/72611)
Resolving deltas: 99% (71885/72611)
Resolving deltas: 100% (72611/72611)
Resolving deltas: 100% (72611/72611), done.
18.56 s
Fetching commit 9d52e6b6b4ff2c85f26457074d140e152414899b for push-zwxzqnpnzwwu ...
18.56 s
$ /nix/store/5vpcfsdx1lcnlb2y4k7xyc74shp5qwbh-git-2.54.0/bin/git fetch origin 9d52e6b6b4ff2c85f26457074d140e152414899b
19.05 s
From https://github.com/alphal00p/gammaloop
19.05 s
* branch 9d52e6b6b4ff2c85f26457074d140e152414899b -> FETCH_HEAD
19.06 s
$ /nix/store/61685rbaxmpigwi3z23i33sv3jyfl70q-coreutils-9.11/bin/timeout --kill-after=15s 7200s /nix/store/5vpcfsdx1lcnlb2y4k7xyc74shp5qwbh-git-2.54.0/bin/git -c advice.detachedHead=false checkout 9d52e6b6b4ff2c85f26457074d140e152414899b
19.37 s
HEAD is now at 9d52e6b6b add standalone xbox sum, soft-triangle, and thrown-out diagrams
19.38 s
$ /nix/store/61685rbaxmpigwi3z23i33sv3jyfl70q-coreutils-9.11/bin/timeout --kill-after=15s 7200s /nix/store/wknkybkzrc16r11vk5vrykh4wmw7a353-nix-2.34.8/bin/nix --extra-experimental-features nix-command --extra-experimental-features flakes --log-format internal-json run .#packages.x86_64-linux.nix-ci-check-gammaloop-nextest-docs --print-build-logs
19.51 s
warning: ignoring untrusted flake configuration setting 'extra-substituters'.
19.51 s
Pass '--accept-flake-config' to trust it
19.51 s
warning: ignoring untrusted flake configuration setting 'extra-trusted-public-keys'.
19.51 s
Pass '--accept-flake-config' to trust it
23.95 s
24.22 s
evaluating derivation 'gdo you want to allow configuration setting 'extra-substituters' to be set to 'https://cache.nix-ci.com ' (y/N)? do you want to permanently mark this value as untrusted (y/N)? warning: ignoring untrusted flake configuration setting 'extra-substituters'.
24.22 s
Pass '--accept-flake-config' to trust it
24.22 s
do you want to allow configuration setting 'extra-trusted-public-keys' to be set to 'nix-ci:g3xV5BDTLtIBZr/A00IU1x0EtKKlb7YLgBN2SgYgM6A= ' (y/N)? do you want to permanently mark this value as untrusted (y/N)? warning: ignoring untrusted flake configuration setting 'extra-trusted-public-keys'.
24.22 s
Pass '--accept-flake-config' to trust it
37.42 s
copying '/nix/store/3raz
evaluating derivation 'g
copying '/nix/store/3raz
evaluating derivation 'g
copying '/nix/store/3raz
evaluating derivation 'g
copying '/nix/store/3raz
evaluating derivation 'g
copying '/nix/store/3raz
evaluating derivation 'g
copying '/nix/store/3raz
evaluating derivation 'g
copying '/nix/store/3raz
evaluating derivation 'g
copying '/nix/store/3raz
evaluating derivation 'g
querying source on https
[1 /0 /1 copied (824.0 KiB
[1 /0 /1 copied (4.7 /201.4
[1 /0 /1 copied (8.5 /201.4
[1 /0 /1 copied (12.9 /201.
[1 /0 /1 copied (17.2 /201.
[1 /0 /1 copied (21.0 /201.
[1 /0 /1 copied (23.2 /201.
[1 /0 /1 copied (25.5 /201.
[1 /0 /1 copied (33.5 /201.
[1 /0 /1 copied (36.0 /201.
[1 /0 /1 copied (38.2 /201.
[1 /0 /1 copied (40.1 /201.
[1 /0 /1 copied (41.8 /201.
[1 /0 /1 copied (43.2 /201.
[1 /0 /1 copied (46.5 /201.
[1 /0 /1 copied (47.9 /201.
[1 /0 /1 copied (50.3 /201.
[1 /0 /1 copied (51.9 /201.
[1 /0 /1 copied (53.8 /201.
[1 /0 /1 copied (55.9 /201.
[1 /0 /1 copied (57.4 /201.
[1 /0 /1 copied (59.6 /201.
[1 /0 /1 copied (61.2 /201.
[1 /0 /1 copied (63.1 /201.
[1 /0 /1 copied (64.7 /201.
[1 /0 /1 copied (66.7 /201.
[1 /0 /1 copied (69.0 /201.
[1 /0 /1 copied (71.1 /201.
[1 /0 /1 copied (72.5 /201.
[1 /0 /1 copied (74.0 /201.
[1 /0 /1 copied (75.3 /201.
[1 /0 /1 copied (76.8 /201.
[1 /0 /1 copied (79.4 /201.
[1 /0 /1 copied (80.6 /201.
[1 /0 /1 copied (82.9 /201.
[1 /0 /1 copied (85.8 /201.
[1 /0 /1 copied (86.8 /201.
[1 /0 /1 copied (88.0 /201.
[1 /0 /1 copied (89.4 /201.
[1 /0 /1 copied (90.4 /201.
[1 /0 /1 copied (91.6 /201.
[1 /0 /1 copied (92.6 /201.
[1 /0 /1 copied (94.6 /201.
[1 /0 /1 copied (96.2 /201.
[1 /0 /1 copied (97.0 /201.
[1 /0 /1 copied (98.0 /201.
[1 /0 /1 copied (99.8 /201.
[1 /0 /1 copied (101.0 /201
[1 /0 /1 copied (102.6 /201
[1 /0 /1 copied (103.9 /201
[1 /0 /1 copied (105.4 /201
[1 /0 /1 copied (106.4 /201
[1 /0 /1 copied (107.6 /201
[1 /0 /1 copied (108.6 /201
[1 /0 /1 copied (110.8 /201
[1 /0 /1 copied (112.4 /201
[1 /0 /1 copied (113.5 /201
[1 /0 /1 copied (115.0 /201
[1 /0 /1 copied (116.2 /201
[1 /0 /1 copied (117.5 /201
[1 /0 /1 copied (118.8 /201
[1 /0 /1 copied (129.8 /201
[1 /0 /1 copied (132.5 /201
[1 /0 /1 copied (141.8 /201
[1 /0 /1 copied (152.2 /201
[1 /0 /1 copied (157.9 /201
[1 /0 /1 copied (158.8 /201
[1 /0 /1 copied (160.0 /201
[1 /0 /1 copied (160.9 /201
[1 /0 /1 copied (161.6 /201
[1 /0 /1 copied (162.4 /201
[1 /0 /1 copied (163.5 /201
[1 /0 /1 copied (164.2 /201
[1 /0 /1 copied (165.0 /201
[1 /0 /1 copied (165.8 /201
[1 /0 /1 copied (166.7 /201
[1 /0 /1 copied (167.7 /201
[1 /0 /1 copied (168.6 /201
[1 /0 /1 copied (169.7 /201
[1 /0 /1 copied (170.5 /201
[1 /0 /1 copied (171.4 /201
[1 /0 /1 copied (172.3 /201
[1 /0 /1 copied (173.6 /201
[1 /0 /1 copied (174.5 /201
[1 /0 /1 copied (175.5 /201
[1 /0 /1 copied (176.6 /201
[1 /0 /1 copied (177.9 /201
[1 /0 /1 copied (187.2 /201
[1 /0 /1 copied (188.6 /201
[1 /0 /1 copied (190.2 /201
[1 /0 /1 copied (192.7 /201
[1 /0 /1 copied (197.5 /201
[1 /0 /1 copied (201.4 MiB
[1 copied (201.4 MiB), 4
46.04 s
[0 /14 built, 4 /1 /70 copi
[0 /14 built, 16 /16 /103 c
[0 /11 built, 16 /28 /103 c
[0 /10 built, 13 /36 /103 c
[0 /10 built, 9 /41 /103 co
[0 /10 built, 12 /44 /103 c
[0 /10 built, 7 /49 /103 co
[0 /10 built, 7 /52 /103 co
[0 /10 built, 6 /53 /103 co
[0 /10 built, 5 /55 /103 co
[0 /10 built, 4 /56 /103 co
[0 /10 built, 3 /57 /103 co
[0 /9 built, 16 /59 /103 co
[0 /9 built, 15 /65 /103 co
[0 /9 built, 15 /67 /103 co
[0 /9 built, 13 /70 /103 co
[0 /9 built, 12 /72 /103 co
[0 /9 built, 11 /75 /103 co
[0 /8 built, 10 /78 /103 co
[0 /8 built, 9 /79 /103 cop
[0 /8 built, 5 /84 /103 cop
[0 /8 built, 4 /85 /103 cop
[0 /8 built, 2 /87 /103 cop
[0 /8 built, 6 /88 /103 cop
[0 /8 built, 5 /89 /103 cop
[0 /8 built, 5 /90 /103 cop
[0 /8 built, 7 /91 /103 cop
[0 /8 built, 6 /92 /103 cop
[0 /7 built, 5 /94 /103 cop
[1 /0 /7 built, 5 /94 /103 cbuilder.pl> Running phase: patchPhase
46.05 s
builder.pl> Running phase: updateAutotoolsGnuConfigScriptsPhase
46.06 s
builder.pl> Running phase: configurePhase
46.06 s
builder.pl> no configure script, doing nothing
46.07 s
builder.pl> Running phase: buildPhase
46.07 s
builder.pl> Running phase: checkPhase
46.08 s
builder.pl> Running phase: installPhase
46.08 s
builder.pl> no Makefile or custom installPhase, doing nothing
46.08 s
builder.pl> Running phase: fixupPhase
46.10 s
builder.pl> shrinking RPATHs of ELF executables and libraries in /nix/store/zzmspl8wdn2a3ancrz8dg3kci887nw6d-builder.pl
46.10 s
builder.pl> checking for references to /build/ in /nix/store/zzmspl8wdn2a3ancrz8dg3kci887nw6d-builder.pl...
46.11 s
builder.pl> patching script interpreter paths in /nix/store/zzmspl8wdn2a3ancrz8dg3kci887nw6d-builder.pl
46.14 s
builder.pl (post)> Uploading to the NixCI cache: /nix/store/zzmspl8wdn2a3ancrz8dg3kci887nw6d-builder.pl
46.19 s
builder.pl (post)> warning: 'warn-short-path-literals' is deprecated, use 'lint-short-path-literals = ignore' instead
46.22 s
builder.pl (post)> copying 0 paths...
46.29 s
builder.pl (post)> warning: 'warn-short-path-literals' is deprecated, use 'lint-short-path-literals = ignore' instead
46.53 s
builder.pl (post)> copying 0 paths...
49.33 s
[1 /7 built, 5 /95 /103 cop
[1 /7 built, 4 /96 /103 cop
[1 /6 built, 3 /97 /103 cop
[1 /5 built, 2 /98 /103 cop
[1 /5 built, 2 /99 /103 cop
[1 /4 built, 1 /100 /103 co
[1 /3 built, 103 copied (typst> structuredAttrs is enabled
49.40 s
[1 /1 /3 built, 103 copiedtypst> created 4 symlinks in user environment
49.49 s
typst (post)> Uploading to the NixCI cache: /nix/store/yc93gbspdkf53nwjsf1mbydbsaq9snxl-typst-0.15.1-env
49.54 s
typst (post)> warning: 'warn-short-path-literals' is deprecated, use 'lint-short-path-literals = ignore' instead
49.58 s
typst (post)> copying 0 paths...
49.64 s
typst (post)> warning: 'warn-short-path-literals' is deprecated, use 'lint-short-path-literals = ignore' instead
49.89 s
typst (post)> copying 0 paths...
50.33 s
[2 /4 built, 103 copied (
[1 /2 /3 built, 103 copiedgammaloop-nextest-docs> Extracting 2 binaries to /build/source
50.38 s
gammaloop-nextest-docs> Extracted 5 files to /build/source in 0.05s
50.39 s
gammaloop-nextest-docs> ------------
50.39 s
gammaloop-nextest-docs> Nextest run ID 73f15340-affa-4fb4-af6e-29fa4492da4f with nextest profile: ci_gammaloop
50.39 s
gammaloop-nextest-docs> Starting 129 tests across 2 binaries
50.52 s
gammaloop-nextest-docs> FAIL [ 0.126s] ( 62/129) alphal00p-docs-builder provenance_tests :: each_build_captures_one_revision_before_rendering
50.52 s
gammaloop-nextest-docs> stdout ---
50.52 s
gammaloop-nextest-docs>
50.52 s
gammaloop-nextest-docs> running 1 test
50.52 s
gammaloop-nextest-docs>
50.52 s
gammaloop-nextest-docs> running 1 test
50.52 s
gammaloop-nextest-docs> test provenance_tests::each_build_captures_one_revision_before_rendering ... FAILED
50.52 s
gammaloop-nextest-docs>
50.52 s
gammaloop-nextest-docs> failures:
50.52 s
gammaloop-nextest-docs>
50.52 s
gammaloop-nextest-docs> failures:
50.52 s
gammaloop-nextest-docs> provenance_tests::each_build_captures_one_revision_before_rendering
50.52 s
gammaloop-nextest-docs>
50.52 s
gammaloop-nextest-docs> test result: FAILED. 0 passed; 1 failed; 0 ignored; 0 measured; 128 filtered out; finished in 0.11s
50.52 s
gammaloop-nextest-docs>
50.52 s
gammaloop-nextest-docs> test provenance_tests::each_build_captures_one_revision_before_rendering ... FAILED
50.52 s
gammaloop-nextest-docs>
50.52 s
gammaloop-nextest-docs> failures:
50.52 s
gammaloop-nextest-docs>
50.52 s
gammaloop-nextest-docs> failures:
50.52 s
gammaloop-nextest-docs> provenance_tests::each_build_captures_one_revision_before_rendering
50.52 s
gammaloop-nextest-docs>
50.52 s
gammaloop-nextest-docs> test result: FAILED. 0 passed; 1 failed; 0 ignored; 0 measured; 128 filtered out; finished in 0.12s
50.52 s
gammaloop-nextest-docs>
50.52 s
gammaloop-nextest-docs> stderr ---
50.52 s
gammaloop-nextest-docs>
50.52 s
gammaloop-nextest-docs> thread 'provenance_tests::each_build_captures_one_revision_before_rendering' (248) panicked at crates/alphal00p-docs-builder/src/provenance_tests.rs:297:14:
50.52 s
gammaloop-nextest-docs> called `Result::unwrap()` on an `Err` value: developer note nix-crane-cache-reuse verified scope nix/rust-workspace.nix changed (expected 66f700580ce13b9eaee90fe0111639e46968c531, found 0a568cb5712045aee37d96bfb2f91d3d32b7e9b9); owner review or an explicit no-impact attestation is required
50.52 s
gammaloop-nextest-docs>
50.52 s
gammaloop-nextest-docs> Location:
50.52 s
gammaloop-nextest-docs> crates/alphal00p-docs-builder/src/lib.rs:992:29
50.52 s
gammaloop-nextest-docs> stack backtrace:
50.52 s
gammaloop-nextest-docs> 0: __rustc::rust_begin_unwind
50.52 s
gammaloop-nextest-docs> 1: core::panicking::panic_fmt
50.52 s
gammaloop-nextest-docs> 2: core::result::unwrap_failed
50.52 s
gammaloop-nextest-docs> 3: alphal00p_docs_builder::provenance_tests::each_build_captures_one_revision_before_rendering
50.52 s
gammaloop-nextest-docs> 4: <alphal00p_docs_builder::provenance_tests::each_build_captures_one_revision_before_rendering::{closure#0} as core::ops::function::FnOnce<()>>::call_once
50.52 s
gammaloop-nextest-docs> note: Some details are omitted, run with `RUST_BACKTRACE=full` for a verbose backtrace.
50.52 s
gammaloop-nextest-docs>
50.52 s
gammaloop-nextest-docs> thread 'provenance_tests::each_build_captures_one_revision_before_rendering' (182) panicked at crates/alphal00p-docs-builder/src/provenance_tests.rs:274:9:
50.52 s
gammaloop-nextest-docs> assertion failed: command.status().unwrap().success()
50.52 s
gammaloop-nextest-docs> stack backtrace:
50.52 s
gammaloop-nextest-docs> 0: __rustc::rust_begin_unwind
50.52 s
gammaloop-nextest-docs> 1: core::panicking::panic_fmt
50.52 s
gammaloop-nextest-docs> 2: core::panicking::panic
50.52 s
gammaloop-nextest-docs> 3: alphal00p_docs_builder::provenance_tests::each_build_captures_one_revision_before_rendering
50.52 s
gammaloop-nextest-docs> 4: <alphal00p_docs_builder::provenance_tests::each_build_captures_one_revision_before_rendering::{closure#0} as core::ops::function::FnOnce<()>>::call_once
50.52 s
gammaloop-nextest-docs> note: Some details are omitted, run with `RUST_BACKTRACE=full` for a verbose backtrace.
50.52 s
gammaloop-nextest-docs>
50.52 s
gammaloop-nextest-docs> FAIL [ 0.131s] ( 65/129) alphal00p-docs-builder tests :: checked_in_registry_is_valid
50.52 s
gammaloop-nextest-docs> stdout ---
50.52 s
gammaloop-nextest-docs>
50.52 s
gammaloop-nextest-docs> running 1 test
50.52 s
gammaloop-nextest-docs> test tests::checked_in_registry_is_valid ... FAILED
50.52 s
gammaloop-nextest-docs>
50.52 s
gammaloop-nextest-docs> failures:
50.52 s
gammaloop-nextest-docs>
50.52 s
gammaloop-nextest-docs> failures:
50.52 s
gammaloop-nextest-docs> tests::checked_in_registry_is_valid
50.52 s
gammaloop-nextest-docs>
50.52 s
gammaloop-nextest-docs> test result: FAILED. 0 passed; 1 failed; 0 ignored; 0 measured; 128 filtered out; finished in 0.12s
50.52 s
gammaloop-nextest-docs>
50.52 s
gammaloop-nextest-docs> stderr ---
50.52 s
gammaloop-nextest-docs>
50.52 s
gammaloop-nextest-docs> thread 'tests::checked_in_registry_is_valid' (210) panicked at crates/alphal00p-docs-builder/src/lib.rs:12178:50:
50.52 s
gammaloop-nextest-docs> called `Result::unwrap()` on an `Err` value: developer note nix-crane-cache-reuse verified scope nix/rust-workspace.nix changed (expected 66f700580ce13b9eaee90fe0111639e46968c531, found 0a568cb5712045aee37d96bfb2f91d3d32b7e9b9); owner review or an explicit no-impact attestation is required
50.52 s
gammaloop-nextest-docs>
50.52 s
gammaloop-nextest-docs> Location:
50.52 s
gammaloop-nextest-docs> crates/alphal00p-docs-builder/src/lib.rs:992:29
50.52 s
gammaloop-nextest-docs> stack backtrace:
50.52 s
gammaloop-nextest-docs> 0: __rustc::rust_begin_unwind
50.52 s
gammaloop-nextest-docs> 1: core::panicking::panic_fmt
50.52 s
gammaloop-nextest-docs> 2: core::result::unwrap_failed
50.52 s
gammaloop-nextest-docs> 3: alphal00p_docs_builder::tests::checked_in_registry_is_valid
50.52 s
gammaloop-nextest-docs> 4: <alphal00p_docs_builder::tests::checked_in_registry_is_valid::{closure#0} as core::ops::function::FnOnce<()>>::call_once
50.52 s
gammaloop-nextest-docs> note: Some details are omitted, run with `RUST_BACKTRACE=full` for a verbose backtrace.
50.52 s
gammaloop-nextest-docs>
50.53 s
gammaloop-nextest-docs> FAIL [ 0.108s] ( 66/129) alphal00p-docs-builder tests :: every_product_requires_a_task_chooser_and_each_supported_interface
50.53 s
gammaloop-nextest-docs> stdout ---
50.53 s
gammaloop-nextest-docs>
50.53 s
gammaloop-nextest-docs> running 1 test
50.53 s
gammaloop-nextest-docs> test tests::every_product_requires_a_task_chooser_and_each_supported_interface ... FAILED
50.53 s
gammaloop-nextest-docs>
50.53 s
gammaloop-nextest-docs> failures:
50.53 s
gammaloop-nextest-docs>
50.53 s
gammaloop-nextest-docs> failures:
50.53 s
gammaloop-nextest-docs> tests::every_product_requires_a_task_chooser_and_each_supported_interface
50.53 s
gammaloop-nextest-docs>
50.53 s
gammaloop-nextest-docs> test result: FAILED. 0 passed; 1 failed; 0 ignored; 0 measured; 128 filtered out; finished in 0.10s
50.53 s
gammaloop-nextest-docs>
50.53 s
gammaloop-nextest-docs> stderr ---
50.53 s
gammaloop-nextest-docs>
50.53 s
gammaloop-nextest-docs> thread 'tests::every_product_requires_a_task_chooser_and_each_supported_interface' (299) panicked at crates/alphal00p-docs-builder/src/lib.rs:12192:9:
50.53 s
gammaloop-nextest-docs> assertion failed: format!("{error:#}").contains("has no quickstart page")
50.53 s
gammaloop-nextest-docs> stack backtrace:
50.53 s
gammaloop-nextest-docs> 0: __rustc::rust_begin_unwind
50.53 s
gammaloop-nextest-docs> 1: core::panicking::panic_fmt
50.53 s
gammaloop-nextest-docs> 2: core::panicking::panic
50.53 s
gammaloop-nextest-docs> 3: alphal00p_docs_builder::tests::every_product_requires_a_task_chooser_and_each_supported_interface
50.53 s
gammaloop-nextest-docs> 4: <alphal00p_docs_builder::tests::every_product_requires_a_task_chooser_and_each_supported_interface::{closure#0} as core::ops::function::FnOnce<()>>::call_once
50.53 s
gammaloop-nextest-docs> note: Some details are omitted, run with `RUST_BACKTRACE=full` for a verbose backtrace.
50.53 s
gammaloop-nextest-docs>
50.54 s
gammaloop-nextest-docs> FAIL [ 0.130s] ( 71/129) alphal00p-docs-builder tests :: developer_scope_ranges_ignore_unrelated_edits_and_warn_only_while_watching
50.54 s
gammaloop-nextest-docs> stdout ---
50.54 s
gammaloop-nextest-docs>
50.54 s
gammaloop-nextest-docs> running 1 test
50.54 s
gammaloop-nextest-docs> test tests::developer_scope_ranges_ignore_unrelated_edits_and_warn_only_while_watching ... FAILED
50.54 s
gammaloop-nextest-docs>
50.54 s
gammaloop-nextest-docs> failures:
50.54 s
gammaloop-nextest-docs>
50.54 s
gammaloop-nextest-docs> failures:
50.54 s
gammaloop-nextest-docs> tests::developer_scope_ranges_ignore_unrelated_edits_and_warn_only_while_watching
50.54 s
gammaloop-nextest-docs>
50.54 s
gammaloop-nextest-docs> test result: FAILED. 0 passed; 1 failed; 0 ignored; 0 measured; 128 filtered out; finished in 0.12s
50.54 s
gammaloop-nextest-docs>
50.54 s
gammaloop-nextest-docs> stderr ---
50.54 s
gammaloop-nextest-docs>
50.54 s
gammaloop-nextest-docs> thread 'tests::developer_scope_ranges_ignore_unrelated_edits_and_warn_only_while_watching' (275) panicked at crates/alphal00p-docs-builder/src/lib.rs:12263:29:
50.54 s
gammaloop-nextest-docs> called `Result::unwrap()` on an `Err` value: developer note nix-crane-cache-reuse verified scope nix/rust-workspace.nix changed (expected 66f700580ce13b9eaee90fe0111639e46968c531, found 0a568cb5712045aee37d96bfb2f91d3d32b7e9b9); owner review or an explicit no-impact attestation is required
50.54 s
gammaloop-nextest-docs>
50.54 s
gammaloop-nextest-docs> Location:
50.54 s
gammaloop-nextest-docs> crates/alphal00p-docs-builder/src/lib.rs:992:29
50.54 s
gammaloop-nextest-docs> stack backtrace:
50.54 s
gammaloop-nextest-docs> 0: __rustc::rust_begin_unwind
50.54 s
gammaloop-nextest-docs> 1: core::panicking::panic_fmt
50.54 s
gammaloop-nextest-docs> 2: core::result::unwrap_failed
50.54 s
gammaloop-nextest-docs> 3: alphal00p_docs_builder::tests::developer_scope_ranges_ignore_unrelated_edits_and_warn_only_while_watching
50.54 s
gammaloop-nextest-docs> 4: <alphal00p_docs_builder::tests::developer_scope_ranges_ignore_unrelated_edits_and_warn_only_while_watching::{closure#0} as core::ops::function::FnOnce<()>>::call_once
50.54 s
gammaloop-nextest-docs> note: Some details are omitted, run with `RUST_BACKTRACE=full` for a verbose backtrace.
50.54 s
gammaloop-nextest-docs>
50.58 s
gammaloop-nextest-docs> FAIL [ 0.120s] (108/129) alphal00p-docs-builder tests :: pdf_manual_chapter_order_must_match_the_page_registry
50.58 s
gammaloop-nextest-docs> stdout ---
50.58 s
gammaloop-nextest-docs>
50.58 s
gammaloop-nextest-docs> running 1 test
50.58 s
gammaloop-nextest-docs> test tests::pdf_manual_chapter_order_must_match_the_page_registry ... FAILED
50.58 s
gammaloop-nextest-docs>
50.58 s
gammaloop-nextest-docs> failures:
50.58 s
gammaloop-nextest-docs>
50.58 s
gammaloop-nextest-docs> failures:
50.58 s
gammaloop-nextest-docs> tests::pdf_manual_chapter_order_must_match_the_page_registry
50.58 s
gammaloop-nextest-docs>
50.58 s
gammaloop-nextest-docs> test result: FAILED. 0 passed; 1 failed; 0 ignored; 0 measured; 128 filtered out; finished in 0.11s
50.58 s
gammaloop-nextest-docs>
50.58 s
gammaloop-nextest-docs> stderr ---
50.58 s
gammaloop-nextest-docs>
50.58 s
gammaloop-nextest-docs> thread 'tests::pdf_manual_chapter_order_must_match_the_page_registry' (417) panicked at crates/alphal00p-docs-builder/src/lib.rs:12243:9:
50.58 s
gammaloop-nextest-docs> assertion failed: format!("{error:#}").contains("PDF manual chapter order differs")
50.58 s
gammaloop-nextest-docs> stack backtrace:
50.58 s
gammaloop-nextest-docs> 0: __rustc::rust_begin_unwind
50.58 s
gammaloop-nextest-docs> 1: core::panicking::panic_fmt
50.58 s
gammaloop-nextest-docs> 2: core::panicking::panic
50.58 s
gammaloop-nextest-docs> 3: alphal00p_docs_builder::tests::pdf_manual_chapter_order_must_match_the_page_registry
50.58 s
gammaloop-nextest-docs> 4: <alphal00p_docs_builder::tests::pdf_manual_chapter_order_must_match_the_page_registry::{closure#0} as core::ops::function::FnOnce<()>>::call_once
50.58 s
gammaloop-nextest-docs> note: Some details are omitted, run with `RUST_BACKTRACE=full` for a verbose backtrace.
50.58 s
gammaloop-nextest-docs>
67.25 s
gammaloop-nextest-docs> ------------
67.25 s
gammaloop-nextest-docs> Summary [ 16.860s] 129 tests run: 124 passed , 5 failed , 0 skipped
67.25 s
gammaloop-nextest-docs> FAIL [ 0.126s] ( 62/129) alphal00p-docs-builder provenance_tests :: each_build_captures_one_revision_before_rendering
67.25 s
gammaloop-nextest-docs> stdout ---
67.25 s
gammaloop-nextest-docs>
67.25 s
gammaloop-nextest-docs> running 1 test
67.25 s
gammaloop-nextest-docs>
67.25 s
gammaloop-nextest-docs> running 1 test
67.25 s
gammaloop-nextest-docs> test provenance_tests::each_build_captures_one_revision_before_rendering ... FAILED
67.25 s
gammaloop-nextest-docs>
67.25 s
gammaloop-nextest-docs> failures:
67.25 s
gammaloop-nextest-docs>
67.25 s
gammaloop-nextest-docs> failures:
67.25 s
gammaloop-nextest-docs> provenance_tests::each_build_captures_one_revision_before_rendering
67.25 s
gammaloop-nextest-docs>
67.25 s
gammaloop-nextest-docs> test result: FAILED. 0 passed; 1 failed; 0 ignored; 0 measured; 128 filtered out; finished in 0.11s
67.25 s
gammaloop-nextest-docs>
67.25 s
gammaloop-nextest-docs> test provenance_tests::each_build_captures_one_revision_before_rendering ... FAILED
67.25 s
gammaloop-nextest-docs>
67.25 s
gammaloop-nextest-docs> failures:
67.25 s
gammaloop-nextest-docs>
67.25 s
gammaloop-nextest-docs> failures:
67.25 s
gammaloop-nextest-docs> provenance_tests::each_build_captures_one_revision_before_rendering
67.25 s
gammaloop-nextest-docs>
67.25 s
gammaloop-nextest-docs> test result: FAILED. 0 passed; 1 failed; 0 ignored; 0 measured; 128 filtered out; finished in 0.12s
67.25 s
gammaloop-nextest-docs>
67.25 s
gammaloop-nextest-docs> stderr ---
67.25 s
gammaloop-nextest-docs>
67.25 s
gammaloop-nextest-docs> thread 'provenance_tests::each_build_captures_one_revision_before_rendering' (248) panicked at crates/alphal00p-docs-builder/src/provenance_tests.rs:297:14:
67.25 s
gammaloop-nextest-docs> called `Result::unwrap()` on an `Err` value: developer note nix-crane-cache-reuse verified scope nix/rust-workspace.nix changed (expected 66f700580ce13b9eaee90fe0111639e46968c531, found 0a568cb5712045aee37d96bfb2f91d3d32b7e9b9); owner review or an explicit no-impact attestation is required
67.25 s
gammaloop-nextest-docs>
67.25 s
gammaloop-nextest-docs> Location:
67.25 s
gammaloop-nextest-docs> crates/alphal00p-docs-builder/src/lib.rs:992:29
67.25 s
gammaloop-nextest-docs> stack backtrace:
67.25 s
gammaloop-nextest-docs> 0: __rustc::rust_begin_unwind
67.25 s
gammaloop-nextest-docs> 1: core::panicking::panic_fmt
67.25 s
gammaloop-nextest-docs> 2: core::result::unwrap_failed
67.25 s
gammaloop-nextest-docs> 3: alphal00p_docs_builder::provenance_tests::each_build_captures_one_revision_before_rendering
67.25 s
gammaloop-nextest-docs> 4: <alphal00p_docs_builder::provenance_tests::each_build_captures_one_revision_before_rendering::{closure#0} as core::ops::function::FnOnce<()>>::call_once
67.25 s
gammaloop-nextest-docs> note: Some details are omitted, run with `RUST_BACKTRACE=full` for a verbose backtrace.
67.25 s
gammaloop-nextest-docs>
67.25 s
gammaloop-nextest-docs> thread 'provenance_tests::each_build_captures_one_revision_before_rendering' (182) panicked at crates/alphal00p-docs-builder/src/provenance_tests.rs:274:9:
67.25 s
gammaloop-nextest-docs> assertion failed: command.status().unwrap().success()
67.25 s
gammaloop-nextest-docs> stack backtrace:
67.25 s
gammaloop-nextest-docs> 0: __rustc::rust_begin_unwind
67.25 s
gammaloop-nextest-docs> 1: core::panicking::panic_fmt
67.25 s
gammaloop-nextest-docs> 2: core::panicking::panic
67.25 s
gammaloop-nextest-docs> 3: alphal00p_docs_builder::provenance_tests::each_build_captures_one_revision_before_rendering
67.25 s
gammaloop-nextest-docs> 4: <alphal00p_docs_builder::provenance_tests::each_build_captures_one_revision_before_rendering::{closure#0} as core::ops::function::FnOnce<()>>::call_once
67.25 s
gammaloop-nextest-docs> note: Some details are omitted, run with `RUST_BACKTRACE=full` for a verbose backtrace.
67.25 s
gammaloop-nextest-docs>
67.25 s
gammaloop-nextest-docs> FAIL [ 0.131s] ( 65/129) alphal00p-docs-builder tests :: checked_in_registry_is_valid
67.25 s
gammaloop-nextest-docs> stdout ---
67.25 s
gammaloop-nextest-docs>
67.25 s
gammaloop-nextest-docs> running 1 test
67.25 s
gammaloop-nextest-docs> test tests::checked_in_registry_is_valid ... FAILED
67.25 s
gammaloop-nextest-docs>
67.25 s
gammaloop-nextest-docs> failures:
67.25 s
gammaloop-nextest-docs>
67.25 s
gammaloop-nextest-docs> failures:
67.25 s
gammaloop-nextest-docs> tests::checked_in_registry_is_valid
67.25 s
gammaloop-nextest-docs>
67.25 s
gammaloop-nextest-docs> test result: FAILED. 0 passed; 1 failed; 0 ignored; 0 measured; 128 filtered out; finished in 0.12s
67.25 s
gammaloop-nextest-docs>
67.25 s
gammaloop-nextest-docs> stderr ---
67.25 s
gammaloop-nextest-docs>
67.25 s
gammaloop-nextest-docs> thread 'tests::checked_in_registry_is_valid' (210) panicked at crates/alphal00p-docs-builder/src/lib.rs:12178:50:
67.25 s
gammaloop-nextest-docs> called `Result::unwrap()` on an `Err` value: developer note nix-crane-cache-reuse verified scope nix/rust-workspace.nix changed (expected 66f700580ce13b9eaee90fe0111639e46968c531, found 0a568cb5712045aee37d96bfb2f91d3d32b7e9b9); owner review or an explicit no-impact attestation is required
67.25 s
gammaloop-nextest-docs>
67.25 s
gammaloop-nextest-docs> Location:
67.25 s
gammaloop-nextest-docs> crates/alphal00p-docs-builder/src/lib.rs:992:29
67.25 s
gammaloop-nextest-docs> stack backtrace:
67.25 s
gammaloop-nextest-docs> 0: __rustc::rust_begin_unwind
67.25 s
gammaloop-nextest-docs> 1: core::panicking::panic_fmt
67.25 s
gammaloop-nextest-docs> 2: core::result::unwrap_failed
67.25 s
gammaloop-nextest-docs> 3: alphal00p_docs_builder::tests::checked_in_registry_is_valid
67.25 s
gammaloop-nextest-docs> 4: <alphal00p_docs_builder::tests::checked_in_registry_is_valid::{closure#0} as core::ops::function::FnOnce<()>>::call_once
67.25 s
gammaloop-nextest-docs> note: Some details are omitted, run with `RUST_BACKTRACE=full` for a verbose backtrace.
67.25 s
gammaloop-nextest-docs>
67.25 s
gammaloop-nextest-docs> FAIL [ 0.108s] ( 66/129) alphal00p-docs-builder tests :: every_product_requires_a_task_chooser_and_each_supported_interface
67.25 s
gammaloop-nextest-docs> stdout ---
67.25 s
gammaloop-nextest-docs>
67.25 s
gammaloop-nextest-docs> running 1 test
67.25 s
gammaloop-nextest-docs> test tests::every_product_requires_a_task_chooser_and_each_supported_interface ... FAILED
67.25 s
gammaloop-nextest-docs>
67.25 s
gammaloop-nextest-docs> failures:
67.25 s
gammaloop-nextest-docs>
67.25 s
gammaloop-nextest-docs> failures:
67.25 s
gammaloop-nextest-docs> tests::every_product_requires_a_task_chooser_and_each_supported_interface
67.25 s
gammaloop-nextest-docs>
67.25 s
gammaloop-nextest-docs> test result: FAILED. 0 passed; 1 failed; 0 ignored; 0 measured; 128 filtered out; finished in 0.10s
67.25 s
gammaloop-nextest-docs>
67.25 s
gammaloop-nextest-docs> stderr ---
67.25 s
gammaloop-nextest-docs>
67.25 s
gammaloop-nextest-docs> thread 'tests::every_product_requires_a_task_chooser_and_each_supported_interface' (299) panicked at crates/alphal00p-docs-builder/src/lib.rs:12192:9:
67.25 s
gammaloop-nextest-docs> assertion failed: format!("{error:#}").contains("has no quickstart page")
67.25 s
gammaloop-nextest-docs> stack backtrace:
67.25 s
gammaloop-nextest-docs> 0: __rustc::rust_begin_unwind
67.25 s
gammaloop-nextest-docs> 1: core::panicking::panic_fmt
67.25 s
gammaloop-nextest-docs> 2: core::panicking::panic
67.25 s
gammaloop-nextest-docs> 3: alphal00p_docs_builder::tests::every_product_requires_a_task_chooser_and_each_supported_interface
67.25 s
gammaloop-nextest-docs> 4: <alphal00p_docs_builder::tests::every_product_requires_a_task_chooser_and_each_supported_interface::{closure#0} as core::ops::function::FnOnce<()>>::call_once
67.25 s
gammaloop-nextest-docs> note: Some details are omitted, run with `RUST_BACKTRACE=full` for a verbose backtrace.
67.25 s
gammaloop-nextest-docs>
67.25 s
gammaloop-nextest-docs> FAIL [ 0.130s] ( 71/129) alphal00p-docs-builder tests :: developer_scope_ranges_ignore_unrelated_edits_and_warn_only_while_watching
67.25 s
gammaloop-nextest-docs> stdout ---
67.25 s
gammaloop-nextest-docs>
67.25 s
gammaloop-nextest-docs> running 1 test
67.25 s
gammaloop-nextest-docs> test tests::developer_scope_ranges_ignore_unrelated_edits_and_warn_only_while_watching ... FAILED
67.25 s
gammaloop-nextest-docs>
67.25 s
gammaloop-nextest-docs> failures:
67.25 s
gammaloop-nextest-docs>
67.25 s
gammaloop-nextest-docs> failures:
67.25 s
gammaloop-nextest-docs> tests::developer_scope_ranges_ignore_unrelated_edits_and_warn_only_while_watching
67.25 s
gammaloop-nextest-docs>
67.25 s
gammaloop-nextest-docs> test result: FAILED. 0 passed; 1 failed; 0 ignored; 0 measured; 128 filtered out; finished in 0.12s
67.25 s
gammaloop-nextest-docs>
67.25 s
gammaloop-nextest-docs> stderr ---
67.25 s
gammaloop-nextest-docs>
67.25 s
gammaloop-nextest-docs> thread 'tests::developer_scope_ranges_ignore_unrelated_edits_and_warn_only_while_watching' (275) panicked at crates/alphal00p-docs-builder/src/lib.rs:12263:29:
67.25 s
gammaloop-nextest-docs> called `Result::unwrap()` on an `Err` value: developer note nix-crane-cache-reuse verified scope nix/rust-workspace.nix changed (expected 66f700580ce13b9eaee90fe0111639e46968c531, found 0a568cb5712045aee37d96bfb2f91d3d32b7e9b9); owner review or an explicit no-impact attestation is required
67.25 s
gammaloop-nextest-docs>
67.25 s
gammaloop-nextest-docs> Location:
67.25 s
gammaloop-nextest-docs> crates/alphal00p-docs-builder/src/lib.rs:992:29
67.25 s
gammaloop-nextest-docs> stack backtrace:
67.25 s
gammaloop-nextest-docs> 0: __rustc::rust_begin_unwind
67.25 s
gammaloop-nextest-docs> 1: core::panicking::panic_fmt
67.25 s
gammaloop-nextest-docs> 2: core::result::unwrap_failed
67.25 s
gammaloop-nextest-docs> 3: alphal00p_docs_builder::tests::developer_scope_ranges_ignore_unrelated_edits_and_warn_only_while_watching
67.25 s
gammaloop-nextest-docs> 4: <alphal00p_docs_builder::tests::developer_scope_ranges_ignore_unrelated_edits_and_warn_only_while_watching::{closure#0} as core::ops::function::FnOnce<()>>::call_once
67.25 s
gammaloop-nextest-docs> note: Some details are omitted, run with `RUST_BACKTRACE=full` for a verbose backtrace.
67.25 s
gammaloop-nextest-docs>
67.25 s
gammaloop-nextest-docs> FAIL [ 0.120s] (108/129) alphal00p-docs-builder tests :: pdf_manual_chapter_order_must_match_the_page_registry
67.25 s
gammaloop-nextest-docs> stdout ---
67.25 s
gammaloop-nextest-docs>
67.25 s
gammaloop-nextest-docs> running 1 test
67.25 s
gammaloop-nextest-docs> test tests::pdf_manual_chapter_order_must_match_the_page_registry ... FAILED
67.25 s
gammaloop-nextest-docs>
67.25 s
gammaloop-nextest-docs> failures:
67.25 s
gammaloop-nextest-docs>
67.25 s
gammaloop-nextest-docs> failures:
67.25 s
gammaloop-nextest-docs> tests::pdf_manual_chapter_order_must_match_the_page_registry
67.25 s
gammaloop-nextest-docs>
67.25 s
gammaloop-nextest-docs> test result: FAILED. 0 passed; 1 failed; 0 ignored; 0 measured; 128 filtered out; finished in 0.11s
67.25 s
gammaloop-nextest-docs>
67.25 s
gammaloop-nextest-docs> stderr ---
67.25 s
gammaloop-nextest-docs>
67.25 s
gammaloop-nextest-docs> thread 'tests::pdf_manual_chapter_order_must_match_the_page_registry' (417) panicked at crates/alphal00p-docs-builder/src/lib.rs:12243:9:
67.25 s
gammaloop-nextest-docs> assertion failed: format!("{error:#}").contains("PDF manual chapter order differs")
67.25 s
gammaloop-nextest-docs> stack backtrace:
67.25 s
gammaloop-nextest-docs> 0: __rustc::rust_begin_unwind
67.25 s
gammaloop-nextest-docs> 1: core::panicking::panic_fmt
67.25 s
gammaloop-nextest-docs> 2: core::panicking::panic
67.25 s
gammaloop-nextest-docs> 3: alphal00p_docs_builder::tests::pdf_manual_chapter_order_must_match_the_page_registry
67.25 s
gammaloop-nextest-docs> 4: <alphal00p_docs_builder::tests::pdf_manual_chapter_order_must_match_the_page_registry::{closure#0} as core::ops::function::FnOnce<()>>::call_once
67.25 s
gammaloop-nextest-docs> note: Some details are omitted, run with `RUST_BACKTRACE=full` for a verbose backtrace.
67.25 s
gammaloop-nextest-docs>
67.26 s
gammaloop-nextest-docs> error : test run failed
67.28 s
gammaloop-nextest-docs>
67.28 s
gammaloop-nextest-docs> ========== nextest test summary ==========
67.28 s
gammaloop-nextest-docs> report: target/nextest/ci_gammaloop/junit.xml
67.28 s
gammaloop-nextest-docs> tests: 129, failures: 5, errors: 0
67.28 s
gammaloop-nextest-docs>
67.28 s
gammaloop-nextest-docs> 1. alphal00p-docs-builder::provenance_tests::each_build_captures_one_revision_before_rendering
67.28 s
gammaloop-nextest-docs> failure: test failure with exit code 101
67.28 s
gammaloop-nextest-docs> thread 'provenance_tests::each_build_captures_one_revision_before_rendering' (182) panicked at crates/alphal00p-docs-builder/src/provenance_tests.rs:274:9:
67.28 s
gammaloop-nextest-docs> assertion failed: command.status().unwrap().success()
67.28 s
gammaloop-nextest-docs> stack backtrace:
67.28 s
gammaloop-nextest-docs> 0: __rustc::rust_begin_unwind
67.28 s
gammaloop-nextest-docs> 1: core::panicking::panic_fmt
67.28 s
gammaloop-nextest-docs> 2: core::panicking::panic
67.28 s
gammaloop-nextest-docs> 3: alphal00p_docs_builder::provenance_tests::each_build_captures_one_revision_before_rendering
67.28 s
gammaloop-nextest-docs> 4: <alphal00p_docs_builder::provenance_tests::each_build_captures_one_revision_before_rendering::{closure#0} as core::ops::function::FnOnce<()>>::call_once
67.28 s
gammaloop-nextest-docs> note: Some details are omitted, run with `RUST_BACKTRACE=full` for a verbose backtrace.
67.28 s
gammaloop-nextest-docs> system-out
67.28 s
gammaloop-nextest-docs> running 1 test
67.28 s
gammaloop-nextest-docs>
67.28 s
gammaloop-nextest-docs> running 1 test
67.28 s
gammaloop-nextest-docs> test provenance_tests::each_build_captures_one_revision_before_rendering ... FAILED
67.28 s
gammaloop-nextest-docs>
67.28 s
gammaloop-nextest-docs> failures:
67.28 s
gammaloop-nextest-docs>
67.28 s
gammaloop-nextest-docs> failures:
67.28 s
gammaloop-nextest-docs> provenance_tests::each_build_captures_one_revision_before_rendering
67.28 s
gammaloop-nextest-docs>
67.28 s
gammaloop-nextest-docs> test result: FAILED. 0 passed; 1 failed; 0 ignored; 0 measured; 128 filtered out; finished in 0.11s
67.28 s
gammaloop-nextest-docs>
67.28 s
gammaloop-nextest-docs> test provenance_tests::each_build_captures_one_revision_before_rendering ... FAILED
67.28 s
gammaloop-nextest-docs>
67.28 s
gammaloop-nextest-docs> failures:
67.28 s
gammaloop-nextest-docs>
67.28 s
gammaloop-nextest-docs> failures:
67.28 s
gammaloop-nextest-docs> provenance_tests::each_build_captures_one_revision_before_rendering
67.28 s
gammaloop-nextest-docs>
67.28 s
gammaloop-nextest-docs> test result: FAILED. 0 passed; 1 failed; 0 ignored; 0 measured; 128 filtered out; finished in 0.12s
67.28 s
gammaloop-nextest-docs> system-err
67.28 s
gammaloop-nextest-docs> thread 'provenance_tests::each_build_captures_one_revision_before_rendering' (248) panicked at crates/alphal00p-docs-builder/src/provenance_tests.rs:297:14:
67.28 s
gammaloop-nextest-docs> called `Result::unwrap()` on an `Err` value: developer note nix-crane-cache-reuse verified scope nix/rust-workspace.nix changed (expected 66f700580ce13b9eaee90fe0111639e46968c531, found 0a568cb5712045aee37d96bfb2f91d3d32b7e9b9); owner review or an explicit no-impact attestation is required
67.28 s
gammaloop-nextest-docs>
67.28 s
gammaloop-nextest-docs> Location:
67.28 s
gammaloop-nextest-docs> crates/alphal00p-docs-builder/src/lib.rs:992:29
67.28 s
gammaloop-nextest-docs> stack backtrace:
67.28 s
gammaloop-nextest-docs> 0: __rustc::rust_begin_unwind
67.28 s
gammaloop-nextest-docs> 1: core::panicking::panic_fmt
67.28 s
gammaloop-nextest-docs> 2: core::result::unwrap_failed
67.28 s
gammaloop-nextest-docs> 3: alphal00p_docs_builder::provenance_tests::each_build_captures_one_revision_before_rendering
67.28 s
gammaloop-nextest-docs> 4: <alphal00p_docs_builder::provenance_tests::each_build_captures_one_revision_before_rendering::{closure#0} as core::ops::function::FnOnce<()>>::call_once
67.28 s
gammaloop-nextest-docs> note: Some details are omitted, run with `RUST_BACKTRACE=full` for a verbose backtrace.
67.28 s
gammaloop-nextest-docs>
67.28 s
gammaloop-nextest-docs> thread 'provenance_tests::each_build_captures_one_revision_before_rendering' (182) panicked at crates/alphal00p-docs-builder/src/provenance_tests.rs:274:9:
67.28 s
gammaloop-nextest-docs> assertion failed: command.status().unwrap().success()
67.28 s
gammaloop-nextest-docs> stack backtrace:
67.28 s
gammaloop-nextest-docs> 0: __rustc::rust_begin_unwind
67.28 s
gammaloop-nextest-docs> 1: core::panicking::panic_fmt
67.28 s
gammaloop-nextest-docs> 2: core::panicking::panic
67.28 s
gammaloop-nextest-docs> 3: alphal00p_docs_builder::provenance_tests::each_build_captures_one_revision_before_rendering
67.28 s
gammaloop-nextest-docs> 4: <alphal00p_docs_builder::provenance_tests::each_build_captures_one_revision_before_rendering::{closure#0} as core::ops::function::FnOnce<()>>::call_once
67.28 s
gammaloop-nextest-docs> note: Some details are omitted, run with `RUST_BACKTRACE=full` for a verbose backtrace.
67.28 s
gammaloop-nextest-docs>
67.28 s
gammaloop-nextest-docs> 2. alphal00p-docs-builder::tests::checked_in_registry_is_valid
67.28 s
gammaloop-nextest-docs> failure: test failure with exit code 101
67.28 s
gammaloop-nextest-docs> thread 'tests::checked_in_registry_is_valid' (210) panicked at crates/alphal00p-docs-builder/src/lib.rs:12178:50:
67.28 s
gammaloop-nextest-docs> called `Result::unwrap()` on an `Err` value: developer note nix-crane-cache-reuse verified scope nix/rust-workspace.nix changed (expected 66f700580ce13b9eaee90fe0111639e46968c531, found 0a568cb5712045aee37d96bfb2f91d3d32b7e9b9); owner review or an explicit no-impact attestation is required
67.28 s
gammaloop-nextest-docs>
67.28 s
gammaloop-nextest-docs> Location:
67.28 s
gammaloop-nextest-docs> crates/alphal00p-docs-builder/src/lib.rs:992:29
67.28 s
gammaloop-nextest-docs> stack backtrace:
67.28 s
gammaloop-nextest-docs> 0: __rustc::rust_begin_unwind
67.28 s
gammaloop-nextest-docs> 1: core::panicking::panic_fmt
67.28 s
gammaloop-nextest-docs> 2: core::result::unwrap_failed
67.28 s
gammaloop-nextest-docs> 3: alphal00p_docs_builder::tests::checked_in_registry_is_valid
67.28 s
gammaloop-nextest-docs> 4: <alphal00p_docs_builder::tests::checked_in_registry_is_valid::{closure#0} as core::ops::function::FnOnce<()>>::call_once
67.28 s
gammaloop-nextest-docs> note: Some details are omitted, run with `RUST_BACKTRACE=full` for a verbose backtrace.
67.28 s
gammaloop-nextest-docs> system-out
67.28 s
gammaloop-nextest-docs> running 1 test
67.28 s
gammaloop-nextest-docs> test tests::checked_in_registry_is_valid ... FAILED
67.28 s
gammaloop-nextest-docs>
67.28 s
gammaloop-nextest-docs> failures:
67.28 s
gammaloop-nextest-docs>
67.28 s
gammaloop-nextest-docs> failures:
67.28 s
gammaloop-nextest-docs> tests::checked_in_registry_is_valid
67.28 s
gammaloop-nextest-docs>
67.28 s
gammaloop-nextest-docs> test result: FAILED. 0 passed; 1 failed; 0 ignored; 0 measured; 128 filtered out; finished in 0.12s
67.28 s
gammaloop-nextest-docs> system-err
67.28 s
gammaloop-nextest-docs> thread 'tests::checked_in_registry_is_valid' (210) panicked at crates/alphal00p-docs-builder/src/lib.rs:12178:50:
67.29 s
gammaloop-nextest-docs> called `Result::unwrap()` on an `Err` value: developer note nix-crane-cache-reuse verified scope nix/rust-workspace.nix changed (expected 66f700580ce13b9eaee90fe0111639e46968c531, found 0a568cb5712045aee37d96bfb2f91d3d32b7e9b9); owner review or an explicit no-impact attestation is required
67.29 s
gammaloop-nextest-docs>
67.29 s
gammaloop-nextest-docs> Location:
67.29 s
gammaloop-nextest-docs> crates/alphal00p-docs-builder/src/lib.rs:992:29
67.29 s
gammaloop-nextest-docs> stack backtrace:
67.29 s
gammaloop-nextest-docs> 0: __rustc::rust_begin_unwind
67.29 s
gammaloop-nextest-docs> 1: core::panicking::panic_fmt
67.29 s
gammaloop-nextest-docs> 2: core::result::unwrap_failed
67.29 s
gammaloop-nextest-docs> 3: alphal00p_docs_builder::tests::checked_in_registry_is_valid
67.29 s
gammaloop-nextest-docs> 4: <alphal00p_docs_builder::tests::checked_in_registry_is_valid::{closure#0} as core::ops::function::FnOnce<()>>::call_once
67.29 s
gammaloop-nextest-docs> note: Some details are omitted, run with `RUST_BACKTRACE=full` for a verbose backtrace.
67.29 s
gammaloop-nextest-docs>
67.29 s
gammaloop-nextest-docs> 3. alphal00p-docs-builder::tests::every_product_requires_a_task_chooser_and_each_supported_interface
67.29 s
gammaloop-nextest-docs> failure: test failure with exit code 101
67.29 s
gammaloop-nextest-docs> thread 'tests::every_product_requires_a_task_chooser_and_each_supported_interface' (299) panicked at crates/alphal00p-docs-builder/src/lib.rs:12192:9:
67.29 s
gammaloop-nextest-docs> assertion failed: format!("{error:#}").contains("has no quickstart page")
67.29 s
gammaloop-nextest-docs> stack backtrace:
67.29 s
gammaloop-nextest-docs> 0: __rustc::rust_begin_unwind
67.29 s
gammaloop-nextest-docs> 1: core::panicking::panic_fmt
67.29 s
gammaloop-nextest-docs> 2: core::panicking::panic
67.29 s
gammaloop-nextest-docs> 3: alphal00p_docs_builder::tests::every_product_requires_a_task_chooser_and_each_supported_interface
67.29 s
gammaloop-nextest-docs> 4: <alphal00p_docs_builder::tests::every_product_requires_a_task_chooser_and_each_supported_interface::{closure#0} as core::ops::function::FnOnce<()>>::call_once
67.29 s
gammaloop-nextest-docs> note: Some details are omitted, run with `RUST_BACKTRACE=full` for a verbose backtrace.
67.29 s
gammaloop-nextest-docs> system-out
67.29 s
gammaloop-nextest-docs> running 1 test
67.29 s
gammaloop-nextest-docs> test tests::every_product_requires_a_task_chooser_and_each_supported_interface ... FAILED
67.29 s
gammaloop-nextest-docs>
67.29 s
gammaloop-nextest-docs> failures:
67.29 s
gammaloop-nextest-docs>
67.29 s
gammaloop-nextest-docs> failures:
67.29 s
gammaloop-nextest-docs> tests::every_product_requires_a_task_chooser_and_each_supported_interface
67.29 s
gammaloop-nextest-docs>
67.29 s
gammaloop-nextest-docs> test result: FAILED. 0 passed; 1 failed; 0 ignored; 0 measured; 128 filtered out; finished in 0.10s
67.29 s
gammaloop-nextest-docs> system-err
67.29 s
gammaloop-nextest-docs> thread 'tests::every_product_requires_a_task_chooser_and_each_supported_interface' (299) panicked at crates/alphal00p-docs-builder/src/lib.rs:12192:9:
67.29 s
gammaloop-nextest-docs> assertion failed: format!("{error:#}").contains("has no quickstart page")
67.29 s
gammaloop-nextest-docs> stack backtrace:
67.29 s
gammaloop-nextest-docs> 0: __rustc::rust_begin_unwind
67.29 s
gammaloop-nextest-docs> 1: core::panicking::panic_fmt
67.29 s
gammaloop-nextest-docs> 2: core::panicking::panic
67.29 s
gammaloop-nextest-docs> 3: alphal00p_docs_builder::tests::every_product_requires_a_task_chooser_and_each_supported_interface
67.29 s
gammaloop-nextest-docs> 4: <alphal00p_docs_builder::tests::every_product_requires_a_task_chooser_and_each_supported_interface::{closure#0} as core::ops::function::FnOnce<()>>::call_once
67.29 s
gammaloop-nextest-docs> note: Some details are omitted, run with `RUST_BACKTRACE=full` for a verbose backtrace.
67.29 s
gammaloop-nextest-docs>
67.29 s
gammaloop-nextest-docs> 4. alphal00p-docs-builder::tests::developer_scope_ranges_ignore_unrelated_edits_and_warn_only_while_watching
67.29 s
gammaloop-nextest-docs> failure: test failure with exit code 101
67.29 s
gammaloop-nextest-docs> thread 'tests::developer_scope_ranges_ignore_unrelated_edits_and_warn_only_while_watching' (275) panicked at crates/alphal00p-docs-builder/src/lib.rs:12263:29:
67.29 s
gammaloop-nextest-docs> called `Result::unwrap()` on an `Err` value: developer note nix-crane-cache-reuse verified scope nix/rust-workspace.nix changed (expected 66f700580ce13b9eaee90fe0111639e46968c531, found 0a568cb5712045aee37d96bfb2f91d3d32b7e9b9); owner review or an explicit no-impact attestation is required
67.29 s
gammaloop-nextest-docs>
67.29 s
gammaloop-nextest-docs> Location:
67.29 s
gammaloop-nextest-docs> crates/alphal00p-docs-builder/src/lib.rs:992:29
67.29 s
gammaloop-nextest-docs> stack backtrace:
67.29 s
gammaloop-nextest-docs> 0: __rustc::rust_begin_unwind
67.29 s
gammaloop-nextest-docs> 1: core::panicking::panic_fmt
67.29 s
gammaloop-nextest-docs> 2: core::result::unwrap_failed
67.29 s
gammaloop-nextest-docs> 3: alphal00p_docs_builder::tests::developer_scope_ranges_ignore_unrelated_edits_and_warn_only_while_watching
67.29 s
gammaloop-nextest-docs> 4: <alphal00p_docs_builder::tests::developer_scope_ranges_ignore_unrelated_edits_and_warn_only_while_watching::{closure#0} as core::ops::function::FnOnce<()>>::call_once
67.29 s
gammaloop-nextest-docs> note: Some details are omitted, run with `RUST_BACKTRACE=full` for a verbose backtrace.
67.29 s
gammaloop-nextest-docs> system-out
67.29 s
gammaloop-nextest-docs> running 1 test
67.29 s
gammaloop-nextest-docs> test tests::developer_scope_ranges_ignore_unrelated_edits_and_warn_only_while_watching ... FAILED
67.29 s
gammaloop-nextest-docs>
67.29 s
gammaloop-nextest-docs> failures:
67.29 s
gammaloop-nextest-docs>
67.29 s
gammaloop-nextest-docs> failures:
67.29 s
gammaloop-nextest-docs> tests::developer_scope_ranges_ignore_unrelated_edits_and_warn_only_while_watching
67.29 s
gammaloop-nextest-docs>
67.29 s
gammaloop-nextest-docs> test result: FAILED. 0 passed; 1 failed; 0 ignored; 0 measured; 128 filtered out; finished in 0.12s
67.29 s
gammaloop-nextest-docs> system-err
67.29 s
gammaloop-nextest-docs> thread 'tests::developer_scope_ranges_ignore_unrelated_edits_and_warn_only_while_watching' (275) panicked at crates/alphal00p-docs-builder/src/lib.rs:12263:29:
67.29 s
gammaloop-nextest-docs> called `Result::unwrap()` on an `Err` value: developer note nix-crane-cache-reuse verified scope nix/rust-workspace.nix changed (expected 66f700580ce13b9eaee90fe0111639e46968c531, found 0a568cb5712045aee37d96bfb2f91d3d32b7e9b9); owner review or an explicit no-impact attestation is required
67.29 s
gammaloop-nextest-docs>
67.29 s
gammaloop-nextest-docs> Location:
67.29 s
gammaloop-nextest-docs> crates/alphal00p-docs-builder/src/lib.rs:992:29
67.29 s
gammaloop-nextest-docs> stack backtrace:
67.29 s
gammaloop-nextest-docs> 0: __rustc::rust_begin_unwind
67.29 s
gammaloop-nextest-docs> 1: core::panicking::panic_fmt
67.29 s
gammaloop-nextest-docs> 2: core::result::unwrap_failed
67.29 s
gammaloop-nextest-docs> 3: alphal00p_docs_builder::tests::developer_scope_ranges_ignore_unrelated_edits_and_warn_only_while_watching
67.29 s
gammaloop-nextest-docs> 4: <alphal00p_docs_builder::tests::developer_scope_ranges_ignore_unrelated_edits_and_warn_only_while_watching::{closure#0} as core::ops::function::FnOnce<()>>::call_once
67.29 s
gammaloop-nextest-docs> note: Some details are omitted, run with `RUST_BACKTRACE=full` for a verbose backtrace.
67.29 s
gammaloop-nextest-docs>
67.29 s
gammaloop-nextest-docs> 5. alphal00p-docs-builder::tests::pdf_manual_chapter_order_must_match_the_page_registry
67.29 s
gammaloop-nextest-docs> failure: test failure with exit code 101
67.29 s
gammaloop-nextest-docs> thread 'tests::pdf_manual_chapter_order_must_match_the_page_registry' (417) panicked at crates/alphal00p-docs-builder/src/lib.rs:12243:9:
67.29 s
gammaloop-nextest-docs> assertion failed: format!("{error:#}").contains("PDF manual chapter order differs")
67.29 s
gammaloop-nextest-docs> stack backtrace:
67.29 s
gammaloop-nextest-docs> 0: __rustc::rust_begin_unwind
67.29 s
gammaloop-nextest-docs> 1: core::panicking::panic_fmt
67.29 s
gammaloop-nextest-docs> 2: core::panicking::panic
67.29 s
gammaloop-nextest-docs> 3: alphal00p_docs_builder::tests::pdf_manual_chapter_order_must_match_the_page_registry
67.29 s
gammaloop-nextest-docs> 4: <alphal00p_docs_builder::tests::pdf_manual_chapter_order_must_match_the_page_registry::{closure#0} as core::ops::function::FnOnce<()>>::call_once
67.29 s
gammaloop-nextest-docs> note: Some details are omitted, run with `RUST_BACKTRACE=full` for a verbose backtrace.
67.29 s
gammaloop-nextest-docs> system-out
67.29 s
gammaloop-nextest-docs> running 1 test
67.29 s
gammaloop-nextest-docs> test tests::pdf_manual_chapter_order_must_match_the_page_registry ... FAILED
67.29 s
gammaloop-nextest-docs>
67.29 s
gammaloop-nextest-docs> failures:
67.29 s
gammaloop-nextest-docs>
67.29 s
gammaloop-nextest-docs> failures:
67.29 s
gammaloop-nextest-docs> tests::pdf_manual_chapter_order_must_match_the_page_registry
67.29 s
gammaloop-nextest-docs>
67.29 s
gammaloop-nextest-docs> test result: FAILED. 0 passed; 1 failed; 0 ignored; 0 measured; 128 filtered out; finished in 0.11s
67.29 s
gammaloop-nextest-docs> system-err
67.29 s
gammaloop-nextest-docs> thread 'tests::pdf_manual_chapter_order_must_match_the_page_registry' (417) panicked at crates/alphal00p-docs-builder/src/lib.rs:12243:9:
67.29 s
gammaloop-nextest-docs> assertion failed: format!("{error:#}").contains("PDF manual chapter order differs")
67.29 s
gammaloop-nextest-docs> stack backtrace:
67.29 s
gammaloop-nextest-docs> 0: __rustc::rust_begin_unwind
67.29 s
gammaloop-nextest-docs> 1: core::panicking::panic_fmt
67.29 s
gammaloop-nextest-docs> 2: core::panicking::panic
67.29 s
gammaloop-nextest-docs> 3: alphal00p_docs_builder::tests::pdf_manual_chapter_order_must_match_the_page_registry
67.29 s
gammaloop-nextest-docs> 4: <alphal00p_docs_builder::tests::pdf_manual_chapter_order_must_match_the_page_registry::{closure#0} as core::ops::function::FnOnce<()>>::call_once
67.29 s
gammaloop-nextest-docs> note: Some details are omitted, run with `RUST_BACKTRACE=full` for a verbose backtrace.
67.29 s
gammaloop-nextest-docs> =========================================
67.30 s
gammaloop-nextest-docs> Extracting 2 binaries to /build/source
67.34 s
gammaloop-nextest-docs> Extracted 5 files to /build/source in 0.04s
67.35 s
gammaloop-nextest-docs> ------------
67.35 s
gammaloop-nextest-docs> Nextest run ID ce47592a-c822-416c-a666-b22341fd0d45 with nextest profile: ci_gammaloop
67.35 s
gammaloop-nextest-docs> Starting 22 tests across 2 binaries
67.37 s
gammaloop-nextest-docs> ------------
67.37 s
gammaloop-nextest-docs> Summary [ 0.023s] 22 tests run: 22 passed , 0 skipped
67.40 s
gammaloop-nextest-docs>
67.40 s
gammaloop-nextest-docs> ========== nextest test summary ==========
67.40 s
gammaloop-nextest-docs> report: target/nextest/ci_gammaloop/junit.xml
67.40 s
gammaloop-nextest-docs> tests: 22, failures: 0, errors: 0
67.40 s
gammaloop-nextest-docs> No failing testcases found.
67.40 s
gammaloop-nextest-docs> =========================================
67.42 s
gammaloop-nextest-docs> Extracting 3 binaries (including 2 non-test binaries), 1 build script output directory, and 2 linked paths to /build/source
67.72 s
gammaloop-nextest-docs> Extracted 22 files to /build/source in 0.30s
67.73 s
gammaloop-nextest-docs> ------------
67.73 s
gammaloop-nextest-docs> Nextest run ID d77fe6a3-bf2d-443c-9475-0f082b84323c with nextest profile: ci_gammaloop
67.73 s
gammaloop-nextest-docs> Starting 89 tests across 1 binary
67.78 s
gammaloop-nextest-docs> ------------
67.78 s
gammaloop-nextest-docs> Summary [ 0.049s] 89 tests run: 89 passed , 0 skipped
67.81 s
gammaloop-nextest-docs>
67.81 s
gammaloop-nextest-docs> ========== nextest test summary ==========
67.81 s
gammaloop-nextest-docs> report: target/nextest/ci_gammaloop/junit.xml
67.81 s
gammaloop-nextest-docs> tests: 89, failures: 0, errors: 0
67.81 s
gammaloop-nextest-docs> No failing testcases found.
67.81 s
gammaloop-nextest-docs> =========================================
67.83 s
gammaloop-nextest-docs> Extracting 2 binaries to /build/source
67.88 s
gammaloop-nextest-docs> Extracted 5 files to /build/source in 0.05s
67.89 s
gammaloop-nextest-docs> ------------
67.89 s
gammaloop-nextest-docs> Nextest run ID 322a3693-80fc-44fc-a1b9-1e9f351501a7 with nextest profile: ci_gammaloop
67.89 s
gammaloop-nextest-docs> Starting 10 tests across 2 binaries
83.92 s
gammaloop-nextest-docs> ------------
83.92 s
gammaloop-nextest-docs> Summary [ 16.032s] 10 tests run: 10 passed , 0 skipped
83.95 s
gammaloop-nextest-docs>
83.95 s
gammaloop-nextest-docs> ========== nextest test summary ==========
83.95 s
gammaloop-nextest-docs> report: target/nextest/ci_gammaloop/junit.xml
83.95 s
gammaloop-nextest-docs> tests: 10, failures: 0, errors: 0
83.95 s
gammaloop-nextest-docs> No failing testcases found.
83.95 s
gammaloop-nextest-docs> =========================================
83.97 s
gammaloop-nextest-docs> Extracting 1 binary to /build/source
84.02 s
gammaloop-nextest-docs> Extracted 4 files to /build/source in 0.05s
84.03 s
gammaloop-nextest-docs> ------------
84.03 s
gammaloop-nextest-docs> Nextest run ID b49f95d2-5a06-412b-b513-755e56e66403 with nextest profile: ci_gammaloop
84.03 s
gammaloop-nextest-docs> Starting 0 tests across 1 binary
84.03 s
gammaloop-nextest-docs> ------------
84.03 s
gammaloop-nextest-docs> Summary [ 0.000s] 0 tests run: 0 passed , 0 skipped
84.07 s
gammaloop-nextest-docs>
84.07 s
gammaloop-nextest-docs> ========== nextest test summary ==========
84.07 s
gammaloop-nextest-docs> report: target/nextest/ci_gammaloop/junit.xml
84.07 s
gammaloop-nextest-docs> tests: 0, failures: 0, errors: 0
84.07 s
gammaloop-nextest-docs> No failing testcases found.
84.07 s
gammaloop-nextest-docs> =========================================
84.08 s
gammaloop-nextest-docs> Extracting 1 binary to /build/source
84.12 s
gammaloop-nextest-docs> Extracted 4 files to /build/source in 0.04s
84.13 s
gammaloop-nextest-docs> ------------
84.13 s
gammaloop-nextest-docs> Nextest run ID b5a46690-35d2-410d-9285-dea671c260f5 with nextest profile: ci_gammaloop
84.13 s
gammaloop-nextest-docs> Starting 5 tests across 1 binary
84.14 s
gammaloop-nextest-docs> ------------
84.14 s
gammaloop-nextest-docs> Summary [ 0.006s] 5 tests run: 5 passed , 0 skipped
84.17 s
gammaloop-nextest-docs>
84.17 s
gammaloop-nextest-docs> ========== nextest test summary ==========
84.17 s
gammaloop-nextest-docs> report: target/nextest/ci_gammaloop/junit.xml
84.17 s
gammaloop-nextest-docs> tests: 5, failures: 0, errors: 0
84.17 s
gammaloop-nextest-docs> No failing testcases found.
84.17 s
gammaloop-nextest-docs> =========================================
84.40 s
error: Cannot build '/nix/store/j3ypjrjxbfx4wvk2yf701zibxcq3r55s-gammaloop-nextest-docs.drv '.
84.40 s
Reason: builder failed with exit code 100 .
84.40 s
Output paths:
84.40 s
/nix/store/9f8zknw7c0k8r0kjl64k88f0h0ihmaa2-gammaloop-nextest-docs
84.40 s
Last 584 log lines:
84.40 s
> Extracting 2 binaries to /build/source
84.40 s
> Extracted 5 files to /build/source in 0.05s
84.40 s
> ------------
84.40 s
> Nextest run ID 73f15340-affa-4fb4-af6e-29fa4492da4f with nextest profile: ci_gammaloop
84.40 s
> Starting 129 tests across 2 binaries
84.40 s
> FAIL [ 0.126s] ( 62/129) alphal00p-docs-builder provenance_tests :: each_build_captures_one_revision_before_rendering
84.40 s
> stdout ---
84.40 s
>
84.40 s
> running 1 test
84.40 s
>
84.40 s
> running 1 test
84.40 s
> test provenance_tests::each_build_captures_one_revision_before_rendering ... FAILED
84.40 s
>
84.40 s
> failures:
84.40 s
>
84.40 s
> failures:
84.40 s
> provenance_tests::each_build_captures_one_revision_before_rendering
84.40 s
>
84.40 s
> test result: FAILED. 0 passed; 1 failed; 0 ignored; 0 measured; 128 filtered out; finished in 0.11s
84.40 s
>
84.40 s
> test provenance_tests::each_build_captures_one_revision_before_rendering ... FAILED
84.40 s
>
84.40 s
> failures:
84.40 s
>
84.40 s
> failures:
84.40 s
> provenance_tests::each_build_captures_one_revision_before_rendering
84.40 s
>
84.40 s
> test result: FAILED. 0 passed; 1 failed; 0 ignored; 0 measured; 128 filtered out; finished in 0.12s
84.40 s
>
84.40 s
> stderr ---
84.40 s
>
84.40 s
> thread 'provenance_tests::each_build_captures_one_revision_before_rendering' (248) panicked at crates/alphal00p-docs-builder/src/provenance_tests.rs:297:14:
84.40 s
> called `Result::unwrap()` on an `Err` value: developer note nix-crane-cache-reuse verified scope nix/rust-workspace.nix changed (expected 66f700580ce13b9eaee90fe0111639e46968c531, found 0a568cb5712045aee37d96bfb2f91d3d32b7e9b9); owner review or an explicit no-impact attestation is required
84.40 s
>
84.40 s
> Location:
84.40 s
> crates/alphal00p-docs-builder/src/lib.rs:992:29
84.40 s
> stack backtrace:
84.40 s
> 0: __rustc::rust_begin_unwind
84.40 s
> 1: core::panicking::panic_fmt
84.40 s
> 2: core::result::unwrap_failed
84.40 s
> 3: alphal00p_docs_builder::provenance_tests::each_build_captures_one_revision_before_rendering
84.40 s
> 4: <alphal00p_docs_builder::provenance_tests::each_build_captures_one_revision_before_rendering::{closure#0} as core::ops::function::FnOnce<()>>::call_once
84.40 s
> note: Some details are omitted, run with `RUST_BACKTRACE=full` for a verbose backtrace.
84.40 s
>
84.40 s
> thread 'provenance_tests::each_build_captures_one_revision_before_rendering' (182) panicked at crates/alphal00p-docs-builder/src/provenance_tests.rs:274:9:
84.40 s
> assertion failed: command.status().unwrap().success()
84.40 s
> stack backtrace:
84.40 s
> 0: __rustc::rust_begin_unwind
84.40 s
> 1: core::panicking::panic_fmt
84.40 s
> 2: core::panicking::panic
84.40 s
> 3: alphal00p_docs_builder::provenance_tests::each_build_captures_one_revision_before_rendering
84.40 s
> 4: <alphal00p_docs_builder::provenance_tests::each_build_captures_one_revision_before_rendering::{closure#0} as core::ops::function::FnOnce<()>>::call_once
84.40 s
> note: Some details are omitted, run with `RUST_BACKTRACE=full` for a verbose backtrace.
84.40 s
>
84.40 s
> FAIL [ 0.131s] ( 65/129) alphal00p-docs-builder tests :: checked_in_registry_is_valid
84.40 s
> stdout ---
84.40 s
>
84.40 s
> running 1 test
84.40 s
> test tests::checked_in_registry_is_valid ... FAILED
84.40 s
>
84.40 s
> failures:
84.40 s
>
84.40 s
> failures:
84.40 s
> tests::checked_in_registry_is_valid
84.40 s
>
84.40 s
> test result: FAILED. 0 passed; 1 failed; 0 ignored; 0 measured; 128 filtered out; finished in 0.12s
84.40 s
>
84.40 s
> stderr ---
84.40 s
>
84.40 s
> thread 'tests::checked_in_registry_is_valid' (210) panicked at crates/alphal00p-docs-builder/src/lib.rs:12178:50:
84.40 s
> called `Result::unwrap()` on an `Err` value: developer note nix-crane-cache-reuse verified scope nix/rust-workspace.nix changed (expected 66f700580ce13b9eaee90fe0111639e46968c531, found 0a568cb5712045aee37d96bfb2f91d3d32b7e9b9); owner review or an explicit no-impact attestation is required
84.40 s
>
84.40 s
> Location:
84.40 s
> crates/alphal00p-docs-builder/src/lib.rs:992:29
84.40 s
> stack backtrace:
84.40 s
> 0: __rustc::rust_begin_unwind
84.40 s
> 1: core::panicking::panic_fmt
84.40 s
> 2: core::result::unwrap_failed
84.40 s
> 3: alphal00p_docs_builder::tests::checked_in_registry_is_valid
84.40 s
> 4: <alphal00p_docs_builder::tests::checked_in_registry_is_valid::{closure#0} as core::ops::function::FnOnce<()>>::call_once
84.40 s
> note: Some details are omitted, run with `RUST_BACKTRACE=full` for a verbose backtrace.
84.40 s
>
84.40 s
> FAIL [ 0.108s] ( 66/129) alphal00p-docs-builder tests :: every_product_requires_a_task_chooser_and_each_supported_interface
84.40 s
> stdout ---
84.40 s
>
84.40 s
> running 1 test
84.40 s
> test tests::every_product_requires_a_task_chooser_and_each_supported_interface ... FAILED
84.40 s
>
84.40 s
> failures:
84.40 s
>
84.40 s
> failures:
84.40 s
> tests::every_product_requires_a_task_chooser_and_each_supported_interface
84.40 s
>
84.40 s
> test result: FAILED. 0 passed; 1 failed; 0 ignored; 0 measured; 128 filtered out; finished in 0.10s
84.40 s
>
84.40 s
> stderr ---
84.40 s
>
84.40 s
> thread 'tests::every_product_requires_a_task_chooser_and_each_supported_interface' (299) panicked at crates/alphal00p-docs-builder/src/lib.rs:12192:9:
84.40 s
> assertion failed: format!("{error:#}").contains("has no quickstart page")
84.40 s
> stack backtrace:
84.40 s
> 0: __rustc::rust_begin_unwind
84.40 s
> 1: core::panicking::panic_fmt
84.40 s
> 2: core::panicking::panic
84.40 s
> 3: alphal00p_docs_builder::tests::every_product_requires_a_task_chooser_and_each_supported_interface
84.40 s
> 4: <alphal00p_docs_builder::tests::every_product_requires_a_task_chooser_and_each_supported_interface::{closure#0} as core::ops::function::FnOnce<()>>::call_once
84.40 s
> note: Some details are omitted, run with `RUST_BACKTRACE=full` for a verbose backtrace.
84.40 s
>
84.40 s
> FAIL [ 0.130s] ( 71/129) alphal00p-docs-builder tests :: developer_scope_ranges_ignore_unrelated_edits_and_warn_only_while_watching
84.40 s
> stdout ---
84.40 s
>
84.40 s
> running 1 test
84.40 s
> test tests::developer_scope_ranges_ignore_unrelated_edits_and_warn_only_while_watching ... FAILED
84.40 s
>
84.40 s
> failures:
84.40 s
>
84.40 s
> failures:
84.40 s
> tests::developer_scope_ranges_ignore_unrelated_edits_and_warn_only_while_watching
84.40 s
>
84.40 s
> test result: FAILED. 0 passed; 1 failed; 0 ignored; 0 measured; 128 filtered out; finished in 0.12s
84.40 s
>
84.40 s
> stderr ---
84.40 s
>
84.40 s
> thread 'tests::developer_scope_ranges_ignore_unrelated_edits_and_warn_only_while_watching' (275) panicked at crates/alphal00p-docs-builder/src/lib.rs:12263:29:
84.40 s
> called `Result::unwrap()` on an `Err` value: developer note nix-crane-cache-reuse verified scope nix/rust-workspace.nix changed (expected 66f700580ce13b9eaee90fe0111639e46968c531, found 0a568cb5712045aee37d96bfb2f91d3d32b7e9b9); owner review or an explicit no-impact attestation is required
84.40 s
>
84.40 s
> Location:
84.40 s
> crates/alphal00p-docs-builder/src/lib.rs:992:29
84.40 s
> stack backtrace:
84.40 s
> 0: __rustc::rust_begin_unwind
84.40 s
> 1: core::panicking::panic_fmt
84.40 s
> 2: core::result::unwrap_failed
84.40 s
> 3: alphal00p_docs_builder::tests::developer_scope_ranges_ignore_unrelated_edits_and_warn_only_while_watching
84.40 s
> 4: <alphal00p_docs_builder::tests::developer_scope_ranges_ignore_unrelated_edits_and_warn_only_while_watching::{closure#0} as core::ops::function::FnOnce<()>>::call_once
84.40 s
> note: Some details are omitted, run with `RUST_BACKTRACE=full` for a verbose backtrace.
84.40 s
>
84.40 s
> FAIL [ 0.120s] (108/129) alphal00p-docs-builder tests :: pdf_manual_chapter_order_must_match_the_page_registry
84.40 s
> stdout ---
84.40 s
>
84.40 s
> running 1 test
84.40 s
> test tests::pdf_manual_chapter_order_must_match_the_page_registry ... FAILED
84.40 s
>
84.40 s
> failures:
84.40 s
>
84.40 s
> failures:
84.40 s
> tests::pdf_manual_chapter_order_must_match_the_page_registry
84.40 s
>
84.40 s
> test result: FAILED. 0 passed; 1 failed; 0 ignored; 0 measured; 128 filtered out; finished in 0.11s
84.40 s
>
84.40 s
> stderr ---
84.40 s
>
84.40 s
> thread 'tests::pdf_manual_chapter_order_must_match_the_page_registry' (417) panicked at crates/alphal00p-docs-builder/src/lib.rs:12243:9:
84.40 s
> assertion failed: format!("{error:#}").contains("PDF manual chapter order differs")
84.40 s
> stack backtrace:
84.40 s
> 0: __rustc::rust_begin_unwind
84.40 s
> 1: core::panicking::panic_fmt
84.40 s
> 2: core::panicking::panic
84.40 s
> 3: alphal00p_docs_builder::tests::pdf_manual_chapter_order_must_match_the_page_registry
84.40 s
> 4: <alphal00p_docs_builder::tests::pdf_manual_chapter_order_must_match_the_page_registry::{closure#0} as core::ops::function::FnOnce<()>>::call_once
84.40 s
> note: Some details are omitted, run with `RUST_BACKTRACE=full` for a verbose backtrace.
84.40 s
>
84.40 s
> ------------
84.40 s
> Summary [ 16.860s] 129 tests run: 124 passed , 5 failed , 0 skipped
84.40 s
> FAIL [ 0.126s] ( 62/129) alphal00p-docs-builder provenance_tests :: each_build_captures_one_revision_before_rendering
84.40 s
> stdout ---
84.40 s
>
84.40 s
> running 1 test
84.40 s
>
84.40 s
> running 1 test
84.40 s
> test provenance_tests::each_build_captures_one_revision_before_rendering ... FAILED
84.40 s
>
84.40 s
> failures:
84.40 s
>
84.40 s
> failures:
84.40 s
> provenance_tests::each_build_captures_one_revision_before_rendering
84.40 s
>
84.40 s
> test result: FAILED. 0 passed; 1 failed; 0 ignored; 0 measured; 128 filtered out; finished in 0.11s
84.40 s
>
84.40 s
> test provenance_tests::each_build_captures_one_revision_before_rendering ... FAILED
84.40 s
>
84.40 s
> failures:
84.40 s
>
84.40 s
> failures:
84.40 s
> provenance_tests::each_build_captures_one_revision_before_rendering
84.40 s
>
84.40 s
> test result: FAILED. 0 passed; 1 failed; 0 ignored; 0 measured; 128 filtered out; finished in 0.12s
84.40 s
>
84.40 s
> stderr ---
84.40 s
>
84.40 s
> thread 'provenance_tests::each_build_captures_one_revision_before_rendering' (248) panicked at crates/alphal00p-docs-builder/src/provenance_tests.rs:297:14:
84.40 s
> called `Result::unwrap()` on an `Err` value: developer note nix-crane-cache-reuse verified scope nix/rust-workspace.nix changed (expected 66f700580ce13b9eaee90fe0111639e46968c531, found 0a568cb5712045aee37d96bfb2f91d3d32b7e9b9); owner review or an explicit no-impact attestation is required
84.40 s
>
84.40 s
> Location:
84.40 s
> crates/alphal00p-docs-builder/src/lib.rs:992:29
84.40 s
> stack backtrace:
84.40 s
> 0: __rustc::rust_begin_unwind
84.40 s
> 1: core::panicking::panic_fmt
84.40 s
> 2: core::result::unwrap_failed
84.40 s
> 3: alphal00p_docs_builder::provenance_tests::each_build_captures_one_revision_before_rendering
84.40 s
> 4: <alphal00p_docs_builder::provenance_tests::each_build_captures_one_revision_before_rendering::{closure#0} as core::ops::function::FnOnce<()>>::call_once
84.40 s
> note: Some details are omitted, run with `RUST_BACKTRACE=full` for a verbose backtrace.
84.40 s
>
84.40 s
> thread 'provenance_tests::each_build_captures_one_revision_before_rendering' (182) panicked at crates/alphal00p-docs-builder/src/provenance_tests.rs:274:9:
84.40 s
> assertion failed: command.status().unwrap().success()
84.40 s
> stack backtrace:
84.40 s
> 0: __rustc::rust_begin_unwind
84.40 s
> 1: core::panicking::panic_fmt
84.40 s
> 2: core::panicking::panic
84.40 s
> 3: alphal00p_docs_builder::provenance_tests::each_build_captures_one_revision_before_rendering
84.40 s
> 4: <alphal00p_docs_builder::provenance_tests::each_build_captures_one_revision_before_rendering::{closure#0} as core::ops::function::FnOnce<()>>::call_once
84.40 s
> note: Some details are omitted, run with `RUST_BACKTRACE=full` for a verbose backtrace.
84.40 s
>
84.40 s
> FAIL [ 0.131s] ( 65/129) alphal00p-docs-builder tests :: checked_in_registry_is_valid
84.40 s
> stdout ---
84.40 s
>
84.40 s
> running 1 test
84.40 s
> test tests::checked_in_registry_is_valid ... FAILED
84.40 s
>
84.40 s
> failures:
84.40 s
>
84.40 s
> failures:
84.40 s
> tests::checked_in_registry_is_valid
84.40 s
>
84.40 s
> test result: FAILED. 0 passed; 1 failed; 0 ignored; 0 measured; 128 filtered out; finished in 0.12s
84.40 s
>
84.40 s
> stderr ---
84.40 s
>
84.40 s
> thread 'tests::checked_in_registry_is_valid' (210) panicked at crates/alphal00p-docs-builder/src/lib.rs:12178:50:
84.40 s
> called `Result::unwrap()` on an `Err` value: developer note nix-crane-cache-reuse verified scope nix/rust-workspace.nix changed (expected 66f700580ce13b9eaee90fe0111639e46968c531, found 0a568cb5712045aee37d96bfb2f91d3d32b7e9b9); owner review or an explicit no-impact attestation is required
84.40 s
>
84.40 s
> Location:
84.40 s
> crates/alphal00p-docs-builder/src/lib.rs:992:29
84.40 s
> stack backtrace:
84.40 s
> 0: __rustc::rust_begin_unwind
84.40 s
> 1: core::panicking::panic_fmt
84.40 s
> 2: core::result::unwrap_failed
84.40 s
> 3: alphal00p_docs_builder::tests::checked_in_registry_is_valid
84.40 s
> 4: <alphal00p_docs_builder::tests::checked_in_registry_is_valid::{closure#0} as core::ops::function::FnOnce<()>>::call_once
84.40 s
> note: Some details are omitted, run with `RUST_BACKTRACE=full` for a verbose backtrace.
84.40 s
>
84.40 s
> FAIL [ 0.108s] ( 66/129) alphal00p-docs-builder tests :: every_product_requires_a_task_chooser_and_each_supported_interface
84.40 s
> stdout ---
84.40 s
>
84.40 s
> running 1 test
84.40 s
> test tests::every_product_requires_a_task_chooser_and_each_supported_interface ... FAILED
84.40 s
>
84.40 s
> failures:
84.40 s
>
84.40 s
> failures:
84.40 s
> tests::every_product_requires_a_task_chooser_and_each_supported_interface
84.40 s
>
84.40 s
> test result: FAILED. 0 passed; 1 failed; 0 ignored; 0 measured; 128 filtered out; finished in 0.10s
84.40 s
>
84.40 s
> stderr ---
84.40 s
>
84.40 s
> thread 'tests::every_product_requires_a_task_chooser_and_each_supported_interface' (299) panicked at crates/alphal00p-docs-builder/src/lib.rs:12192:9:
84.40 s
> assertion failed: format!("{error:#}").contains("has no quickstart page")
84.40 s
> stack backtrace:
84.40 s
> 0: __rustc::rust_begin_unwind
84.40 s
> 1: core::panicking::panic_fmt
84.40 s
> 2: core::panicking::panic
84.40 s
> 3: alphal00p_docs_builder::tests::every_product_requires_a_task_chooser_and_each_supported_interface
84.40 s
> 4: <alphal00p_docs_builder::tests::every_product_requires_a_task_chooser_and_each_supported_interface::{closure#0} as core::ops::function::FnOnce<()>>::call_once
84.40 s
> note: Some details are omitted, run with `RUST_BACKTRACE=full` for a verbose backtrace.
84.40 s
>
84.40 s
> FAIL [ 0.130s] ( 71/129) alphal00p-docs-builder tests :: developer_scope_ranges_ignore_unrelated_edits_and_warn_only_while_watching
84.40 s
> stdout ---
84.40 s
>
84.40 s
> running 1 test
84.40 s
> test tests::developer_scope_ranges_ignore_unrelated_edits_and_warn_only_while_watching ... FAILED
84.40 s
>
84.40 s
> failures:
84.40 s
>
84.40 s
> failures:
84.40 s
> tests::developer_scope_ranges_ignore_unrelated_edits_and_warn_only_while_watching
84.40 s
>
84.40 s
> test result: FAILED. 0 passed; 1 failed; 0 ignored; 0 measured; 128 filtered out; finished in 0.12s
84.40 s
>
84.40 s
> stderr ---
84.40 s
>
84.40 s
> thread 'tests::developer_scope_ranges_ignore_unrelated_edits_and_warn_only_while_watching' (275) panicked at crates/alphal00p-docs-builder/src/lib.rs:12263:29:
84.40 s
> called `Result::unwrap()` on an `Err` value: developer note nix-crane-cache-reuse verified scope nix/rust-workspace.nix changed (expected 66f700580ce13b9eaee90fe0111639e46968c531, found 0a568cb5712045aee37d96bfb2f91d3d32b7e9b9); owner review or an explicit no-impact attestation is required
84.40 s
>
84.40 s
> Location:
84.40 s
> crates/alphal00p-docs-builder/src/lib.rs:992:29
84.40 s
> stack backtrace:
84.40 s
> 0: __rustc::rust_begin_unwind
84.40 s
> 1: core::panicking::panic_fmt
84.40 s
> 2: core::result::unwrap_failed
84.40 s
> 3: alphal00p_docs_builder::tests::developer_scope_ranges_ignore_unrelated_edits_and_warn_only_while_watching
84.40 s
> 4: <alphal00p_docs_builder::tests::developer_scope_ranges_ignore_unrelated_edits_and_warn_only_while_watching::{closure#0} as core::ops::function::FnOnce<()>>::call_once
84.40 s
> note: Some details are omitted, run with `RUST_BACKTRACE=full` for a verbose backtrace.
84.40 s
>
84.40 s
> FAIL [ 0.120s] (108/129) alphal00p-docs-builder tests :: pdf_manual_chapter_order_must_match_the_page_registry
84.40 s
> stdout ---
84.40 s
>
84.40 s
> running 1 test
84.40 s
> test tests::pdf_manual_chapter_order_must_match_the_page_registry ... FAILED
84.40 s
>
84.40 s
> failures:
84.40 s
>
84.40 s
> failures:
84.40 s
> tests::pdf_manual_chapter_order_must_match_the_page_registry
84.40 s
>
84.40 s
> test result: FAILED. 0 passed; 1 failed; 0 ignored; 0 measured; 128 filtered out; finished in 0.11s
84.40 s
>
84.40 s
> stderr ---
84.40 s
>
84.40 s
> thread 'tests::pdf_manual_chapter_order_must_match_the_page_registry' (417) panicked at crates/alphal00p-docs-builder/src/lib.rs:12243:9:
84.40 s
> assertion failed: format!("{error:#}").contains("PDF manual chapter order differs")
84.40 s
> stack backtrace:
84.40 s
> 0: __rustc::rust_begin_unwind
84.40 s
> 1: core::panicking::panic_fmt
84.40 s
> 2: core::panicking::panic
84.40 s
> 3: alphal00p_docs_builder::tests::pdf_manual_chapter_order_must_match_the_page_registry
84.40 s
> 4: <alphal00p_docs_builder::tests::pdf_manual_chapter_order_must_match_the_page_registry::{closure#0} as core::ops::function::FnOnce<()>>::call_once
84.40 s
> note: Some details are omitted, run with `RUST_BACKTRACE=full` for a verbose backtrace.
84.40 s
>
84.40 s
> error : test run failed
84.40 s
>
84.40 s
> ========== nextest test summary ==========
84.40 s
> report: target/nextest/ci_gammaloop/junit.xml
84.40 s
> tests: 129, failures: 5, errors: 0
84.40 s
>
84.40 s
> 1. alphal00p-docs-builder::provenance_tests::each_build_captures_one_revision_before_rendering
84.40 s
> failure: test failure with exit code 101
84.40 s
> thread 'provenance_tests::each_build_captures_one_revision_before_rendering' (182) panicked at crates/alphal00p-docs-builder/src/provenance_tests.rs:274:9:
84.40 s
> assertion failed: command.status().unwrap().success()
84.40 s
> stack backtrace:
84.40 s
> 0: __rustc::rust_begin_unwind
84.40 s
> 1: core::panicking::panic_fmt
84.40 s
> 2: core::panicking::panic
84.40 s
> 3: alphal00p_docs_builder::provenance_tests::each_build_captures_one_revision_before_rendering
84.40 s
> 4: <alphal00p_docs_builder::provenance_tests::each_build_captures_one_revision_before_rendering::{closure#0} as core::ops::function::FnOnce<()>>::call_once
84.40 s
> note: Some details are omitted, run with `RUST_BACKTRACE=full` for a verbose backtrace.
84.40 s
> system-out
84.40 s
> running 1 test
84.40 s
>
84.40 s
> running 1 test
84.40 s
> test provenance_tests::each_build_captures_one_revision_before_rendering ... FAILED
84.40 s
>
84.40 s
> failures:
84.40 s
>
84.40 s
> failures:
84.40 s
> provenance_tests::each_build_captures_one_revision_before_rendering
84.40 s
>
84.40 s
> test result: FAILED. 0 passed; 1 failed; 0 ignored; 0 measured; 128 filtered out; finished in 0.11s
84.40 s
>
84.40 s
> test provenance_tests::each_build_captures_one_revision_before_rendering ... FAILED
84.40 s
>
84.40 s
> failures:
84.40 s
>
84.40 s
> failures:
84.40 s
> provenance_tests::each_build_captures_one_revision_before_rendering
84.40 s
>
84.40 s
> test result: FAILED. 0 passed; 1 failed; 0 ignored; 0 measured; 128 filtered out; finished in 0.12s
84.40 s
> system-err
84.40 s
> thread 'provenance_tests::each_build_captures_one_revision_before_rendering' (248) panicked at crates/alphal00p-docs-builder/src/provenance_tests.rs:297:14:
84.40 s
> called `Result::unwrap()` on an `Err` value: developer note nix-crane-cache-reuse verified scope nix/rust-workspace.nix changed (expected 66f700580ce13b9eaee90fe0111639e46968c531, found 0a568cb5712045aee37d96bfb2f91d3d32b7e9b9); owner review or an explicit no-impact attestation is required
84.40 s
>
84.40 s
> Location:
84.40 s
> crates/alphal00p-docs-builder/src/lib.rs:992:29
84.40 s
> stack backtrace:
84.40 s
> 0: __rustc::rust_begin_unwind
84.40 s
> 1: core::panicking::panic_fmt
84.40 s
> 2: core::result::unwrap_failed
84.40 s
> 3: alphal00p_docs_builder::provenance_tests::each_build_captures_one_revision_before_rendering
84.40 s
> 4: <alphal00p_docs_builder::provenance_tests::each_build_captures_one_revision_before_rendering::{closure#0} as core::ops::function::FnOnce<()>>::call_once
84.40 s
> note: Some details are omitted, run with `RUST_BACKTRACE=full` for a verbose backtrace.
84.40 s
>
84.40 s
> thread 'provenance_tests::each_build_captures_one_revision_before_rendering' (182) panicked at crates/alphal00p-docs-builder/src/provenance_tests.rs:274:9:
84.40 s
> assertion failed: command.status().unwrap().success()
84.40 s
> stack backtrace:
84.40 s
> 0: __rustc::rust_begin_unwind
84.40 s
> 1: core::panicking::panic_fmt
84.40 s
> 2: core::panicking::panic
84.40 s
> 3: alphal00p_docs_builder::provenance_tests::each_build_captures_one_revision_before_rendering
84.40 s
> 4: <alphal00p_docs_builder::provenance_tests::each_build_captures_one_revision_before_rendering::{closure#0} as core::ops::function::FnOnce<()>>::call_once
84.40 s
> note: Some details are omitted, run with `RUST_BACKTRACE=full` for a verbose backtrace.
84.40 s
>
84.40 s
> 2. alphal00p-docs-builder::tests::checked_in_registry_is_valid
84.40 s
> failure: test failure with exit code 101
84.40 s
> thread 'tests::checked_in_registry_is_valid' (210) panicked at crates/alphal00p-docs-builder/src/lib.rs:12178:50:
84.40 s
> called `Result::unwrap()` on an `Err` value: developer note nix-crane-cache-reuse verified scope nix/rust-workspace.nix changed (expected 66f700580ce13b9eaee90fe0111639e46968c531, found 0a568cb5712045aee37d96bfb2f91d3d32b7e9b9); owner review or an explicit no-impact attestation is required
84.40 s
>
84.40 s
> Location:
84.40 s
> crates/alphal00p-docs-builder/src/lib.rs:992:29
84.40 s
> stack backtrace:
84.40 s
> 0: __rustc::rust_begin_unwind
84.40 s
> 1: core::panicking::panic_fmt
84.40 s
> 2: core::result::unwrap_failed
84.40 s
> 3: alphal00p_docs_builder::tests::checked_in_registry_is_valid
84.40 s
> 4: <alphal00p_docs_builder::tests::checked_in_registry_is_valid::{closure#0} as core::ops::function::FnOnce<()>>::call_once
84.40 s
> note: Some details are omitted, run with `RUST_BACKTRACE=full` for a verbose backtrace.
84.40 s
> system-out
84.40 s
> running 1 test
84.40 s
> test tests::checked_in_registry_is_valid ... FAILED
84.40 s
>
84.40 s
> failures:
84.40 s
>
84.40 s
> failures:
84.40 s
> tests::checked_in_registry_is_valid
84.40 s
>
84.40 s
> test result: FAILED. 0 passed; 1 failed; 0 ignored; 0 measured; 128 filtered out; finished in 0.12s
84.40 s
> system-err
84.40 s
> thread 'tests::checked_in_registry_is_valid' (210) panicked at crates/alphal00p-docs-builder/src/lib.rs:12178:50:
84.40 s
> called `Result::unwrap()` on an `Err` value: developer note nix-crane-cache-reuse verified scope nix/rust-workspace.nix changed (expected 66f700580ce13b9eaee90fe0111639e46968c531, found 0a568cb5712045aee37d96bfb2f91d3d32b7e9b9); owner review or an explicit no-impact attestation is required
84.40 s
>
84.40 s
> Location:
84.40 s
> crates/alphal00p-docs-builder/src/lib.rs:992:29
84.40 s
> stack backtrace:
84.40 s
> 0: __rustc::rust_begin_unwind
84.40 s
> 1: core::panicking::panic_fmt
84.40 s
> 2: core::result::unwrap_failed
84.40 s
> 3: alphal00p_docs_builder::tests::checked_in_registry_is_valid
84.40 s
> 4: <alphal00p_docs_builder::tests::checked_in_registry_is_valid::{closure#0} as core::ops::function::FnOnce<()>>::call_once
84.40 s
> note: Some details are omitted, run with `RUST_BACKTRACE=full` for a verbose backtrace.
84.40 s
>
84.40 s
> 3. alphal00p-docs-builder::tests::every_product_requires_a_task_chooser_and_each_supported_interface
84.40 s
> failure: test failure with exit code 101
84.40 s
> thread 'tests::every_product_requires_a_task_chooser_and_each_supported_interface' (299) panicked at crates/alphal00p-docs-builder/src/lib.rs:12192:9:
84.40 s
> assertion failed: format!("{error:#}").contains("has no quickstart page")
84.40 s
> stack backtrace:
84.40 s
> 0: __rustc::rust_begin_unwind
84.40 s
> 1: core::panicking::panic_fmt
84.40 s
> 2: core::panicking::panic
84.40 s
> 3: alphal00p_docs_builder::tests::every_product_requires_a_task_chooser_and_each_supported_interface
84.40 s
> 4: <alphal00p_docs_builder::tests::every_product_requires_a_task_chooser_and_each_supported_interface::{closure#0} as core::ops::function::FnOnce<()>>::call_once
84.40 s
> note: Some details are omitted, run with `RUST_BACKTRACE=full` for a verbose backtrace.
84.40 s
> system-out
84.40 s
> running 1 test
84.40 s
> test tests::every_product_requires_a_task_chooser_and_each_supported_interface ... FAILED
84.40 s
>
84.40 s
> failures:
84.40 s
>
84.40 s
> failures:
84.40 s
> tests::every_product_requires_a_task_chooser_and_each_supported_interface
84.40 s
>
84.40 s
> test result: FAILED. 0 passed; 1 failed; 0 ignored; 0 measured; 128 filtered out; finished in 0.10s
84.40 s
> system-err
84.40 s
> thread 'tests::every_product_requires_a_task_chooser_and_each_supported_interface' (299) panicked at crates/alphal00p-docs-builder/src/lib.rs:12192:9:
84.40 s
> assertion failed: format!("{error:#}").contains("has no quickstart page")
84.40 s
> stack backtrace:
84.40 s
> 0: __rustc::rust_begin_unwind
84.40 s
> 1: core::panicking::panic_fmt
84.40 s
> 2: core::panicking::panic
84.40 s
> 3: alphal00p_docs_builder::tests::every_product_requires_a_task_chooser_and_each_supported_interface
84.40 s
> 4: <alphal00p_docs_builder::tests::every_product_requires_a_task_chooser_and_each_supported_interface::{closure#0} as core::ops::function::FnOnce<()>>::call_once
84.40 s
> note: Some details are omitted, run with `RUST_BACKTRACE=full` for a verbose backtrace.
84.40 s
>
84.40 s
> 4. alphal00p-docs-builder::tests::developer_scope_ranges_ignore_unrelated_edits_and_warn_only_while_watching
84.40 s
> failure: test failure with exit code 101
84.40 s
> thread 'tests::developer_scope_ranges_ignore_unrelated_edits_and_warn_only_while_watching' (275) panicked at crates/alphal00p-docs-builder/src/lib.rs:12263:29:
84.40 s
> called `Result::unwrap()` on an `Err` value: developer note nix-crane-cache-reuse verified scope nix/rust-workspace.nix changed (expected 66f700580ce13b9eaee90fe0111639e46968c531, found 0a568cb5712045aee37d96bfb2f91d3d32b7e9b9); owner review or an explicit no-impact attestation is required
84.40 s
>
84.40 s
> Location:
84.40 s
> crates/alphal00p-docs-builder/src/lib.rs:992:29
84.40 s
> stack backtrace:
84.40 s
> 0: __rustc::rust_begin_unwind
84.40 s
> 1: core::panicking::panic_fmt
84.40 s
> 2: core::result::unwrap_failed
84.40 s
> 3: alphal00p_docs_builder::tests::developer_scope_ranges_ignore_unrelated_edits_and_warn_only_while_watching
84.40 s
> 4: <alphal00p_docs_builder::tests::developer_scope_ranges_ignore_unrelated_edits_and_warn_only_while_watching::{closure#0} as core::ops::function::FnOnce<()>>::call_once
84.40 s
> note: Some details are omitted, run with `RUST_BACKTRACE=full` for a verbose backtrace.
84.40 s
> system-out
84.40 s
> running 1 test
84.40 s
> test tests::developer_scope_ranges_ignore_unrelated_edits_and_warn_only_while_watching ... FAILED
84.40 s
>
84.40 s
> failures:
84.40 s
>
84.40 s
> failures:
84.40 s
> tests::developer_scope_ranges_ignore_unrelated_edits_and_warn_only_while_watching
84.40 s
>
84.40 s
> test result: FAILED. 0 passed; 1 failed; 0 ignored; 0 measured; 128 filtered out; finished in 0.12s
84.40 s
> system-err
84.40 s
> thread 'tests::developer_scope_ranges_ignore_unrelated_edits_and_warn_only_while_watching' (275) panicked at crates/alphal00p-docs-builder/src/lib.rs:12263:29:
84.40 s
> called `Result::unwrap()` on an `Err` value: developer note nix-crane-cache-reuse verified scope nix/rust-workspace.nix changed (expected 66f700580ce13b9eaee90fe0111639e46968c531, found 0a568cb5712045aee37d96bfb2f91d3d32b7e9b9); owner review or an explicit no-impact attestation is required
84.40 s
>
84.40 s
> Location:
84.40 s
> crates/alphal00p-docs-builder/src/lib.rs:992:29
84.40 s
> stack backtrace:
84.40 s
> 0: __rustc::rust_begin_unwind
84.40 s
> 1: core::panicking::panic_fmt
84.40 s
> 2: core::result::unwrap_failed
84.40 s
> 3: alphal00p_docs_builder::tests::developer_scope_ranges_ignore_unrelated_edits_and_warn_only_while_watching
84.40 s
> 4: <alphal00p_docs_builder::tests::developer_scope_ranges_ignore_unrelated_edits_and_warn_only_while_watching::{closure#0} as core::ops::function::FnOnce<()>>::call_once
84.40 s
> note: Some details are omitted, run with `RUST_BACKTRACE=full` for a verbose backtrace.
84.40 s
>
84.40 s
> 5. alphal00p-docs-builder::tests::pdf_manual_chapter_order_must_match_the_page_registry
84.40 s
> failure: test failure with exit code 101
84.40 s
> thread 'tests::pdf_manual_chapter_order_must_match_the_page_registry' (417) panicked at crates/alphal00p-docs-builder/src/lib.rs:12243:9:
84.40 s
> assertion failed: format!("{error:#}").contains("PDF manual chapter order differs")
84.40 s
> stack backtrace:
84.40 s
> 0: __rustc::rust_begin_unwind
84.40 s
> 1: core::panicking::panic_fmt
84.40 s
> 2: core::panicking::panic
84.40 s
> 3: alphal00p_docs_builder::tests::pdf_manual_chapter_order_must_match_the_page_registry
84.40 s
> 4: <alphal00p_docs_builder::tests::pdf_manual_chapter_order_must_match_the_page_registry::{closure#0} as core::ops::function::FnOnce<()>>::call_once
84.40 s
> note: Some details are omitted, run with `RUST_BACKTRACE=full` for a verbose backtrace.
84.40 s
> system-out
84.40 s
> running 1 test
84.40 s
> test tests::pdf_manual_chapter_order_must_match_the_page_registry ... FAILED
84.40 s
>
84.40 s
> failures:
84.40 s
>
84.40 s
> failures:
84.40 s
> tests::pdf_manual_chapter_order_must_match_the_page_registry
84.40 s
>
84.40 s
> test result: FAILED. 0 passed; 1 failed; 0 ignored; 0 measured; 128 filtered out; finished in 0.11s
84.40 s
> system-err
84.40 s
> thread 'tests::pdf_manual_chapter_order_must_match_the_page_registry' (417) panicked at crates/alphal00p-docs-builder/src/lib.rs:12243:9:
84.40 s
> assertion failed: format!("{error:#}").contains("PDF manual chapter order differs")
84.40 s
> stack backtrace:
84.40 s
> 0: __rustc::rust_begin_unwind
84.40 s
> 1: core::panicking::panic_fmt
84.40 s
> 2: core::panicking::panic
84.40 s
> 3: alphal00p_docs_builder::tests::pdf_manual_chapter_order_must_match_the_page_registry
84.40 s
> 4: <alphal00p_docs_builder::tests::pdf_manual_chapter_order_must_match_the_page_registry::{closure#0} as core::ops::function::FnOnce<()>>::call_once
84.40 s
> note: Some details are omitted, run with `RUST_BACKTRACE=full` for a verbose backtrace.
84.40 s
> =========================================
84.40 s
> Extracting 2 binaries to /build/source
84.40 s
> Extracted 5 files to /build/source in 0.04s
84.40 s
> ------------
84.40 s
> Nextest run ID ce47592a-c822-416c-a666-b22341fd0d45 with nextest profile: ci_gammaloop
84.40 s
> Starting 22 tests across 2 binaries
84.40 s
> ------------
84.40 s
> Summary [ 0.023s] 22 tests run: 22 passed , 0 skipped
84.40 s
>
84.40 s
> ========== nextest test summary ==========
84.40 s
> report: target/nextest/ci_gammaloop/junit.xml
84.40 s
> tests: 22, failures: 0, errors: 0
84.40 s
> No failing testcases found.
84.40 s
> =========================================
84.40 s
> Extracting 3 binaries (including 2 non-test binaries), 1 build script output directory, and 2 linked paths to /build/source
84.40 s
> Extracted 22 files to /build/source in 0.30s
84.40 s
> ------------
84.40 s
> Nextest run ID d77fe6a3-bf2d-443c-9475-0f082b84323c with nextest profile: ci_gammaloop
84.40 s
> Starting 89 tests across 1 binary
84.40 s
> ------------
84.40 s
> Summary [ 0.049s] 89 tests run: 89 passed , 0 skipped
84.40 s
>
84.40 s
> ========== nextest test summary ==========
84.40 s
> report: target/nextest/ci_gammaloop/junit.xml
84.40 s
> tests: 89, failures: 0, errors: 0
84.40 s
> No failing testcases found.
84.40 s
> =========================================
84.40 s
> Extracting 2 binaries to /build/source
84.40 s
> Extracted 5 files to /build/source in 0.05s
84.40 s
> ------------
84.40 s
> Nextest run ID 322a3693-80fc-44fc-a1b9-1e9f351501a7 with nextest profile: ci_gammaloop
84.40 s
> Starting 10 tests across 2 binaries
84.40 s
> ------------
84.40 s
> Summary [ 16.032s] 10 tests run: 10 passed , 0 skipped
84.40 s
>
84.40 s
> ========== nextest test summary ==========
84.40 s
> report: target/nextest/ci_gammaloop/junit.xml
84.40 s
> tests: 10, failures: 0, errors: 0
84.40 s
> No failing testcases found.
84.40 s
> =========================================
84.40 s
> Extracting 1 binary to /build/source
84.40 s
> Extracted 4 files to /build/source in 0.05s
84.40 s
> ------------
84.40 s
> Nextest run ID b49f95d2-5a06-412b-b513-755e56e66403 with nextest profile: ci_gammaloop
84.40 s
> Starting 0 tests across 1 binary
84.40 s
> ------------
84.40 s
> Summary [ 0.000s] 0 tests run: 0 passed , 0 skipped
84.40 s
>
84.40 s
> ========== nextest test summary ==========
84.40 s
> report: target/nextest/ci_gammaloop/junit.xml
84.40 s
> tests: 0, failures: 0, errors: 0
84.40 s
> No failing testcases found.
84.40 s
> =========================================
84.40 s
> Extracting 1 binary to /build/source
84.40 s
> Extracted 4 files to /build/source in 0.04s
84.40 s
> ------------
84.40 s
> Nextest run ID b5a46690-35d2-410d-9285-dea671c260f5 with nextest profile: ci_gammaloop
84.40 s
> Starting 5 tests across 1 binary
84.40 s
> ------------
84.40 s
> Summary [ 0.006s] 5 tests run: 5 passed , 0 skipped
84.40 s
>
84.40 s
> ========== nextest test summary ==========
84.40 s
> report: target/nextest/ci_gammaloop/junit.xml
84.40 s
> tests: 5, failures: 0, errors: 0
84.40 s
> No failing testcases found.
84.40 s
> =========================================
84.40 s
For full logs, run:
84.40 s
nix log /nix/store/j3ypjrjxbfx4wvk2yf701zibxcq3r55s-gammaloop-nextest-docs.drv
84.61 s
[2 built (1 failed ), 103 Run failed.