test packages.x86_64-linux.nix-ci-check-gammaloop-nextest-clinnet
0.01 s
$ /nix/store/61685rbaxmpigwi3z23i33sv3jyfl70q-coreutils-9.11/bin/timeout --kill-after=15s 7200s /nix/store/wknkybkzrc16r11vk5vrykh4wmw7a353-nix-2.34.8/bin/nix --extra-experimental-features nix-command --extra-experimental-features flakes flake clone git+https://github.com/alphal00p/gammaloop --dest /tmp/nix-ci-worker/stable-pwd/repo/
0.12 s
Cloning into '/tmp/nix-ci-worker/stable-pwd/repo'...
1.00 s
remote: Enumerating objects: 110731, done.
1.11 s
remote: Counting objects: 0% (1/14562)
remote: Counting objects: 1% (146/14562)
remote: Counting objects: 2% (292/14562)
remote: Counting objects: 3% (437/14562)
remote: Counting objects: 4% (583/14562)
remote: Counting objects: 5% (729/14562)
remote: Counting objects: 6% (874/14562)
remote: Counting objects: 7% (1020/14562)
remote: Counting objects: 8% (1165/14562)
remote: Counting objects: 9% (1311/14562)
remote: Counting objects: 10% (1457/14562)
remote: Counting objects: 11% (1602/14562)
remote: Counting objects: 12% (1748/14562)
remote: Counting objects: 13% (1894/14562)
remote: Counting objects: 14% (2039/14562)
remote: Counting objects: 15% (2185/14562)
remote: Counting objects: 16% (2330/14562)
remote: Counting objects: 17% (2476/14562)
remote: Counting objects: 18% (2622/14562)
remote: Counting objects: 19% (2767/14562)
remote: Counting objects: 20% (2913/14562)
remote: Counting objects: 21% (3059/14562)
remote: Counting objects: 22% (3204/14562)
remote: Counting objects: 23% (3350/14562)
remote: Counting objects: 24% (3495/14562)
remote: Counting objects: 25% (3641/14562)
remote: Counting objects: 26% (3787/14562)
remote: Counting objects: 27% (3932/14562)
remote: Counting objects: 28% (4078/14562)
remote: Counting objects: 29% (4223/14562)
remote: Counting objects: 30% (4369/14562)
remote: Counting objects: 31% (4515/14562)
remote: Counting objects: 32% (4660/14562)
remote: Counting objects: 33% (4806/14562)
remote: Counting objects: 34% (4952/14562)
remote: Counting objects: 35% (5097/14562)
remote: Counting objects: 36% (5243/14562)
remote: Counting objects: 37% (5388/14562)
remote: Counting objects: 38% (5534/14562)
remote: Counting objects: 39% (5680/14562)
remote: Counting objects: 40% (5825/14562)
remote: Counting objects: 41% (5971/14562)
remote: Counting objects: 42% (6117/14562)
remote: Counting objects: 43% (6262/14562)
remote: Counting objects: 44% (6408/14562)
remote: Counting objects: 45% (6553/14562)
remote: Counting objects: 46% (6699/14562)
remote: Counting objects: 47% (6845/14562)
remote: Counting objects: 48% (6990/14562)
remote: Counting objects: 49% (7136/14562)
remote: Counting objects: 50% (7281/14562)
remote: Counting objects: 51% (7427/14562)
remote: Counting objects: 52% (7573/14562)
remote: Counting objects: 53% (7718/14562)
remote: Counting objects: 54% (7864/14562)
remote: Counting objects: 55% (8010/14562)
remote: Counting objects: 56% (8155/14562)
remote: Counting objects: 57% (8301/14562)
remote: Counting objects: 58% (8446/14562)
remote: Counting objects: 59% (8592/14562)
remote: Counting objects: 60% (8738/14562)
remote: Counting objects: 61% (8883/14562)
remote: Counting objects: 62% (9029/14562)
remote: Counting objects: 63% (9175/14562)
remote: Counting objects: 64% (9320/14562)
remote: Counting objects: 65% (9466/14562)
remote: Counting objects: 66% (9611/14562)
remote: Counting objects: 67% (9757/14562)
remote: Counting objects: 68% (9903/14562)
remote: Counting objects: 69% (10048/14562)
remote: Counting objects: 70% (10194/14562)
remote: Counting objects: 71% (10340/14562)
remote: Counting objects: 72% (10485/14562)
remote: Counting objects: 73% (10631/14562)
remote: Counting objects: 74% (10776/14562)
remote: Counting objects: 75% (10922/14562)
remote: Counting objects: 76% (11068/14562)
remote: Counting objects: 77% (11213/14562)
remote: Counting objects: 78% (11359/14562)
remote: Counting objects: 79% (11504/14562)
remote: Counting objects: 80% (11650/14562)
remote: Counting objects: 81% (11796/14562)
remote: Counting objects: 82% (11941/14562)
remote: Counting objects: 83% (12087/14562)
remote: Counting objects: 84% (12233/14562)
remote: Counting objects: 85% (12378/14562)
remote: Counting objects: 86% (12524/14562)
remote: Counting objects: 87% (12669/14562)
remote: Counting objects: 88% (12815/14562)
remote: Counting objects: 89% (12961/14562)
remote: Counting objects: 90% (13106/14562)
remote: Counting objects: 91% (13252/14562)
remote: Counting objects: 92% (13398/14562)
remote: Counting objects: 93% (13543/14562)
remote: Counting objects: 94% (13689/14562)
remote: Counting objects: 95% (13834/14562)
remote: Counting objects: 96% (13980/14562)
remote: Counting objects: 97% (14126/14562)
remote: Counting objects: 98% (14271/14562)
remote: Counting objects: 99% (14417/14562)
remote: Counting objects: 100% (14562/14562)
remote: Counting objects: 100% (14562/14562), done.
5.53 s
remote: Compressing objects: 0% (1/2921)
remote: Compressing objects: 1% (30/2921)
remote: Compressing objects: 2% (59/2921)
remote: Compressing objects: 3% (88/2921)
remote: Compressing objects: 4% (117/2921)
remote: Compressing objects: 5% (147/2921)
remote: Compressing objects: 6% (176/2921)
remote: Compressing objects: 7% (205/2921)
remote: Compressing objects: 8% (234/2921)
remote: Compressing objects: 9% (263/2921)
remote: Compressing objects: 10% (293/2921)
remote: Compressing objects: 11% (322/2921)
remote: Compressing objects: 11% (342/2921)
remote: Compressing objects: 12% (351/2921)
remote: Compressing objects: 13% (380/2921)
remote: Compressing objects: 13% (390/2921)
remote: Compressing objects: 14% (409/2921)
remote: Compressing objects: 15% (439/2921)
remote: Compressing objects: 16% (468/2921)
remote: Compressing objects: 17% (497/2921)
remote: Compressing objects: 18% (526/2921)
remote: Compressing objects: 19% (555/2921)
remote: Compressing objects: 20% (585/2921)
remote: Compressing objects: 21% (614/2921)
remote: Compressing objects: 22% (643/2921)
remote: Compressing objects: 23% (672/2921)
remote: Compressing objects: 24% (702/2921)
remote: Compressing objects: 25% (731/2921)
remote: Compressing objects: 26% (760/2921)
remote: Compressing objects: 27% (789/2921)
remote: Compressing objects: 27% (795/2921)
remote: Compressing objects: 28% (818/2921)
remote: Compressing objects: 29% (848/2921)
remote: Compressing objects: 30% (877/2921)
remote: Compressing objects: 31% (906/2921)
remote: Compressing objects: 32% (935/2921)
remote: Compressing objects: 33% (964/2921)
remote: Compressing objects: 34% (994/2921)
remote: Compressing objects: 35% (1023/2921)
remote: Compressing objects: 36% (1052/2921)
remote: Compressing objects: 37% (1081/2921)
remote: Compressing objects: 38% (1110/2921)
remote: Compressing objects: 39% (1140/2921)
remote: Compressing objects: 40% (1169/2921)
remote: Compressing objects: 41% (1198/2921)
remote: Compressing objects: 42% (1227/2921)
remote: Compressing objects: 43% (1257/2921)
remote: Compressing objects: 44% (1286/2921)
remote: Compressing objects: 45% (1315/2921)
remote: Compressing objects: 46% (1344/2921)
remote: Compressing objects: 47% (1373/2921)
remote: Compressing objects: 48% (1403/2921)
remote: Compressing objects: 49% (1432/2921)
remote: Compressing objects: 50% (1461/2921)
remote: Compressing objects: 51% (1490/2921)
remote: Compressing objects: 52% (1519/2921)
remote: Compressing objects: 53% (1549/2921)
remote: Compressing objects: 54% (1578/2921)
remote: Compressing objects: 55% (1607/2921)
remote: Compressing objects: 56% (1636/2921)
remote: Compressing objects: 57% (1665/2921)
remote: Compressing objects: 58% (1695/2921)
remote: Compressing objects: 59% (1724/2921)
remote: Compressing objects: 60% (1753/2921)
remote: Compressing objects: 61% (1782/2921)
remote: Compressing objects: 62% (1812/2921)
remote: Compressing objects: 63% (1841/2921)
remote: Compressing objects: 64% (1870/2921)
remote: Compressing objects: 65% (1899/2921)
remote: Compressing objects: 66% (1928/2921)
remote: Compressing objects: 67% (1958/2921)
remote: Compressing objects: 68% (1987/2921)
remote: Compressing objects: 69% (2016/2921)
remote: Compressing objects: 70% (2045/2921)
remote: Compressing objects: 71% (2074/2921)
remote: Compressing objects: 72% (2104/2921)
remote: Compressing objects: 73% (2133/2921)
remote: Compressing objects: 74% (2162/2921)
remote: Compressing objects: 75% (2191/2921)
remote: Compressing objects: 76% (2220/2921)
remote: Compressing objects: 77% (2250/2921)
remote: Compressing objects: 78% (2279/2921)
remote: Compressing objects: 79% (2308/2921)
remote: Compressing objects: 80% (2337/2921)
remote: Compressing objects: 81% (2367/2921)
remote: Compressing objects: 82% (2396/2921)
remote: Compressing objects: 83% (2425/2921)
remote: Compressing objects: 84% (2454/2921)
remote: Compressing objects: 85% (2483/2921)
remote: Compressing objects: 86% (2513/2921)
remote: Compressing objects: 87% (2542/2921)
remote: Compressing objects: 88% (2571/2921)
remote: Compressing objects: 89% (2600/2921)
remote: Compressing objects: 90% (2629/2921)
remote: Compressing objects: 91% (2659/2921)
remote: Compressing objects: 92% (2688/2921)
remote: Compressing objects: 93% (2717/2921)
remote: Compressing objects: 94% (2746/2921)
remote: Compressing objects: 95% (2775/2921)
remote: Compressing objects: 96% (2805/2921)
remote: Compressing objects: 97% (2834/2921)
remote: Compressing objects: 98% (2863/2921)
remote: Compressing objects: 99% (2892/2921)
remote: Compressing objects: 100% (2921/2921)
remote: Compressing objects: 100% (2921/2921), done.
18.42 s
Receiving objects: 0% (1/110731)
Receiving objects: 1% (1108/110731)
Receiving objects: 2% (2215/110731)
Receiving objects: 3% (3322/110731), 14.37 MiB | 27.34 MiB/s
Receiving objects: 4% (4430/110731), 14.37 MiB | 27.34 MiB/s
Receiving objects: 5% (5537/110731), 14.37 MiB | 27.34 MiB/s
Receiving objects: 6% (6644/110731), 14.37 MiB | 27.34 MiB/s
Receiving objects: 6% (6945/110731), 14.37 MiB | 27.34 MiB/s
Receiving objects: 7% (7752/110731), 30.70 MiB | 29.93 MiB/s
Receiving objects: 8% (8859/110731), 30.70 MiB | 29.93 MiB/s
Receiving objects: 9% (9966/110731), 30.70 MiB | 29.93 MiB/s
Receiving objects: 10% (11074/110731), 30.70 MiB | 29.93 MiB/s
Receiving objects: 10% (11664/110731), 64.41 MiB | 31.79 MiB/s
Receiving objects: 11% (12181/110731), 64.41 MiB | 31.79 MiB/s
Receiving objects: 12% (13288/110731), 64.41 MiB | 31.79 MiB/s
Receiving objects: 13% (14396/110731), 64.41 MiB | 31.79 MiB/s
Receiving objects: 14% (15503/110731), 64.41 MiB | 31.79 MiB/s
Receiving objects: 15% (16610/110731), 64.41 MiB | 31.79 MiB/s
Receiving objects: 16% (17717/110731), 74.92 MiB | 29.63 MiB/s
Receiving objects: 17% (18825/110731), 74.92 MiB | 29.63 MiB/s
Receiving objects: 18% (19932/110731), 74.92 MiB | 29.63 MiB/s
Receiving objects: 19% (21039/110731), 74.92 MiB | 29.63 MiB/s
Receiving objects: 20% (22147/110731), 74.92 MiB | 29.63 MiB/s
Receiving objects: 21% (23254/110731), 74.92 MiB | 29.63 MiB/s
Receiving objects: 22% (24361/110731), 74.92 MiB | 29.63 MiB/s
Receiving objects: 23% (25469/110731), 74.92 MiB | 29.63 MiB/s
Receiving objects: 24% (26576/110731), 74.92 MiB | 29.63 MiB/s
Receiving objects: 25% (27683/110731), 74.92 MiB | 29.63 MiB/s
Receiving objects: 26% (28791/110731), 74.92 MiB | 29.63 MiB/s
Receiving objects: 27% (29898/110731), 74.92 MiB | 29.63 MiB/s
Receiving objects: 28% (31005/110731), 74.92 MiB | 29.63 MiB/s
Receiving objects: 29% (32112/110731), 74.92 MiB | 29.63 MiB/s
Receiving objects: 30% (33220/110731), 74.92 MiB | 29.63 MiB/s
Receiving objects: 30% (34213/110731), 74.92 MiB | 29.63 MiB/s
Receiving objects: 31% (34327/110731), 89.32 MiB | 29.45 MiB/s
Receiving objects: 32% (35434/110731), 89.32 MiB | 29.45 MiB/s
Receiving objects: 33% (36542/110731), 89.32 MiB | 29.45 MiB/s
Receiving objects: 34% (37649/110731), 89.32 MiB | 29.45 MiB/s
Receiving objects: 35% (38756/110731), 89.32 MiB | 29.45 MiB/s
Receiving objects: 36% (39864/110731), 89.32 MiB | 29.45 MiB/s
Receiving objects: 37% (40971/110731), 89.32 MiB | 29.45 MiB/s
Receiving objects: 38% (42078/110731), 89.32 MiB | 29.45 MiB/s
Receiving objects: 39% (43186/110731), 89.32 MiB | 29.45 MiB/s
Receiving objects: 40% (44293/110731), 89.32 MiB | 29.45 MiB/s
Receiving objects: 41% (45400/110731), 89.32 MiB | 29.45 MiB/s
Receiving objects: 42% (46508/110731), 98.83 MiB | 27.98 MiB/s
Receiving objects: 43% (47615/110731), 98.83 MiB | 27.98 MiB/s
Receiving objects: 44% (48722/110731), 98.83 MiB | 27.98 MiB/s
Receiving objects: 45% (49829/110731), 98.83 MiB | 27.98 MiB/s
Receiving objects: 45% (50049/110731), 98.83 MiB | 27.98 MiB/s
Receiving objects: 46% (50937/110731), 108.74 MiB | 26.96 MiB/s
Receiving objects: 47% (52044/110731), 108.74 MiB | 26.96 MiB/s
Receiving objects: 48% (53151/110731), 108.74 MiB | 26.96 MiB/s
Receiving objects: 49% (54259/110731), 108.74 MiB | 26.96 MiB/s
Receiving objects: 50% (55366/110731), 108.74 MiB | 26.96 MiB/s
Receiving objects: 51% (56473/110731), 108.74 MiB | 26.96 MiB/s
Receiving objects: 52% (57581/110731), 118.93 MiB | 26.24 MiB/s
Receiving objects: 53% (58688/110731), 118.93 MiB | 26.24 MiB/s
Receiving objects: 54% (59795/110731), 118.93 MiB | 26.24 MiB/s
Receiving objects: 54% (59889/110731), 129.30 MiB | 25.50 MiB/s
Receiving objects: 55% (60903/110731), 129.30 MiB | 25.50 MiB/s
Receiving objects: 56% (62010/110731), 129.30 MiB | 25.50 MiB/s
Receiving objects: 57% (63117/110731), 129.30 MiB | 25.50 MiB/s
Receiving objects: 58% (64224/110731), 129.30 MiB | 25.50 MiB/s
Receiving objects: 59% (65332/110731), 139.75 MiB | 24.19 MiB/s
Receiving objects: 60% (66439/110731), 139.75 MiB | 24.19 MiB/s
Receiving objects: 61% (67546/110731), 139.75 MiB | 24.19 MiB/s
Receiving objects: 61% (68168/110731), 139.75 MiB | 24.19 MiB/s
Receiving objects: 62% (68654/110731), 161.50 MiB | 21.54 MiB/s
Receiving objects: 63% (69761/110731), 161.50 MiB | 21.54 MiB/s
Receiving objects: 64% (70868/110731), 161.50 MiB | 21.54 MiB/s
Receiving objects: 65% (71976/110731), 161.50 MiB | 21.54 MiB/s
Receiving objects: 65% (72743/110731), 161.50 MiB | 21.54 MiB/s
Receiving objects: 66% (73083/110731), 161.50 MiB | 21.54 MiB/s
Receiving objects: 67% (74190/110731), 172.83 MiB | 21.73 MiB/s
Receiving objects: 68% (75298/110731), 172.83 MiB | 21.73 MiB/s
Receiving objects: 69% (76405/110731), 172.83 MiB | 21.73 MiB/s
Receiving objects: 70% (77512/110731), 184.39 MiB | 21.11 MiB/s
Receiving objects: 71% (78620/110731), 184.39 MiB | 21.11 MiB/s
Receiving objects: 72% (79727/110731), 184.39 MiB | 21.11 MiB/s
Receiving objects: 73% (80834/110731), 184.39 MiB | 21.11 MiB/s
Receiving objects: 74% (81941/110731), 184.39 MiB | 21.11 MiB/s
Receiving objects: 75% (83049/110731), 184.39 MiB | 21.11 MiB/s
Receiving objects: 76% (84156/110731), 184.39 MiB | 21.11 MiB/s
Receiving objects: 77% (85263/110731), 184.39 MiB | 21.11 MiB/s
Receiving objects: 77% (85408/110731), 184.39 MiB | 21.11 MiB/s
Receiving objects: 78% (86371/110731), 196.42 MiB | 21.67 MiB/s
Receiving objects: 79% (87478/110731), 196.42 MiB | 21.67 MiB/s
Receiving objects: 80% (88585/110731), 196.42 MiB | 21.67 MiB/s
Receiving objects: 81% (89693/110731), 196.42 MiB | 21.67 MiB/s
Receiving objects: 81% (89701/110731), 221.00 MiB | 22.65 MiB/s
Receiving objects: 81% (89737/110731), 246.63 MiB | 23.72 MiB/s
Receiving objects: 82% (90800/110731), 259.54 MiB | 24.19 MiB/s
Receiving objects: 83% (91907/110731), 259.54 MiB | 24.19 MiB/s
Receiving objects: 84% (93015/110731), 259.54 MiB | 24.19 MiB/s
Receiving objects: 84% (93589/110731), 259.54 MiB | 24.19 MiB/s
Receiving objects: 85% (94122/110731), 273.05 MiB | 24.76 MiB/s
Receiving objects: 86% (95229/110731), 286.88 MiB | 25.31 MiB/s
Receiving objects: 87% (96336/110731), 286.88 MiB | 25.31 MiB/s
Receiving objects: 88% (97444/110731), 286.88 MiB | 25.31 MiB/s
Receiving objects: 89% (98551/110731), 286.88 MiB | 25.31 MiB/s
Receiving objects: 90% (99658/110731), 286.88 MiB | 25.31 MiB/s
Receiving objects: 91% (100766/110731), 286.88 MiB | 25.31 MiB/s
Receiving objects: 91% (101214/110731), 286.88 MiB | 25.31 MiB/s
Receiving objects: 92% (101873/110731), 286.88 MiB | 25.31 MiB/s
Receiving objects: 93% (102980/110731), 300.57 MiB | 25.79 MiB/s
Receiving objects: 94% (104088/110731), 300.57 MiB | 25.79 MiB/s
Receiving objects: 95% (105195/110731), 300.57 MiB | 25.79 MiB/s
Receiving objects: 96% (106302/110731), 300.57 MiB | 25.79 MiB/s
Receiving objects: 97% (107410/110731), 300.57 MiB | 25.79 MiB/s
Receiving objects: 98% (108517/110731), 300.57 MiB | 25.79 MiB/s
Receiving objects: 99% (109624/110731), 315.31 MiB | 26.40 MiB/s
remote: Total 110731 (delta 12254), reused 11928 (delta 11241), pack-reused 96169 (from 2)
18.42 s
Receiving objects: 100% (110731/110731), 315.31 MiB | 26.40 MiB/s
Receiving objects: 100% (110731/110731), 324.99 MiB | 25.21 MiB/s, done.
22.45 s
Resolving deltas: 0% (0/72611)
Resolving deltas: 1% (727/72611)
Resolving deltas: 2% (1453/72611)
Resolving deltas: 3% (2179/72611)
Resolving deltas: 4% (2905/72611)
Resolving deltas: 5% (3631/72611)
Resolving deltas: 6% (4357/72611)
Resolving deltas: 7% (5083/72611)
Resolving deltas: 8% (5809/72611)
Resolving deltas: 9% (6535/72611)
Resolving deltas: 10% (7262/72611)
Resolving deltas: 11% (7988/72611)
Resolving deltas: 12% (8714/72611)
Resolving deltas: 13% (9442/72611)
Resolving deltas: 14% (10166/72611)
Resolving deltas: 15% (10892/72611)
Resolving deltas: 16% (11618/72611)
Resolving deltas: 17% (12344/72611)
Resolving deltas: 18% (13070/72611)
Resolving deltas: 19% (13798/72611)
Resolving deltas: 20% (14523/72611)
Resolving deltas: 21% (15249/72611)
Resolving deltas: 22% (15975/72611)
Resolving deltas: 23% (16701/72611)
Resolving deltas: 23% (17411/72611)
Resolving deltas: 24% (17427/72611)
Resolving deltas: 25% (18153/72611)
Resolving deltas: 26% (18879/72611)
Resolving deltas: 27% (19605/72611)
Resolving deltas: 28% (20332/72611)
Resolving deltas: 29% (21058/72611)
Resolving deltas: 30% (21784/72611)
Resolving deltas: 31% (22510/72611)
Resolving deltas: 32% (23236/72611)
Resolving deltas: 33% (23962/72611)
Resolving deltas: 34% (24688/72611)
Resolving deltas: 35% (25414/72611)
Resolving deltas: 36% (26140/72611)
Resolving deltas: 37% (26867/72611)
Resolving deltas: 37% (27250/72611)
Resolving deltas: 38% (27593/72611)
Resolving deltas: 39% (28319/72611)
Resolving deltas: 40% (29045/72611)
Resolving deltas: 41% (29771/72611)
Resolving deltas: 42% (30497/72611)
Resolving deltas: 43% (31223/72611)
Resolving deltas: 44% (31949/72611)
Resolving deltas: 45% (32675/72611)
Resolving deltas: 46% (33402/72611)
Resolving deltas: 47% (34128/72611)
Resolving deltas: 48% (34855/72611)
Resolving deltas: 49% (35580/72611)
Resolving deltas: 50% (36306/72611)
Resolving deltas: 51% (37032/72611)
Resolving deltas: 52% (37758/72611)
Resolving deltas: 53% (38484/72611)
Resolving deltas: 54% (39210/72611)
Resolving deltas: 55% (39937/72611)
Resolving deltas: 56% (40663/72611)
Resolving deltas: 57% (41389/72611)
Resolving deltas: 58% (42115/72611)
Resolving deltas: 59% (42841/72611)
Resolving deltas: 60% (43567/72611)
Resolving deltas: 61% (44293/72611)
Resolving deltas: 62% (45019/72611)
Resolving deltas: 63% (45745/72611)
Resolving deltas: 64% (46472/72611)
Resolving deltas: 65% (47198/72611)
Resolving deltas: 66% (47924/72611)
Resolving deltas: 67% (48650/72611)
Resolving deltas: 68% (49376/72611)
Resolving deltas: 69% (50103/72611)
Resolving deltas: 70% (50828/72611)
Resolving deltas: 71% (51554/72611)
Resolving deltas: 72% (52280/72611)
Resolving deltas: 73% (53007/72611)
Resolving deltas: 74% (53733/72611)
Resolving deltas: 75% (54459/72611)
Resolving deltas: 76% (55185/72611)
Resolving deltas: 77% (55911/72611)
Resolving deltas: 77% (56145/72611)
Resolving deltas: 78% (56637/72611)
Resolving deltas: 79% (57363/72611)
Resolving deltas: 80% (58090/72611)
Resolving deltas: 81% (58815/72611)
Resolving deltas: 82% (59542/72611)
Resolving deltas: 83% (60269/72611)
Resolving deltas: 84% (60994/72611)
Resolving deltas: 85% (61720/72611)
Resolving deltas: 86% (62446/72611)
Resolving deltas: 87% (63172/72611)
Resolving deltas: 88% (63899/72611)
Resolving deltas: 89% (64624/72611)
Resolving deltas: 90% (65350/72611)
Resolving deltas: 91% (66079/72611)
Resolving deltas: 92% (66803/72611)
Resolving deltas: 93% (67529/72611)
Resolving deltas: 94% (68255/72611)
Resolving deltas: 95% (68981/72611)
Resolving deltas: 96% (69707/72611)
Resolving deltas: 97% (70433/72611)
Resolving deltas: 98% (71159/72611)
Resolving deltas: 99% (71885/72611)
Resolving deltas: 99% (72469/72611)
Resolving deltas: 100% (72611/72611)
Resolving deltas: 100% (72611/72611), done.
23.73 s
Fetching commit 9d52e6b6b4ff2c85f26457074d140e152414899b for push-zwxzqnpnzwwu ...
23.73 s
$ /nix/store/5vpcfsdx1lcnlb2y4k7xyc74shp5qwbh-git-2.54.0/bin/git fetch origin 9d52e6b6b4ff2c85f26457074d140e152414899b
24.49 s
From https://github.com/alphal00p/gammaloop
24.49 s
* branch 9d52e6b6b4ff2c85f26457074d140e152414899b -> FETCH_HEAD
24.55 s
$ /nix/store/61685rbaxmpigwi3z23i33sv3jyfl70q-coreutils-9.11/bin/timeout --kill-after=15s 7200s /nix/store/5vpcfsdx1lcnlb2y4k7xyc74shp5qwbh-git-2.54.0/bin/git -c advice.detachedHead=false checkout 9d52e6b6b4ff2c85f26457074d140e152414899b
25.15 s
HEAD is now at 9d52e6b6b add standalone xbox sum, soft-triangle, and thrown-out diagrams
25.17 s
$ /nix/store/61685rbaxmpigwi3z23i33sv3jyfl70q-coreutils-9.11/bin/timeout --kill-after=15s 7200s /nix/store/wknkybkzrc16r11vk5vrykh4wmw7a353-nix-2.34.8/bin/nix --extra-experimental-features nix-command --extra-experimental-features flakes --log-format internal-json run .#packages.x86_64-linux.nix-ci-check-gammaloop-nextest-clinnet --print-build-logs
25.90 s
warning: ignoring untrusted flake configuration setting 'extra-substituters'.
25.90 s
Pass '--accept-flake-config' to trust it
25.90 s
warning: ignoring untrusted flake configuration setting 'extra-trusted-public-keys'.
25.90 s
Pass '--accept-flake-config' to trust it
31.88 s
32.35 s
evaluating derivation 'gdo you want to allow configuration setting 'extra-substituters' to be set to 'https://cache.nix-ci.com ' (y/N)? do you want to permanently mark this value as untrusted (y/N)? warning: ignoring untrusted flake configuration setting 'extra-substituters'.
32.35 s
Pass '--accept-flake-config' to trust it
32.35 s
do you want to allow configuration setting 'extra-trusted-public-keys' to be set to 'nix-ci:g3xV5BDTLtIBZr/A00IU1x0EtKKlb7YLgBN2SgYgM6A= ' (y/N)? do you want to permanently mark this value as untrusted (y/N)? warning: ignoring untrusted flake configuration setting 'extra-trusted-public-keys'.
32.35 s
Pass '--accept-flake-config' to trust it
40.93 s
querying info about miss
querying gammaloop-nexte
[3.1 KiB DL] querying ty
[10.4 KiB DL] querying g
[17.8 KiB DL] querying e
[33.0 KiB DL] querying i
[41.3 KiB DL]
[0 /13 built, 10 /0 /56 cop
[0 /10 built, 7 /4 /56 copi
[0 /9 built, 4 /8 /56 copie
[0 /8 built, 2 /11 /56 copi
[0 /8 built, 2 /12 /56 copi
[0 /8 built, 1 /13 /56 copi
[0 /8 built, 16 /14 /56 cop
[0 /7 built, 14 /23 /56 cop
[0 /7 built, 14 /25 /56 cop
[0 /7 built, 9 /37 /56 copi
[0 /7 built, 5 /44 /56 copi
[0 /7 built, 4 /45 /56 copi
[0 /7 built, 6 /46 /56 copi
[0 /7 built, 5 /48 /56 copi
[0 /7 built, 5 /49 /56 copi
[0 /6 built, 4 /50 /56 copi
[1 /0 /6 built, 3 /51 /56 cobuilder.pl> Running phase: patchPhase
40.94 s
builder.pl> Running phase: updateAutotoolsGnuConfigScriptsPhase
40.95 s
builder.pl> Running phase: configurePhase
40.97 s
builder.pl> no configure script, doing nothing
40.97 s
builder.pl> Running phase: buildPhase
40.98 s
builder.pl> Running phase: checkPhase
40.99 s
builder.pl> Running phase: installPhase
41.00 s
builder.pl> no Makefile or custom installPhase, doing nothing
41.00 s
builder.pl> Running phase: fixupPhase
41.02 s
builder.pl> shrinking RPATHs of ELF executables and libraries in /nix/store/zzmspl8wdn2a3ancrz8dg3kci887nw6d-builder.pl
41.02 s
builder.pl> checking for references to /build/ in /nix/store/zzmspl8wdn2a3ancrz8dg3kci887nw6d-builder.pl...
41.04 s
builder.pl> patching script interpreter paths in /nix/store/zzmspl8wdn2a3ancrz8dg3kci887nw6d-builder.pl
41.10 s
builder.pl (post)> Uploading to the NixCI cache: /nix/store/zzmspl8wdn2a3ancrz8dg3kci887nw6d-builder.pl
41.18 s
builder.pl (post)> warning: 'warn-short-path-literals' is deprecated, use 'lint-short-path-literals = ignore' instead
41.33 s
builder.pl (post)> copying 0 paths...
41.44 s
builder.pl (post)> warning: 'warn-short-path-literals' is deprecated, use 'lint-short-path-literals = ignore' instead
41.87 s
builder.pl (post)> copying 0 paths...
42.09 s
[1 /4 built, 1 /54 /56 copi
[1 /4 built, 1 /55 /56 copi
[1 /3 built, 56 copied (5 typst> structuredAttrs is enabled
42.19 s
[1 /1 /3 built, 56 copied typst> created 4 symlinks in user environment
42.35 s
typst (post)> Uploading to the NixCI cache: /nix/store/yc93gbspdkf53nwjsf1mbydbsaq9snxl-typst-0.15.1-env
42.42 s
typst (post)> warning: 'warn-short-path-literals' is deprecated, use 'lint-short-path-literals = ignore' instead
42.55 s
typst (post)> copying 0 paths...
42.63 s
typst (post)> warning: 'warn-short-path-literals' is deprecated, use 'lint-short-path-literals = ignore' instead
43.13 s
typst (post)> copying 0 paths...
43.64 s
[2 /4 built, 56 copied (5
[1 /2 /3 built, 56 copied gammaloop-nextest-clinnet> Extracting 4 binaries (including 1 non-test binary) and 1 linked path to /build/source
43.75 s
gammaloop-nextest-clinnet> Extracted 15 files to /build/source in 0.11s
43.77 s
gammaloop-nextest-clinnet> ------------
43.77 s
gammaloop-nextest-clinnet> Nextest run ID d586f30a-ba83-49e6-888e-2347b75d0473 with nextest profile: ci_gammaloop
43.77 s
gammaloop-nextest-clinnet> Starting 36 tests across 3 binaries
45.74 s
gammaloop-nextest-clinnet> FAIL [ 1.974s] (22/36) clinnet tests :: default_template_renders_generic_config_and_static_subgraphs_with_typst
45.74 s
gammaloop-nextest-clinnet> stdout ---
45.74 s
gammaloop-nextest-clinnet>
45.74 s
gammaloop-nextest-clinnet> running 1 test
45.74 s
gammaloop-nextest-clinnet> test tests::default_template_renders_generic_config_and_static_subgraphs_with_typst ... FAILED
45.74 s
gammaloop-nextest-clinnet>
45.74 s
gammaloop-nextest-clinnet> failures:
45.74 s
gammaloop-nextest-clinnet>
45.74 s
gammaloop-nextest-clinnet> failures:
45.74 s
gammaloop-nextest-clinnet> tests::default_template_renders_generic_config_and_static_subgraphs_with_typst
45.74 s
gammaloop-nextest-clinnet>
45.74 s
gammaloop-nextest-clinnet> test result: FAILED. 0 passed; 1 failed; 0 ignored; 0 measured; 13 filtered out; finished in 1.97s
45.74 s
gammaloop-nextest-clinnet>
45.74 s
gammaloop-nextest-clinnet> stderr ---
45.74 s
gammaloop-nextest-clinnet>
45.74 s
gammaloop-nextest-clinnet> thread 'tests::default_template_renders_generic_config_and_static_subgraphs_with_typst' (181) panicked at crates/clinnet/src/lib.rs:1307:14:
45.74 s
gammaloop-nextest-clinnet> called `Result::unwrap()` on an `Err` value: typst failed while compiling template /build/clinnet-real-typst-166-0/gamma-style-assertions.pdf
45.74 s
gammaloop-nextest-clinnet>
45.74 s
gammaloop-nextest-clinnet> Command executed:
45.74 s
gammaloop-nextest-clinnet> "typst" "c" "/build/source/crates/clinnet/tests/resources/gamma-style-behavior.typ" "/build/clinnet-real-typst-166-0/gamma-style-assertions.pdf" "--root" "/build/source"
45.74 s
gammaloop-nextest-clinnet>
45.74 s
gammaloop-nextest-clinnet> File not found - check that all paths are correct and files exist
45.74 s
gammaloop-nextest-clinnet>
45.74 s
gammaloop-nextest-clinnet> Typst stdout:
45.74 s
gammaloop-nextest-clinnet>
45.74 s
gammaloop-nextest-clinnet>
45.74 s
gammaloop-nextest-clinnet> Typst stderr:
45.74 s
gammaloop-nextest-clinnet> error: file not found (searched at /build/source/docs/assets/typst/theme.typ)
45.74 s
gammaloop-nextest-clinnet> ┌─ ../../docs/assets/typst/portal-graphs/edge-style.typ:5:8
45.74 s
gammaloop-nextest-clinnet> │
45.74 s
gammaloop-nextest-clinnet> 5 │ #import "../theme.typ": palette
45.74 s
gammaloop-nextest-clinnet> │ ^^^^^^^^^^^^^^
45.74 s
gammaloop-nextest-clinnet>
45.74 s
gammaloop-nextest-clinnet> while importing `../../../../docs/assets/typst/portal-graphs/edge-style.typ` at tests/resources/gamma-style-behavior.typ:7:1
45.74 s
gammaloop-nextest-clinnet> import "../../../../docs/assets/typst/portal-graphs/edge-style.typ" as model-style
45.74 s
gammaloop-nextest-clinnet>
45.74 s
gammaloop-nextest-clinnet> Location:
45.74 s
gammaloop-nextest-clinnet> crates/clinnet/src/lib.rs:770:13
45.74 s
gammaloop-nextest-clinnet> stack backtrace:
45.74 s
gammaloop-nextest-clinnet> 0: __rustc::rust_begin_unwind
45.74 s
gammaloop-nextest-clinnet> 1: core::panicking::panic_fmt
45.74 s
gammaloop-nextest-clinnet> 2: core::result::unwrap_failed
45.74 s
gammaloop-nextest-clinnet> 3: clinnet::tests::default_template_renders_generic_config_and_static_subgraphs_with_typst
45.74 s
gammaloop-nextest-clinnet> 4: <clinnet::tests::default_template_renders_generic_config_and_static_subgraphs_with_typst::{closure#0} as core::ops::function::FnOnce<()>>::call_once
45.74 s
gammaloop-nextest-clinnet> note: Some details are omitted, run with `RUST_BACKTRACE=full` for a verbose backtrace.
45.74 s
gammaloop-nextest-clinnet>
89.13 s
gammaloop-nextest-clinnet> ------------
89.13 s
gammaloop-nextest-clinnet> Summary [ 45.356s] 36 tests run: 35 passed , 1 failed , 0 skipped
89.13 s
gammaloop-nextest-clinnet> FAIL [ 1.974s] (22/36) clinnet tests :: default_template_renders_generic_config_and_static_subgraphs_with_typst
89.13 s
gammaloop-nextest-clinnet> stdout ---
89.13 s
gammaloop-nextest-clinnet>
89.13 s
gammaloop-nextest-clinnet> running 1 test
89.13 s
gammaloop-nextest-clinnet> test tests::default_template_renders_generic_config_and_static_subgraphs_with_typst ... FAILED
89.13 s
gammaloop-nextest-clinnet>
89.13 s
gammaloop-nextest-clinnet> failures:
89.13 s
gammaloop-nextest-clinnet>
89.13 s
gammaloop-nextest-clinnet> failures:
89.13 s
gammaloop-nextest-clinnet> tests::default_template_renders_generic_config_and_static_subgraphs_with_typst
89.13 s
gammaloop-nextest-clinnet>
89.13 s
gammaloop-nextest-clinnet> test result: FAILED. 0 passed; 1 failed; 0 ignored; 0 measured; 13 filtered out; finished in 1.97s
89.13 s
gammaloop-nextest-clinnet>
89.13 s
gammaloop-nextest-clinnet> stderr ---
89.13 s
gammaloop-nextest-clinnet>
89.13 s
gammaloop-nextest-clinnet> thread 'tests::default_template_renders_generic_config_and_static_subgraphs_with_typst' (181) panicked at crates/clinnet/src/lib.rs:1307:14:
89.13 s
gammaloop-nextest-clinnet> called `Result::unwrap()` on an `Err` value: typst failed while compiling template /build/clinnet-real-typst-166-0/gamma-style-assertions.pdf
89.13 s
gammaloop-nextest-clinnet>
89.13 s
gammaloop-nextest-clinnet> Command executed:
89.13 s
gammaloop-nextest-clinnet> "typst" "c" "/build/source/crates/clinnet/tests/resources/gamma-style-behavior.typ" "/build/clinnet-real-typst-166-0/gamma-style-assertions.pdf" "--root" "/build/source"
89.13 s
gammaloop-nextest-clinnet>
89.13 s
gammaloop-nextest-clinnet> File not found - check that all paths are correct and files exist
89.13 s
gammaloop-nextest-clinnet>
89.13 s
gammaloop-nextest-clinnet> Typst stdout:
89.13 s
gammaloop-nextest-clinnet>
89.13 s
gammaloop-nextest-clinnet>
89.13 s
gammaloop-nextest-clinnet> Typst stderr:
89.13 s
gammaloop-nextest-clinnet> error: file not found (searched at /build/source/docs/assets/typst/theme.typ)
89.13 s
gammaloop-nextest-clinnet> ┌─ ../../docs/assets/typst/portal-graphs/edge-style.typ:5:8
89.13 s
gammaloop-nextest-clinnet> │
89.13 s
gammaloop-nextest-clinnet> 5 │ #import "../theme.typ": palette
89.13 s
gammaloop-nextest-clinnet> │ ^^^^^^^^^^^^^^
89.13 s
gammaloop-nextest-clinnet>
89.13 s
gammaloop-nextest-clinnet> while importing `../../../../docs/assets/typst/portal-graphs/edge-style.typ` at tests/resources/gamma-style-behavior.typ:7:1
89.13 s
gammaloop-nextest-clinnet> import "../../../../docs/assets/typst/portal-graphs/edge-style.typ" as model-style
89.13 s
gammaloop-nextest-clinnet>
89.13 s
gammaloop-nextest-clinnet> Location:
89.13 s
gammaloop-nextest-clinnet> crates/clinnet/src/lib.rs:770:13
89.13 s
gammaloop-nextest-clinnet> stack backtrace:
89.13 s
gammaloop-nextest-clinnet> 0: __rustc::rust_begin_unwind
89.13 s
gammaloop-nextest-clinnet> 1: core::panicking::panic_fmt
89.13 s
gammaloop-nextest-clinnet> 2: core::result::unwrap_failed
89.13 s
gammaloop-nextest-clinnet> 3: clinnet::tests::default_template_renders_generic_config_and_static_subgraphs_with_typst
89.13 s
gammaloop-nextest-clinnet> 4: <clinnet::tests::default_template_renders_generic_config_and_static_subgraphs_with_typst::{closure#0} as core::ops::function::FnOnce<()>>::call_once
89.13 s
gammaloop-nextest-clinnet> note: Some details are omitted, run with `RUST_BACKTRACE=full` for a verbose backtrace.
89.13 s
gammaloop-nextest-clinnet>
89.14 s
gammaloop-nextest-clinnet> error : test run failed
89.18 s
gammaloop-nextest-clinnet>
89.18 s
gammaloop-nextest-clinnet> ========== nextest test summary ==========
89.18 s
gammaloop-nextest-clinnet> report: target/nextest/ci_gammaloop/junit.xml
89.18 s
gammaloop-nextest-clinnet> tests: 36, failures: 1, errors: 0
89.18 s
gammaloop-nextest-clinnet>
89.18 s
gammaloop-nextest-clinnet> 1. clinnet::tests::default_template_renders_generic_config_and_static_subgraphs_with_typst
89.18 s
gammaloop-nextest-clinnet> failure: test failure with exit code 101
89.18 s
gammaloop-nextest-clinnet> thread 'tests::default_template_renders_generic_config_and_static_subgraphs_with_typst' (181) panicked at crates/clinnet/src/lib.rs:1307:14:
89.18 s
gammaloop-nextest-clinnet> called `Result::unwrap()` on an `Err` value: typst failed while compiling template /build/clinnet-real-typst-166-0/gamma-style-assertions.pdf
89.18 s
gammaloop-nextest-clinnet>
89.18 s
gammaloop-nextest-clinnet> Command executed:
89.18 s
gammaloop-nextest-clinnet> "typst" "c" "/build/source/crates/clinnet/tests/resources/gamma-style-behavior.typ" "/build/clinnet-real-typst-166-0/gamma-style-assertions.pdf" "--root" "/build/source"
89.18 s
gammaloop-nextest-clinnet>
89.18 s
gammaloop-nextest-clinnet> File not found - check that all paths are correct and files exist
89.18 s
gammaloop-nextest-clinnet>
89.18 s
gammaloop-nextest-clinnet> Typst stdout:
89.18 s
gammaloop-nextest-clinnet>
89.18 s
gammaloop-nextest-clinnet>
89.19 s
gammaloop-nextest-clinnet> Typst stderr:
89.19 s
gammaloop-nextest-clinnet> error: file not found (searched at /build/source/docs/assets/typst/theme.typ)
89.19 s
gammaloop-nextest-clinnet> ┌─ ../../docs/assets/typst/portal-graphs/edge-style.typ:5:8
89.19 s
gammaloop-nextest-clinnet> │
89.19 s
gammaloop-nextest-clinnet> 5 │ #import "../theme.typ": palette
89.19 s
gammaloop-nextest-clinnet> │ ^^^^^^^^^^^^^^
89.19 s
gammaloop-nextest-clinnet>
89.19 s
gammaloop-nextest-clinnet> while importing `../../../../docs/assets/typst/portal-graphs/edge-style.typ` at tests/resources/gamma-style-behavior.typ:7:1
89.19 s
gammaloop-nextest-clinnet> import "../../../../docs/assets/typst/portal-graphs/edge-style.typ" as model-style
89.19 s
gammaloop-nextest-clinnet>
89.19 s
gammaloop-nextest-clinnet> Location:
89.19 s
gammaloop-nextest-clinnet> crates/clinnet/src/lib.rs:770:13
89.19 s
gammaloop-nextest-clinnet> stack backtrace:
89.19 s
gammaloop-nextest-clinnet> 0: __rustc::rust_begin_unwind
89.19 s
gammaloop-nextest-clinnet> 1: core::panicking::panic_fmt
89.19 s
gammaloop-nextest-clinnet> 2: core::result::unwrap_failed
89.19 s
gammaloop-nextest-clinnet> 3: clinnet::tests::default_template_renders_generic_config_and_static_subgraphs_with_typst
89.19 s
gammaloop-nextest-clinnet> 4: <clinnet::tests::default_template_renders_generic_config_and_static_subgraphs_with_typst::{closure#0} as core::ops::function::FnOnce<()>>::call_once
89.19 s
gammaloop-nextest-clinnet> note: Some details are omitted, run with `RUST_BACKTRACE=full` for a verbose backtrace.
89.19 s
gammaloop-nextest-clinnet> system-out
89.19 s
gammaloop-nextest-clinnet> running 1 test
89.19 s
gammaloop-nextest-clinnet> test tests::default_template_renders_generic_config_and_static_subgraphs_with_typst ... FAILED
89.19 s
gammaloop-nextest-clinnet>
89.19 s
gammaloop-nextest-clinnet> failures:
89.19 s
gammaloop-nextest-clinnet>
89.19 s
gammaloop-nextest-clinnet> failures:
89.19 s
gammaloop-nextest-clinnet> tests::default_template_renders_generic_config_and_static_subgraphs_with_typst
89.19 s
gammaloop-nextest-clinnet>
89.19 s
gammaloop-nextest-clinnet> test result: FAILED. 0 passed; 1 failed; 0 ignored; 0 measured; 13 filtered out; finished in 1.97s
89.19 s
gammaloop-nextest-clinnet> system-err
89.19 s
gammaloop-nextest-clinnet> thread 'tests::default_template_renders_generic_config_and_static_subgraphs_with_typst' (181) panicked at crates/clinnet/src/lib.rs:1307:14:
89.19 s
gammaloop-nextest-clinnet> called `Result::unwrap()` on an `Err` value: typst failed while compiling template /build/clinnet-real-typst-166-0/gamma-style-assertions.pdf
89.19 s
gammaloop-nextest-clinnet>
89.19 s
gammaloop-nextest-clinnet> Command executed:
89.19 s
gammaloop-nextest-clinnet> "typst" "c" "/build/source/crates/clinnet/tests/resources/gamma-style-behavior.typ" "/build/clinnet-real-typst-166-0/gamma-style-assertions.pdf" "--root" "/build/source"
89.19 s
gammaloop-nextest-clinnet>
89.19 s
gammaloop-nextest-clinnet> File not found - check that all paths are correct and files exist
89.19 s
gammaloop-nextest-clinnet>
89.19 s
gammaloop-nextest-clinnet> Typst stdout:
89.19 s
gammaloop-nextest-clinnet>
89.19 s
gammaloop-nextest-clinnet>
89.19 s
gammaloop-nextest-clinnet> Typst stderr:
89.19 s
gammaloop-nextest-clinnet> error: file not found (searched at /build/source/docs/assets/typst/theme.typ)
89.19 s
gammaloop-nextest-clinnet> ┌─ ../../docs/assets/typst/portal-graphs/edge-style.typ:5:8
89.19 s
gammaloop-nextest-clinnet> │
89.19 s
gammaloop-nextest-clinnet> 5 │ #import "../theme.typ": palette
89.19 s
gammaloop-nextest-clinnet> │ ^^^^^^^^^^^^^^
89.19 s
gammaloop-nextest-clinnet>
89.19 s
gammaloop-nextest-clinnet> while importing `../../../../docs/assets/typst/portal-graphs/edge-style.typ` at tests/resources/gamma-style-behavior.typ:7:1
89.19 s
gammaloop-nextest-clinnet> import "../../../../docs/assets/typst/portal-graphs/edge-style.typ" as model-style
89.19 s
gammaloop-nextest-clinnet>
89.19 s
gammaloop-nextest-clinnet> Location:
89.19 s
gammaloop-nextest-clinnet> crates/clinnet/src/lib.rs:770:13
89.19 s
gammaloop-nextest-clinnet> stack backtrace:
89.19 s
gammaloop-nextest-clinnet> 0: __rustc::rust_begin_unwind
89.19 s
gammaloop-nextest-clinnet> 1: core::panicking::panic_fmt
89.19 s
gammaloop-nextest-clinnet> 2: core::result::unwrap_failed
89.19 s
gammaloop-nextest-clinnet> 3: clinnet::tests::default_template_renders_generic_config_and_static_subgraphs_with_typst
89.19 s
gammaloop-nextest-clinnet> 4: <clinnet::tests::default_template_renders_generic_config_and_static_subgraphs_with_typst::{closure#0} as core::ops::function::FnOnce<()>>::call_once
89.19 s
gammaloop-nextest-clinnet> note: Some details are omitted, run with `RUST_BACKTRACE=full` for a verbose backtrace.
89.19 s
gammaloop-nextest-clinnet> =========================================
89.29 s
error: Cannot build '/nix/store/h7wfxf9is8d9pfbnnbafzbqf2ky01xla-gammaloop-nextest-clinnet.drv '.
89.29 s
Reason: builder failed with exit code 100 .
89.29 s
Output paths:
89.29 s
/nix/store/457wcp0rzgz0k62034js40b1iqyxmyf5-gammaloop-nextest-clinnet
89.29 s
Last 179 log lines:
89.29 s
> Extracting 4 binaries (including 1 non-test binary) and 1 linked path to /build/source
89.29 s
> Extracted 15 files to /build/source in 0.11s
89.29 s
> ------------
89.29 s
> Nextest run ID d586f30a-ba83-49e6-888e-2347b75d0473 with nextest profile: ci_gammaloop
89.29 s
> Starting 36 tests across 3 binaries
89.29 s
> FAIL [ 1.974s] (22/36) clinnet tests :: default_template_renders_generic_config_and_static_subgraphs_with_typst
89.29 s
> stdout ---
89.29 s
>
89.29 s
> running 1 test
89.29 s
> test tests::default_template_renders_generic_config_and_static_subgraphs_with_typst ... FAILED
89.29 s
>
89.29 s
> failures:
89.29 s
>
89.29 s
> failures:
89.29 s
> tests::default_template_renders_generic_config_and_static_subgraphs_with_typst
89.29 s
>
89.29 s
> test result: FAILED. 0 passed; 1 failed; 0 ignored; 0 measured; 13 filtered out; finished in 1.97s
89.29 s
>
89.29 s
> stderr ---
89.29 s
>
89.29 s
> thread 'tests::default_template_renders_generic_config_and_static_subgraphs_with_typst' (181) panicked at crates/clinnet/src/lib.rs:1307:14:
89.29 s
> called `Result::unwrap()` on an `Err` value: typst failed while compiling template /build/clinnet-real-typst-166-0/gamma-style-assertions.pdf
89.29 s
>
89.29 s
> Command executed:
89.29 s
> "typst" "c" "/build/source/crates/clinnet/tests/resources/gamma-style-behavior.typ" "/build/clinnet-real-typst-166-0/gamma-style-assertions.pdf" "--root" "/build/source"
89.29 s
>
89.29 s
> File not found - check that all paths are correct and files exist
89.29 s
>
89.29 s
> Typst stdout:
89.29 s
>
89.29 s
>
89.29 s
> Typst stderr:
89.29 s
> error: file not found (searched at /build/source/docs/assets/typst/theme.typ)
89.29 s
> ┌─ ../../docs/assets/typst/portal-graphs/edge-style.typ:5:8
89.29 s
> │
89.29 s
> 5 │ #import "../theme.typ": palette
89.29 s
> │ ^^^^^^^^^^^^^^
89.29 s
>
89.29 s
> while importing `../../../../docs/assets/typst/portal-graphs/edge-style.typ` at tests/resources/gamma-style-behavior.typ:7:1
89.29 s
> import "../../../../docs/assets/typst/portal-graphs/edge-style.typ" as model-style
89.29 s
>
89.29 s
> Location:
89.29 s
> crates/clinnet/src/lib.rs:770:13
89.29 s
> stack backtrace:
89.29 s
> 0: __rustc::rust_begin_unwind
89.29 s
> 1: core::panicking::panic_fmt
89.29 s
> 2: core::result::unwrap_failed
89.29 s
> 3: clinnet::tests::default_template_renders_generic_config_and_static_subgraphs_with_typst
89.29 s
> 4: <clinnet::tests::default_template_renders_generic_config_and_static_subgraphs_with_typst::{closure#0} as core::ops::function::FnOnce<()>>::call_once
89.29 s
> note: Some details are omitted, run with `RUST_BACKTRACE=full` for a verbose backtrace.
89.29 s
>
89.29 s
> ------------
89.29 s
> Summary [ 45.356s] 36 tests run: 35 passed , 1 failed , 0 skipped
89.29 s
> FAIL [ 1.974s] (22/36) clinnet tests :: default_template_renders_generic_config_and_static_subgraphs_with_typst
89.29 s
> stdout ---
89.29 s
>
89.29 s
> running 1 test
89.29 s
> test tests::default_template_renders_generic_config_and_static_subgraphs_with_typst ... FAILED
89.29 s
>
89.29 s
> failures:
89.29 s
>
89.29 s
> failures:
89.29 s
> tests::default_template_renders_generic_config_and_static_subgraphs_with_typst
89.29 s
>
89.29 s
> test result: FAILED. 0 passed; 1 failed; 0 ignored; 0 measured; 13 filtered out; finished in 1.97s
89.29 s
>
89.29 s
> stderr ---
89.29 s
>
89.29 s
> thread 'tests::default_template_renders_generic_config_and_static_subgraphs_with_typst' (181) panicked at crates/clinnet/src/lib.rs:1307:14:
89.29 s
> called `Result::unwrap()` on an `Err` value: typst failed while compiling template /build/clinnet-real-typst-166-0/gamma-style-assertions.pdf
89.29 s
>
89.29 s
> Command executed:
89.29 s
> "typst" "c" "/build/source/crates/clinnet/tests/resources/gamma-style-behavior.typ" "/build/clinnet-real-typst-166-0/gamma-style-assertions.pdf" "--root" "/build/source"
89.29 s
>
89.29 s
> File not found - check that all paths are correct and files exist
89.29 s
>
89.29 s
> Typst stdout:
89.29 s
>
89.29 s
>
89.29 s
> Typst stderr:
89.29 s
> error: file not found (searched at /build/source/docs/assets/typst/theme.typ)
89.29 s
> ┌─ ../../docs/assets/typst/portal-graphs/edge-style.typ:5:8
89.29 s
> │
89.29 s
> 5 │ #import "../theme.typ": palette
89.29 s
> │ ^^^^^^^^^^^^^^
89.29 s
>
89.29 s
> while importing `../../../../docs/assets/typst/portal-graphs/edge-style.typ` at tests/resources/gamma-style-behavior.typ:7:1
89.29 s
> import "../../../../docs/assets/typst/portal-graphs/edge-style.typ" as model-style
89.29 s
>
89.29 s
> Location:
89.29 s
> crates/clinnet/src/lib.rs:770:13
89.29 s
> stack backtrace:
89.29 s
> 0: __rustc::rust_begin_unwind
89.29 s
> 1: core::panicking::panic_fmt
89.29 s
> 2: core::result::unwrap_failed
89.29 s
> 3: clinnet::tests::default_template_renders_generic_config_and_static_subgraphs_with_typst
89.29 s
> 4: <clinnet::tests::default_template_renders_generic_config_and_static_subgraphs_with_typst::{closure#0} as core::ops::function::FnOnce<()>>::call_once
89.29 s
> note: Some details are omitted, run with `RUST_BACKTRACE=full` for a verbose backtrace.
89.29 s
>
89.29 s
> error : test run failed
89.29 s
>
89.29 s
> ========== nextest test summary ==========
89.29 s
> report: target/nextest/ci_gammaloop/junit.xml
89.29 s
> tests: 36, failures: 1, errors: 0
89.29 s
>
89.29 s
> 1. clinnet::tests::default_template_renders_generic_config_and_static_subgraphs_with_typst
89.29 s
> failure: test failure with exit code 101
89.29 s
> thread 'tests::default_template_renders_generic_config_and_static_subgraphs_with_typst' (181) panicked at crates/clinnet/src/lib.rs:1307:14:
89.29 s
> called `Result::unwrap()` on an `Err` value: typst failed while compiling template /build/clinnet-real-typst-166-0/gamma-style-assertions.pdf
89.29 s
>
89.29 s
> Command executed:
89.29 s
> "typst" "c" "/build/source/crates/clinnet/tests/resources/gamma-style-behavior.typ" "/build/clinnet-real-typst-166-0/gamma-style-assertions.pdf" "--root" "/build/source"
89.29 s
>
89.29 s
> File not found - check that all paths are correct and files exist
89.29 s
>
89.29 s
> Typst stdout:
89.29 s
>
89.29 s
>
89.29 s
> Typst stderr:
89.29 s
> error: file not found (searched at /build/source/docs/assets/typst/theme.typ)
89.29 s
> ┌─ ../../docs/assets/typst/portal-graphs/edge-style.typ:5:8
89.29 s
> │
89.29 s
> 5 │ #import "../theme.typ": palette
89.29 s
> │ ^^^^^^^^^^^^^^
89.29 s
>
89.29 s
> while importing `../../../../docs/assets/typst/portal-graphs/edge-style.typ` at tests/resources/gamma-style-behavior.typ:7:1
89.29 s
> import "../../../../docs/assets/typst/portal-graphs/edge-style.typ" as model-style
89.29 s
>
89.29 s
> Location:
89.29 s
> crates/clinnet/src/lib.rs:770:13
89.29 s
> stack backtrace:
89.29 s
> 0: __rustc::rust_begin_unwind
89.29 s
> 1: core::panicking::panic_fmt
89.29 s
> 2: core::result::unwrap_failed
89.29 s
> 3: clinnet::tests::default_template_renders_generic_config_and_static_subgraphs_with_typst
89.29 s
> 4: <clinnet::tests::default_template_renders_generic_config_and_static_subgraphs_with_typst::{closure#0} as core::ops::function::FnOnce<()>>::call_once
89.29 s
> note: Some details are omitted, run with `RUST_BACKTRACE=full` for a verbose backtrace.
89.29 s
> system-out
89.29 s
> running 1 test
89.29 s
> test tests::default_template_renders_generic_config_and_static_subgraphs_with_typst ... FAILED
89.29 s
>
89.29 s
> failures:
89.29 s
>
89.29 s
> failures:
89.29 s
> tests::default_template_renders_generic_config_and_static_subgraphs_with_typst
89.29 s
>
89.29 s
> test result: FAILED. 0 passed; 1 failed; 0 ignored; 0 measured; 13 filtered out; finished in 1.97s
89.29 s
> system-err
89.29 s
> thread 'tests::default_template_renders_generic_config_and_static_subgraphs_with_typst' (181) panicked at crates/clinnet/src/lib.rs:1307:14:
89.29 s
> called `Result::unwrap()` on an `Err` value: typst failed while compiling template /build/clinnet-real-typst-166-0/gamma-style-assertions.pdf
89.29 s
>
89.29 s
> Command executed:
89.29 s
> "typst" "c" "/build/source/crates/clinnet/tests/resources/gamma-style-behavior.typ" "/build/clinnet-real-typst-166-0/gamma-style-assertions.pdf" "--root" "/build/source"
89.29 s
>
89.29 s
> File not found - check that all paths are correct and files exist
89.29 s
>
89.29 s
> Typst stdout:
89.29 s
>
89.29 s
>
89.29 s
> Typst stderr:
89.29 s
> error: file not found (searched at /build/source/docs/assets/typst/theme.typ)
89.29 s
> ┌─ ../../docs/assets/typst/portal-graphs/edge-style.typ:5:8
89.29 s
> │
89.29 s
> 5 │ #import "../theme.typ": palette
89.29 s
> │ ^^^^^^^^^^^^^^
89.29 s
>
89.29 s
> while importing `../../../../docs/assets/typst/portal-graphs/edge-style.typ` at tests/resources/gamma-style-behavior.typ:7:1
89.29 s
> import "../../../../docs/assets/typst/portal-graphs/edge-style.typ" as model-style
89.29 s
>
89.29 s
> Location:
89.29 s
> crates/clinnet/src/lib.rs:770:13
89.29 s
> stack backtrace:
89.29 s
> 0: __rustc::rust_begin_unwind
89.29 s
> 1: core::panicking::panic_fmt
89.29 s
> 2: core::result::unwrap_failed
89.29 s
> 3: clinnet::tests::default_template_renders_generic_config_and_static_subgraphs_with_typst
89.29 s
> 4: <clinnet::tests::default_template_renders_generic_config_and_static_subgraphs_with_typst::{closure#0} as core::ops::function::FnOnce<()>>::call_once
89.29 s
> note: Some details are omitted, run with `RUST_BACKTRACE=full` for a verbose backtrace.
89.29 s
> =========================================
89.29 s
For full logs, run:
89.29 s
nix log /nix/store/h7wfxf9is8d9pfbnnbafzbqf2ky01xla-gammaloop-nextest-clinnet.drv
89.57 s
[2 built (1 failed ), 56 Run failed.