1. 0.00 s $ /nix/store/61685rbaxmpigwi3z23i33sv3jyfl70q-coreutils-9.11/bin/timeout --kill-after=15s 7200s /nix/store/wknkybkzrc16r11vk5vrykh4wmw7a353-nix-2.34.8/bin/nix --extra-experimental-features nix-command --extra-experimental-features flakes flake clone git+https://github.com/alphal00p/gammaloop --dest /tmp/nix-ci-worker/stable-pwd/repo/
  2. 0.11 s Cloning into '/tmp/nix-ci-worker/stable-pwd/repo'...
  3. 1.84 s remote: Enumerating objects: 96551 remote: Enumerating objects: 110731, done.
  4. 2.06 s remote: Counting objects: 0% (1/14180) remote: Counting objects: 1% (142/14180) remote: Counting objects: 2% (284/14180) remote: Counting objects: 3% (426/14180) remote: Counting objects: 4% (568/14180) remote: Counting objects: 5% (709/14180) remote: Counting objects: 6% (851/14180) remote: Counting objects: 7% (993/14180) remote: Counting objects: 8% (1135/14180) remote: Counting objects: 9% (1277/14180) remote: Counting objects: 10% (1418/14180) remote: Counting objects: 11% (1560/14180) remote: Counting objects: 12% (1702/14180) remote: Counting objects: 13% (1844/14180) remote: Counting objects: 14% (1986/14180) remote: Counting objects: 15% (2127/14180) remote: Counting objects: 16% (2269/14180) remote: Counting objects: 17% (2411/14180) remote: Counting objects: 18% (2553/14180) remote: Counting objects: 19% (2695/14180) remote: Counting objects: 20% (2836/14180) remote: Counting objects: 21% (2978/14180) remote: Counting objects: 22% (3120/14180) remote: Counting objects: 23% (3262/14180) remote: Counting objects: 24% (3404/14180) remote: Counting objects: 25% (3545/14180) remote: Counting objects: 26% (3687/14180) remote: Counting objects: 27% (3829/14180) remote: Counting objects: 28% (3971/14180) remote: Counting objects: 29% (4113/14180) remote: Counting objects: 30% (4254/14180) remote: Counting objects: 31% (4396/14180) remote: Counting objects: 32% (4538/14180) remote: Counting objects: 33% (4680/14180) remote: Counting objects: 34% (4822/14180) remote: Counting objects: 35% (4963/14180) remote: Counting objects: 36% (5105/14180) remote: Counting objects: 37% (5247/14180) remote: Counting objects: 38% (5389/14180) remote: Counting objects: 39% (5531/14180) remote: Counting objects: 40% (5672/14180) remote: Counting objects: 41% (5814/14180) remote: Counting objects: 42% (5956/14180) remote: Counting objects: 43% (6098/14180) remote: Counting objects: 44% (6240/14180) remote: Counting objects: 45% (6381/14180) remote: Counting objects: 46% (6523/14180) remote: Counting objects: 47% (6665/14180) remote: Counting objects: 48% (6807/14180) remote: Counting objects: 49% (6949/14180) remote: Counting objects: 50% (7090/14180) remote: Counting objects: 51% (7232/14180) remote: Counting objects: 52% (7374/14180) remote: Counting objects: 53% (7516/14180) remote: Counting objects: 54% (7658/14180) remote: Counting objects: 55% (7799/14180) remote: Counting objects: 56% (7941/14180) remote: Counting objects: 57% (8083/14180) remote: Counting objects: 58% (8225/14180) remote: Counting objects: 59% (8367/14180) remote: Counting objects: 60% (8508/14180) remote: Counting objects: 61% (8650/14180) remote: Counting objects: 62% (8792/14180) remote: Counting objects: 63% (8934/14180) remote: Counting objects: 64% (9076/14180) remote: Counting objects: 65% (9217/14180) remote: Counting objects: 66% (9359/14180) remote: Counting objects: 67% (9501/14180) remote: Counting objects: 68% (9643/14180) remote: Counting objects: 69% (9785/14180) remote: Counting objects: 70% (9926/14180) remote: Counting objects: 71% (10068/14180) remote: Counting objects: 72% (10210/14180) remote: Counting objects: 73% (10352/14180) remote: Counting objects: 74% (10494/14180) remote: Counting objects: 75% (10635/14180) remote: Counting objects: 76% (10777/14180) remote: Counting objects: 77% (10919/14180) remote: Counting objects: 78% (11061/14180) remote: Counting objects: 79% (11203/14180) remote: Counting objects: 80% (11344/14180) remote: Counting objects: 81% (11486/14180) remote: Counting objects: 82% (11628/14180) remote: Counting objects: 83% (11770/14180) remote: Counting objects: 84% (11912/14180) remote: Counting objects: 85% (12053/14180) remote: Counting objects: 86% (12195/14180) remote: Counting objects: 87% (12337/14180) remote: Counting objects: 88% (12479/14180) remote: Counting objects: 89% (12621/14180) remote: Counting objects: 90% (12762/14180) remote: Counting objects: 91% (12904/14180) remote: Counting objects: 92% (13046/14180) remote: Counting objects: 93% (13188/14180) remote: Counting objects: 94% (13330/14180) remote: Counting objects: 95% (13471/14180) remote: Counting objects: 96% (13613/14180) remote: Counting objects: 97% (13755/14180) remote: Counting objects: 98% (13897/14180) remote: Counting objects: 99% (14039/14180) remote: Counting objects: 100% (14180/14180) remote: Counting objects: 100% (14180/14180), done.
  5. 6.87 s remote: Compressing objects: 0% (1/2882) remote: Compressing objects: 1% (29/2882) remote: Compressing objects: 2% (58/2882) remote: Compressing objects: 3% (87/2882) remote: Compressing objects: 4% (116/2882) remote: Compressing objects: 5% (145/2882) remote: Compressing objects: 6% (173/2882) remote: Compressing objects: 7% (202/2882) remote: Compressing objects: 8% (231/2882) remote: Compressing objects: 9% (260/2882) remote: Compressing objects: 10% (289/2882) remote: Compressing objects: 11% (318/2882) remote: Compressing objects: 11% (333/2882) remote: Compressing objects: 12% (346/2882) remote: Compressing objects: 12% (374/2882) remote: Compressing objects: 13% (375/2882) remote: Compressing objects: 14% (404/2882) remote: Compressing objects: 15% (433/2882) remote: Compressing objects: 16% (462/2882) remote: Compressing objects: 16% (489/2882) remote: Compressing objects: 17% (490/2882) remote: Compressing objects: 18% (519/2882) remote: Compressing objects: 19% (548/2882) remote: Compressing objects: 20% (577/2882) remote: Compressing objects: 21% (606/2882) remote: Compressing objects: 22% (635/2882) remote: Compressing objects: 22% (642/2882) remote: Compressing objects: 23% (663/2882) remote: Compressing objects: 24% (692/2882) remote: Compressing objects: 25% (721/2882) remote: Compressing objects: 26% (750/2882) remote: Compressing objects: 27% (779/2882) remote: Compressing objects: 28% (807/2882) remote: Compressing objects: 29% (836/2882) remote: Compressing objects: 30% (865/2882) remote: Compressing objects: 31% (894/2882) remote: Compressing objects: 32% (923/2882) remote: Compressing objects: 33% (952/2882) remote: Compressing objects: 34% (980/2882) remote: Compressing objects: 35% (1009/2882) remote: Compressing objects: 36% (1038/2882) remote: Compressing objects: 37% (1067/2882) remote: Compressing objects: 38% (1096/2882) remote: Compressing objects: 39% (1124/2882) remote: Compressing objects: 40% (1153/2882) remote: Compressing objects: 41% (1182/2882) remote: Compressing objects: 42% (1211/2882) remote: Compressing objects: 43% (1240/2882) remote: Compressing objects: 44% (1269/2882) remote: Compressing objects: 45% (1297/2882) remote: Compressing objects: 46% (1326/2882) remote: Compressing objects: 47% (1355/2882) remote: Compressing objects: 48% (1384/2882) remote: Compressing objects: 49% (1413/2882) remote: Compressing objects: 50% (1441/2882) remote: Compressing objects: 51% (1470/2882) remote: Compressing objects: 52% (1499/2882) remote: Compressing objects: 53% (1528/2882) remote: Compressing objects: 54% (1557/2882) remote: Compressing objects: 55% (1586/2882) remote: Compressing objects: 56% (1614/2882) remote: Compressing objects: 57% (1643/2882) remote: Compressing objects: 58% (1672/2882) remote: Compressing objects: 59% (1701/2882) remote: Compressing objects: 60% (1730/2882) remote: Compressing objects: 61% (1759/2882) remote: Compressing objects: 62% (1787/2882) remote: Compressing objects: 63% (1816/2882) remote: Compressing objects: 64% (1845/2882) remote: Compressing objects: 65% (1874/2882) remote: Compressing objects: 66% (1903/2882) remote: Compressing objects: 67% (1931/2882) remote: Compressing objects: 68% (1960/2882) remote: Compressing objects: 69% (1989/2882) remote: Compressing objects: 70% (2018/2882) remote: Compressing objects: 71% (2047/2882) remote: Compressing objects: 72% (2076/2882) remote: Compressing objects: 73% (2104/2882) remote: Compressing objects: 74% (2133/2882) remote: Compressing objects: 75% (2162/2882) remote: Compressing objects: 76% (2191/2882) remote: Compressing objects: 77% (2220/2882) remote: Compressing objects: 78% (2248/2882) remote: Compressing objects: 79% (2277/2882) remote: Compressing objects: 80% (2306/2882) remote: Compressing objects: 81% (2335/2882) remote: Compressing objects: 82% (2364/2882) remote: Compressing objects: 83% (2393/2882) remote: Compressing objects: 84% (2421/2882) remote: Compressing objects: 85% (2450/2882) remote: Compressing objects: 86% (2479/2882) remote: Compressing objects: 87% (2508/2882) remote: Compressing objects: 88% (2537/2882) remote: Compressing objects: 89% (2565/2882) remote: Compressing objects: 90% (2594/2882) remote: Compressing objects: 91% (2623/2882) remote: Compressing objects: 91% (2630/2882) remote: Compressing objects: 92% (2652/2882) remote: Compressing objects: 93% (2681/2882) remote: Compressing objects: 94% (2710/2882) remote: Compressing objects: 95% (2738/2882) remote: Compressing objects: 96% (2767/2882) remote: Compressing objects: 97% (2796/2882) remote: Compressing objects: 98% (2825/2882) remote: Compressing objects: 99% (2854/2882) remote: Compressing objects: 100% (2882/2882) remote: Compressing objects: 100% (2882/2882), done.
  6. 17.15 s Receiving objects: 0% (1/110731) Receiving objects: 1% (1108/110731) Receiving objects: 2% (2215/110731) Receiving objects: 3% (3322/110731) Receiving objects: 4% (4430/110731), 17.64 MiB | 35.26 MiB/s Receiving objects: 5% (5537/110731), 17.64 MiB | 35.26 MiB/s Receiving objects: 6% (6644/110731), 17.64 MiB | 35.26 MiB/s Receiving objects: 7% (7752/110731), 17.64 MiB | 35.26 MiB/s Receiving objects: 8% (8859/110731), 17.64 MiB | 35.26 MiB/s Receiving objects: 9% (9966/110731), 17.64 MiB | 35.26 MiB/s Receiving objects: 9% (10041/110731), 29.67 MiB | 29.66 MiB/s Receiving objects: 10% (11074/110731), 29.67 MiB | 29.66 MiB/s Receiving objects: 11% (12181/110731), 29.67 MiB | 29.66 MiB/s Receiving objects: 12% (13288/110731), 29.67 MiB | 29.66 MiB/s Receiving objects: 13% (14396/110731), 29.67 MiB | 29.66 MiB/s Receiving objects: 14% (15503/110731), 29.67 MiB | 29.66 MiB/s Receiving objects: 15% (16610/110731), 29.67 MiB | 29.66 MiB/s Receiving objects: 16% (17717/110731), 29.67 MiB | 29.66 MiB/s Receiving objects: 17% (18825/110731), 29.67 MiB | 29.66 MiB/s Receiving objects: 18% (19932/110731), 29.67 MiB | 29.66 MiB/s Receiving objects: 19% (21039/110731), 29.67 MiB | 29.66 MiB/s Receiving objects: 20% (22147/110731), 29.67 MiB | 29.66 MiB/s Receiving objects: 21% (23254/110731), 29.67 MiB | 29.66 MiB/s Receiving objects: 22% (24361/110731), 29.67 MiB | 29.66 MiB/s Receiving objects: 23% (25469/110731), 29.67 MiB | 29.66 MiB/s Receiving objects: 24% (26576/110731), 29.67 MiB | 29.66 MiB/s Receiving objects: 25% (27683/110731), 29.67 MiB | 29.66 MiB/s Receiving objects: 26% (28791/110731), 29.67 MiB | 29.66 MiB/s Receiving objects: 27% (29898/110731), 29.67 MiB | 29.66 MiB/s Receiving objects: 28% (31005/110731), 29.67 MiB | 29.66 MiB/s Receiving objects: 29% (32112/110731), 29.67 MiB | 29.66 MiB/s Receiving objects: 30% (33220/110731), 29.67 MiB | 29.66 MiB/s Receiving objects: 31% (34327/110731), 29.67 MiB | 29.66 MiB/s Receiving objects: 32% (35434/110731), 29.67 MiB | 29.66 MiB/s Receiving objects: 33% (36542/110731), 29.67 MiB | 29.66 MiB/s Receiving objects: 34% (37649/110731), 50.59 MiB | 33.72 MiB/s Receiving objects: 35% (38756/110731), 50.59 MiB | 33.72 MiB/s Receiving objects: 36% (39864/110731), 50.59 MiB | 33.72 MiB/s Receiving objects: 37% (40971/110731), 50.59 MiB | 33.72 MiB/s Receiving objects: 38% (42078/110731), 50.59 MiB | 33.72 MiB/s Receiving objects: 39% (43186/110731), 50.59 MiB | 33.72 MiB/s Receiving objects: 40% (44293/110731), 50.59 MiB | 33.72 MiB/s Receiving objects: 40% (45358/110731), 68.46 MiB | 33.57 MiB/s Receiving objects: 41% (45400/110731), 68.46 MiB | 33.57 MiB/s Receiving objects: 42% (46508/110731), 68.46 MiB | 33.57 MiB/s Receiving objects: 43% (47615/110731), 68.46 MiB | 33.57 MiB/s Receiving objects: 44% (48722/110731), 68.46 MiB | 33.57 MiB/s Receiving objects: 45% (49829/110731), 68.46 MiB | 33.57 MiB/s Receiving objects: 46% (50937/110731), 68.46 MiB | 33.57 MiB/s Receiving objects: 47% (52044/110731), 68.46 MiB | 33.57 MiB/s Receiving objects: 48% (53151/110731), 68.46 MiB | 33.57 MiB/s Receiving objects: 49% (54259/110731), 86.31 MiB | 33.99 MiB/s Receiving objects: 50% (55366/110731), 86.31 MiB | 33.99 MiB/s Receiving objects: 51% (56473/110731), 86.31 MiB | 33.99 MiB/s Receiving objects: 52% (57581/110731), 86.31 MiB | 33.99 MiB/s Receiving objects: 53% (58688/110731), 86.31 MiB | 33.99 MiB/s Receiving objects: 54% (59795/110731), 86.31 MiB | 33.99 MiB/s Receiving objects: 55% (60903/110731), 86.31 MiB | 33.99 MiB/s Receiving objects: 55% (61079/110731), 103.02 MiB | 33.67 MiB/s Receiving objects: 56% (62010/110731), 103.02 MiB | 33.67 MiB/s Receiving objects: 57% (63117/110731), 103.02 MiB | 33.67 MiB/s Receiving objects: 58% (64224/110731), 103.02 MiB | 33.67 MiB/s Receiving objects: 59% (65332/110731), 121.69 MiB | 34.18 MiB/s Receiving objects: 60% (66439/110731), 121.69 MiB | 34.18 MiB/s Receiving objects: 60% (66709/110731), 137.48 MiB | 33.68 MiB/s Receiving objects: 61% (67546/110731), 137.48 MiB | 33.68 MiB/s Receiving objects: 61% (68436/110731), 155.16 MiB | 33.86 MiB/s Receiving objects: 62% (68654/110731), 155.16 MiB | 33.86 MiB/s Receiving objects: 63% (69761/110731), 155.16 MiB | 33.86 MiB/s Receiving objects: 64% (70868/110731), 155.16 MiB | 33.86 MiB/s Receiving objects: 65% (71976/110731), 167.61 MiB | 32.58 MiB/s Receiving objects: 66% (73083/110731), 167.61 MiB | 32.58 MiB/s Receiving objects: 67% (74190/110731), 167.61 MiB | 32.58 MiB/s Receiving objects: 68% (75298/110731), 167.61 MiB | 32.58 MiB/s Receiving objects: 69% (76405/110731), 167.61 MiB | 32.58 MiB/s Receiving objects: 70% (77512/110731), 167.61 MiB | 32.58 MiB/s Receiving objects: 71% (78620/110731), 184.34 MiB | 33.61 MiB/s Receiving objects: 72% (79727/110731), 184.34 MiB | 33.61 MiB/s Receiving objects: 73% (80834/110731), 184.34 MiB | 33.61 MiB/s Receiving objects: 74% (81941/110731), 184.34 MiB | 33.61 MiB/s Receiving objects: 75% (83049/110731), 184.34 MiB | 33.61 MiB/s Receiving objects: 76% (84156/110731), 184.34 MiB | 33.61 MiB/s Receiving objects: 77% (85263/110731), 184.34 MiB | 33.61 MiB/s Receiving objects: 78% (86371/110731), 184.34 MiB | 33.61 MiB/s Receiving objects: 78% (86483/110731), 184.34 MiB | 33.61 MiB/s Receiving objects: 79% (87478/110731), 201.77 MiB | 32.69 MiB/s Receiving objects: 80% (88585/110731), 201.77 MiB | 32.69 MiB/s Receiving objects: 81% (89693/110731), 201.77 MiB | 32.69 MiB/s Receiving objects: 81% (90109/110731), 219.30 MiB | 32.90 MiB/s Receiving objects: 82% (90800/110731), 252.71 MiB | 32.67 MiB/s Receiving objects: 82% (91118/110731), 252.71 MiB | 32.67 MiB/s Receiving objects: 83% (91907/110731), 263.00 MiB | 30.70 MiB/s Receiving objects: 84% (93015/110731), 263.00 MiB | 30.70 MiB/s Receiving objects: 85% (94122/110731), 263.00 MiB | 30.70 MiB/s Receiving objects: 86% (95229/110731), 263.00 MiB | 30.70 MiB/s Receiving objects: 86% (95528/110731), 280.07 MiB | 31.11 MiB/s Receiving objects: 87% (96336/110731), 297.20 MiB | 30.87 MiB/s Receiving objects: 88% (97444/110731), 297.20 MiB | 30.87 MiB/s Receiving objects: 89% (98551/110731), 297.20 MiB | 30.87 MiB/s Receiving objects: 90% (99658/110731), 297.20 MiB | 30.87 MiB/s Receiving objects: 91% (100766/110731), 297.20 MiB | 30.87 MiB/s Receiving objects: 92% (101873/110731), 297.20 MiB | 30.87 MiB/s Receiving objects: 93% (102980/110731), 297.20 MiB | 30.87 MiB/s Receiving objects: 94% (104088/110731), 297.20 MiB | 30.87 MiB/s Receiving objects: 95% (105195/110731), 297.20 MiB | 30.87 MiB/s Receiving objects: 96% (106302/110731), 297.20 MiB | 30.87 MiB/s Receiving objects: 97% (107410/110731), 297.20 MiB | 30.87 MiB/s Receiving objects: 98% (108517/110731), 297.20 MiB | 30.87 MiB/s Receiving objects: 98% (109392/110731), 312.37 MiB | 31.14 MiB/s Receiving objects: 99% (109624/110731), 312.37 MiB | 31.14 MiB/s remote: Total 110731 (delta 11886), reused 11585 (delta 10898), pack-reused 96551 (from 2)
  7. 17.15 s Receiving objects: 100% (110731/110731), 324.05 MiB | 30.05 MiB/s Receiving objects: 100% (110731/110731), 325.00 MiB | 31.59 MiB/s, done.
  8. 19.14 s Resolving deltas: 0% (0/72602) Resolving deltas: 1% (727/72602) Resolving deltas: 2% (1455/72602) Resolving deltas: 3% (2180/72602) Resolving deltas: 4% (2905/72602) Resolving deltas: 5% (3631/72602) Resolving deltas: 6% (4357/72602) Resolving deltas: 7% (5083/72602) Resolving deltas: 8% (5809/72602) Resolving deltas: 9% (6535/72602) Resolving deltas: 10% (7261/72602) Resolving deltas: 11% (7988/72602) Resolving deltas: 12% (8713/72602) Resolving deltas: 13% (9439/72602) Resolving deltas: 14% (10167/72602) Resolving deltas: 15% (10891/72602) Resolving deltas: 16% (11617/72602) Resolving deltas: 17% (12343/72602) Resolving deltas: 18% (13069/72602) Resolving deltas: 19% (13796/72602) Resolving deltas: 20% (14521/72602) Resolving deltas: 21% (15248/72602) Resolving deltas: 22% (15973/72602) Resolving deltas: 23% (16699/72602) Resolving deltas: 24% (17425/72602) Resolving deltas: 25% (18151/72602) Resolving deltas: 26% (18877/72602) Resolving deltas: 27% (19603/72602) Resolving deltas: 28% (20329/72602) Resolving deltas: 29% (21056/72602) Resolving deltas: 30% (21781/72602) Resolving deltas: 31% (22509/72602) Resolving deltas: 32% (23237/72602) Resolving deltas: 33% (23959/72602) Resolving deltas: 34% (24685/72602) Resolving deltas: 35% (25412/72602) Resolving deltas: 36% (26137/72602) Resolving deltas: 37% (26863/72602) Resolving deltas: 38% (27589/72602) Resolving deltas: 39% (28315/72602) Resolving deltas: 40% (29041/72602) Resolving deltas: 41% (29767/72602) Resolving deltas: 42% (30494/72602) Resolving deltas: 43% (31219/72602) Resolving deltas: 44% (31945/72602) Resolving deltas: 45% (32671/72602) Resolving deltas: 46% (33397/72602) Resolving deltas: 47% (34123/72602) Resolving deltas: 48% (34849/72602) Resolving deltas: 48% (35272/72602) Resolving deltas: 49% (35575/72602) Resolving deltas: 50% (36301/72602) Resolving deltas: 51% (37029/72602) Resolving deltas: 52% (37754/72602) Resolving deltas: 53% (38480/72602) Resolving deltas: 54% (39207/72602) Resolving deltas: 55% (39932/72602) Resolving deltas: 56% (40658/72602) Resolving deltas: 57% (41384/72602) Resolving deltas: 58% (42110/72602) Resolving deltas: 59% (42836/72602) Resolving deltas: 60% (43562/72602) Resolving deltas: 61% (44289/72602) Resolving deltas: 62% (45014/72602) Resolving deltas: 63% (45740/72602) Resolving deltas: 64% (46466/72602) Resolving deltas: 65% (47193/72602) Resolving deltas: 66% (47918/72602) Resolving deltas: 67% (48647/72602) Resolving deltas: 68% (49370/72602) Resolving deltas: 69% (50096/72602) Resolving deltas: 70% (50822/72602) Resolving deltas: 71% (51548/72602) Resolving deltas: 72% (52275/72602) Resolving deltas: 73% (53001/72602) Resolving deltas: 74% (53730/72602) Resolving deltas: 75% (54452/72602) Resolving deltas: 76% (55178/72602) Resolving deltas: 77% (55904/72602) Resolving deltas: 78% (56630/72602) Resolving deltas: 79% (57356/72602) Resolving deltas: 80% (58083/72602) Resolving deltas: 81% (58808/72602) Resolving deltas: 82% (59534/72602) Resolving deltas: 83% (60260/72602) Resolving deltas: 84% (60986/72602) Resolving deltas: 85% (61712/72602) Resolving deltas: 86% (62438/72602) Resolving deltas: 87% (63164/72602) Resolving deltas: 88% (63890/72602) Resolving deltas: 89% (64616/72602) Resolving deltas: 90% (65342/72602) Resolving deltas: 91% (66068/72602) Resolving deltas: 92% (66794/72602) Resolving deltas: 93% (67520/72602) Resolving deltas: 94% (68247/72602) Resolving deltas: 95% (68972/72602) Resolving deltas: 96% (69698/72602) Resolving deltas: 97% (70424/72602) Resolving deltas: 98% (71150/72602) Resolving deltas: 99% (71876/72602) Resolving deltas: 100% (72602/72602) Resolving deltas: 100% (72602/72602), done.
  9. 19.91 s Fetching commit 9d52e6b6b4ff2c85f26457074d140e152414899b for push-zwxzqnpnzwwu ...
  10. 19.91 s $ /nix/store/5vpcfsdx1lcnlb2y4k7xyc74shp5qwbh-git-2.54.0/bin/git fetch origin 9d52e6b6b4ff2c85f26457074d140e152414899b
  11. 20.39 s From https://github.com/alphal00p/gammaloop
  12. 20.39 s * branch 9d52e6b6b4ff2c85f26457074d140e152414899b -> FETCH_HEAD
  13. 20.41 s $ /nix/store/61685rbaxmpigwi3z23i33sv3jyfl70q-coreutils-9.11/bin/timeout --kill-after=15s 7200s /nix/store/5vpcfsdx1lcnlb2y4k7xyc74shp5qwbh-git-2.54.0/bin/git -c advice.detachedHead=false checkout 9d52e6b6b4ff2c85f26457074d140e152414899b
  14. 20.76 s HEAD is now at 9d52e6b6b add standalone xbox sum, soft-triangle, and thrown-out diagrams
  15. 20.76 s $ /nix/store/61685rbaxmpigwi3z23i33sv3jyfl70q-coreutils-9.11/bin/timeout --kill-after=15s 7200s /nix/store/wknkybkzrc16r11vk5vrykh4wmw7a353-nix-2.34.8/bin/nix --extra-experimental-features nix-command --extra-experimental-features flakes --log-format internal-json run .#packages.x86_64-linux.nix-ci-check-gammaloop-nextest-docs --print-build-logs
  16. 20.93 s warning: ignoring untrusted flake configuration setting 'extra-substituters'.
  17. 20.93 s Pass '--accept-flake-config' to trust it
  18. 20.93 s warning: ignoring untrusted flake configuration setting 'extra-trusted-public-keys'.
  19. 20.93 s Pass '--accept-flake-config' to trust it
  20. 20.93 s
  21. 21.21 s evaluating derivation 'gdo you want to allow configuration setting 'extra-substituters' to be set to 'https://cache.nix-ci.com' (y/N)? do you want to permanently mark this value as untrusted (y/N)? warning: ignoring untrusted flake configuration setting 'extra-substituters'.
  22. 21.21 s Pass '--accept-flake-config' to trust it
  23. 21.21 s do you want to allow configuration setting 'extra-trusted-public-keys' to be set to 'nix-ci:g3xV5BDTLtIBZr/A00IU1x0EtKKlb7YLgBN2SgYgM6A=' (y/N)? do you want to permanently mark this value as untrusted (y/N)? warning: ignoring untrusted flake configuration setting 'extra-trusted-public-keys'.
  24. 21.21 s Pass '--accept-flake-config' to trust it
  25. 28.99 s copying '/nix/store/3raz evaluating derivation 'g copying '/nix/store/3raz evaluating derivation 'g copying '/nix/store/3raz evaluating derivation 'g copying '/nix/store/3raz evaluating derivation 'g copying '/nix/store/3raz evaluating derivation 'g copying '/nix/store/3raz evaluating derivation 'g copying '/nix/store/3raz evaluating derivation 'g [0/1 built] [1/0/1 built] building ggammaloop-nextest-docs> Extracting 2 binaries to /build/source
  26. 29.04 s gammaloop-nextest-docs> Extracted 5 files to /build/source in 0.06s
  27. 29.05 s gammaloop-nextest-docs> ------------
  28. 29.05 s gammaloop-nextest-docs> Nextest run ID 10946950-5bc2-44e0-9ba7-b6800ac99ccb with nextest profile: ci_gammaloop
  29. 29.05 s gammaloop-nextest-docs> Starting 129 tests across 2 binaries
  30. 29.19 s gammaloop-nextest-docs> FAIL [ 0.134s] ( 59/129) alphal00p-docs-builder tests::checked_in_registry_is_valid
  31. 29.19 s gammaloop-nextest-docs> stdout ---
  32. 29.19 s gammaloop-nextest-docs>
  33. 29.19 s gammaloop-nextest-docs> running 1 test
  34. 29.19 s gammaloop-nextest-docs> test tests::checked_in_registry_is_valid ... FAILED
  35. 29.19 s gammaloop-nextest-docs>
  36. 29.19 s gammaloop-nextest-docs> failures:
  37. 29.19 s gammaloop-nextest-docs>
  38. 29.19 s gammaloop-nextest-docs> failures:
  39. 29.19 s gammaloop-nextest-docs> tests::checked_in_registry_is_valid
  40. 29.19 s gammaloop-nextest-docs>
  41. 29.19 s gammaloop-nextest-docs> test result: FAILED. 0 passed; 1 failed; 0 ignored; 0 measured; 128 filtered out; finished in 0.12s
  42. 29.19 s gammaloop-nextest-docs>
  43. 29.19 s gammaloop-nextest-docs> stderr ---
  44. 29.19 s gammaloop-nextest-docs>
  45. 29.19 s gammaloop-nextest-docs> thread 'tests::checked_in_registry_is_valid' (216) panicked at crates/alphal00p-docs-builder/src/lib.rs:12178:50:
  46. 29.19 s gammaloop-nextest-docs> called `Result::unwrap()` on an `Err` value: developer note nix-crane-cache-reuse verified scope nix/rust-workspace.nix changed (expected 66f700580ce13b9eaee90fe0111639e46968c531, found 0a568cb5712045aee37d96bfb2f91d3d32b7e9b9); owner review or an explicit no-impact attestation is required
  47. 29.19 s gammaloop-nextest-docs>
  48. 29.19 s gammaloop-nextest-docs> Location:
  49. 29.19 s gammaloop-nextest-docs> crates/alphal00p-docs-builder/src/lib.rs:992:29
  50. 29.19 s gammaloop-nextest-docs> stack backtrace:
  51. 29.19 s gammaloop-nextest-docs> 0: __rustc::rust_begin_unwind
  52. 29.19 s gammaloop-nextest-docs> 1: core::panicking::panic_fmt
  53. 29.19 s gammaloop-nextest-docs> 2: core::result::unwrap_failed
  54. 29.19 s gammaloop-nextest-docs> 3: alphal00p_docs_builder::tests::checked_in_registry_is_valid
  55. 29.19 s gammaloop-nextest-docs> 4: <alphal00p_docs_builder::tests::checked_in_registry_is_valid::{closure#0} as core::ops::function::FnOnce<()>>::call_once
  56. 29.19 s gammaloop-nextest-docs> note: Some details are omitted, run with `RUST_BACKTRACE=full` for a verbose backtrace.
  57. 29.19 s gammaloop-nextest-docs>
  58. 29.20 s gammaloop-nextest-docs> FAIL [ 0.128s] ( 63/129) alphal00p-docs-builder tests::developer_scope_ranges_ignore_unrelated_edits_and_warn_only_while_watching
  59. 29.20 s gammaloop-nextest-docs> stdout ---
  60. 29.20 s gammaloop-nextest-docs>
  61. 29.20 s gammaloop-nextest-docs> running 1 test
  62. 29.20 s gammaloop-nextest-docs> test tests::developer_scope_ranges_ignore_unrelated_edits_and_warn_only_while_watching ... FAILED
  63. 29.20 s gammaloop-nextest-docs>
  64. 29.20 s gammaloop-nextest-docs> failures:
  65. 29.20 s gammaloop-nextest-docs>
  66. 29.20 s gammaloop-nextest-docs> failures:
  67. 29.20 s gammaloop-nextest-docs> tests::developer_scope_ranges_ignore_unrelated_edits_and_warn_only_while_watching
  68. 29.20 s gammaloop-nextest-docs>
  69. 29.20 s gammaloop-nextest-docs> test result: FAILED. 0 passed; 1 failed; 0 ignored; 0 measured; 128 filtered out; finished in 0.12s
  70. 29.20 s gammaloop-nextest-docs>
  71. 29.20 s gammaloop-nextest-docs> stderr ---
  72. 29.20 s gammaloop-nextest-docs>
  73. 29.20 s gammaloop-nextest-docs> thread 'tests::developer_scope_ranges_ignore_unrelated_edits_and_warn_only_while_watching' (278) panicked at crates/alphal00p-docs-builder/src/lib.rs:12263:29:
  74. 29.20 s gammaloop-nextest-docs> called `Result::unwrap()` on an `Err` value: developer note nix-crane-cache-reuse verified scope nix/rust-workspace.nix changed (expected 66f700580ce13b9eaee90fe0111639e46968c531, found 0a568cb5712045aee37d96bfb2f91d3d32b7e9b9); owner review or an explicit no-impact attestation is required
  75. 29.20 s gammaloop-nextest-docs>
  76. 29.20 s gammaloop-nextest-docs> Location:
  77. 29.20 s gammaloop-nextest-docs> crates/alphal00p-docs-builder/src/lib.rs:992:29
  78. 29.20 s gammaloop-nextest-docs> stack backtrace:
  79. 29.20 s gammaloop-nextest-docs> 0: __rustc::rust_begin_unwind
  80. 29.20 s gammaloop-nextest-docs> 1: core::panicking::panic_fmt
  81. 29.20 s gammaloop-nextest-docs> 2: core::result::unwrap_failed
  82. 29.20 s gammaloop-nextest-docs> 3: alphal00p_docs_builder::tests::developer_scope_ranges_ignore_unrelated_edits_and_warn_only_while_watching
  83. 29.20 s gammaloop-nextest-docs> 4: <alphal00p_docs_builder::tests::developer_scope_ranges_ignore_unrelated_edits_and_warn_only_while_watching::{closure#0} as core::ops::function::FnOnce<()>>::call_once
  84. 29.20 s gammaloop-nextest-docs> note: Some details are omitted, run with `RUST_BACKTRACE=full` for a verbose backtrace.
  85. 29.20 s gammaloop-nextest-docs>
  86. 29.21 s gammaloop-nextest-docs> FAIL [ 0.154s] ( 66/129) alphal00p-docs-builder provenance_tests::each_build_captures_one_revision_before_rendering
  87. 29.21 s gammaloop-nextest-docs> stdout ---
  88. 29.21 s gammaloop-nextest-docs>
  89. 29.21 s gammaloop-nextest-docs> running 1 test
  90. 29.21 s gammaloop-nextest-docs>
  91. 29.21 s gammaloop-nextest-docs> running 1 test
  92. 29.21 s gammaloop-nextest-docs> test provenance_tests::each_build_captures_one_revision_before_rendering ... FAILED
  93. 29.21 s gammaloop-nextest-docs>
  94. 29.21 s gammaloop-nextest-docs> failures:
  95. 29.21 s gammaloop-nextest-docs>
  96. 29.21 s gammaloop-nextest-docs> failures:
  97. 29.21 s gammaloop-nextest-docs> provenance_tests::each_build_captures_one_revision_before_rendering
  98. 29.21 s gammaloop-nextest-docs>
  99. 29.21 s gammaloop-nextest-docs> test result: FAILED. 0 passed; 1 failed; 0 ignored; 0 measured; 128 filtered out; finished in 0.13s
  100. 29.21 s gammaloop-nextest-docs>
  101. 29.21 s gammaloop-nextest-docs> test provenance_tests::each_build_captures_one_revision_before_rendering ... FAILED
  102. 29.21 s gammaloop-nextest-docs>
  103. 29.21 s gammaloop-nextest-docs> failures:
  104. 29.21 s gammaloop-nextest-docs>
  105. 29.21 s gammaloop-nextest-docs> failures:
  106. 29.21 s gammaloop-nextest-docs> provenance_tests::each_build_captures_one_revision_before_rendering
  107. 29.21 s gammaloop-nextest-docs>
  108. 29.21 s gammaloop-nextest-docs> test result: FAILED. 0 passed; 1 failed; 0 ignored; 0 measured; 128 filtered out; finished in 0.15s
  109. 29.21 s gammaloop-nextest-docs>
  110. 29.21 s gammaloop-nextest-docs> stderr ---
  111. 29.21 s gammaloop-nextest-docs>
  112. 29.21 s gammaloop-nextest-docs> thread 'provenance_tests::each_build_captures_one_revision_before_rendering' (248) panicked at crates/alphal00p-docs-builder/src/provenance_tests.rs:297:14:
  113. 29.21 s gammaloop-nextest-docs> called `Result::unwrap()` on an `Err` value: developer note nix-crane-cache-reuse verified scope nix/rust-workspace.nix changed (expected 66f700580ce13b9eaee90fe0111639e46968c531, found 0a568cb5712045aee37d96bfb2f91d3d32b7e9b9); owner review or an explicit no-impact attestation is required
  114. 29.21 s gammaloop-nextest-docs>
  115. 29.21 s gammaloop-nextest-docs> Location:
  116. 29.21 s gammaloop-nextest-docs> crates/alphal00p-docs-builder/src/lib.rs:992:29
  117. 29.21 s gammaloop-nextest-docs> stack backtrace:
  118. 29.21 s gammaloop-nextest-docs> 0: __rustc::rust_begin_unwind
  119. 29.21 s gammaloop-nextest-docs> 1: core::panicking::panic_fmt
  120. 29.21 s gammaloop-nextest-docs> 2: core::result::unwrap_failed
  121. 29.21 s gammaloop-nextest-docs> 3: alphal00p_docs_builder::provenance_tests::each_build_captures_one_revision_before_rendering
  122. 29.21 s gammaloop-nextest-docs> 4: <alphal00p_docs_builder::provenance_tests::each_build_captures_one_revision_before_rendering::{closure#0} as core::ops::function::FnOnce<()>>::call_once
  123. 29.21 s gammaloop-nextest-docs> note: Some details are omitted, run with `RUST_BACKTRACE=full` for a verbose backtrace.
  124. 29.21 s gammaloop-nextest-docs>
  125. 29.21 s gammaloop-nextest-docs> thread 'provenance_tests::each_build_captures_one_revision_before_rendering' (166) panicked at crates/alphal00p-docs-builder/src/provenance_tests.rs:274:9:
  126. 29.21 s gammaloop-nextest-docs> assertion failed: command.status().unwrap().success()
  127. 29.21 s gammaloop-nextest-docs> stack backtrace:
  128. 29.21 s gammaloop-nextest-docs> 0: __rustc::rust_begin_unwind
  129. 29.21 s gammaloop-nextest-docs> 1: core::panicking::panic_fmt
  130. 29.21 s gammaloop-nextest-docs> 2: core::panicking::panic
  131. 29.21 s gammaloop-nextest-docs> 3: alphal00p_docs_builder::provenance_tests::each_build_captures_one_revision_before_rendering
  132. 29.21 s gammaloop-nextest-docs> 4: <alphal00p_docs_builder::provenance_tests::each_build_captures_one_revision_before_rendering::{closure#0} as core::ops::function::FnOnce<()>>::call_once
  133. 29.21 s gammaloop-nextest-docs> note: Some details are omitted, run with `RUST_BACKTRACE=full` for a verbose backtrace.
  134. 29.21 s gammaloop-nextest-docs>
  135. 29.22 s gammaloop-nextest-docs> FAIL [ 0.137s] ( 69/129) alphal00p-docs-builder tests::every_product_requires_a_task_chooser_and_each_supported_interface
  136. 29.22 s gammaloop-nextest-docs> stdout ---
  137. 29.22 s gammaloop-nextest-docs>
  138. 29.22 s gammaloop-nextest-docs> running 1 test
  139. 29.22 s gammaloop-nextest-docs> test tests::every_product_requires_a_task_chooser_and_each_supported_interface ... FAILED
  140. 29.22 s gammaloop-nextest-docs>
  141. 29.22 s gammaloop-nextest-docs> failures:
  142. 29.22 s gammaloop-nextest-docs>
  143. 29.22 s gammaloop-nextest-docs> failures:
  144. 29.22 s gammaloop-nextest-docs> tests::every_product_requires_a_task_chooser_and_each_supported_interface
  145. 29.22 s gammaloop-nextest-docs>
  146. 29.22 s gammaloop-nextest-docs> test result: FAILED. 0 passed; 1 failed; 0 ignored; 0 measured; 128 filtered out; finished in 0.13s
  147. 29.22 s gammaloop-nextest-docs>
  148. 29.22 s gammaloop-nextest-docs> stderr ---
  149. 29.22 s gammaloop-nextest-docs>
  150. 29.22 s gammaloop-nextest-docs> thread 'tests::every_product_requires_a_task_chooser_and_each_supported_interface' (302) panicked at crates/alphal00p-docs-builder/src/lib.rs:12192:9:
  151. 29.22 s gammaloop-nextest-docs> assertion failed: format!("{error:#}").contains("has no quickstart page")
  152. 29.22 s gammaloop-nextest-docs> stack backtrace:
  153. 29.22 s gammaloop-nextest-docs> 0: __rustc::rust_begin_unwind
  154. 29.22 s gammaloop-nextest-docs> 1: core::panicking::panic_fmt
  155. 29.22 s gammaloop-nextest-docs> 2: core::panicking::panic
  156. 29.22 s gammaloop-nextest-docs> 3: alphal00p_docs_builder::tests::every_product_requires_a_task_chooser_and_each_supported_interface
  157. 29.22 s gammaloop-nextest-docs> 4: <alphal00p_docs_builder::tests::every_product_requires_a_task_chooser_and_each_supported_interface::{closure#0} as core::ops::function::FnOnce<()>>::call_once
  158. 29.22 s gammaloop-nextest-docs> note: Some details are omitted, run with `RUST_BACKTRACE=full` for a verbose backtrace.
  159. 29.22 s gammaloop-nextest-docs>
  160. 29.27 s gammaloop-nextest-docs> FAIL [ 0.131s] ( 90/129) alphal00p-docs-builder tests::pdf_manual_chapter_order_must_match_the_page_registry
  161. 29.27 s gammaloop-nextest-docs> stdout ---
  162. 29.27 s gammaloop-nextest-docs>
  163. 29.27 s gammaloop-nextest-docs> running 1 test
  164. 29.27 s gammaloop-nextest-docs> test tests::pdf_manual_chapter_order_must_match_the_page_registry ... FAILED
  165. 29.27 s gammaloop-nextest-docs>
  166. 29.27 s gammaloop-nextest-docs> failures:
  167. 29.27 s gammaloop-nextest-docs>
  168. 29.27 s gammaloop-nextest-docs> failures:
  169. 29.27 s gammaloop-nextest-docs> tests::pdf_manual_chapter_order_must_match_the_page_registry
  170. 29.27 s gammaloop-nextest-docs>
  171. 29.27 s gammaloop-nextest-docs> test result: FAILED. 0 passed; 1 failed; 0 ignored; 0 measured; 128 filtered out; finished in 0.12s
  172. 29.27 s gammaloop-nextest-docs>
  173. 29.27 s gammaloop-nextest-docs> stderr ---
  174. 29.27 s gammaloop-nextest-docs>
  175. 29.27 s gammaloop-nextest-docs> thread 'tests::pdf_manual_chapter_order_must_match_the_page_registry' (424) panicked at crates/alphal00p-docs-builder/src/lib.rs:12243:9:
  176. 29.27 s gammaloop-nextest-docs> assertion failed: format!("{error:#}").contains("PDF manual chapter order differs")
  177. 29.27 s gammaloop-nextest-docs> stack backtrace:
  178. 29.27 s gammaloop-nextest-docs> 0: __rustc::rust_begin_unwind
  179. 29.27 s gammaloop-nextest-docs> 1: core::panicking::panic_fmt
  180. 29.27 s gammaloop-nextest-docs> 2: core::panicking::panic
  181. 29.27 s gammaloop-nextest-docs> 3: alphal00p_docs_builder::tests::pdf_manual_chapter_order_must_match_the_page_registry
  182. 29.27 s gammaloop-nextest-docs> 4: <alphal00p_docs_builder::tests::pdf_manual_chapter_order_must_match_the_page_registry::{closure#0} as core::ops::function::FnOnce<()>>::call_once
  183. 29.27 s gammaloop-nextest-docs> note: Some details are omitted, run with `RUST_BACKTRACE=full` for a verbose backtrace.
  184. 29.27 s gammaloop-nextest-docs>
  185. 53.07 s gammaloop-nextest-docs> ------------
  186. 53.07 s gammaloop-nextest-docs> Summary [ 24.012s] 129 tests run: 124 passed, 5 failed, 0 skipped
  187. 53.07 s gammaloop-nextest-docs> FAIL [ 0.134s] ( 59/129) alphal00p-docs-builder tests::checked_in_registry_is_valid
  188. 53.07 s gammaloop-nextest-docs> stdout ---
  189. 53.07 s gammaloop-nextest-docs>
  190. 53.07 s gammaloop-nextest-docs> running 1 test
  191. 53.07 s gammaloop-nextest-docs> test tests::checked_in_registry_is_valid ... FAILED
  192. 53.07 s gammaloop-nextest-docs>
  193. 53.07 s gammaloop-nextest-docs> failures:
  194. 53.07 s gammaloop-nextest-docs>
  195. 53.07 s gammaloop-nextest-docs> failures:
  196. 53.07 s gammaloop-nextest-docs> tests::checked_in_registry_is_valid
  197. 53.07 s gammaloop-nextest-docs>
  198. 53.07 s gammaloop-nextest-docs> test result: FAILED. 0 passed; 1 failed; 0 ignored; 0 measured; 128 filtered out; finished in 0.12s
  199. 53.07 s gammaloop-nextest-docs>
  200. 53.07 s gammaloop-nextest-docs> stderr ---
  201. 53.07 s gammaloop-nextest-docs>
  202. 53.07 s gammaloop-nextest-docs> thread 'tests::checked_in_registry_is_valid' (216) panicked at crates/alphal00p-docs-builder/src/lib.rs:12178:50:
  203. 53.07 s gammaloop-nextest-docs> called `Result::unwrap()` on an `Err` value: developer note nix-crane-cache-reuse verified scope nix/rust-workspace.nix changed (expected 66f700580ce13b9eaee90fe0111639e46968c531, found 0a568cb5712045aee37d96bfb2f91d3d32b7e9b9); owner review or an explicit no-impact attestation is required
  204. 53.07 s gammaloop-nextest-docs>
  205. 53.07 s gammaloop-nextest-docs> Location:
  206. 53.07 s gammaloop-nextest-docs> crates/alphal00p-docs-builder/src/lib.rs:992:29
  207. 53.07 s gammaloop-nextest-docs> stack backtrace:
  208. 53.07 s gammaloop-nextest-docs> 0: __rustc::rust_begin_unwind
  209. 53.07 s gammaloop-nextest-docs> 1: core::panicking::panic_fmt
  210. 53.07 s gammaloop-nextest-docs> 2: core::result::unwrap_failed
  211. 53.07 s gammaloop-nextest-docs> 3: alphal00p_docs_builder::tests::checked_in_registry_is_valid
  212. 53.07 s gammaloop-nextest-docs> 4: <alphal00p_docs_builder::tests::checked_in_registry_is_valid::{closure#0} as core::ops::function::FnOnce<()>>::call_once
  213. 53.07 s gammaloop-nextest-docs> note: Some details are omitted, run with `RUST_BACKTRACE=full` for a verbose backtrace.
  214. 53.07 s gammaloop-nextest-docs>
  215. 53.07 s gammaloop-nextest-docs> FAIL [ 0.128s] ( 63/129) alphal00p-docs-builder tests::developer_scope_ranges_ignore_unrelated_edits_and_warn_only_while_watching
  216. 53.07 s gammaloop-nextest-docs> stdout ---
  217. 53.07 s gammaloop-nextest-docs>
  218. 53.07 s gammaloop-nextest-docs> running 1 test
  219. 53.07 s gammaloop-nextest-docs> test tests::developer_scope_ranges_ignore_unrelated_edits_and_warn_only_while_watching ... FAILED
  220. 53.07 s gammaloop-nextest-docs>
  221. 53.07 s gammaloop-nextest-docs> failures:
  222. 53.07 s gammaloop-nextest-docs>
  223. 53.07 s gammaloop-nextest-docs> failures:
  224. 53.07 s gammaloop-nextest-docs> tests::developer_scope_ranges_ignore_unrelated_edits_and_warn_only_while_watching
  225. 53.07 s gammaloop-nextest-docs>
  226. 53.07 s gammaloop-nextest-docs> test result: FAILED. 0 passed; 1 failed; 0 ignored; 0 measured; 128 filtered out; finished in 0.12s
  227. 53.07 s gammaloop-nextest-docs>
  228. 53.07 s gammaloop-nextest-docs> stderr ---
  229. 53.07 s gammaloop-nextest-docs>
  230. 53.07 s gammaloop-nextest-docs> thread 'tests::developer_scope_ranges_ignore_unrelated_edits_and_warn_only_while_watching' (278) panicked at crates/alphal00p-docs-builder/src/lib.rs:12263:29:
  231. 53.07 s gammaloop-nextest-docs> called `Result::unwrap()` on an `Err` value: developer note nix-crane-cache-reuse verified scope nix/rust-workspace.nix changed (expected 66f700580ce13b9eaee90fe0111639e46968c531, found 0a568cb5712045aee37d96bfb2f91d3d32b7e9b9); owner review or an explicit no-impact attestation is required
  232. 53.07 s gammaloop-nextest-docs>
  233. 53.07 s gammaloop-nextest-docs> Location:
  234. 53.07 s gammaloop-nextest-docs> crates/alphal00p-docs-builder/src/lib.rs:992:29
  235. 53.07 s gammaloop-nextest-docs> stack backtrace:
  236. 53.07 s gammaloop-nextest-docs> 0: __rustc::rust_begin_unwind
  237. 53.07 s gammaloop-nextest-docs> 1: core::panicking::panic_fmt
  238. 53.07 s gammaloop-nextest-docs> 2: core::result::unwrap_failed
  239. 53.07 s gammaloop-nextest-docs> 3: alphal00p_docs_builder::tests::developer_scope_ranges_ignore_unrelated_edits_and_warn_only_while_watching
  240. 53.07 s gammaloop-nextest-docs> 4: <alphal00p_docs_builder::tests::developer_scope_ranges_ignore_unrelated_edits_and_warn_only_while_watching::{closure#0} as core::ops::function::FnOnce<()>>::call_once
  241. 53.07 s gammaloop-nextest-docs> note: Some details are omitted, run with `RUST_BACKTRACE=full` for a verbose backtrace.
  242. 53.07 s gammaloop-nextest-docs>
  243. 53.07 s gammaloop-nextest-docs> FAIL [ 0.154s] ( 66/129) alphal00p-docs-builder provenance_tests::each_build_captures_one_revision_before_rendering
  244. 53.07 s gammaloop-nextest-docs> stdout ---
  245. 53.07 s gammaloop-nextest-docs>
  246. 53.07 s gammaloop-nextest-docs> running 1 test
  247. 53.07 s gammaloop-nextest-docs>
  248. 53.07 s gammaloop-nextest-docs> running 1 test
  249. 53.07 s gammaloop-nextest-docs> test provenance_tests::each_build_captures_one_revision_before_rendering ... FAILED
  250. 53.07 s gammaloop-nextest-docs>
  251. 53.07 s gammaloop-nextest-docs> failures:
  252. 53.07 s gammaloop-nextest-docs>
  253. 53.07 s gammaloop-nextest-docs> failures:
  254. 53.07 s gammaloop-nextest-docs> provenance_tests::each_build_captures_one_revision_before_rendering
  255. 53.07 s gammaloop-nextest-docs>
  256. 53.07 s gammaloop-nextest-docs> test result: FAILED. 0 passed; 1 failed; 0 ignored; 0 measured; 128 filtered out; finished in 0.13s
  257. 53.07 s gammaloop-nextest-docs>
  258. 53.07 s gammaloop-nextest-docs> test provenance_tests::each_build_captures_one_revision_before_rendering ... FAILED
  259. 53.07 s gammaloop-nextest-docs>
  260. 53.07 s gammaloop-nextest-docs> failures:
  261. 53.07 s gammaloop-nextest-docs>
  262. 53.07 s gammaloop-nextest-docs> failures:
  263. 53.07 s gammaloop-nextest-docs> provenance_tests::each_build_captures_one_revision_before_rendering
  264. 53.07 s gammaloop-nextest-docs>
  265. 53.07 s gammaloop-nextest-docs> test result: FAILED. 0 passed; 1 failed; 0 ignored; 0 measured; 128 filtered out; finished in 0.15s
  266. 53.07 s gammaloop-nextest-docs>
  267. 53.07 s gammaloop-nextest-docs> stderr ---
  268. 53.07 s gammaloop-nextest-docs>
  269. 53.07 s gammaloop-nextest-docs> thread 'provenance_tests::each_build_captures_one_revision_before_rendering' (248) panicked at crates/alphal00p-docs-builder/src/provenance_tests.rs:297:14:
  270. 53.07 s gammaloop-nextest-docs> called `Result::unwrap()` on an `Err` value: developer note nix-crane-cache-reuse verified scope nix/rust-workspace.nix changed (expected 66f700580ce13b9eaee90fe0111639e46968c531, found 0a568cb5712045aee37d96bfb2f91d3d32b7e9b9); owner review or an explicit no-impact attestation is required
  271. 53.07 s gammaloop-nextest-docs>
  272. 53.07 s gammaloop-nextest-docs> Location:
  273. 53.07 s gammaloop-nextest-docs> crates/alphal00p-docs-builder/src/lib.rs:992:29
  274. 53.07 s gammaloop-nextest-docs> stack backtrace:
  275. 53.07 s gammaloop-nextest-docs> 0: __rustc::rust_begin_unwind
  276. 53.07 s gammaloop-nextest-docs> 1: core::panicking::panic_fmt
  277. 53.07 s gammaloop-nextest-docs> 2: core::result::unwrap_failed
  278. 53.07 s gammaloop-nextest-docs> 3: alphal00p_docs_builder::provenance_tests::each_build_captures_one_revision_before_rendering
  279. 53.07 s gammaloop-nextest-docs> 4: <alphal00p_docs_builder::provenance_tests::each_build_captures_one_revision_before_rendering::{closure#0} as core::ops::function::FnOnce<()>>::call_once
  280. 53.07 s gammaloop-nextest-docs> note: Some details are omitted, run with `RUST_BACKTRACE=full` for a verbose backtrace.
  281. 53.07 s gammaloop-nextest-docs>
  282. 53.07 s gammaloop-nextest-docs> thread 'provenance_tests::each_build_captures_one_revision_before_rendering' (166) panicked at crates/alphal00p-docs-builder/src/provenance_tests.rs:274:9:
  283. 53.07 s gammaloop-nextest-docs> assertion failed: command.status().unwrap().success()
  284. 53.07 s gammaloop-nextest-docs> stack backtrace:
  285. 53.07 s gammaloop-nextest-docs> 0: __rustc::rust_begin_unwind
  286. 53.07 s gammaloop-nextest-docs> 1: core::panicking::panic_fmt
  287. 53.07 s gammaloop-nextest-docs> 2: core::panicking::panic
  288. 53.07 s gammaloop-nextest-docs> 3: alphal00p_docs_builder::provenance_tests::each_build_captures_one_revision_before_rendering
  289. 53.07 s gammaloop-nextest-docs> 4: <alphal00p_docs_builder::provenance_tests::each_build_captures_one_revision_before_rendering::{closure#0} as core::ops::function::FnOnce<()>>::call_once
  290. 53.07 s gammaloop-nextest-docs> note: Some details are omitted, run with `RUST_BACKTRACE=full` for a verbose backtrace.
  291. 53.07 s gammaloop-nextest-docs>
  292. 53.07 s gammaloop-nextest-docs> FAIL [ 0.137s] ( 69/129) alphal00p-docs-builder tests::every_product_requires_a_task_chooser_and_each_supported_interface
  293. 53.07 s gammaloop-nextest-docs> stdout ---
  294. 53.07 s gammaloop-nextest-docs>
  295. 53.07 s gammaloop-nextest-docs> running 1 test
  296. 53.07 s gammaloop-nextest-docs> test tests::every_product_requires_a_task_chooser_and_each_supported_interface ... FAILED
  297. 53.07 s gammaloop-nextest-docs>
  298. 53.07 s gammaloop-nextest-docs> failures:
  299. 53.07 s gammaloop-nextest-docs>
  300. 53.07 s gammaloop-nextest-docs> failures:
  301. 53.07 s gammaloop-nextest-docs> tests::every_product_requires_a_task_chooser_and_each_supported_interface
  302. 53.07 s gammaloop-nextest-docs>
  303. 53.07 s gammaloop-nextest-docs> test result: FAILED. 0 passed; 1 failed; 0 ignored; 0 measured; 128 filtered out; finished in 0.13s
  304. 53.07 s gammaloop-nextest-docs>
  305. 53.07 s gammaloop-nextest-docs> stderr ---
  306. 53.07 s gammaloop-nextest-docs>
  307. 53.07 s gammaloop-nextest-docs> thread 'tests::every_product_requires_a_task_chooser_and_each_supported_interface' (302) panicked at crates/alphal00p-docs-builder/src/lib.rs:12192:9:
  308. 53.07 s gammaloop-nextest-docs> assertion failed: format!("{error:#}").contains("has no quickstart page")
  309. 53.07 s gammaloop-nextest-docs> stack backtrace:
  310. 53.07 s gammaloop-nextest-docs> 0: __rustc::rust_begin_unwind
  311. 53.07 s gammaloop-nextest-docs> 1: core::panicking::panic_fmt
  312. 53.07 s gammaloop-nextest-docs> 2: core::panicking::panic
  313. 53.07 s gammaloop-nextest-docs> 3: alphal00p_docs_builder::tests::every_product_requires_a_task_chooser_and_each_supported_interface
  314. 53.07 s gammaloop-nextest-docs> 4: <alphal00p_docs_builder::tests::every_product_requires_a_task_chooser_and_each_supported_interface::{closure#0} as core::ops::function::FnOnce<()>>::call_once
  315. 53.07 s gammaloop-nextest-docs> note: Some details are omitted, run with `RUST_BACKTRACE=full` for a verbose backtrace.
  316. 53.07 s gammaloop-nextest-docs>
  317. 53.07 s gammaloop-nextest-docs> FAIL [ 0.131s] ( 90/129) alphal00p-docs-builder tests::pdf_manual_chapter_order_must_match_the_page_registry
  318. 53.07 s gammaloop-nextest-docs> stdout ---
  319. 53.07 s gammaloop-nextest-docs>
  320. 53.07 s gammaloop-nextest-docs> running 1 test
  321. 53.07 s gammaloop-nextest-docs> test tests::pdf_manual_chapter_order_must_match_the_page_registry ... FAILED
  322. 53.07 s gammaloop-nextest-docs>
  323. 53.07 s gammaloop-nextest-docs> failures:
  324. 53.07 s gammaloop-nextest-docs>
  325. 53.07 s gammaloop-nextest-docs> failures:
  326. 53.07 s gammaloop-nextest-docs> tests::pdf_manual_chapter_order_must_match_the_page_registry
  327. 53.07 s gammaloop-nextest-docs>
  328. 53.07 s gammaloop-nextest-docs> test result: FAILED. 0 passed; 1 failed; 0 ignored; 0 measured; 128 filtered out; finished in 0.12s
  329. 53.07 s gammaloop-nextest-docs>
  330. 53.07 s gammaloop-nextest-docs> stderr ---
  331. 53.07 s gammaloop-nextest-docs>
  332. 53.07 s gammaloop-nextest-docs> thread 'tests::pdf_manual_chapter_order_must_match_the_page_registry' (424) panicked at crates/alphal00p-docs-builder/src/lib.rs:12243:9:
  333. 53.07 s gammaloop-nextest-docs> assertion failed: format!("{error:#}").contains("PDF manual chapter order differs")
  334. 53.07 s gammaloop-nextest-docs> stack backtrace:
  335. 53.07 s gammaloop-nextest-docs> 0: __rustc::rust_begin_unwind
  336. 53.07 s gammaloop-nextest-docs> 1: core::panicking::panic_fmt
  337. 53.07 s gammaloop-nextest-docs> 2: core::panicking::panic
  338. 53.07 s gammaloop-nextest-docs> 3: alphal00p_docs_builder::tests::pdf_manual_chapter_order_must_match_the_page_registry
  339. 53.07 s gammaloop-nextest-docs> 4: <alphal00p_docs_builder::tests::pdf_manual_chapter_order_must_match_the_page_registry::{closure#0} as core::ops::function::FnOnce<()>>::call_once
  340. 53.07 s gammaloop-nextest-docs> note: Some details are omitted, run with `RUST_BACKTRACE=full` for a verbose backtrace.
  341. 53.07 s gammaloop-nextest-docs>
  342. 53.07 s gammaloop-nextest-docs> error: test run failed
  343. 53.10 s gammaloop-nextest-docs>
  344. 53.10 s gammaloop-nextest-docs> ========== nextest test summary ==========
  345. 53.10 s gammaloop-nextest-docs> report: target/nextest/ci_gammaloop/junit.xml
  346. 53.10 s gammaloop-nextest-docs> tests: 129, failures: 5, errors: 0
  347. 53.10 s gammaloop-nextest-docs>
  348. 53.10 s gammaloop-nextest-docs> 1. alphal00p-docs-builder::tests::checked_in_registry_is_valid
  349. 53.10 s gammaloop-nextest-docs> failure: test failure with exit code 101
  350. 53.10 s gammaloop-nextest-docs> thread 'tests::checked_in_registry_is_valid' (216) panicked at crates/alphal00p-docs-builder/src/lib.rs:12178:50:
  351. 53.10 s gammaloop-nextest-docs> called `Result::unwrap()` on an `Err` value: developer note nix-crane-cache-reuse verified scope nix/rust-workspace.nix changed (expected 66f700580ce13b9eaee90fe0111639e46968c531, found 0a568cb5712045aee37d96bfb2f91d3d32b7e9b9); owner review or an explicit no-impact attestation is required
  352. 53.10 s gammaloop-nextest-docs>
  353. 53.10 s gammaloop-nextest-docs> Location:
  354. 53.10 s gammaloop-nextest-docs> crates/alphal00p-docs-builder/src/lib.rs:992:29
  355. 53.10 s gammaloop-nextest-docs> stack backtrace:
  356. 53.10 s gammaloop-nextest-docs> 0: __rustc::rust_begin_unwind
  357. 53.10 s gammaloop-nextest-docs> 1: core::panicking::panic_fmt
  358. 53.10 s gammaloop-nextest-docs> 2: core::result::unwrap_failed
  359. 53.10 s gammaloop-nextest-docs> 3: alphal00p_docs_builder::tests::checked_in_registry_is_valid
  360. 53.10 s gammaloop-nextest-docs> 4: <alphal00p_docs_builder::tests::checked_in_registry_is_valid::{closure#0} as core::ops::function::FnOnce<()>>::call_once
  361. 53.10 s gammaloop-nextest-docs> note: Some details are omitted, run with `RUST_BACKTRACE=full` for a verbose backtrace.
  362. 53.10 s gammaloop-nextest-docs> system-out
  363. 53.10 s gammaloop-nextest-docs> running 1 test
  364. 53.10 s gammaloop-nextest-docs> test tests::checked_in_registry_is_valid ... FAILED
  365. 53.10 s gammaloop-nextest-docs>
  366. 53.10 s gammaloop-nextest-docs> failures:
  367. 53.10 s gammaloop-nextest-docs>
  368. 53.10 s gammaloop-nextest-docs> failures:
  369. 53.10 s gammaloop-nextest-docs> tests::checked_in_registry_is_valid
  370. 53.10 s gammaloop-nextest-docs>
  371. 53.10 s gammaloop-nextest-docs> test result: FAILED. 0 passed; 1 failed; 0 ignored; 0 measured; 128 filtered out; finished in 0.12s
  372. 53.10 s gammaloop-nextest-docs> system-err
  373. 53.10 s gammaloop-nextest-docs> thread 'tests::checked_in_registry_is_valid' (216) panicked at crates/alphal00p-docs-builder/src/lib.rs:12178:50:
  374. 53.10 s gammaloop-nextest-docs> called `Result::unwrap()` on an `Err` value: developer note nix-crane-cache-reuse verified scope nix/rust-workspace.nix changed (expected 66f700580ce13b9eaee90fe0111639e46968c531, found 0a568cb5712045aee37d96bfb2f91d3d32b7e9b9); owner review or an explicit no-impact attestation is required
  375. 53.10 s gammaloop-nextest-docs>
  376. 53.10 s gammaloop-nextest-docs> Location:
  377. 53.10 s gammaloop-nextest-docs> crates/alphal00p-docs-builder/src/lib.rs:992:29
  378. 53.10 s gammaloop-nextest-docs> stack backtrace:
  379. 53.10 s gammaloop-nextest-docs> 0: __rustc::rust_begin_unwind
  380. 53.10 s gammaloop-nextest-docs> 1: core::panicking::panic_fmt
  381. 53.10 s gammaloop-nextest-docs> 2: core::result::unwrap_failed
  382. 53.10 s gammaloop-nextest-docs> 3: alphal00p_docs_builder::tests::checked_in_registry_is_valid
  383. 53.10 s gammaloop-nextest-docs> 4: <alphal00p_docs_builder::tests::checked_in_registry_is_valid::{closure#0} as core::ops::function::FnOnce<()>>::call_once
  384. 53.10 s gammaloop-nextest-docs> note: Some details are omitted, run with `RUST_BACKTRACE=full` for a verbose backtrace.
  385. 53.10 s gammaloop-nextest-docs>
  386. 53.10 s gammaloop-nextest-docs> 2. alphal00p-docs-builder::tests::developer_scope_ranges_ignore_unrelated_edits_and_warn_only_while_watching
  387. 53.10 s gammaloop-nextest-docs> failure: test failure with exit code 101
  388. 53.10 s gammaloop-nextest-docs> thread 'tests::developer_scope_ranges_ignore_unrelated_edits_and_warn_only_while_watching' (278) panicked at crates/alphal00p-docs-builder/src/lib.rs:12263:29:
  389. 53.10 s gammaloop-nextest-docs> called `Result::unwrap()` on an `Err` value: developer note nix-crane-cache-reuse verified scope nix/rust-workspace.nix changed (expected 66f700580ce13b9eaee90fe0111639e46968c531, found 0a568cb5712045aee37d96bfb2f91d3d32b7e9b9); owner review or an explicit no-impact attestation is required
  390. 53.10 s gammaloop-nextest-docs>
  391. 53.10 s gammaloop-nextest-docs> Location:
  392. 53.10 s gammaloop-nextest-docs> crates/alphal00p-docs-builder/src/lib.rs:992:29
  393. 53.10 s gammaloop-nextest-docs> stack backtrace:
  394. 53.10 s gammaloop-nextest-docs> 0: __rustc::rust_begin_unwind
  395. 53.10 s gammaloop-nextest-docs> 1: core::panicking::panic_fmt
  396. 53.10 s gammaloop-nextest-docs> 2: core::result::unwrap_failed
  397. 53.10 s gammaloop-nextest-docs> 3: alphal00p_docs_builder::tests::developer_scope_ranges_ignore_unrelated_edits_and_warn_only_while_watching
  398. 53.10 s gammaloop-nextest-docs> 4: <alphal00p_docs_builder::tests::developer_scope_ranges_ignore_unrelated_edits_and_warn_only_while_watching::{closure#0} as core::ops::function::FnOnce<()>>::call_once
  399. 53.10 s gammaloop-nextest-docs> note: Some details are omitted, run with `RUST_BACKTRACE=full` for a verbose backtrace.
  400. 53.10 s gammaloop-nextest-docs> system-out
  401. 53.10 s gammaloop-nextest-docs> running 1 test
  402. 53.10 s gammaloop-nextest-docs> test tests::developer_scope_ranges_ignore_unrelated_edits_and_warn_only_while_watching ... FAILED
  403. 53.10 s gammaloop-nextest-docs>
  404. 53.10 s gammaloop-nextest-docs> failures:
  405. 53.10 s gammaloop-nextest-docs>
  406. 53.10 s gammaloop-nextest-docs> failures:
  407. 53.10 s gammaloop-nextest-docs> tests::developer_scope_ranges_ignore_unrelated_edits_and_warn_only_while_watching
  408. 53.10 s gammaloop-nextest-docs>
  409. 53.10 s gammaloop-nextest-docs> test result: FAILED. 0 passed; 1 failed; 0 ignored; 0 measured; 128 filtered out; finished in 0.12s
  410. 53.10 s gammaloop-nextest-docs> system-err
  411. 53.10 s gammaloop-nextest-docs> thread 'tests::developer_scope_ranges_ignore_unrelated_edits_and_warn_only_while_watching' (278) panicked at crates/alphal00p-docs-builder/src/lib.rs:12263:29:
  412. 53.10 s gammaloop-nextest-docs> called `Result::unwrap()` on an `Err` value: developer note nix-crane-cache-reuse verified scope nix/rust-workspace.nix changed (expected 66f700580ce13b9eaee90fe0111639e46968c531, found 0a568cb5712045aee37d96bfb2f91d3d32b7e9b9); owner review or an explicit no-impact attestation is required
  413. 53.10 s gammaloop-nextest-docs>
  414. 53.10 s gammaloop-nextest-docs> Location:
  415. 53.10 s gammaloop-nextest-docs> crates/alphal00p-docs-builder/src/lib.rs:992:29
  416. 53.10 s gammaloop-nextest-docs> stack backtrace:
  417. 53.10 s gammaloop-nextest-docs> 0: __rustc::rust_begin_unwind
  418. 53.10 s gammaloop-nextest-docs> 1: core::panicking::panic_fmt
  419. 53.10 s gammaloop-nextest-docs> 2: core::result::unwrap_failed
  420. 53.10 s gammaloop-nextest-docs> 3: alphal00p_docs_builder::tests::developer_scope_ranges_ignore_unrelated_edits_and_warn_only_while_watching
  421. 53.10 s gammaloop-nextest-docs> 4: <alphal00p_docs_builder::tests::developer_scope_ranges_ignore_unrelated_edits_and_warn_only_while_watching::{closure#0} as core::ops::function::FnOnce<()>>::call_once
  422. 53.10 s gammaloop-nextest-docs> note: Some details are omitted, run with `RUST_BACKTRACE=full` for a verbose backtrace.
  423. 53.10 s gammaloop-nextest-docs>
  424. 53.10 s gammaloop-nextest-docs> 3. alphal00p-docs-builder::provenance_tests::each_build_captures_one_revision_before_rendering
  425. 53.10 s gammaloop-nextest-docs> failure: test failure with exit code 101
  426. 53.10 s gammaloop-nextest-docs> thread 'provenance_tests::each_build_captures_one_revision_before_rendering' (166) panicked at crates/alphal00p-docs-builder/src/provenance_tests.rs:274:9:
  427. 53.10 s gammaloop-nextest-docs> assertion failed: command.status().unwrap().success()
  428. 53.10 s gammaloop-nextest-docs> stack backtrace:
  429. 53.10 s gammaloop-nextest-docs> 0: __rustc::rust_begin_unwind
  430. 53.10 s gammaloop-nextest-docs> 1: core::panicking::panic_fmt
  431. 53.10 s gammaloop-nextest-docs> 2: core::panicking::panic
  432. 53.10 s gammaloop-nextest-docs> 3: alphal00p_docs_builder::provenance_tests::each_build_captures_one_revision_before_rendering
  433. 53.10 s gammaloop-nextest-docs> 4: <alphal00p_docs_builder::provenance_tests::each_build_captures_one_revision_before_rendering::{closure#0} as core::ops::function::FnOnce<()>>::call_once
  434. 53.10 s gammaloop-nextest-docs> note: Some details are omitted, run with `RUST_BACKTRACE=full` for a verbose backtrace.
  435. 53.10 s gammaloop-nextest-docs> system-out
  436. 53.10 s gammaloop-nextest-docs> running 1 test
  437. 53.10 s gammaloop-nextest-docs>
  438. 53.10 s gammaloop-nextest-docs> running 1 test
  439. 53.10 s gammaloop-nextest-docs> test provenance_tests::each_build_captures_one_revision_before_rendering ... FAILED
  440. 53.10 s gammaloop-nextest-docs>
  441. 53.10 s gammaloop-nextest-docs> failures:
  442. 53.10 s gammaloop-nextest-docs>
  443. 53.10 s gammaloop-nextest-docs> failures:
  444. 53.10 s gammaloop-nextest-docs> provenance_tests::each_build_captures_one_revision_before_rendering
  445. 53.10 s gammaloop-nextest-docs>
  446. 53.10 s gammaloop-nextest-docs> test result: FAILED. 0 passed; 1 failed; 0 ignored; 0 measured; 128 filtered out; finished in 0.13s
  447. 53.10 s gammaloop-nextest-docs>
  448. 53.10 s gammaloop-nextest-docs> test provenance_tests::each_build_captures_one_revision_before_rendering ... FAILED
  449. 53.10 s gammaloop-nextest-docs>
  450. 53.10 s gammaloop-nextest-docs> failures:
  451. 53.10 s gammaloop-nextest-docs>
  452. 53.10 s gammaloop-nextest-docs> failures:
  453. 53.10 s gammaloop-nextest-docs> provenance_tests::each_build_captures_one_revision_before_rendering
  454. 53.10 s gammaloop-nextest-docs>
  455. 53.10 s gammaloop-nextest-docs> test result: FAILED. 0 passed; 1 failed; 0 ignored; 0 measured; 128 filtered out; finished in 0.15s
  456. 53.10 s gammaloop-nextest-docs> system-err
  457. 53.10 s gammaloop-nextest-docs> thread 'provenance_tests::each_build_captures_one_revision_before_rendering' (248) panicked at crates/alphal00p-docs-builder/src/provenance_tests.rs:297:14:
  458. 53.10 s gammaloop-nextest-docs> called `Result::unwrap()` on an `Err` value: developer note nix-crane-cache-reuse verified scope nix/rust-workspace.nix changed (expected 66f700580ce13b9eaee90fe0111639e46968c531, found 0a568cb5712045aee37d96bfb2f91d3d32b7e9b9); owner review or an explicit no-impact attestation is required
  459. 53.10 s gammaloop-nextest-docs>
  460. 53.10 s gammaloop-nextest-docs> Location:
  461. 53.10 s gammaloop-nextest-docs> crates/alphal00p-docs-builder/src/lib.rs:992:29
  462. 53.10 s gammaloop-nextest-docs> stack backtrace:
  463. 53.10 s gammaloop-nextest-docs> 0: __rustc::rust_begin_unwind
  464. 53.10 s gammaloop-nextest-docs> 1: core::panicking::panic_fmt
  465. 53.10 s gammaloop-nextest-docs> 2: core::result::unwrap_failed
  466. 53.10 s gammaloop-nextest-docs> 3: alphal00p_docs_builder::provenance_tests::each_build_captures_one_revision_before_rendering
  467. 53.11 s gammaloop-nextest-docs> 4: <alphal00p_docs_builder::provenance_tests::each_build_captures_one_revision_before_rendering::{closure#0} as core::ops::function::FnOnce<()>>::call_once
  468. 53.11 s gammaloop-nextest-docs> note: Some details are omitted, run with `RUST_BACKTRACE=full` for a verbose backtrace.
  469. 53.11 s gammaloop-nextest-docs>
  470. 53.11 s gammaloop-nextest-docs> thread 'provenance_tests::each_build_captures_one_revision_before_rendering' (166) panicked at crates/alphal00p-docs-builder/src/provenance_tests.rs:274:9:
  471. 53.11 s gammaloop-nextest-docs> assertion failed: command.status().unwrap().success()
  472. 53.11 s gammaloop-nextest-docs> stack backtrace:
  473. 53.11 s gammaloop-nextest-docs> 0: __rustc::rust_begin_unwind
  474. 53.11 s gammaloop-nextest-docs> 1: core::panicking::panic_fmt
  475. 53.11 s gammaloop-nextest-docs> 2: core::panicking::panic
  476. 53.11 s gammaloop-nextest-docs> 3: alphal00p_docs_builder::provenance_tests::each_build_captures_one_revision_before_rendering
  477. 53.11 s gammaloop-nextest-docs> 4: <alphal00p_docs_builder::provenance_tests::each_build_captures_one_revision_before_rendering::{closure#0} as core::ops::function::FnOnce<()>>::call_once
  478. 53.11 s gammaloop-nextest-docs> note: Some details are omitted, run with `RUST_BACKTRACE=full` for a verbose backtrace.
  479. 53.11 s gammaloop-nextest-docs>
  480. 53.11 s gammaloop-nextest-docs> 4. alphal00p-docs-builder::tests::every_product_requires_a_task_chooser_and_each_supported_interface
  481. 53.11 s gammaloop-nextest-docs> failure: test failure with exit code 101
  482. 53.11 s gammaloop-nextest-docs> thread 'tests::every_product_requires_a_task_chooser_and_each_supported_interface' (302) panicked at crates/alphal00p-docs-builder/src/lib.rs:12192:9:
  483. 53.11 s gammaloop-nextest-docs> assertion failed: format!("{error:#}").contains("has no quickstart page")
  484. 53.11 s gammaloop-nextest-docs> stack backtrace:
  485. 53.11 s gammaloop-nextest-docs> 0: __rustc::rust_begin_unwind
  486. 53.11 s gammaloop-nextest-docs> 1: core::panicking::panic_fmt
  487. 53.11 s gammaloop-nextest-docs> 2: core::panicking::panic
  488. 53.11 s gammaloop-nextest-docs> 3: alphal00p_docs_builder::tests::every_product_requires_a_task_chooser_and_each_supported_interface
  489. 53.11 s gammaloop-nextest-docs> 4: <alphal00p_docs_builder::tests::every_product_requires_a_task_chooser_and_each_supported_interface::{closure#0} as core::ops::function::FnOnce<()>>::call_once
  490. 53.11 s gammaloop-nextest-docs> note: Some details are omitted, run with `RUST_BACKTRACE=full` for a verbose backtrace.
  491. 53.11 s gammaloop-nextest-docs> system-out
  492. 53.11 s gammaloop-nextest-docs> running 1 test
  493. 53.11 s gammaloop-nextest-docs> test tests::every_product_requires_a_task_chooser_and_each_supported_interface ... FAILED
  494. 53.11 s gammaloop-nextest-docs>
  495. 53.11 s gammaloop-nextest-docs> failures:
  496. 53.11 s gammaloop-nextest-docs>
  497. 53.11 s gammaloop-nextest-docs> failures:
  498. 53.11 s gammaloop-nextest-docs> tests::every_product_requires_a_task_chooser_and_each_supported_interface
  499. 53.11 s gammaloop-nextest-docs>
  500. 53.11 s gammaloop-nextest-docs> test result: FAILED. 0 passed; 1 failed; 0 ignored; 0 measured; 128 filtered out; finished in 0.13s
  501. 53.11 s gammaloop-nextest-docs> system-err
  502. 53.11 s gammaloop-nextest-docs> thread 'tests::every_product_requires_a_task_chooser_and_each_supported_interface' (302) panicked at crates/alphal00p-docs-builder/src/lib.rs:12192:9:
  503. 53.11 s gammaloop-nextest-docs> assertion failed: format!("{error:#}").contains("has no quickstart page")
  504. 53.11 s gammaloop-nextest-docs> stack backtrace:
  505. 53.11 s gammaloop-nextest-docs> 0: __rustc::rust_begin_unwind
  506. 53.11 s gammaloop-nextest-docs> 1: core::panicking::panic_fmt
  507. 53.11 s gammaloop-nextest-docs> 2: core::panicking::panic
  508. 53.11 s gammaloop-nextest-docs> 3: alphal00p_docs_builder::tests::every_product_requires_a_task_chooser_and_each_supported_interface
  509. 53.11 s gammaloop-nextest-docs> 4: <alphal00p_docs_builder::tests::every_product_requires_a_task_chooser_and_each_supported_interface::{closure#0} as core::ops::function::FnOnce<()>>::call_once
  510. 53.11 s gammaloop-nextest-docs> note: Some details are omitted, run with `RUST_BACKTRACE=full` for a verbose backtrace.
  511. 53.11 s gammaloop-nextest-docs>
  512. 53.11 s gammaloop-nextest-docs> 5. alphal00p-docs-builder::tests::pdf_manual_chapter_order_must_match_the_page_registry
  513. 53.11 s gammaloop-nextest-docs> failure: test failure with exit code 101
  514. 53.11 s gammaloop-nextest-docs> thread 'tests::pdf_manual_chapter_order_must_match_the_page_registry' (424) panicked at crates/alphal00p-docs-builder/src/lib.rs:12243:9:
  515. 53.11 s gammaloop-nextest-docs> assertion failed: format!("{error:#}").contains("PDF manual chapter order differs")
  516. 53.11 s gammaloop-nextest-docs> stack backtrace:
  517. 53.11 s gammaloop-nextest-docs> 0: __rustc::rust_begin_unwind
  518. 53.11 s gammaloop-nextest-docs> 1: core::panicking::panic_fmt
  519. 53.11 s gammaloop-nextest-docs> 2: core::panicking::panic
  520. 53.11 s gammaloop-nextest-docs> 3: alphal00p_docs_builder::tests::pdf_manual_chapter_order_must_match_the_page_registry
  521. 53.11 s gammaloop-nextest-docs> 4: <alphal00p_docs_builder::tests::pdf_manual_chapter_order_must_match_the_page_registry::{closure#0} as core::ops::function::FnOnce<()>>::call_once
  522. 53.11 s gammaloop-nextest-docs> note: Some details are omitted, run with `RUST_BACKTRACE=full` for a verbose backtrace.
  523. 53.11 s gammaloop-nextest-docs> system-out
  524. 53.11 s gammaloop-nextest-docs> running 1 test
  525. 53.11 s gammaloop-nextest-docs> test tests::pdf_manual_chapter_order_must_match_the_page_registry ... FAILED
  526. 53.11 s gammaloop-nextest-docs>
  527. 53.11 s gammaloop-nextest-docs> failures:
  528. 53.11 s gammaloop-nextest-docs>
  529. 53.11 s gammaloop-nextest-docs> failures:
  530. 53.11 s gammaloop-nextest-docs> tests::pdf_manual_chapter_order_must_match_the_page_registry
  531. 53.11 s gammaloop-nextest-docs>
  532. 53.11 s gammaloop-nextest-docs> test result: FAILED. 0 passed; 1 failed; 0 ignored; 0 measured; 128 filtered out; finished in 0.12s
  533. 53.11 s gammaloop-nextest-docs> system-err
  534. 53.11 s gammaloop-nextest-docs> thread 'tests::pdf_manual_chapter_order_must_match_the_page_registry' (424) panicked at crates/alphal00p-docs-builder/src/lib.rs:12243:9:
  535. 53.11 s gammaloop-nextest-docs> assertion failed: format!("{error:#}").contains("PDF manual chapter order differs")
  536. 53.11 s gammaloop-nextest-docs> stack backtrace:
  537. 53.11 s gammaloop-nextest-docs> 0: __rustc::rust_begin_unwind
  538. 53.11 s gammaloop-nextest-docs> 1: core::panicking::panic_fmt
  539. 53.11 s gammaloop-nextest-docs> 2: core::panicking::panic
  540. 53.11 s gammaloop-nextest-docs> 3: alphal00p_docs_builder::tests::pdf_manual_chapter_order_must_match_the_page_registry
  541. 53.11 s gammaloop-nextest-docs> 4: <alphal00p_docs_builder::tests::pdf_manual_chapter_order_must_match_the_page_registry::{closure#0} as core::ops::function::FnOnce<()>>::call_once
  542. 53.11 s gammaloop-nextest-docs> note: Some details are omitted, run with `RUST_BACKTRACE=full` for a verbose backtrace.
  543. 53.11 s gammaloop-nextest-docs> =========================================
  544. 53.12 s gammaloop-nextest-docs> Extracting 2 binaries to /build/source
  545. 53.16 s gammaloop-nextest-docs> Extracted 5 files to /build/source in 0.04s
  546. 53.17 s gammaloop-nextest-docs> ------------
  547. 53.17 s gammaloop-nextest-docs> Nextest run ID 4c25074c-2b12-4e33-acb2-a36214f7ec51 with nextest profile: ci_gammaloop
  548. 53.17 s gammaloop-nextest-docs> Starting 22 tests across 2 binaries
  549. 53.20 s gammaloop-nextest-docs> ------------
  550. 53.20 s gammaloop-nextest-docs> Summary [ 0.025s] 22 tests run: 22 passed, 0 skipped
  551. 53.24 s gammaloop-nextest-docs>
  552. 53.24 s gammaloop-nextest-docs> ========== nextest test summary ==========
  553. 53.24 s gammaloop-nextest-docs> report: target/nextest/ci_gammaloop/junit.xml
  554. 53.24 s gammaloop-nextest-docs> tests: 22, failures: 0, errors: 0
  555. 53.24 s gammaloop-nextest-docs> No failing testcases found.
  556. 53.24 s gammaloop-nextest-docs> =========================================
  557. 53.25 s gammaloop-nextest-docs> Extracting 3 binaries (including 2 non-test binaries), 1 build script output directory, and 2 linked paths to /build/source
  558. 53.58 s gammaloop-nextest-docs> Extracted 22 files to /build/source in 0.33s
  559. 53.59 s gammaloop-nextest-docs> ------------
  560. 53.59 s gammaloop-nextest-docs> Nextest run ID 6c18fda9-e8b5-4fd7-8df7-e3789fa2d9c1 with nextest profile: ci_gammaloop
  561. 53.59 s gammaloop-nextest-docs> Starting 89 tests across 1 binary
  562. 53.64 s gammaloop-nextest-docs> ------------
  563. 53.64 s gammaloop-nextest-docs> Summary [ 0.048s] 89 tests run: 89 passed, 0 skipped
  564. 53.67 s gammaloop-nextest-docs>
  565. 53.67 s gammaloop-nextest-docs> ========== nextest test summary ==========
  566. 53.67 s gammaloop-nextest-docs> report: target/nextest/ci_gammaloop/junit.xml
  567. 53.67 s gammaloop-nextest-docs> tests: 89, failures: 0, errors: 0
  568. 53.67 s gammaloop-nextest-docs> No failing testcases found.
  569. 53.67 s gammaloop-nextest-docs> =========================================
  570. 53.69 s gammaloop-nextest-docs> Extracting 2 binaries to /build/source
  571. 53.73 s gammaloop-nextest-docs> Extracted 5 files to /build/source in 0.04s
  572. 53.74 s gammaloop-nextest-docs> ------------
  573. 53.74 s gammaloop-nextest-docs> Nextest run ID d66cef77-e0b9-4a5b-aa23-e5299ac134fb with nextest profile: ci_gammaloop
  574. 53.74 s gammaloop-nextest-docs> Starting 10 tests across 2 binaries
  575. 67.88 s gammaloop-nextest-docs> ------------
  576. 67.88 s gammaloop-nextest-docs> Summary [ 14.134s] 10 tests run: 10 passed, 0 skipped
  577. 67.91 s gammaloop-nextest-docs>
  578. 67.91 s gammaloop-nextest-docs> ========== nextest test summary ==========
  579. 67.91 s gammaloop-nextest-docs> report: target/nextest/ci_gammaloop/junit.xml
  580. 67.91 s gammaloop-nextest-docs> tests: 10, failures: 0, errors: 0
  581. 67.91 s gammaloop-nextest-docs> No failing testcases found.
  582. 67.91 s gammaloop-nextest-docs> =========================================
  583. 67.92 s gammaloop-nextest-docs> Extracting 1 binary to /build/source
  584. 67.96 s gammaloop-nextest-docs> Extracted 4 files to /build/source in 0.04s
  585. 67.97 s gammaloop-nextest-docs> ------------
  586. 67.97 s gammaloop-nextest-docs> Nextest run ID c19913be-9006-4b89-a808-4f4e23bdb31b with nextest profile: ci_gammaloop
  587. 67.97 s gammaloop-nextest-docs> Starting 0 tests across 1 binary
  588. 67.97 s gammaloop-nextest-docs> ------------
  589. 67.97 s gammaloop-nextest-docs> Summary [ 0.000s] 0 tests run: 0 passed, 0 skipped
  590. 68.00 s gammaloop-nextest-docs>
  591. 68.00 s gammaloop-nextest-docs> ========== nextest test summary ==========
  592. 68.00 s gammaloop-nextest-docs> report: target/nextest/ci_gammaloop/junit.xml
  593. 68.00 s gammaloop-nextest-docs> tests: 0, failures: 0, errors: 0
  594. 68.00 s gammaloop-nextest-docs> No failing testcases found.
  595. 68.00 s gammaloop-nextest-docs> =========================================
  596. 68.01 s gammaloop-nextest-docs> Extracting 1 binary to /build/source
  597. 68.04 s gammaloop-nextest-docs> Extracted 4 files to /build/source in 0.03s
  598. 68.05 s gammaloop-nextest-docs> ------------
  599. 68.05 s gammaloop-nextest-docs> Nextest run ID d10a8cc0-4fc6-4236-88e6-5eb0c3efde0c with nextest profile: ci_gammaloop
  600. 68.05 s gammaloop-nextest-docs> Starting 5 tests across 1 binary
  601. 68.06 s gammaloop-nextest-docs> ------------
  602. 68.06 s gammaloop-nextest-docs> Summary [ 0.005s] 5 tests run: 5 passed, 0 skipped
  603. 68.08 s gammaloop-nextest-docs>
  604. 68.08 s gammaloop-nextest-docs> ========== nextest test summary ==========
  605. 68.08 s gammaloop-nextest-docs> report: target/nextest/ci_gammaloop/junit.xml
  606. 68.08 s gammaloop-nextest-docs> tests: 5, failures: 0, errors: 0
  607. 68.08 s gammaloop-nextest-docs> No failing testcases found.
  608. 68.08 s gammaloop-nextest-docs> =========================================
  609. 68.30 s error: Cannot build '/nix/store/j3ypjrjxbfx4wvk2yf701zibxcq3r55s-gammaloop-nextest-docs.drv'.
  610. 68.30 s Reason: builder failed with exit code 100.
  611. 68.30 s Output paths:
  612. 68.30 s /nix/store/9f8zknw7c0k8r0kjl64k88f0h0ihmaa2-gammaloop-nextest-docs
  613. 68.30 s Last 584 log lines:
  614. 68.30 s > Extracting 2 binaries to /build/source
  615. 68.30 s > Extracted 5 files to /build/source in 0.06s
  616. 68.30 s > ------------
  617. 68.30 s > Nextest run ID 10946950-5bc2-44e0-9ba7-b6800ac99ccb with nextest profile: ci_gammaloop
  618. 68.30 s > Starting 129 tests across 2 binaries
  619. 68.30 s > FAIL [ 0.134s] ( 59/129) alphal00p-docs-builder tests::checked_in_registry_is_valid
  620. 68.30 s > stdout ---
  621. 68.30 s >
  622. 68.30 s > running 1 test
  623. 68.30 s > test tests::checked_in_registry_is_valid ... FAILED
  624. 68.30 s >
  625. 68.30 s > failures:
  626. 68.30 s >
  627. 68.30 s > failures:
  628. 68.30 s > tests::checked_in_registry_is_valid
  629. 68.30 s >
  630. 68.30 s > test result: FAILED. 0 passed; 1 failed; 0 ignored; 0 measured; 128 filtered out; finished in 0.12s
  631. 68.30 s >
  632. 68.30 s > stderr ---
  633. 68.30 s >
  634. 68.30 s > thread 'tests::checked_in_registry_is_valid' (216) panicked at crates/alphal00p-docs-builder/src/lib.rs:12178:50:
  635. 68.30 s > called `Result::unwrap()` on an `Err` value: developer note nix-crane-cache-reuse verified scope nix/rust-workspace.nix changed (expected 66f700580ce13b9eaee90fe0111639e46968c531, found 0a568cb5712045aee37d96bfb2f91d3d32b7e9b9); owner review or an explicit no-impact attestation is required
  636. 68.30 s >
  637. 68.30 s > Location:
  638. 68.30 s > crates/alphal00p-docs-builder/src/lib.rs:992:29
  639. 68.30 s > stack backtrace:
  640. 68.30 s > 0: __rustc::rust_begin_unwind
  641. 68.30 s > 1: core::panicking::panic_fmt
  642. 68.30 s > 2: core::result::unwrap_failed
  643. 68.30 s > 3: alphal00p_docs_builder::tests::checked_in_registry_is_valid
  644. 68.30 s > 4: <alphal00p_docs_builder::tests::checked_in_registry_is_valid::{closure#0} as core::ops::function::FnOnce<()>>::call_once
  645. 68.30 s > note: Some details are omitted, run with `RUST_BACKTRACE=full` for a verbose backtrace.
  646. 68.30 s >
  647. 68.30 s > FAIL [ 0.128s] ( 63/129) alphal00p-docs-builder tests::developer_scope_ranges_ignore_unrelated_edits_and_warn_only_while_watching
  648. 68.30 s > stdout ---
  649. 68.30 s >
  650. 68.30 s > running 1 test
  651. 68.30 s > test tests::developer_scope_ranges_ignore_unrelated_edits_and_warn_only_while_watching ... FAILED
  652. 68.30 s >
  653. 68.30 s > failures:
  654. 68.30 s >
  655. 68.30 s > failures:
  656. 68.30 s > tests::developer_scope_ranges_ignore_unrelated_edits_and_warn_only_while_watching
  657. 68.30 s >
  658. 68.30 s > test result: FAILED. 0 passed; 1 failed; 0 ignored; 0 measured; 128 filtered out; finished in 0.12s
  659. 68.30 s >
  660. 68.30 s > stderr ---
  661. 68.30 s >
  662. 68.30 s > thread 'tests::developer_scope_ranges_ignore_unrelated_edits_and_warn_only_while_watching' (278) panicked at crates/alphal00p-docs-builder/src/lib.rs:12263:29:
  663. 68.30 s > called `Result::unwrap()` on an `Err` value: developer note nix-crane-cache-reuse verified scope nix/rust-workspace.nix changed (expected 66f700580ce13b9eaee90fe0111639e46968c531, found 0a568cb5712045aee37d96bfb2f91d3d32b7e9b9); owner review or an explicit no-impact attestation is required
  664. 68.30 s >
  665. 68.30 s > Location:
  666. 68.30 s > crates/alphal00p-docs-builder/src/lib.rs:992:29
  667. 68.30 s > stack backtrace:
  668. 68.30 s > 0: __rustc::rust_begin_unwind
  669. 68.30 s > 1: core::panicking::panic_fmt
  670. 68.30 s > 2: core::result::unwrap_failed
  671. 68.30 s > 3: alphal00p_docs_builder::tests::developer_scope_ranges_ignore_unrelated_edits_and_warn_only_while_watching
  672. 68.30 s > 4: <alphal00p_docs_builder::tests::developer_scope_ranges_ignore_unrelated_edits_and_warn_only_while_watching::{closure#0} as core::ops::function::FnOnce<()>>::call_once
  673. 68.30 s > note: Some details are omitted, run with `RUST_BACKTRACE=full` for a verbose backtrace.
  674. 68.30 s >
  675. 68.30 s > FAIL [ 0.154s] ( 66/129) alphal00p-docs-builder provenance_tests::each_build_captures_one_revision_before_rendering
  676. 68.30 s > stdout ---
  677. 68.30 s >
  678. 68.30 s > running 1 test
  679. 68.30 s >
  680. 68.30 s > running 1 test
  681. 68.30 s > test provenance_tests::each_build_captures_one_revision_before_rendering ... FAILED
  682. 68.30 s >
  683. 68.30 s > failures:
  684. 68.30 s >
  685. 68.30 s > failures:
  686. 68.30 s > provenance_tests::each_build_captures_one_revision_before_rendering
  687. 68.30 s >
  688. 68.30 s > test result: FAILED. 0 passed; 1 failed; 0 ignored; 0 measured; 128 filtered out; finished in 0.13s
  689. 68.30 s >
  690. 68.30 s > test provenance_tests::each_build_captures_one_revision_before_rendering ... FAILED
  691. 68.30 s >
  692. 68.30 s > failures:
  693. 68.30 s >
  694. 68.30 s > failures:
  695. 68.30 s > provenance_tests::each_build_captures_one_revision_before_rendering
  696. 68.30 s >
  697. 68.30 s > test result: FAILED. 0 passed; 1 failed; 0 ignored; 0 measured; 128 filtered out; finished in 0.15s
  698. 68.30 s >
  699. 68.30 s > stderr ---
  700. 68.30 s >
  701. 68.30 s > thread 'provenance_tests::each_build_captures_one_revision_before_rendering' (248) panicked at crates/alphal00p-docs-builder/src/provenance_tests.rs:297:14:
  702. 68.30 s > called `Result::unwrap()` on an `Err` value: developer note nix-crane-cache-reuse verified scope nix/rust-workspace.nix changed (expected 66f700580ce13b9eaee90fe0111639e46968c531, found 0a568cb5712045aee37d96bfb2f91d3d32b7e9b9); owner review or an explicit no-impact attestation is required
  703. 68.30 s >
  704. 68.30 s > Location:
  705. 68.30 s > crates/alphal00p-docs-builder/src/lib.rs:992:29
  706. 68.30 s > stack backtrace:
  707. 68.30 s > 0: __rustc::rust_begin_unwind
  708. 68.30 s > 1: core::panicking::panic_fmt
  709. 68.30 s > 2: core::result::unwrap_failed
  710. 68.30 s > 3: alphal00p_docs_builder::provenance_tests::each_build_captures_one_revision_before_rendering
  711. 68.30 s > 4: <alphal00p_docs_builder::provenance_tests::each_build_captures_one_revision_before_rendering::{closure#0} as core::ops::function::FnOnce<()>>::call_once
  712. 68.30 s > note: Some details are omitted, run with `RUST_BACKTRACE=full` for a verbose backtrace.
  713. 68.30 s >
  714. 68.30 s > thread 'provenance_tests::each_build_captures_one_revision_before_rendering' (166) panicked at crates/alphal00p-docs-builder/src/provenance_tests.rs:274:9:
  715. 68.30 s > assertion failed: command.status().unwrap().success()
  716. 68.30 s > stack backtrace:
  717. 68.30 s > 0: __rustc::rust_begin_unwind
  718. 68.30 s > 1: core::panicking::panic_fmt
  719. 68.30 s > 2: core::panicking::panic
  720. 68.30 s > 3: alphal00p_docs_builder::provenance_tests::each_build_captures_one_revision_before_rendering
  721. 68.30 s > 4: <alphal00p_docs_builder::provenance_tests::each_build_captures_one_revision_before_rendering::{closure#0} as core::ops::function::FnOnce<()>>::call_once
  722. 68.30 s > note: Some details are omitted, run with `RUST_BACKTRACE=full` for a verbose backtrace.
  723. 68.30 s >
  724. 68.30 s > FAIL [ 0.137s] ( 69/129) alphal00p-docs-builder tests::every_product_requires_a_task_chooser_and_each_supported_interface
  725. 68.30 s > stdout ---
  726. 68.30 s >
  727. 68.30 s > running 1 test
  728. 68.30 s > test tests::every_product_requires_a_task_chooser_and_each_supported_interface ... FAILED
  729. 68.30 s >
  730. 68.30 s > failures:
  731. 68.30 s >
  732. 68.30 s > failures:
  733. 68.30 s > tests::every_product_requires_a_task_chooser_and_each_supported_interface
  734. 68.30 s >
  735. 68.30 s > test result: FAILED. 0 passed; 1 failed; 0 ignored; 0 measured; 128 filtered out; finished in 0.13s
  736. 68.30 s >
  737. 68.30 s > stderr ---
  738. 68.30 s >
  739. 68.30 s > thread 'tests::every_product_requires_a_task_chooser_and_each_supported_interface' (302) panicked at crates/alphal00p-docs-builder/src/lib.rs:12192:9:
  740. 68.30 s > assertion failed: format!("{error:#}").contains("has no quickstart page")
  741. 68.30 s > stack backtrace:
  742. 68.30 s > 0: __rustc::rust_begin_unwind
  743. 68.30 s > 1: core::panicking::panic_fmt
  744. 68.30 s > 2: core::panicking::panic
  745. 68.30 s > 3: alphal00p_docs_builder::tests::every_product_requires_a_task_chooser_and_each_supported_interface
  746. 68.30 s > 4: <alphal00p_docs_builder::tests::every_product_requires_a_task_chooser_and_each_supported_interface::{closure#0} as core::ops::function::FnOnce<()>>::call_once
  747. 68.30 s > note: Some details are omitted, run with `RUST_BACKTRACE=full` for a verbose backtrace.
  748. 68.30 s >
  749. 68.30 s > FAIL [ 0.131s] ( 90/129) alphal00p-docs-builder tests::pdf_manual_chapter_order_must_match_the_page_registry
  750. 68.30 s > stdout ---
  751. 68.30 s >
  752. 68.30 s > running 1 test
  753. 68.30 s > test tests::pdf_manual_chapter_order_must_match_the_page_registry ... FAILED
  754. 68.30 s >
  755. 68.30 s > failures:
  756. 68.30 s >
  757. 68.30 s > failures:
  758. 68.30 s > tests::pdf_manual_chapter_order_must_match_the_page_registry
  759. 68.30 s >
  760. 68.30 s > test result: FAILED. 0 passed; 1 failed; 0 ignored; 0 measured; 128 filtered out; finished in 0.12s
  761. 68.30 s >
  762. 68.30 s > stderr ---
  763. 68.30 s >
  764. 68.30 s > thread 'tests::pdf_manual_chapter_order_must_match_the_page_registry' (424) panicked at crates/alphal00p-docs-builder/src/lib.rs:12243:9:
  765. 68.30 s > assertion failed: format!("{error:#}").contains("PDF manual chapter order differs")
  766. 68.30 s > stack backtrace:
  767. 68.30 s > 0: __rustc::rust_begin_unwind
  768. 68.30 s > 1: core::panicking::panic_fmt
  769. 68.30 s > 2: core::panicking::panic
  770. 68.30 s > 3: alphal00p_docs_builder::tests::pdf_manual_chapter_order_must_match_the_page_registry
  771. 68.30 s > 4: <alphal00p_docs_builder::tests::pdf_manual_chapter_order_must_match_the_page_registry::{closure#0} as core::ops::function::FnOnce<()>>::call_once
  772. 68.30 s > note: Some details are omitted, run with `RUST_BACKTRACE=full` for a verbose backtrace.
  773. 68.30 s >
  774. 68.30 s > ------------
  775. 68.30 s > Summary [ 24.012s] 129 tests run: 124 passed, 5 failed, 0 skipped
  776. 68.30 s > FAIL [ 0.134s] ( 59/129) alphal00p-docs-builder tests::checked_in_registry_is_valid
  777. 68.30 s > stdout ---
  778. 68.30 s >
  779. 68.30 s > running 1 test
  780. 68.30 s > test tests::checked_in_registry_is_valid ... FAILED
  781. 68.30 s >
  782. 68.30 s > failures:
  783. 68.30 s >
  784. 68.30 s > failures:
  785. 68.30 s > tests::checked_in_registry_is_valid
  786. 68.30 s >
  787. 68.30 s > test result: FAILED. 0 passed; 1 failed; 0 ignored; 0 measured; 128 filtered out; finished in 0.12s
  788. 68.30 s >
  789. 68.30 s > stderr ---
  790. 68.30 s >
  791. 68.30 s > thread 'tests::checked_in_registry_is_valid' (216) panicked at crates/alphal00p-docs-builder/src/lib.rs:12178:50:
  792. 68.30 s > called `Result::unwrap()` on an `Err` value: developer note nix-crane-cache-reuse verified scope nix/rust-workspace.nix changed (expected 66f700580ce13b9eaee90fe0111639e46968c531, found 0a568cb5712045aee37d96bfb2f91d3d32b7e9b9); owner review or an explicit no-impact attestation is required
  793. 68.30 s >
  794. 68.30 s > Location:
  795. 68.30 s > crates/alphal00p-docs-builder/src/lib.rs:992:29
  796. 68.30 s > stack backtrace:
  797. 68.30 s > 0: __rustc::rust_begin_unwind
  798. 68.30 s > 1: core::panicking::panic_fmt
  799. 68.30 s > 2: core::result::unwrap_failed
  800. 68.30 s > 3: alphal00p_docs_builder::tests::checked_in_registry_is_valid
  801. 68.30 s > 4: <alphal00p_docs_builder::tests::checked_in_registry_is_valid::{closure#0} as core::ops::function::FnOnce<()>>::call_once
  802. 68.30 s > note: Some details are omitted, run with `RUST_BACKTRACE=full` for a verbose backtrace.
  803. 68.30 s >
  804. 68.30 s > FAIL [ 0.128s] ( 63/129) alphal00p-docs-builder tests::developer_scope_ranges_ignore_unrelated_edits_and_warn_only_while_watching
  805. 68.30 s > stdout ---
  806. 68.30 s >
  807. 68.30 s > running 1 test
  808. 68.30 s > test tests::developer_scope_ranges_ignore_unrelated_edits_and_warn_only_while_watching ... FAILED
  809. 68.30 s >
  810. 68.30 s > failures:
  811. 68.30 s >
  812. 68.30 s > failures:
  813. 68.30 s > tests::developer_scope_ranges_ignore_unrelated_edits_and_warn_only_while_watching
  814. 68.30 s >
  815. 68.30 s > test result: FAILED. 0 passed; 1 failed; 0 ignored; 0 measured; 128 filtered out; finished in 0.12s
  816. 68.30 s >
  817. 68.30 s > stderr ---
  818. 68.30 s >
  819. 68.30 s > thread 'tests::developer_scope_ranges_ignore_unrelated_edits_and_warn_only_while_watching' (278) panicked at crates/alphal00p-docs-builder/src/lib.rs:12263:29:
  820. 68.30 s > called `Result::unwrap()` on an `Err` value: developer note nix-crane-cache-reuse verified scope nix/rust-workspace.nix changed (expected 66f700580ce13b9eaee90fe0111639e46968c531, found 0a568cb5712045aee37d96bfb2f91d3d32b7e9b9); owner review or an explicit no-impact attestation is required
  821. 68.30 s >
  822. 68.30 s > Location:
  823. 68.30 s > crates/alphal00p-docs-builder/src/lib.rs:992:29
  824. 68.30 s > stack backtrace:
  825. 68.30 s > 0: __rustc::rust_begin_unwind
  826. 68.30 s > 1: core::panicking::panic_fmt
  827. 68.30 s > 2: core::result::unwrap_failed
  828. 68.30 s > 3: alphal00p_docs_builder::tests::developer_scope_ranges_ignore_unrelated_edits_and_warn_only_while_watching
  829. 68.30 s > 4: <alphal00p_docs_builder::tests::developer_scope_ranges_ignore_unrelated_edits_and_warn_only_while_watching::{closure#0} as core::ops::function::FnOnce<()>>::call_once
  830. 68.30 s > note: Some details are omitted, run with `RUST_BACKTRACE=full` for a verbose backtrace.
  831. 68.30 s >
  832. 68.30 s > FAIL [ 0.154s] ( 66/129) alphal00p-docs-builder provenance_tests::each_build_captures_one_revision_before_rendering
  833. 68.30 s > stdout ---
  834. 68.30 s >
  835. 68.30 s > running 1 test
  836. 68.30 s >
  837. 68.30 s > running 1 test
  838. 68.30 s > test provenance_tests::each_build_captures_one_revision_before_rendering ... FAILED
  839. 68.30 s >
  840. 68.30 s > failures:
  841. 68.30 s >
  842. 68.30 s > failures:
  843. 68.30 s > provenance_tests::each_build_captures_one_revision_before_rendering
  844. 68.30 s >
  845. 68.30 s > test result: FAILED. 0 passed; 1 failed; 0 ignored; 0 measured; 128 filtered out; finished in 0.13s
  846. 68.30 s >
  847. 68.30 s > test provenance_tests::each_build_captures_one_revision_before_rendering ... FAILED
  848. 68.30 s >
  849. 68.30 s > failures:
  850. 68.30 s >
  851. 68.30 s > failures:
  852. 68.30 s > provenance_tests::each_build_captures_one_revision_before_rendering
  853. 68.30 s >
  854. 68.30 s > test result: FAILED. 0 passed; 1 failed; 0 ignored; 0 measured; 128 filtered out; finished in 0.15s
  855. 68.30 s >
  856. 68.30 s > stderr ---
  857. 68.30 s >
  858. 68.30 s > thread 'provenance_tests::each_build_captures_one_revision_before_rendering' (248) panicked at crates/alphal00p-docs-builder/src/provenance_tests.rs:297:14:
  859. 68.30 s > called `Result::unwrap()` on an `Err` value: developer note nix-crane-cache-reuse verified scope nix/rust-workspace.nix changed (expected 66f700580ce13b9eaee90fe0111639e46968c531, found 0a568cb5712045aee37d96bfb2f91d3d32b7e9b9); owner review or an explicit no-impact attestation is required
  860. 68.30 s >
  861. 68.30 s > Location:
  862. 68.30 s > crates/alphal00p-docs-builder/src/lib.rs:992:29
  863. 68.30 s > stack backtrace:
  864. 68.30 s > 0: __rustc::rust_begin_unwind
  865. 68.30 s > 1: core::panicking::panic_fmt
  866. 68.30 s > 2: core::result::unwrap_failed
  867. 68.30 s > 3: alphal00p_docs_builder::provenance_tests::each_build_captures_one_revision_before_rendering
  868. 68.30 s > 4: <alphal00p_docs_builder::provenance_tests::each_build_captures_one_revision_before_rendering::{closure#0} as core::ops::function::FnOnce<()>>::call_once
  869. 68.30 s > note: Some details are omitted, run with `RUST_BACKTRACE=full` for a verbose backtrace.
  870. 68.30 s >
  871. 68.30 s > thread 'provenance_tests::each_build_captures_one_revision_before_rendering' (166) panicked at crates/alphal00p-docs-builder/src/provenance_tests.rs:274:9:
  872. 68.30 s > assertion failed: command.status().unwrap().success()
  873. 68.30 s > stack backtrace:
  874. 68.30 s > 0: __rustc::rust_begin_unwind
  875. 68.30 s > 1: core::panicking::panic_fmt
  876. 68.30 s > 2: core::panicking::panic
  877. 68.30 s > 3: alphal00p_docs_builder::provenance_tests::each_build_captures_one_revision_before_rendering
  878. 68.30 s > 4: <alphal00p_docs_builder::provenance_tests::each_build_captures_one_revision_before_rendering::{closure#0} as core::ops::function::FnOnce<()>>::call_once
  879. 68.30 s > note: Some details are omitted, run with `RUST_BACKTRACE=full` for a verbose backtrace.
  880. 68.30 s >
  881. 68.30 s > FAIL [ 0.137s] ( 69/129) alphal00p-docs-builder tests::every_product_requires_a_task_chooser_and_each_supported_interface
  882. 68.30 s > stdout ---
  883. 68.30 s >
  884. 68.30 s > running 1 test
  885. 68.30 s > test tests::every_product_requires_a_task_chooser_and_each_supported_interface ... FAILED
  886. 68.30 s >
  887. 68.30 s > failures:
  888. 68.30 s >
  889. 68.30 s > failures:
  890. 68.30 s > tests::every_product_requires_a_task_chooser_and_each_supported_interface
  891. 68.30 s >
  892. 68.30 s > test result: FAILED. 0 passed; 1 failed; 0 ignored; 0 measured; 128 filtered out; finished in 0.13s
  893. 68.30 s >
  894. 68.30 s > stderr ---
  895. 68.30 s >
  896. 68.30 s > thread 'tests::every_product_requires_a_task_chooser_and_each_supported_interface' (302) panicked at crates/alphal00p-docs-builder/src/lib.rs:12192:9:
  897. 68.30 s > assertion failed: format!("{error:#}").contains("has no quickstart page")
  898. 68.30 s > stack backtrace:
  899. 68.30 s > 0: __rustc::rust_begin_unwind
  900. 68.30 s > 1: core::panicking::panic_fmt
  901. 68.30 s > 2: core::panicking::panic
  902. 68.30 s > 3: alphal00p_docs_builder::tests::every_product_requires_a_task_chooser_and_each_supported_interface
  903. 68.30 s > 4: <alphal00p_docs_builder::tests::every_product_requires_a_task_chooser_and_each_supported_interface::{closure#0} as core::ops::function::FnOnce<()>>::call_once
  904. 68.30 s > note: Some details are omitted, run with `RUST_BACKTRACE=full` for a verbose backtrace.
  905. 68.30 s >
  906. 68.30 s > FAIL [ 0.131s] ( 90/129) alphal00p-docs-builder tests::pdf_manual_chapter_order_must_match_the_page_registry
  907. 68.30 s > stdout ---
  908. 68.30 s >
  909. 68.30 s > running 1 test
  910. 68.30 s > test tests::pdf_manual_chapter_order_must_match_the_page_registry ... FAILED
  911. 68.30 s >
  912. 68.30 s > failures:
  913. 68.30 s >
  914. 68.30 s > failures:
  915. 68.30 s > tests::pdf_manual_chapter_order_must_match_the_page_registry
  916. 68.30 s >
  917. 68.30 s > test result: FAILED. 0 passed; 1 failed; 0 ignored; 0 measured; 128 filtered out; finished in 0.12s
  918. 68.30 s >
  919. 68.30 s > stderr ---
  920. 68.30 s >
  921. 68.30 s > thread 'tests::pdf_manual_chapter_order_must_match_the_page_registry' (424) panicked at crates/alphal00p-docs-builder/src/lib.rs:12243:9:
  922. 68.30 s > assertion failed: format!("{error:#}").contains("PDF manual chapter order differs")
  923. 68.30 s > stack backtrace:
  924. 68.30 s > 0: __rustc::rust_begin_unwind
  925. 68.30 s > 1: core::panicking::panic_fmt
  926. 68.30 s > 2: core::panicking::panic
  927. 68.30 s > 3: alphal00p_docs_builder::tests::pdf_manual_chapter_order_must_match_the_page_registry
  928. 68.30 s > 4: <alphal00p_docs_builder::tests::pdf_manual_chapter_order_must_match_the_page_registry::{closure#0} as core::ops::function::FnOnce<()>>::call_once
  929. 68.30 s > note: Some details are omitted, run with `RUST_BACKTRACE=full` for a verbose backtrace.
  930. 68.30 s >
  931. 68.30 s > error: test run failed
  932. 68.30 s >
  933. 68.30 s > ========== nextest test summary ==========
  934. 68.30 s > report: target/nextest/ci_gammaloop/junit.xml
  935. 68.30 s > tests: 129, failures: 5, errors: 0
  936. 68.30 s >
  937. 68.30 s > 1. alphal00p-docs-builder::tests::checked_in_registry_is_valid
  938. 68.30 s > failure: test failure with exit code 101
  939. 68.30 s > thread 'tests::checked_in_registry_is_valid' (216) panicked at crates/alphal00p-docs-builder/src/lib.rs:12178:50:
  940. 68.30 s > called `Result::unwrap()` on an `Err` value: developer note nix-crane-cache-reuse verified scope nix/rust-workspace.nix changed (expected 66f700580ce13b9eaee90fe0111639e46968c531, found 0a568cb5712045aee37d96bfb2f91d3d32b7e9b9); owner review or an explicit no-impact attestation is required
  941. 68.30 s >
  942. 68.30 s > Location:
  943. 68.30 s > crates/alphal00p-docs-builder/src/lib.rs:992:29
  944. 68.30 s > stack backtrace:
  945. 68.30 s > 0: __rustc::rust_begin_unwind
  946. 68.30 s > 1: core::panicking::panic_fmt
  947. 68.30 s > 2: core::result::unwrap_failed
  948. 68.30 s > 3: alphal00p_docs_builder::tests::checked_in_registry_is_valid
  949. 68.30 s > 4: <alphal00p_docs_builder::tests::checked_in_registry_is_valid::{closure#0} as core::ops::function::FnOnce<()>>::call_once
  950. 68.30 s > note: Some details are omitted, run with `RUST_BACKTRACE=full` for a verbose backtrace.
  951. 68.30 s > system-out
  952. 68.30 s > running 1 test
  953. 68.30 s > test tests::checked_in_registry_is_valid ... FAILED
  954. 68.30 s >
  955. 68.30 s > failures:
  956. 68.30 s >
  957. 68.30 s > failures:
  958. 68.30 s > tests::checked_in_registry_is_valid
  959. 68.30 s >
  960. 68.30 s > test result: FAILED. 0 passed; 1 failed; 0 ignored; 0 measured; 128 filtered out; finished in 0.12s
  961. 68.30 s > system-err
  962. 68.30 s > thread 'tests::checked_in_registry_is_valid' (216) panicked at crates/alphal00p-docs-builder/src/lib.rs:12178:50:
  963. 68.30 s > called `Result::unwrap()` on an `Err` value: developer note nix-crane-cache-reuse verified scope nix/rust-workspace.nix changed (expected 66f700580ce13b9eaee90fe0111639e46968c531, found 0a568cb5712045aee37d96bfb2f91d3d32b7e9b9); owner review or an explicit no-impact attestation is required
  964. 68.30 s >
  965. 68.30 s > Location:
  966. 68.30 s > crates/alphal00p-docs-builder/src/lib.rs:992:29
  967. 68.30 s > stack backtrace:
  968. 68.30 s > 0: __rustc::rust_begin_unwind
  969. 68.30 s > 1: core::panicking::panic_fmt
  970. 68.30 s > 2: core::result::unwrap_failed
  971. 68.30 s > 3: alphal00p_docs_builder::tests::checked_in_registry_is_valid
  972. 68.30 s > 4: <alphal00p_docs_builder::tests::checked_in_registry_is_valid::{closure#0} as core::ops::function::FnOnce<()>>::call_once
  973. 68.30 s > note: Some details are omitted, run with `RUST_BACKTRACE=full` for a verbose backtrace.
  974. 68.30 s >
  975. 68.30 s > 2. alphal00p-docs-builder::tests::developer_scope_ranges_ignore_unrelated_edits_and_warn_only_while_watching
  976. 68.30 s > failure: test failure with exit code 101
  977. 68.30 s > thread 'tests::developer_scope_ranges_ignore_unrelated_edits_and_warn_only_while_watching' (278) panicked at crates/alphal00p-docs-builder/src/lib.rs:12263:29:
  978. 68.30 s > called `Result::unwrap()` on an `Err` value: developer note nix-crane-cache-reuse verified scope nix/rust-workspace.nix changed (expected 66f700580ce13b9eaee90fe0111639e46968c531, found 0a568cb5712045aee37d96bfb2f91d3d32b7e9b9); owner review or an explicit no-impact attestation is required
  979. 68.30 s >
  980. 68.30 s > Location:
  981. 68.30 s > crates/alphal00p-docs-builder/src/lib.rs:992:29
  982. 68.30 s > stack backtrace:
  983. 68.30 s > 0: __rustc::rust_begin_unwind
  984. 68.30 s > 1: core::panicking::panic_fmt
  985. 68.30 s > 2: core::result::unwrap_failed
  986. 68.30 s > 3: alphal00p_docs_builder::tests::developer_scope_ranges_ignore_unrelated_edits_and_warn_only_while_watching
  987. 68.30 s > 4: <alphal00p_docs_builder::tests::developer_scope_ranges_ignore_unrelated_edits_and_warn_only_while_watching::{closure#0} as core::ops::function::FnOnce<()>>::call_once
  988. 68.30 s > note: Some details are omitted, run with `RUST_BACKTRACE=full` for a verbose backtrace.
  989. 68.30 s > system-out
  990. 68.30 s > running 1 test
  991. 68.30 s > test tests::developer_scope_ranges_ignore_unrelated_edits_and_warn_only_while_watching ... FAILED
  992. 68.30 s >
  993. 68.30 s > failures:
  994. 68.30 s >
  995. 68.30 s > failures:
  996. 68.30 s > tests::developer_scope_ranges_ignore_unrelated_edits_and_warn_only_while_watching
  997. 68.30 s >
  998. 68.30 s > test result: FAILED. 0 passed; 1 failed; 0 ignored; 0 measured; 128 filtered out; finished in 0.12s
  999. 68.30 s > system-err
  1000. 68.30 s > thread 'tests::developer_scope_ranges_ignore_unrelated_edits_and_warn_only_while_watching' (278) panicked at crates/alphal00p-docs-builder/src/lib.rs:12263:29:
  1001. 68.30 s > called `Result::unwrap()` on an `Err` value: developer note nix-crane-cache-reuse verified scope nix/rust-workspace.nix changed (expected 66f700580ce13b9eaee90fe0111639e46968c531, found 0a568cb5712045aee37d96bfb2f91d3d32b7e9b9); owner review or an explicit no-impact attestation is required
  1002. 68.30 s >
  1003. 68.30 s > Location:
  1004. 68.30 s > crates/alphal00p-docs-builder/src/lib.rs:992:29
  1005. 68.30 s > stack backtrace:
  1006. 68.30 s > 0: __rustc::rust_begin_unwind
  1007. 68.30 s > 1: core::panicking::panic_fmt
  1008. 68.30 s > 2: core::result::unwrap_failed
  1009. 68.30 s > 3: alphal00p_docs_builder::tests::developer_scope_ranges_ignore_unrelated_edits_and_warn_only_while_watching
  1010. 68.30 s > 4: <alphal00p_docs_builder::tests::developer_scope_ranges_ignore_unrelated_edits_and_warn_only_while_watching::{closure#0} as core::ops::function::FnOnce<()>>::call_once
  1011. 68.30 s > note: Some details are omitted, run with `RUST_BACKTRACE=full` for a verbose backtrace.
  1012. 68.30 s >
  1013. 68.30 s > 3. alphal00p-docs-builder::provenance_tests::each_build_captures_one_revision_before_rendering
  1014. 68.30 s > failure: test failure with exit code 101
  1015. 68.30 s > thread 'provenance_tests::each_build_captures_one_revision_before_rendering' (166) panicked at crates/alphal00p-docs-builder/src/provenance_tests.rs:274:9:
  1016. 68.30 s > assertion failed: command.status().unwrap().success()
  1017. 68.30 s > stack backtrace:
  1018. 68.30 s > 0: __rustc::rust_begin_unwind
  1019. 68.30 s > 1: core::panicking::panic_fmt
  1020. 68.30 s > 2: core::panicking::panic
  1021. 68.30 s > 3: alphal00p_docs_builder::provenance_tests::each_build_captures_one_revision_before_rendering
  1022. 68.30 s > 4: <alphal00p_docs_builder::provenance_tests::each_build_captures_one_revision_before_rendering::{closure#0} as core::ops::function::FnOnce<()>>::call_once
  1023. 68.30 s > note: Some details are omitted, run with `RUST_BACKTRACE=full` for a verbose backtrace.
  1024. 68.30 s > system-out
  1025. 68.30 s > running 1 test
  1026. 68.30 s >
  1027. 68.30 s > running 1 test
  1028. 68.30 s > test provenance_tests::each_build_captures_one_revision_before_rendering ... FAILED
  1029. 68.30 s >
  1030. 68.30 s > failures:
  1031. 68.30 s >
  1032. 68.30 s > failures:
  1033. 68.30 s > provenance_tests::each_build_captures_one_revision_before_rendering
  1034. 68.30 s >
  1035. 68.30 s > test result: FAILED. 0 passed; 1 failed; 0 ignored; 0 measured; 128 filtered out; finished in 0.13s
  1036. 68.30 s >
  1037. 68.30 s > test provenance_tests::each_build_captures_one_revision_before_rendering ... FAILED
  1038. 68.30 s >
  1039. 68.30 s > failures:
  1040. 68.30 s >
  1041. 68.30 s > failures:
  1042. 68.30 s > provenance_tests::each_build_captures_one_revision_before_rendering
  1043. 68.30 s >
  1044. 68.30 s > test result: FAILED. 0 passed; 1 failed; 0 ignored; 0 measured; 128 filtered out; finished in 0.15s
  1045. 68.30 s > system-err
  1046. 68.30 s > thread 'provenance_tests::each_build_captures_one_revision_before_rendering' (248) panicked at crates/alphal00p-docs-builder/src/provenance_tests.rs:297:14:
  1047. 68.30 s > called `Result::unwrap()` on an `Err` value: developer note nix-crane-cache-reuse verified scope nix/rust-workspace.nix changed (expected 66f700580ce13b9eaee90fe0111639e46968c531, found 0a568cb5712045aee37d96bfb2f91d3d32b7e9b9); owner review or an explicit no-impact attestation is required
  1048. 68.30 s >
  1049. 68.30 s > Location:
  1050. 68.30 s > crates/alphal00p-docs-builder/src/lib.rs:992:29
  1051. 68.30 s > stack backtrace:
  1052. 68.30 s > 0: __rustc::rust_begin_unwind
  1053. 68.30 s > 1: core::panicking::panic_fmt
  1054. 68.30 s > 2: core::result::unwrap_failed
  1055. 68.30 s > 3: alphal00p_docs_builder::provenance_tests::each_build_captures_one_revision_before_rendering
  1056. 68.30 s > 4: <alphal00p_docs_builder::provenance_tests::each_build_captures_one_revision_before_rendering::{closure#0} as core::ops::function::FnOnce<()>>::call_once
  1057. 68.30 s > note: Some details are omitted, run with `RUST_BACKTRACE=full` for a verbose backtrace.
  1058. 68.30 s >
  1059. 68.30 s > thread 'provenance_tests::each_build_captures_one_revision_before_rendering' (166) panicked at crates/alphal00p-docs-builder/src/provenance_tests.rs:274:9:
  1060. 68.30 s > assertion failed: command.status().unwrap().success()
  1061. 68.30 s > stack backtrace:
  1062. 68.30 s > 0: __rustc::rust_begin_unwind
  1063. 68.30 s > 1: core::panicking::panic_fmt
  1064. 68.30 s > 2: core::panicking::panic
  1065. 68.30 s > 3: alphal00p_docs_builder::provenance_tests::each_build_captures_one_revision_before_rendering
  1066. 68.30 s > 4: <alphal00p_docs_builder::provenance_tests::each_build_captures_one_revision_before_rendering::{closure#0} as core::ops::function::FnOnce<()>>::call_once
  1067. 68.30 s > note: Some details are omitted, run with `RUST_BACKTRACE=full` for a verbose backtrace.
  1068. 68.30 s >
  1069. 68.30 s > 4. alphal00p-docs-builder::tests::every_product_requires_a_task_chooser_and_each_supported_interface
  1070. 68.30 s > failure: test failure with exit code 101
  1071. 68.30 s > thread 'tests::every_product_requires_a_task_chooser_and_each_supported_interface' (302) panicked at crates/alphal00p-docs-builder/src/lib.rs:12192:9:
  1072. 68.30 s > assertion failed: format!("{error:#}").contains("has no quickstart page")
  1073. 68.30 s > stack backtrace:
  1074. 68.30 s > 0: __rustc::rust_begin_unwind
  1075. 68.30 s > 1: core::panicking::panic_fmt
  1076. 68.30 s > 2: core::panicking::panic
  1077. 68.30 s > 3: alphal00p_docs_builder::tests::every_product_requires_a_task_chooser_and_each_supported_interface
  1078. 68.30 s > 4: <alphal00p_docs_builder::tests::every_product_requires_a_task_chooser_and_each_supported_interface::{closure#0} as core::ops::function::FnOnce<()>>::call_once
  1079. 68.30 s > note: Some details are omitted, run with `RUST_BACKTRACE=full` for a verbose backtrace.
  1080. 68.30 s > system-out
  1081. 68.30 s > running 1 test
  1082. 68.30 s > test tests::every_product_requires_a_task_chooser_and_each_supported_interface ... FAILED
  1083. 68.30 s >
  1084. 68.30 s > failures:
  1085. 68.30 s >
  1086. 68.30 s > failures:
  1087. 68.30 s > tests::every_product_requires_a_task_chooser_and_each_supported_interface
  1088. 68.30 s >
  1089. 68.30 s > test result: FAILED. 0 passed; 1 failed; 0 ignored; 0 measured; 128 filtered out; finished in 0.13s
  1090. 68.30 s > system-err
  1091. 68.30 s > thread 'tests::every_product_requires_a_task_chooser_and_each_supported_interface' (302) panicked at crates/alphal00p-docs-builder/src/lib.rs:12192:9:
  1092. 68.30 s > assertion failed: format!("{error:#}").contains("has no quickstart page")
  1093. 68.30 s > stack backtrace:
  1094. 68.30 s > 0: __rustc::rust_begin_unwind
  1095. 68.30 s > 1: core::panicking::panic_fmt
  1096. 68.30 s > 2: core::panicking::panic
  1097. 68.30 s > 3: alphal00p_docs_builder::tests::every_product_requires_a_task_chooser_and_each_supported_interface
  1098. 68.30 s > 4: <alphal00p_docs_builder::tests::every_product_requires_a_task_chooser_and_each_supported_interface::{closure#0} as core::ops::function::FnOnce<()>>::call_once
  1099. 68.30 s > note: Some details are omitted, run with `RUST_BACKTRACE=full` for a verbose backtrace.
  1100. 68.30 s >
  1101. 68.30 s > 5. alphal00p-docs-builder::tests::pdf_manual_chapter_order_must_match_the_page_registry
  1102. 68.30 s > failure: test failure with exit code 101
  1103. 68.30 s > thread 'tests::pdf_manual_chapter_order_must_match_the_page_registry' (424) panicked at crates/alphal00p-docs-builder/src/lib.rs:12243:9:
  1104. 68.30 s > assertion failed: format!("{error:#}").contains("PDF manual chapter order differs")
  1105. 68.30 s > stack backtrace:
  1106. 68.30 s > 0: __rustc::rust_begin_unwind
  1107. 68.30 s > 1: core::panicking::panic_fmt
  1108. 68.30 s > 2: core::panicking::panic
  1109. 68.30 s > 3: alphal00p_docs_builder::tests::pdf_manual_chapter_order_must_match_the_page_registry
  1110. 68.30 s > 4: <alphal00p_docs_builder::tests::pdf_manual_chapter_order_must_match_the_page_registry::{closure#0} as core::ops::function::FnOnce<()>>::call_once
  1111. 68.30 s > note: Some details are omitted, run with `RUST_BACKTRACE=full` for a verbose backtrace.
  1112. 68.30 s > system-out
  1113. 68.30 s > running 1 test
  1114. 68.30 s > test tests::pdf_manual_chapter_order_must_match_the_page_registry ... FAILED
  1115. 68.30 s >
  1116. 68.30 s > failures:
  1117. 68.30 s >
  1118. 68.30 s > failures:
  1119. 68.30 s > tests::pdf_manual_chapter_order_must_match_the_page_registry
  1120. 68.30 s >
  1121. 68.30 s > test result: FAILED. 0 passed; 1 failed; 0 ignored; 0 measured; 128 filtered out; finished in 0.12s
  1122. 68.30 s > system-err
  1123. 68.30 s > thread 'tests::pdf_manual_chapter_order_must_match_the_page_registry' (424) panicked at crates/alphal00p-docs-builder/src/lib.rs:12243:9:
  1124. 68.30 s > assertion failed: format!("{error:#}").contains("PDF manual chapter order differs")
  1125. 68.30 s > stack backtrace:
  1126. 68.30 s > 0: __rustc::rust_begin_unwind
  1127. 68.30 s > 1: core::panicking::panic_fmt
  1128. 68.30 s > 2: core::panicking::panic
  1129. 68.30 s > 3: alphal00p_docs_builder::tests::pdf_manual_chapter_order_must_match_the_page_registry
  1130. 68.30 s > 4: <alphal00p_docs_builder::tests::pdf_manual_chapter_order_must_match_the_page_registry::{closure#0} as core::ops::function::FnOnce<()>>::call_once
  1131. 68.30 s > note: Some details are omitted, run with `RUST_BACKTRACE=full` for a verbose backtrace.
  1132. 68.30 s > =========================================
  1133. 68.30 s > Extracting 2 binaries to /build/source
  1134. 68.30 s > Extracted 5 files to /build/source in 0.04s
  1135. 68.30 s > ------------
  1136. 68.30 s > Nextest run ID 4c25074c-2b12-4e33-acb2-a36214f7ec51 with nextest profile: ci_gammaloop
  1137. 68.30 s > Starting 22 tests across 2 binaries
  1138. 68.30 s > ------------
  1139. 68.30 s > Summary [ 0.025s] 22 tests run: 22 passed, 0 skipped
  1140. 68.30 s >
  1141. 68.30 s > ========== nextest test summary ==========
  1142. 68.30 s > report: target/nextest/ci_gammaloop/junit.xml
  1143. 68.30 s > tests: 22, failures: 0, errors: 0
  1144. 68.30 s > No failing testcases found.
  1145. 68.30 s > =========================================
  1146. 68.30 s > Extracting 3 binaries (including 2 non-test binaries), 1 build script output directory, and 2 linked paths to /build/source
  1147. 68.30 s > Extracted 22 files to /build/source in 0.33s
  1148. 68.30 s > ------------
  1149. 68.30 s > Nextest run ID 6c18fda9-e8b5-4fd7-8df7-e3789fa2d9c1 with nextest profile: ci_gammaloop
  1150. 68.30 s > Starting 89 tests across 1 binary
  1151. 68.30 s > ------------
  1152. 68.30 s > Summary [ 0.048s] 89 tests run: 89 passed, 0 skipped
  1153. 68.30 s >
  1154. 68.30 s > ========== nextest test summary ==========
  1155. 68.30 s > report: target/nextest/ci_gammaloop/junit.xml
  1156. 68.30 s > tests: 89, failures: 0, errors: 0
  1157. 68.30 s > No failing testcases found.
  1158. 68.30 s > =========================================
  1159. 68.30 s > Extracting 2 binaries to /build/source
  1160. 68.30 s > Extracted 5 files to /build/source in 0.04s
  1161. 68.30 s > ------------
  1162. 68.30 s > Nextest run ID d66cef77-e0b9-4a5b-aa23-e5299ac134fb with nextest profile: ci_gammaloop
  1163. 68.30 s > Starting 10 tests across 2 binaries
  1164. 68.30 s > ------------
  1165. 68.30 s > Summary [ 14.134s] 10 tests run: 10 passed, 0 skipped
  1166. 68.30 s >
  1167. 68.30 s > ========== nextest test summary ==========
  1168. 68.30 s > report: target/nextest/ci_gammaloop/junit.xml
  1169. 68.30 s > tests: 10, failures: 0, errors: 0
  1170. 68.30 s > No failing testcases found.
  1171. 68.30 s > =========================================
  1172. 68.30 s > Extracting 1 binary to /build/source
  1173. 68.30 s > Extracted 4 files to /build/source in 0.04s
  1174. 68.30 s > ------------
  1175. 68.30 s > Nextest run ID c19913be-9006-4b89-a808-4f4e23bdb31b with nextest profile: ci_gammaloop
  1176. 68.30 s > Starting 0 tests across 1 binary
  1177. 68.30 s > ------------
  1178. 68.30 s > Summary [ 0.000s] 0 tests run: 0 passed, 0 skipped
  1179. 68.30 s >
  1180. 68.30 s > ========== nextest test summary ==========
  1181. 68.30 s > report: target/nextest/ci_gammaloop/junit.xml
  1182. 68.30 s > tests: 0, failures: 0, errors: 0
  1183. 68.30 s > No failing testcases found.
  1184. 68.30 s > =========================================
  1185. 68.30 s > Extracting 1 binary to /build/source
  1186. 68.30 s > Extracted 4 files to /build/source in 0.03s
  1187. 68.30 s > ------------
  1188. 68.30 s > Nextest run ID d10a8cc0-4fc6-4236-88e6-5eb0c3efde0c with nextest profile: ci_gammaloop
  1189. 68.30 s > Starting 5 tests across 1 binary
  1190. 68.30 s > ------------
  1191. 68.30 s > Summary [ 0.005s] 5 tests run: 5 passed, 0 skipped
  1192. 68.30 s >
  1193. 68.30 s > ========== nextest test summary ==========
  1194. 68.30 s > report: target/nextest/ci_gammaloop/junit.xml
  1195. 68.30 s > tests: 5, failures: 0, errors: 0
  1196. 68.30 s > No failing testcases found.
  1197. 68.30 s > =========================================
  1198. 68.30 s For full logs, run:
  1199. 68.30 s nix log /nix/store/j3ypjrjxbfx4wvk2yf701zibxcq3r55s-gammaloop-nextest-docs.drv
  1200. 68.48 s [0 built (1 failed)]Run failed.