build packages.x86_64-linux.crate-test-binaries-three-dimensional-reps
0.00 s
$ /nix/store/9ypz3flqsrl5xl495mm8h645gadjsxi1-coreutils-9.11/bin/timeout --kill-after=15s 7200s /nix/store/23zk8sgzamrbmj1fday15szf7f2279s8-nix-2.34.7/bin/nix --extra-experimental-features nix-command --extra-experimental-features flakes --log-format internal-json build --no-link --print-out-paths git+https://github.com/alphal00p/gammaloop?ref=raised_energy_cff_wip&rev=0ad34794d0fc6dd9289afae942a88a0688b5b3fe&shallow=1#packages.x86_64-linux.crate-test-binaries-three-dimensional-reps --print-build-logs
0.65 s
error (ignored): SQLite database '/var/cache/nix-ci-worker/eval-cache-v6/3c588e75934b091d5375103ebbb7271cdeb9b9c47ddccc59a63538731c90a356.sqlite ' is busy
3.21 s
3.48 s
Building /nix/store/jw4czjjdv1cc9jr1gsiygk91yx66v8ip-gammaloop-crate-test-binaries-three-dimensional-reps-50150770f831b638-deps-0.1.0.drv
3.56 s
[gammaloop-crate-test-binaries-three-dimensional-reps-50150770f831b638-deps] Phase: unpackPhase
3.56 s
[gammaloop-crate-test-binaries-three-dimensional-reps-50150770f831b638-deps] unpacking source archive /nix/store/s1ajjdsb6bzj5dvvg360rj0kxnvgb27s-source
3.58 s
[gammaloop-crate-test-binaries-three-dimensional-reps-50150770f831b638-deps] source root is source
3.59 s
[gammaloop-crate-test-binaries-three-dimensional-reps-50150770f831b638-deps] Phase: patchPhase
3.71 s
[gammaloop-crate-test-binaries-three-dimensional-reps-50150770f831b638-deps] Executing configureCargoCommonVars
3.71 s
[gammaloop-crate-test-binaries-three-dimensional-reps-50150770f831b638-deps] copying cargo artifacts from /nix/store/71lg5z9qr6b69cp7v2y427r8blvhr0lh-gammaloop-crate-test-binaries-three-dimensional-reps-50150770f831b638-inputs/target to target
3.71 s
[gammaloop-crate-test-binaries-three-dimensional-reps-50150770f831b638-deps] will deep copy artifacts (instead of symlinking) as requested
4.70 s
[gammaloop-crate-test-binaries-three-dimensional-reps-50150770f831b638-deps] Phase: updateAutotoolsGnuConfigScriptsPhase
4.73 s
[gammaloop-crate-test-binaries-three-dimensional-reps-50150770f831b638-deps] Phase: configurePhase
4.73 s
[gammaloop-crate-test-binaries-three-dimensional-reps-50150770f831b638-deps] will append /build/source/.cargo-home/config.toml with contents of /nix/store/1sigmg52bb61pfngmk9k8wq5fz9r7bf1-vendor-cargo-deps/config.toml
4.73 s
[gammaloop-crate-test-binaries-three-dimensional-reps-50150770f831b638-deps] default configurePhase, nothing to do
4.74 s
[gammaloop-crate-test-binaries-three-dimensional-reps-50150770f831b638-deps] Phase: buildPhase
4.74 s
[gammaloop-crate-test-binaries-three-dimensional-reps-50150770f831b638-deps] +++ command cargo --version
4.74 s
[gammaloop-crate-test-binaries-three-dimensional-reps-50150770f831b638-deps] cargo 1.97.0 (c980f4866 2026-06-30)
4.75 s
[gammaloop-crate-test-binaries-three-dimensional-reps-50150770f831b638-deps] +++ command cargo test --profile ci-optim --no-run --offline -p three-dimensional-reps --features three-dimensional-reps/serde
5.19 s
[gammaloop-crate-test-binaries-three-dimensional-reps-50150770f831b638-deps] Compiling three-dimensional-reps v0.1.0 (/build/source/crates/three-dimensional-reps)
5.43 s
[gammaloop-crate-test-binaries-three-dimensional-reps-50150770f831b638-deps] error[E0433] : cannot find `eval` in `crate`
5.43 s
[gammaloop-crate-test-binaries-three-dimensional-reps-50150770f831b638-deps] --> crates/three-dimensional-reps/src/generation.rs:8045:28
5.43 s
[gammaloop-crate-test-binaries-three-dimensional-reps-50150770f831b638-deps] |
5.43 s
[gammaloop-crate-test-binaries-three-dimensional-reps-50150770f831b638-deps] 8045 | let input = crate::eval::EvaluationInput {
5.43 s
[gammaloop-crate-test-binaries-three-dimensional-reps-50150770f831b638-deps] | ^^^^ could not find `eval` in the crate root
5.43 s
[gammaloop-crate-test-binaries-three-dimensional-reps-50150770f831b638-deps] |
5.43 s
[gammaloop-crate-test-binaries-three-dimensional-reps-50150770f831b638-deps] note : found an item that was configured out
5.43 s
[gammaloop-crate-test-binaries-three-dimensional-reps-50150770f831b638-deps] --> crates/three-dimensional-reps/src/lib.rs:7:9
5.43 s
[gammaloop-crate-test-binaries-three-dimensional-reps-50150770f831b638-deps] |
5.43 s
[gammaloop-crate-test-binaries-three-dimensional-reps-50150770f831b638-deps] 6 | #[cfg(feature = "eval")]
5.43 s
[gammaloop-crate-test-binaries-three-dimensional-reps-50150770f831b638-deps] | ---------------- the item is gated behind the `eval` feature
5.43 s
[gammaloop-crate-test-binaries-three-dimensional-reps-50150770f831b638-deps] 7 | pub mod eval;
5.43 s
[gammaloop-crate-test-binaries-three-dimensional-reps-50150770f831b638-deps] | ^^^^
5.43 s
[gammaloop-crate-test-binaries-three-dimensional-reps-50150770f831b638-deps]
5.44 s
[gammaloop-crate-test-binaries-three-dimensional-reps-50150770f831b638-deps] error[E0433] : cannot find `eval` in `crate`
5.44 s
[gammaloop-crate-test-binaries-three-dimensional-reps-50150770f831b638-deps] --> crates/three-dimensional-reps/src/generation.rs:8052:30
5.44 s
[gammaloop-crate-test-binaries-three-dimensional-reps-50150770f831b638-deps] |
5.44 s
[gammaloop-crate-test-binaries-three-dimensional-reps-50150770f831b638-deps] 8052 | let contact = crate::eval::evaluate_expression(
5.44 s
[gammaloop-crate-test-binaries-three-dimensional-reps-50150770f831b638-deps] | ^^^^ could not find `eval` in the crate root
5.44 s
[gammaloop-crate-test-binaries-three-dimensional-reps-50150770f831b638-deps] |
5.44 s
[gammaloop-crate-test-binaries-three-dimensional-reps-50150770f831b638-deps] note : found an item that was configured out
5.44 s
[gammaloop-crate-test-binaries-three-dimensional-reps-50150770f831b638-deps] --> crates/three-dimensional-reps/src/lib.rs:7:9
5.44 s
[gammaloop-crate-test-binaries-three-dimensional-reps-50150770f831b638-deps] |
5.44 s
[gammaloop-crate-test-binaries-three-dimensional-reps-50150770f831b638-deps] 6 | #[cfg(feature = "eval")]
5.44 s
[gammaloop-crate-test-binaries-three-dimensional-reps-50150770f831b638-deps] | ---------------- the item is gated behind the `eval` feature
5.44 s
[gammaloop-crate-test-binaries-three-dimensional-reps-50150770f831b638-deps] 7 | pub mod eval;
5.44 s
[gammaloop-crate-test-binaries-three-dimensional-reps-50150770f831b638-deps] | ^^^^
5.44 s
[gammaloop-crate-test-binaries-three-dimensional-reps-50150770f831b638-deps]
5.45 s
[gammaloop-crate-test-binaries-three-dimensional-reps-50150770f831b638-deps] error[E0433] : cannot find `eval` in `crate`
5.45 s
[gammaloop-crate-test-binaries-three-dimensional-reps-50150770f831b638-deps] --> crates/three-dimensional-reps/src/generation.rs:8060:32
5.45 s
[gammaloop-crate-test-binaries-three-dimensional-reps-50150770f831b638-deps] |
5.45 s
[gammaloop-crate-test-binaries-three-dimensional-reps-50150770f831b638-deps] 8060 | let remainder = crate::eval::evaluate_expression(
5.45 s
[gammaloop-crate-test-binaries-three-dimensional-reps-50150770f831b638-deps] | ^^^^ could not find `eval` in the crate root
5.45 s
[gammaloop-crate-test-binaries-three-dimensional-reps-50150770f831b638-deps] |
5.45 s
[gammaloop-crate-test-binaries-three-dimensional-reps-50150770f831b638-deps] note : found an item that was configured out
5.45 s
[gammaloop-crate-test-binaries-three-dimensional-reps-50150770f831b638-deps] --> crates/three-dimensional-reps/src/lib.rs:7:9
5.45 s
[gammaloop-crate-test-binaries-three-dimensional-reps-50150770f831b638-deps] |
5.45 s
[gammaloop-crate-test-binaries-three-dimensional-reps-50150770f831b638-deps] 6 | #[cfg(feature = "eval")]
5.45 s
[gammaloop-crate-test-binaries-three-dimensional-reps-50150770f831b638-deps] | ---------------- the item is gated behind the `eval` feature
5.45 s
[gammaloop-crate-test-binaries-three-dimensional-reps-50150770f831b638-deps] 7 | pub mod eval;
5.45 s
[gammaloop-crate-test-binaries-three-dimensional-reps-50150770f831b638-deps] | ^^^^
5.45 s
[gammaloop-crate-test-binaries-three-dimensional-reps-50150770f831b638-deps]
5.45 s
[gammaloop-crate-test-binaries-three-dimensional-reps-50150770f831b638-deps] error[E0433] : cannot find `eval` in `crate`
5.45 s
[gammaloop-crate-test-binaries-three-dimensional-reps-50150770f831b638-deps] --> crates/three-dimensional-reps/src/generation.rs:8068:28
5.45 s
[gammaloop-crate-test-binaries-three-dimensional-reps-50150770f831b638-deps] |
5.45 s
[gammaloop-crate-test-binaries-three-dimensional-reps-50150770f831b638-deps] 8068 | let total = crate::eval::evaluate_expression(&powered, &expression, numerator, &input)
5.45 s
[gammaloop-crate-test-binaries-three-dimensional-reps-50150770f831b638-deps] | ^^^^ could not find `eval` in the crate root
5.45 s
[gammaloop-crate-test-binaries-three-dimensional-reps-50150770f831b638-deps] |
5.45 s
[gammaloop-crate-test-binaries-three-dimensional-reps-50150770f831b638-deps] note : found an item that was configured out
5.46 s
[gammaloop-crate-test-binaries-three-dimensional-reps-50150770f831b638-deps] --> crates/three-dimensional-reps/src/lib.rs:7:9
5.46 s
[gammaloop-crate-test-binaries-three-dimensional-reps-50150770f831b638-deps] |
5.46 s
[gammaloop-crate-test-binaries-three-dimensional-reps-50150770f831b638-deps] 6 | #[cfg(feature = "eval")]
5.46 s
[gammaloop-crate-test-binaries-three-dimensional-reps-50150770f831b638-deps] | ---------------- the item is gated behind the `eval` feature
5.46 s
[gammaloop-crate-test-binaries-three-dimensional-reps-50150770f831b638-deps] 7 | pub mod eval;
5.46 s
[gammaloop-crate-test-binaries-three-dimensional-reps-50150770f831b638-deps] | ^^^^
5.46 s
[gammaloop-crate-test-binaries-three-dimensional-reps-50150770f831b638-deps]
7.50 s
[gammaloop-crate-test-binaries-three-dimensional-reps-50150770f831b638-deps] For more information about this error, try `rustc --explain E0433`.
7.52 s
[gammaloop-crate-test-binaries-three-dimensional-reps-50150770f831b638-deps] error : could not compile `three-dimensional-reps` (lib test) due to 4 previous errors
7.82 s
Progress: 0 of 2 built (1 failed)
7.82 s
Failed to build gammaloop-crate-test-binaries-three-dimensional-reps-50150770f831b638-deps after 4.3s
7.82 s
error: Cannot build '/nix/store/jw4czjjdv1cc9jr1gsiygk91yx66v8ip-gammaloop-crate-test-binaries-three-dimensional-reps-50150770f831b638-deps-0.1.0.drv '.
7.82 s
Reason: builder failed with exit code 101 .
7.82 s
Output paths:
7.82 s
/nix/store/vf8ksab94faladqcwqcly6amf5fvpg1h-gammaloop-crate-test-binaries-three-dimensional-reps-50150770f831b638-deps-0.1.0
7.82 s
Last 74 log lines:
7.82 s
> Running phase: unpackPhase
7.82 s
> unpacking source archive /nix/store/s1ajjdsb6bzj5dvvg360rj0kxnvgb27s-source
7.82 s
> source root is source
7.82 s
> Running phase: patchPhase
7.82 s
> Executing configureCargoCommonVars
7.82 s
> copying cargo artifacts from /nix/store/71lg5z9qr6b69cp7v2y427r8blvhr0lh-gammaloop-crate-test-binaries-three-dimensional-reps-50150770f831b638-inputs/target to target
7.82 s
> will deep copy artifacts (instead of symlinking) as requested
7.82 s
> Running phase: updateAutotoolsGnuConfigScriptsPhase
7.82 s
> Running phase: configurePhase
7.82 s
> will append /build/source/.cargo-home/config.toml with contents of /nix/store/1sigmg52bb61pfngmk9k8wq5fz9r7bf1-vendor-cargo-deps/config.toml
7.82 s
> default configurePhase, nothing to do
7.82 s
> Running phase: buildPhase
7.82 s
> +++ command cargo --version
7.82 s
> cargo 1.97.0 (c980f4866 2026-06-30)
7.82 s
> +++ command cargo test --profile ci-optim --no-run --offline -p three-dimensional-reps --features three-dimensional-reps/serde
7.82 s
> Compiling three-dimensional-reps v0.1.0 (/build/source/crates/three-dimensional-reps)
7.82 s
> error[E0433] : cannot find `eval` in `crate`
7.82 s
> --> crates/three-dimensional-reps/src/generation.rs:8045:28
7.82 s
> |
7.82 s
> 8045 | let input = crate::eval::EvaluationInput {
7.82 s
> | ^^^^ could not find `eval` in the crate root
7.82 s
> |
7.82 s
> note : found an item that was configured out
7.82 s
> --> crates/three-dimensional-reps/src/lib.rs:7:9
7.82 s
> |
7.82 s
> 6 | #[cfg(feature = "eval")]
7.82 s
> | ---------------- the item is gated behind the `eval` feature
7.82 s
> 7 | pub mod eval;
7.82 s
> | ^^^^
7.82 s
>
7.82 s
> error[E0433] : cannot find `eval` in `crate`
7.82 s
> --> crates/three-dimensional-reps/src/generation.rs:8052:30
7.82 s
> |
7.82 s
> 8052 | let contact = crate::eval::evaluate_expression(
7.82 s
> | ^^^^ could not find `eval` in the crate root
7.82 s
> |
7.82 s
> note : found an item that was configured out
7.82 s
> --> crates/three-dimensional-reps/src/lib.rs:7:9
7.82 s
> |
7.82 s
> 6 | #[cfg(feature = "eval")]
7.82 s
> | ---------------- the item is gated behind the `eval` feature
7.82 s
> 7 | pub mod eval;
7.82 s
> | ^^^^
7.82 s
>
7.82 s
> error[E0433] : cannot find `eval` in `crate`
7.82 s
> --> crates/three-dimensional-reps/src/generation.rs:8060:32
7.82 s
> |
7.82 s
> 8060 | let remainder = crate::eval::evaluate_expression(
7.82 s
> | ^^^^ could not find `eval` in the crate root
7.82 s
> |
7.82 s
> note : found an item that was configured out
7.82 s
> --> crates/three-dimensional-reps/src/lib.rs:7:9
7.82 s
> |
7.82 s
> 6 | #[cfg(feature = "eval")]
7.82 s
> | ---------------- the item is gated behind the `eval` feature
7.82 s
> 7 | pub mod eval;
7.82 s
> | ^^^^
7.82 s
>
7.82 s
> error[E0433] : cannot find `eval` in `crate`
7.82 s
> --> crates/three-dimensional-reps/src/generation.rs:8068:28
7.82 s
> |
7.82 s
> 8068 | let total = crate::eval::evaluate_expression(&powered, &expression, numerator, &input)
7.82 s
> | ^^^^ could not find `eval` in the crate root
7.82 s
> |
7.82 s
> note : found an item that was configured out
7.82 s
> --> crates/three-dimensional-reps/src/lib.rs:7:9
7.82 s
> |
7.82 s
> 6 | #[cfg(feature = "eval")]
7.82 s
> | ---------------- the item is gated behind the `eval` feature
7.82 s
> 7 | pub mod eval;
7.82 s
> | ^^^^
7.82 s
>
7.82 s
> For more information about this error, try `rustc --explain E0433`.
7.82 s
> error : could not compile `three-dimensional-reps` (lib test) due to 4 previous errors
7.82 s
For full logs, run:
7.82 s
nix log /nix/store/jw4czjjdv1cc9jr1gsiygk91yx66v8ip-gammaloop-crate-test-binaries-three-dimensional-reps-50150770f831b638-deps-0.1.0.drv
7.82 s
error: Cannot build '/nix/store/5qklr9s2dfz2051x2kpmcdpb214fxqw3-nix-ci-artifact-barrier-crate-test-binaries-three-dimensional-reps.drv '.
7.82 s
Reason: 1 dependency failed .
7.82 s
Output paths:
7.82 s
/nix/store/7vpbzs1z13hsxvhsram7baw77ng839rz-nix-ci-artifact-barrier-crate-test-binaries-three-dimensional-reps
7.82 s
Build failed due to failed dependency
7.87 s
Build failed.