0.00 s
$ /nix/store/9ypz3flqsrl5xl495mm8h645gadjsxi1-coreutils-9.11/bin/timeout --kill-after=15s 7200s /nix/store/23zk8sgzamrbmj1fday15szf7f2279s8-nix-2.34.7/bin/nix --extra-experimental-features nix-command --extra-experimental-features flakes --log-format internal-json build --no-link --print-out-paths git+https://github.com/alphal00p/gammaloop?ref=raised_energy_cff_wip&rev=0ad34794d0fc6dd9289afae942a88a0688b5b3fe&shallow=1#packages.x86_64-linux.crate-test-binaries-three-dimensional-reps --print-build-logs
0.10 s
error (ignored): SQLite database '/var/cache/nix-ci-worker/eval-cache-v6/3c588e75934b091d5375103ebbb7271cdeb9b9c47ddccc59a63538731c90a356.sqlite ' is busy
1.96 s
2.87 s
Building /nix/store/hfhr1vnsz0zwj9xfb244lm3kzkl3ndib-gammaloop-crate-test-binaries-three-dimensional-reps-50150770f831b638-inputs.drv
6.40 s
[gammaloop-crate-test-binaries-three-dimensional-reps-50150770f831b638-inputs:post-build] Uploading to the NixCI cache: /nix/store/71lg5z9qr6b69cp7v2y427r8blvhr0lh-gammaloop-crate-test-binaries-three-dimensional-reps-50150770f831b638-inputs
6.46 s
[gammaloop-crate-test-binaries-three-dimensional-reps-50150770f831b638-inputs:post-build] warning: 'warn-short-path-literals' is deprecated, use 'lint-short-path-literals = ignore' instead
6.51 s
[gammaloop-crate-test-binaries-three-dimensional-reps-50150770f831b638-inputs:post-build] copying 1 paths...
6.51 s
[gammaloop-crate-test-binaries-three-dimensional-reps-50150770f831b638-inputs:post-build] copying path '/nix/store/71lg5z9qr6b69cp7v2y427r8blvhr0lh-gammaloop-crate-test-binaries-three-dimensional-reps-50150770f831b638-inputs' to 'https://cache.nix-ci.com'...
107.09 s
[gammaloop-crate-test-binaries-three-dimensional-reps-50150770f831b638-inputs:post-build] warning: 'warn-short-path-literals' is deprecated, use 'lint-short-path-literals = ignore' instead
107.42 s
[gammaloop-crate-test-binaries-three-dimensional-reps-50150770f831b638-inputs:post-build] copying 1 paths...
107.42 s
[gammaloop-crate-test-binaries-three-dimensional-reps-50150770f831b638-inputs:post-build] copying path '/nix/store/hfhr1vnsz0zwj9xfb244lm3kzkl3ndib-gammaloop-crate-test-binaries-three-dimensional-reps-50150770f831b638-inputs.drv' to 'https://cache.nix-ci.com'...
107.59 s
Uploaded gammaloop-crate-test-binaries-three-dimensional-reps-50150770f831b638-inputs in 1m41s
107.59 s
Progress: 1 of 4 built
107.59 s
Built gammaloop-crate-test-binaries-three-dimensional-reps-50150770f831b638-inputs in 1m44s
107.71 s
Building /nix/store/jw4czjjdv1cc9jr1gsiygk91yx66v8ip-gammaloop-crate-test-binaries-three-dimensional-reps-50150770f831b638-deps-0.1.0.drv
107.82 s
[gammaloop-crate-test-binaries-three-dimensional-reps-50150770f831b638-deps] Phase: unpackPhase
107.83 s
[gammaloop-crate-test-binaries-three-dimensional-reps-50150770f831b638-deps] unpacking source archive /nix/store/s1ajjdsb6bzj5dvvg360rj0kxnvgb27s-source
107.87 s
[gammaloop-crate-test-binaries-three-dimensional-reps-50150770f831b638-deps] source root is source
107.89 s
[gammaloop-crate-test-binaries-three-dimensional-reps-50150770f831b638-deps] Phase: patchPhase
108.07 s
[gammaloop-crate-test-binaries-three-dimensional-reps-50150770f831b638-deps] Executing configureCargoCommonVars
108.07 s
[gammaloop-crate-test-binaries-three-dimensional-reps-50150770f831b638-deps] copying cargo artifacts from /nix/store/71lg5z9qr6b69cp7v2y427r8blvhr0lh-gammaloop-crate-test-binaries-three-dimensional-reps-50150770f831b638-inputs/target to target
108.07 s
[gammaloop-crate-test-binaries-three-dimensional-reps-50150770f831b638-deps] will deep copy artifacts (instead of symlinking) as requested
109.49 s
[gammaloop-crate-test-binaries-three-dimensional-reps-50150770f831b638-deps] Phase: updateAutotoolsGnuConfigScriptsPhase
109.54 s
[gammaloop-crate-test-binaries-three-dimensional-reps-50150770f831b638-deps] Phase: configurePhase
109.54 s
[gammaloop-crate-test-binaries-three-dimensional-reps-50150770f831b638-deps] will append /build/source/.cargo-home/config.toml with contents of /nix/store/1sigmg52bb61pfngmk9k8wq5fz9r7bf1-vendor-cargo-deps/config.toml
109.55 s
[gammaloop-crate-test-binaries-three-dimensional-reps-50150770f831b638-deps] default configurePhase, nothing to do
109.55 s
[gammaloop-crate-test-binaries-three-dimensional-reps-50150770f831b638-deps] Phase: buildPhase
109.56 s
[gammaloop-crate-test-binaries-three-dimensional-reps-50150770f831b638-deps] +++ command cargo --version
109.57 s
[gammaloop-crate-test-binaries-three-dimensional-reps-50150770f831b638-deps] cargo 1.97.0 (c980f4866 2026-06-30)
109.57 s
[gammaloop-crate-test-binaries-three-dimensional-reps-50150770f831b638-deps] +++ command cargo test --profile ci-optim --no-run --offline -p three-dimensional-reps --features three-dimensional-reps/serde
110.26 s
[gammaloop-crate-test-binaries-three-dimensional-reps-50150770f831b638-deps] Compiling three-dimensional-reps v0.1.0 (/build/source/crates/three-dimensional-reps)
110.61 s
[gammaloop-crate-test-binaries-three-dimensional-reps-50150770f831b638-deps] error[E0433] : cannot find `eval` in `crate`
110.61 s
[gammaloop-crate-test-binaries-three-dimensional-reps-50150770f831b638-deps] --> crates/three-dimensional-reps/src/generation.rs:8045:28
110.61 s
[gammaloop-crate-test-binaries-three-dimensional-reps-50150770f831b638-deps] |
110.61 s
[gammaloop-crate-test-binaries-three-dimensional-reps-50150770f831b638-deps] 8045 | let input = crate::eval::EvaluationInput {
110.61 s
[gammaloop-crate-test-binaries-three-dimensional-reps-50150770f831b638-deps] | ^^^^ could not find `eval` in the crate root
110.61 s
[gammaloop-crate-test-binaries-three-dimensional-reps-50150770f831b638-deps] |
110.61 s
[gammaloop-crate-test-binaries-three-dimensional-reps-50150770f831b638-deps] note : found an item that was configured out
110.61 s
[gammaloop-crate-test-binaries-three-dimensional-reps-50150770f831b638-deps] --> crates/three-dimensional-reps/src/lib.rs:7:9
110.61 s
[gammaloop-crate-test-binaries-three-dimensional-reps-50150770f831b638-deps] |
110.61 s
[gammaloop-crate-test-binaries-three-dimensional-reps-50150770f831b638-deps] 6 | #[cfg(feature = "eval")]
110.61 s
[gammaloop-crate-test-binaries-three-dimensional-reps-50150770f831b638-deps] | ---------------- the item is gated behind the `eval` feature
110.61 s
[gammaloop-crate-test-binaries-three-dimensional-reps-50150770f831b638-deps] 7 | pub mod eval;
110.61 s
[gammaloop-crate-test-binaries-three-dimensional-reps-50150770f831b638-deps] | ^^^^
110.61 s
[gammaloop-crate-test-binaries-three-dimensional-reps-50150770f831b638-deps]
110.63 s
[gammaloop-crate-test-binaries-three-dimensional-reps-50150770f831b638-deps] error[E0433] : cannot find `eval` in `crate`
110.63 s
[gammaloop-crate-test-binaries-three-dimensional-reps-50150770f831b638-deps] --> crates/three-dimensional-reps/src/generation.rs:8052:30
110.63 s
[gammaloop-crate-test-binaries-three-dimensional-reps-50150770f831b638-deps] |
110.63 s
[gammaloop-crate-test-binaries-three-dimensional-reps-50150770f831b638-deps] 8052 | let contact = crate::eval::evaluate_expression(
110.63 s
[gammaloop-crate-test-binaries-three-dimensional-reps-50150770f831b638-deps] | ^^^^ could not find `eval` in the crate root
110.63 s
[gammaloop-crate-test-binaries-three-dimensional-reps-50150770f831b638-deps] |
110.63 s
[gammaloop-crate-test-binaries-three-dimensional-reps-50150770f831b638-deps] note : found an item that was configured out
110.63 s
[gammaloop-crate-test-binaries-three-dimensional-reps-50150770f831b638-deps] --> crates/three-dimensional-reps/src/lib.rs:7:9
110.63 s
[gammaloop-crate-test-binaries-three-dimensional-reps-50150770f831b638-deps] |
110.63 s
[gammaloop-crate-test-binaries-three-dimensional-reps-50150770f831b638-deps] 6 | #[cfg(feature = "eval")]
110.63 s
[gammaloop-crate-test-binaries-three-dimensional-reps-50150770f831b638-deps] | ---------------- the item is gated behind the `eval` feature
110.63 s
[gammaloop-crate-test-binaries-three-dimensional-reps-50150770f831b638-deps] 7 | pub mod eval;
110.63 s
[gammaloop-crate-test-binaries-three-dimensional-reps-50150770f831b638-deps] | ^^^^
110.63 s
[gammaloop-crate-test-binaries-three-dimensional-reps-50150770f831b638-deps]
110.64 s
[gammaloop-crate-test-binaries-three-dimensional-reps-50150770f831b638-deps] error[E0433] : cannot find `eval` in `crate`
110.64 s
[gammaloop-crate-test-binaries-three-dimensional-reps-50150770f831b638-deps] --> crates/three-dimensional-reps/src/generation.rs:8060:32
110.64 s
[gammaloop-crate-test-binaries-three-dimensional-reps-50150770f831b638-deps] |
110.64 s
[gammaloop-crate-test-binaries-three-dimensional-reps-50150770f831b638-deps] 8060 | let remainder = crate::eval::evaluate_expression(
110.64 s
[gammaloop-crate-test-binaries-three-dimensional-reps-50150770f831b638-deps] | ^^^^ could not find `eval` in the crate root
110.64 s
[gammaloop-crate-test-binaries-three-dimensional-reps-50150770f831b638-deps] |
110.64 s
[gammaloop-crate-test-binaries-three-dimensional-reps-50150770f831b638-deps] note : found an item that was configured out
110.64 s
[gammaloop-crate-test-binaries-three-dimensional-reps-50150770f831b638-deps] --> crates/three-dimensional-reps/src/lib.rs:7:9
110.64 s
[gammaloop-crate-test-binaries-three-dimensional-reps-50150770f831b638-deps] |
110.64 s
[gammaloop-crate-test-binaries-three-dimensional-reps-50150770f831b638-deps] 6 | #[cfg(feature = "eval")]
110.64 s
[gammaloop-crate-test-binaries-three-dimensional-reps-50150770f831b638-deps] | ---------------- the item is gated behind the `eval` feature
110.64 s
[gammaloop-crate-test-binaries-three-dimensional-reps-50150770f831b638-deps] 7 | pub mod eval;
110.64 s
[gammaloop-crate-test-binaries-three-dimensional-reps-50150770f831b638-deps] | ^^^^
110.64 s
[gammaloop-crate-test-binaries-three-dimensional-reps-50150770f831b638-deps]
110.66 s
[gammaloop-crate-test-binaries-three-dimensional-reps-50150770f831b638-deps] error[E0433] : cannot find `eval` in `crate`
110.66 s
[gammaloop-crate-test-binaries-three-dimensional-reps-50150770f831b638-deps] --> crates/three-dimensional-reps/src/generation.rs:8068:28
110.66 s
[gammaloop-crate-test-binaries-three-dimensional-reps-50150770f831b638-deps] |
110.66 s
[gammaloop-crate-test-binaries-three-dimensional-reps-50150770f831b638-deps] 8068 | let total = crate::eval::evaluate_expression(&powered, &expression, numerator, &input)
110.66 s
[gammaloop-crate-test-binaries-three-dimensional-reps-50150770f831b638-deps] | ^^^^ could not find `eval` in the crate root
110.66 s
[gammaloop-crate-test-binaries-three-dimensional-reps-50150770f831b638-deps] |
110.66 s
[gammaloop-crate-test-binaries-three-dimensional-reps-50150770f831b638-deps] note : found an item that was configured out
110.66 s
[gammaloop-crate-test-binaries-three-dimensional-reps-50150770f831b638-deps] --> crates/three-dimensional-reps/src/lib.rs:7:9
110.66 s
[gammaloop-crate-test-binaries-three-dimensional-reps-50150770f831b638-deps] |
110.66 s
[gammaloop-crate-test-binaries-three-dimensional-reps-50150770f831b638-deps] 6 | #[cfg(feature = "eval")]
110.66 s
[gammaloop-crate-test-binaries-three-dimensional-reps-50150770f831b638-deps] | ---------------- the item is gated behind the `eval` feature
110.66 s
[gammaloop-crate-test-binaries-three-dimensional-reps-50150770f831b638-deps] 7 | pub mod eval;
110.66 s
[gammaloop-crate-test-binaries-three-dimensional-reps-50150770f831b638-deps] | ^^^^
110.66 s
[gammaloop-crate-test-binaries-three-dimensional-reps-50150770f831b638-deps]
112.92 s
[gammaloop-crate-test-binaries-three-dimensional-reps-50150770f831b638-deps] For more information about this error, try `rustc --explain E0433`.
112.95 s
[gammaloop-crate-test-binaries-three-dimensional-reps-50150770f831b638-deps] error : could not compile `three-dimensional-reps` (lib test) due to 4 previous errors
113.39 s
Progress: 1 of 3 built (1 failed)
113.39 s
Failed to build gammaloop-crate-test-binaries-three-dimensional-reps-50150770f831b638-deps after 5.6s
113.39 s
error: Cannot build '/nix/store/jw4czjjdv1cc9jr1gsiygk91yx66v8ip-gammaloop-crate-test-binaries-three-dimensional-reps-50150770f831b638-deps-0.1.0.drv '.
113.39 s
Reason: builder failed with exit code 101 .
113.39 s
Output paths:
113.39 s
/nix/store/vf8ksab94faladqcwqcly6amf5fvpg1h-gammaloop-crate-test-binaries-three-dimensional-reps-50150770f831b638-deps-0.1.0
113.39 s
Last 74 log lines:
113.39 s
> Running phase: unpackPhase
113.39 s
> unpacking source archive /nix/store/s1ajjdsb6bzj5dvvg360rj0kxnvgb27s-source
113.39 s
> source root is source
113.39 s
> Running phase: patchPhase
113.39 s
> Executing configureCargoCommonVars
113.39 s
> copying cargo artifacts from /nix/store/71lg5z9qr6b69cp7v2y427r8blvhr0lh-gammaloop-crate-test-binaries-three-dimensional-reps-50150770f831b638-inputs/target to target
113.39 s
> will deep copy artifacts (instead of symlinking) as requested
113.39 s
> Running phase: updateAutotoolsGnuConfigScriptsPhase
113.39 s
> Running phase: configurePhase
113.39 s
> will append /build/source/.cargo-home/config.toml with contents of /nix/store/1sigmg52bb61pfngmk9k8wq5fz9r7bf1-vendor-cargo-deps/config.toml
113.39 s
> default configurePhase, nothing to do
113.39 s
> Running phase: buildPhase
113.39 s
> +++ command cargo --version
113.39 s
> cargo 1.97.0 (c980f4866 2026-06-30)
113.39 s
> +++ command cargo test --profile ci-optim --no-run --offline -p three-dimensional-reps --features three-dimensional-reps/serde
113.39 s
> Compiling three-dimensional-reps v0.1.0 (/build/source/crates/three-dimensional-reps)
113.39 s
> error[E0433] : cannot find `eval` in `crate`
113.39 s
> --> crates/three-dimensional-reps/src/generation.rs:8045:28
113.39 s
> |
113.39 s
> 8045 | let input = crate::eval::EvaluationInput {
113.39 s
> | ^^^^ could not find `eval` in the crate root
113.39 s
> |
113.39 s
> note : found an item that was configured out
113.39 s
> --> crates/three-dimensional-reps/src/lib.rs:7:9
113.39 s
> |
113.39 s
> 6 | #[cfg(feature = "eval")]
113.39 s
> | ---------------- the item is gated behind the `eval` feature
113.39 s
> 7 | pub mod eval;
113.39 s
> | ^^^^
113.39 s
>
113.39 s
> error[E0433] : cannot find `eval` in `crate`
113.39 s
> --> crates/three-dimensional-reps/src/generation.rs:8052:30
113.39 s
> |
113.39 s
> 8052 | let contact = crate::eval::evaluate_expression(
113.39 s
> | ^^^^ could not find `eval` in the crate root
113.39 s
> |
113.39 s
> note : found an item that was configured out
113.39 s
> --> crates/three-dimensional-reps/src/lib.rs:7:9
113.39 s
> |
113.39 s
> 6 | #[cfg(feature = "eval")]
113.39 s
> | ---------------- the item is gated behind the `eval` feature
113.39 s
> 7 | pub mod eval;
113.39 s
> | ^^^^
113.39 s
>
113.39 s
> error[E0433] : cannot find `eval` in `crate`
113.39 s
> --> crates/three-dimensional-reps/src/generation.rs:8060:32
113.39 s
> |
113.39 s
> 8060 | let remainder = crate::eval::evaluate_expression(
113.39 s
> | ^^^^ could not find `eval` in the crate root
113.39 s
> |
113.39 s
> note : found an item that was configured out
113.39 s
> --> crates/three-dimensional-reps/src/lib.rs:7:9
113.39 s
> |
113.39 s
> 6 | #[cfg(feature = "eval")]
113.39 s
> | ---------------- the item is gated behind the `eval` feature
113.39 s
> 7 | pub mod eval;
113.39 s
> | ^^^^
113.39 s
>
113.39 s
> error[E0433] : cannot find `eval` in `crate`
113.39 s
> --> crates/three-dimensional-reps/src/generation.rs:8068:28
113.39 s
> |
113.39 s
> 8068 | let total = crate::eval::evaluate_expression(&powered, &expression, numerator, &input)
113.39 s
> | ^^^^ could not find `eval` in the crate root
113.39 s
> |
113.39 s
> note : found an item that was configured out
113.39 s
> --> crates/three-dimensional-reps/src/lib.rs:7:9
113.39 s
> |
113.39 s
> 6 | #[cfg(feature = "eval")]
113.39 s
> | ---------------- the item is gated behind the `eval` feature
113.39 s
> 7 | pub mod eval;
113.39 s
> | ^^^^
113.39 s
>
113.39 s
> For more information about this error, try `rustc --explain E0433`.
113.39 s
> error : could not compile `three-dimensional-reps` (lib test) due to 4 previous errors
113.39 s
For full logs, run:
113.39 s
nix log /nix/store/jw4czjjdv1cc9jr1gsiygk91yx66v8ip-gammaloop-crate-test-binaries-three-dimensional-reps-50150770f831b638-deps-0.1.0.drv
113.39 s
error: Cannot build '/nix/store/5qklr9s2dfz2051x2kpmcdpb214fxqw3-nix-ci-artifact-barrier-crate-test-binaries-three-dimensional-reps.drv '.
113.39 s
Reason: 1 dependency failed .
113.39 s
Output paths:
113.39 s
/nix/store/7vpbzs1z13hsxvhsram7baw77ng839rz-nix-ci-artifact-barrier-crate-test-binaries-three-dimensional-reps
113.40 s
Build failed due to failed dependency
113.46 s
Build failed.