1. 0.01 s $ /nix/store/9ypz3flqsrl5xl495mm8h645gadjsxi1-coreutils-9.11/bin/timeout --kill-after=15s 7200s /nix/store/23zk8sgzamrbmj1fday15szf7f2279s8-nix-2.34.7/bin/nix --extra-experimental-features nix-command --extra-experimental-features flakes --log-format internal-json build --no-link --print-out-paths git+https://github.com/alphal00p/gammaloop?ref=raised_energy_cff_wip&rev=1b760f6389d8bafaf27d81526df58d777b0d9cdc&shallow=1#packages.x86_64-linux.crate-test-binaries-three-dimensional-reps --print-build-logs
  2. 0.85 s error (ignored): SQLite database '/var/cache/nix-ci-worker/eval-cache-v6/c95e80f94b32785e9a43dce9c701a3fb92c38d4174189b2aa3971848dbdbf027.sqlite' is busy
  3. 3.55 s
  4. 4.97 s Building /nix/store/jw4czjjdv1cc9jr1gsiygk91yx66v8ip-gammaloop-crate-test-binaries-three-dimensional-reps-50150770f831b638-deps-0.1.0.drv
  5. 5.11 s [gammaloop-crate-test-binaries-three-dimensional-reps-50150770f831b638-deps] Phase: unpackPhase
  6. 5.12 s [gammaloop-crate-test-binaries-three-dimensional-reps-50150770f831b638-deps] unpacking source archive /nix/store/s1ajjdsb6bzj5dvvg360rj0kxnvgb27s-source
  7. 5.23 s [gammaloop-crate-test-binaries-three-dimensional-reps-50150770f831b638-deps] source root is source
  8. 5.26 s [gammaloop-crate-test-binaries-three-dimensional-reps-50150770f831b638-deps] Phase: patchPhase
  9. 5.52 s [gammaloop-crate-test-binaries-three-dimensional-reps-50150770f831b638-deps] Executing configureCargoCommonVars
  10. 5.53 s [gammaloop-crate-test-binaries-three-dimensional-reps-50150770f831b638-deps] copying cargo artifacts from /nix/store/71lg5z9qr6b69cp7v2y427r8blvhr0lh-gammaloop-crate-test-binaries-three-dimensional-reps-50150770f831b638-inputs/target to target
  11. 5.53 s [gammaloop-crate-test-binaries-three-dimensional-reps-50150770f831b638-deps] will deep copy artifacts (instead of symlinking) as requested
  12. 6.79 s [gammaloop-crate-test-binaries-three-dimensional-reps-50150770f831b638-deps] Phase: updateAutotoolsGnuConfigScriptsPhase
  13. 6.82 s [gammaloop-crate-test-binaries-three-dimensional-reps-50150770f831b638-deps] Phase: configurePhase
  14. 6.82 s [gammaloop-crate-test-binaries-three-dimensional-reps-50150770f831b638-deps] will append /build/source/.cargo-home/config.toml with contents of /nix/store/1sigmg52bb61pfngmk9k8wq5fz9r7bf1-vendor-cargo-deps/config.toml
  15. 6.83 s [gammaloop-crate-test-binaries-three-dimensional-reps-50150770f831b638-deps] default configurePhase, nothing to do
  16. 6.83 s [gammaloop-crate-test-binaries-three-dimensional-reps-50150770f831b638-deps] Phase: buildPhase
  17. 6.83 s [gammaloop-crate-test-binaries-three-dimensional-reps-50150770f831b638-deps] +++ command cargo --version
  18. 6.84 s [gammaloop-crate-test-binaries-three-dimensional-reps-50150770f831b638-deps] cargo 1.97.0 (c980f4866 2026-06-30)
  19. 6.84 s [gammaloop-crate-test-binaries-three-dimensional-reps-50150770f831b638-deps] +++ command cargo test --profile ci-optim --no-run --offline -p three-dimensional-reps --features three-dimensional-reps/serde
  20. 7.27 s [gammaloop-crate-test-binaries-three-dimensional-reps-50150770f831b638-deps] Compiling three-dimensional-reps v0.1.0 (/build/source/crates/three-dimensional-reps)
  21. 7.58 s [gammaloop-crate-test-binaries-three-dimensional-reps-50150770f831b638-deps] error[E0433]: cannot find `eval` in `crate`
  22. 7.58 s [gammaloop-crate-test-binaries-three-dimensional-reps-50150770f831b638-deps] --> crates/three-dimensional-reps/src/generation.rs:8045:28
  23. 7.58 s [gammaloop-crate-test-binaries-three-dimensional-reps-50150770f831b638-deps] |
  24. 7.58 s [gammaloop-crate-test-binaries-three-dimensional-reps-50150770f831b638-deps] 8045 | let input = crate::eval::EvaluationInput {
  25. 7.58 s [gammaloop-crate-test-binaries-three-dimensional-reps-50150770f831b638-deps] | ^^^^ could not find `eval` in the crate root
  26. 7.58 s [gammaloop-crate-test-binaries-three-dimensional-reps-50150770f831b638-deps] |
  27. 7.58 s [gammaloop-crate-test-binaries-three-dimensional-reps-50150770f831b638-deps] note: found an item that was configured out
  28. 7.58 s [gammaloop-crate-test-binaries-three-dimensional-reps-50150770f831b638-deps] --> crates/three-dimensional-reps/src/lib.rs:7:9
  29. 7.58 s [gammaloop-crate-test-binaries-three-dimensional-reps-50150770f831b638-deps] |
  30. 7.58 s [gammaloop-crate-test-binaries-three-dimensional-reps-50150770f831b638-deps] 6 | #[cfg(feature = "eval")]
  31. 7.58 s [gammaloop-crate-test-binaries-three-dimensional-reps-50150770f831b638-deps] | ---------------- the item is gated behind the `eval` feature
  32. 7.58 s [gammaloop-crate-test-binaries-three-dimensional-reps-50150770f831b638-deps] 7 | pub mod eval;
  33. 7.58 s [gammaloop-crate-test-binaries-three-dimensional-reps-50150770f831b638-deps] | ^^^^
  34. 7.58 s [gammaloop-crate-test-binaries-three-dimensional-reps-50150770f831b638-deps]
  35. 7.60 s [gammaloop-crate-test-binaries-three-dimensional-reps-50150770f831b638-deps] error[E0433]: cannot find `eval` in `crate`
  36. 7.60 s [gammaloop-crate-test-binaries-three-dimensional-reps-50150770f831b638-deps] --> crates/three-dimensional-reps/src/generation.rs:8052:30
  37. 7.60 s [gammaloop-crate-test-binaries-three-dimensional-reps-50150770f831b638-deps] |
  38. 7.60 s [gammaloop-crate-test-binaries-three-dimensional-reps-50150770f831b638-deps] 8052 | let contact = crate::eval::evaluate_expression(
  39. 7.60 s [gammaloop-crate-test-binaries-three-dimensional-reps-50150770f831b638-deps] | ^^^^ could not find `eval` in the crate root
  40. 7.60 s [gammaloop-crate-test-binaries-three-dimensional-reps-50150770f831b638-deps] |
  41. 7.60 s [gammaloop-crate-test-binaries-three-dimensional-reps-50150770f831b638-deps] note: found an item that was configured out
  42. 7.60 s [gammaloop-crate-test-binaries-three-dimensional-reps-50150770f831b638-deps] --> crates/three-dimensional-reps/src/lib.rs:7:9
  43. 7.60 s [gammaloop-crate-test-binaries-three-dimensional-reps-50150770f831b638-deps] |
  44. 7.60 s [gammaloop-crate-test-binaries-three-dimensional-reps-50150770f831b638-deps] 6 | #[cfg(feature = "eval")]
  45. 7.60 s [gammaloop-crate-test-binaries-three-dimensional-reps-50150770f831b638-deps] | ---------------- the item is gated behind the `eval` feature
  46. 7.60 s [gammaloop-crate-test-binaries-three-dimensional-reps-50150770f831b638-deps] 7 | pub mod eval;
  47. 7.60 s [gammaloop-crate-test-binaries-three-dimensional-reps-50150770f831b638-deps] | ^^^^
  48. 7.60 s [gammaloop-crate-test-binaries-three-dimensional-reps-50150770f831b638-deps]
  49. 7.61 s [gammaloop-crate-test-binaries-three-dimensional-reps-50150770f831b638-deps] error[E0433]: cannot find `eval` in `crate`
  50. 7.61 s [gammaloop-crate-test-binaries-three-dimensional-reps-50150770f831b638-deps] --> crates/three-dimensional-reps/src/generation.rs:8060:32
  51. 7.61 s [gammaloop-crate-test-binaries-three-dimensional-reps-50150770f831b638-deps] |
  52. 7.61 s [gammaloop-crate-test-binaries-three-dimensional-reps-50150770f831b638-deps] 8060 | let remainder = crate::eval::evaluate_expression(
  53. 7.61 s [gammaloop-crate-test-binaries-three-dimensional-reps-50150770f831b638-deps] | ^^^^ could not find `eval` in the crate root
  54. 7.61 s [gammaloop-crate-test-binaries-three-dimensional-reps-50150770f831b638-deps] |
  55. 7.61 s [gammaloop-crate-test-binaries-three-dimensional-reps-50150770f831b638-deps] note: found an item that was configured out
  56. 7.61 s [gammaloop-crate-test-binaries-three-dimensional-reps-50150770f831b638-deps] --> crates/three-dimensional-reps/src/lib.rs:7:9
  57. 7.61 s [gammaloop-crate-test-binaries-three-dimensional-reps-50150770f831b638-deps] |
  58. 7.61 s [gammaloop-crate-test-binaries-three-dimensional-reps-50150770f831b638-deps] 6 | #[cfg(feature = "eval")]
  59. 7.61 s [gammaloop-crate-test-binaries-three-dimensional-reps-50150770f831b638-deps] | ---------------- the item is gated behind the `eval` feature
  60. 7.61 s [gammaloop-crate-test-binaries-three-dimensional-reps-50150770f831b638-deps] 7 | pub mod eval;
  61. 7.61 s [gammaloop-crate-test-binaries-three-dimensional-reps-50150770f831b638-deps] | ^^^^
  62. 7.61 s [gammaloop-crate-test-binaries-three-dimensional-reps-50150770f831b638-deps]
  63. 7.62 s [gammaloop-crate-test-binaries-three-dimensional-reps-50150770f831b638-deps] error[E0433]: cannot find `eval` in `crate`
  64. 7.62 s [gammaloop-crate-test-binaries-three-dimensional-reps-50150770f831b638-deps] --> crates/three-dimensional-reps/src/generation.rs:8068:28
  65. 7.62 s [gammaloop-crate-test-binaries-three-dimensional-reps-50150770f831b638-deps] |
  66. 7.62 s [gammaloop-crate-test-binaries-three-dimensional-reps-50150770f831b638-deps] 8068 | let total = crate::eval::evaluate_expression(&powered, &expression, numerator, &input)
  67. 7.62 s [gammaloop-crate-test-binaries-three-dimensional-reps-50150770f831b638-deps] | ^^^^ could not find `eval` in the crate root
  68. 7.62 s [gammaloop-crate-test-binaries-three-dimensional-reps-50150770f831b638-deps] |
  69. 7.62 s [gammaloop-crate-test-binaries-three-dimensional-reps-50150770f831b638-deps] note: found an item that was configured out
  70. 7.62 s [gammaloop-crate-test-binaries-three-dimensional-reps-50150770f831b638-deps] --> crates/three-dimensional-reps/src/lib.rs:7:9
  71. 7.62 s [gammaloop-crate-test-binaries-three-dimensional-reps-50150770f831b638-deps] |
  72. 7.62 s [gammaloop-crate-test-binaries-three-dimensional-reps-50150770f831b638-deps] 6 | #[cfg(feature = "eval")]
  73. 7.62 s [gammaloop-crate-test-binaries-three-dimensional-reps-50150770f831b638-deps] | ---------------- the item is gated behind the `eval` feature
  74. 7.62 s [gammaloop-crate-test-binaries-three-dimensional-reps-50150770f831b638-deps] 7 | pub mod eval;
  75. 7.62 s [gammaloop-crate-test-binaries-three-dimensional-reps-50150770f831b638-deps] | ^^^^
  76. 7.62 s [gammaloop-crate-test-binaries-three-dimensional-reps-50150770f831b638-deps]
  77. 11.22 s [gammaloop-crate-test-binaries-three-dimensional-reps-50150770f831b638-deps] For more information about this error, try `rustc --explain E0433`.
  78. 11.25 s [gammaloop-crate-test-binaries-three-dimensional-reps-50150770f831b638-deps] error: could not compile `three-dimensional-reps` (lib test) due to 4 previous errors
  79. 11.68 s Progress: 0 of 2 built (1 failed)
  80. 11.68 s Failed to build gammaloop-crate-test-binaries-three-dimensional-reps-50150770f831b638-deps after 6.7s
  81. 11.68 s error: Cannot build '/nix/store/jw4czjjdv1cc9jr1gsiygk91yx66v8ip-gammaloop-crate-test-binaries-three-dimensional-reps-50150770f831b638-deps-0.1.0.drv'.
  82. 11.68 s Reason: builder failed with exit code 101.
  83. 11.68 s Output paths:
  84. 11.68 s /nix/store/vf8ksab94faladqcwqcly6amf5fvpg1h-gammaloop-crate-test-binaries-three-dimensional-reps-50150770f831b638-deps-0.1.0
  85. 11.68 s Last 74 log lines:
  86. 11.68 s > Running phase: unpackPhase
  87. 11.68 s > unpacking source archive /nix/store/s1ajjdsb6bzj5dvvg360rj0kxnvgb27s-source
  88. 11.68 s > source root is source
  89. 11.68 s > Running phase: patchPhase
  90. 11.68 s > Executing configureCargoCommonVars
  91. 11.68 s > copying cargo artifacts from /nix/store/71lg5z9qr6b69cp7v2y427r8blvhr0lh-gammaloop-crate-test-binaries-three-dimensional-reps-50150770f831b638-inputs/target to target
  92. 11.68 s > will deep copy artifacts (instead of symlinking) as requested
  93. 11.68 s > Running phase: updateAutotoolsGnuConfigScriptsPhase
  94. 11.68 s > Running phase: configurePhase
  95. 11.68 s > will append /build/source/.cargo-home/config.toml with contents of /nix/store/1sigmg52bb61pfngmk9k8wq5fz9r7bf1-vendor-cargo-deps/config.toml
  96. 11.68 s > default configurePhase, nothing to do
  97. 11.68 s > Running phase: buildPhase
  98. 11.68 s > +++ command cargo --version
  99. 11.68 s > cargo 1.97.0 (c980f4866 2026-06-30)
  100. 11.68 s > +++ command cargo test --profile ci-optim --no-run --offline -p three-dimensional-reps --features three-dimensional-reps/serde
  101. 11.68 s > Compiling three-dimensional-reps v0.1.0 (/build/source/crates/three-dimensional-reps)
  102. 11.68 s > error[E0433]: cannot find `eval` in `crate`
  103. 11.68 s > --> crates/three-dimensional-reps/src/generation.rs:8045:28
  104. 11.68 s > |
  105. 11.68 s > 8045 | let input = crate::eval::EvaluationInput {
  106. 11.68 s > | ^^^^ could not find `eval` in the crate root
  107. 11.68 s > |
  108. 11.68 s > note: found an item that was configured out
  109. 11.68 s > --> crates/three-dimensional-reps/src/lib.rs:7:9
  110. 11.68 s > |
  111. 11.68 s > 6 | #[cfg(feature = "eval")]
  112. 11.68 s > | ---------------- the item is gated behind the `eval` feature
  113. 11.68 s > 7 | pub mod eval;
  114. 11.68 s > | ^^^^
  115. 11.68 s >
  116. 11.68 s > error[E0433]: cannot find `eval` in `crate`
  117. 11.68 s > --> crates/three-dimensional-reps/src/generation.rs:8052:30
  118. 11.68 s > |
  119. 11.68 s > 8052 | let contact = crate::eval::evaluate_expression(
  120. 11.68 s > | ^^^^ could not find `eval` in the crate root
  121. 11.68 s > |
  122. 11.68 s > note: found an item that was configured out
  123. 11.68 s > --> crates/three-dimensional-reps/src/lib.rs:7:9
  124. 11.68 s > |
  125. 11.68 s > 6 | #[cfg(feature = "eval")]
  126. 11.68 s > | ---------------- the item is gated behind the `eval` feature
  127. 11.68 s > 7 | pub mod eval;
  128. 11.68 s > | ^^^^
  129. 11.68 s >
  130. 11.68 s > error[E0433]: cannot find `eval` in `crate`
  131. 11.68 s > --> crates/three-dimensional-reps/src/generation.rs:8060:32
  132. 11.68 s > |
  133. 11.68 s > 8060 | let remainder = crate::eval::evaluate_expression(
  134. 11.68 s > | ^^^^ could not find `eval` in the crate root
  135. 11.68 s > |
  136. 11.68 s > note: found an item that was configured out
  137. 11.68 s > --> crates/three-dimensional-reps/src/lib.rs:7:9
  138. 11.68 s > |
  139. 11.68 s > 6 | #[cfg(feature = "eval")]
  140. 11.68 s > | ---------------- the item is gated behind the `eval` feature
  141. 11.68 s > 7 | pub mod eval;
  142. 11.68 s > | ^^^^
  143. 11.68 s >
  144. 11.68 s > error[E0433]: cannot find `eval` in `crate`
  145. 11.68 s > --> crates/three-dimensional-reps/src/generation.rs:8068:28
  146. 11.68 s > |
  147. 11.68 s > 8068 | let total = crate::eval::evaluate_expression(&powered, &expression, numerator, &input)
  148. 11.68 s > | ^^^^ could not find `eval` in the crate root
  149. 11.68 s > |
  150. 11.68 s > note: found an item that was configured out
  151. 11.68 s > --> crates/three-dimensional-reps/src/lib.rs:7:9
  152. 11.68 s > |
  153. 11.68 s > 6 | #[cfg(feature = "eval")]
  154. 11.68 s > | ---------------- the item is gated behind the `eval` feature
  155. 11.68 s > 7 | pub mod eval;
  156. 11.68 s > | ^^^^
  157. 11.68 s >
  158. 11.68 s > For more information about this error, try `rustc --explain E0433`.
  159. 11.68 s > error: could not compile `three-dimensional-reps` (lib test) due to 4 previous errors
  160. 11.68 s For full logs, run:
  161. 11.68 s nix log /nix/store/jw4czjjdv1cc9jr1gsiygk91yx66v8ip-gammaloop-crate-test-binaries-three-dimensional-reps-50150770f831b638-deps-0.1.0.drv
  162. 11.68 s error: Cannot build '/nix/store/82q0w19lk465i1vkzypp1wsrbnq1hx6q-nix-ci-artifact-barrier-crate-test-binaries-three-dimensional-reps.drv'.
  163. 11.68 s Reason: 1 dependency failed.
  164. 11.68 s Output paths:
  165. 11.68 s /nix/store/7va6sdnzmy18jfp62ndfb0j5jsfy4981-nix-ci-artifact-barrier-crate-test-binaries-three-dimensional-reps
  166. 11.68 s Build failed due to failed dependency
  167. 11.74 s Build failed.