build checks.x86_64-linux.gammaloop-nextest-binaries-core

Reproduce this run
Retry Run
  1. 0.00 s $ /nix/store/9ypz3flqsrl5xl495mm8h645gadjsxi1-coreutils-9.11/bin/timeout --kill-after=15s 7200s /nix/store/23zk8sgzamrbmj1fday15szf7f2279s8-nix-2.34.7/bin/nix --extra-experimental-features nix-command --extra-experimental-features flakes --log-format internal-json build --no-link --print-out-paths git+https://github.com/alphal00p/gammaloop?ref=raised_energy_cff_wip&rev=1b760f6389d8bafaf27d81526df58d777b0d9cdc&shallow=1#checks.x86_64-linux.gammaloop-nextest-binaries-core --print-build-logs
  2. 0.11 s error (ignored): SQLite database '/var/cache/nix-ci-worker/eval-cache-v6/c95e80f94b32785e9a43dce9c701a3fb92c38d4174189b2aa3971848dbdbf027.sqlite' is busy
  3. 4.65 s
  4. 5.02 s Downloading cached gammaloop-crate-test-binaries-gammaloop-api-f0f952c3f8c3050c-inputs from https://cache.nix-ci.com
  5. 5.02 s Downloading cached gammaloop-crate-test-binaries-gammalooprs-247ff5d63201fb2c-inputs from https://cache.nix-ci.com
  6. 5.18 s Building /nix/store/arx10qm23ci8dfj1niv2y32y83wbg9dj-gammaloop-nextest-binaries-core-gammaloop-tracing-filter-0.1.0.drv
  7. 5.26 s Building /nix/store/27i97c6xhk0vdw2qmyrhrq17jh733sag-gammaloop-nextest-binaries-core-gammaloop-tracing-filter-macros-0.1.0.drv
  8. 5.36 s Building /nix/store/jw4czjjdv1cc9jr1gsiygk91yx66v8ip-gammaloop-crate-test-binaries-three-dimensional-reps-50150770f831b638-deps-0.1.0.drv
  9. 5.36 s [gammaloop-nextest-binaries-core-gammaloop-tracing-filter] Phase: unpackPhase
  10. 5.36 s [gammaloop-nextest-binaries-core-gammaloop-tracing-filter] unpacking source archive /nix/store/2d3120xrfvxkkiskdx2ds014jixzy3vp-source
  11. 5.36 s [gammaloop-nextest-binaries-core-gammaloop-tracing-filter] source root is source
  12. 5.36 s [gammaloop-nextest-binaries-core-gammaloop-tracing-filter] Phase: patchPhase
  13. 5.36 s [gammaloop-nextest-binaries-core-gammaloop-tracing-filter-macros] Phase: unpackPhase
  14. 5.36 s [gammaloop-nextest-binaries-core-gammaloop-tracing-filter-macros] unpacking source archive /nix/store/nsc45kyypqv5aw6m0z9w3b4wbx1yi2km-source
  15. 5.36 s [gammaloop-nextest-binaries-core-gammaloop-tracing-filter-macros] source root is source
  16. 5.36 s [gammaloop-nextest-binaries-core-gammaloop-tracing-filter-macros] Phase: patchPhase
  17. 5.43 s [gammaloop-nextest-binaries-core-gammaloop-tracing-filter] copying cargo artifacts from /nix/store/lrqyi3nmrf07zddkafn9qilj067gy5f6-gammaloop-crate-test-binaries-gammaloop-tracing-filter-31e37aec92971227-inputs/target to target
  18. 5.45 s [gammaloop-crate-test-binaries-three-dimensional-reps-50150770f831b638-deps] Phase: unpackPhase
  19. 5.45 s [gammaloop-crate-test-binaries-three-dimensional-reps-50150770f831b638-deps] unpacking source archive /nix/store/s1ajjdsb6bzj5dvvg360rj0kxnvgb27s-source
  20. 5.48 s [gammaloop-crate-test-binaries-three-dimensional-reps-50150770f831b638-deps] source root is source
  21. 5.49 s [gammaloop-crate-test-binaries-three-dimensional-reps-50150770f831b638-deps] Phase: patchPhase
  22. 5.50 s [gammaloop-nextest-binaries-core-gammaloop-tracing-filter-macros] copying cargo artifacts from /nix/store/dlh3rl0zih31g7l8hwjabhdf9wlzr0db-gammaloop-crate-test-binaries-gammaloop-tracing-filter-macros-1b17e1ec025c6580-inputs/target to target
  23. 5.63 s [gammaloop-crate-test-binaries-three-dimensional-reps-50150770f831b638-deps] Executing configureCargoCommonVars
  24. 5.64 s [gammaloop-crate-test-binaries-three-dimensional-reps-50150770f831b638-deps] copying cargo artifacts from /nix/store/71lg5z9qr6b69cp7v2y427r8blvhr0lh-gammaloop-crate-test-binaries-three-dimensional-reps-50150770f831b638-inputs/target to target
  25. 5.64 s [gammaloop-crate-test-binaries-three-dimensional-reps-50150770f831b638-deps] will deep copy artifacts (instead of symlinking) as requested
  26. 7.02 s [gammaloop-crate-test-binaries-three-dimensional-reps-50150770f831b638-deps] Phase: updateAutotoolsGnuConfigScriptsPhase
  27. 7.62 s [gammaloop-crate-test-binaries-three-dimensional-reps-50150770f831b638-deps] Phase: configurePhase
  28. 7.62 s [gammaloop-crate-test-binaries-three-dimensional-reps-50150770f831b638-deps] will append /build/source/.cargo-home/config.toml with contents of /nix/store/1sigmg52bb61pfngmk9k8wq5fz9r7bf1-vendor-cargo-deps/config.toml
  29. 7.63 s [gammaloop-crate-test-binaries-three-dimensional-reps-50150770f831b638-deps] default configurePhase, nothing to do
  30. 7.63 s [gammaloop-crate-test-binaries-three-dimensional-reps-50150770f831b638-deps] Phase: buildPhase
  31. 7.63 s [gammaloop-crate-test-binaries-three-dimensional-reps-50150770f831b638-deps] +++ command cargo --version
  32. 7.64 s [gammaloop-crate-test-binaries-three-dimensional-reps-50150770f831b638-deps] cargo 1.97.0 (c980f4866 2026-06-30)
  33. 7.64 s [gammaloop-crate-test-binaries-three-dimensional-reps-50150770f831b638-deps] +++ command cargo test --profile ci-optim --no-run --offline -p three-dimensional-reps --features three-dimensional-reps/serde
  34. 8.23 s [gammaloop-nextest-binaries-core-gammaloop-tracing-filter-macros] Executing configureCargoCommonVars
  35. 8.23 s [gammaloop-nextest-binaries-core-gammaloop-tracing-filter-macros] decompressing cargo artifacts from /nix/store/7v5kj1x4cvs2ixg2cjqarhd57l0d9d3b-gammaloop-crate-test-binaries-gammaloop-tracing-filter-macros-1b17e1ec025c6580-deps-0.1.0/target.tar.zst to target
  36. 8.28 s [gammaloop-nextest-binaries-core-gammaloop-tracing-filter] Executing configureCargoCommonVars
  37. 8.29 s [gammaloop-nextest-binaries-core-gammaloop-tracing-filter] decompressing cargo artifacts from /nix/store/hkialgfs0rf1qzg7fgd6vf1ki3npqdla-gammaloop-crate-test-binaries-gammaloop-tracing-filter-31e37aec92971227-deps-0.1.0/target.tar.zst to target
  38. 8.99 s [gammaloop-nextest-binaries-core-gammaloop-tracing-filter-macros] Phase: updateAutotoolsGnuConfigScriptsPhase
  39. 9.02 s [gammaloop-nextest-binaries-core-gammaloop-tracing-filter] Phase: updateAutotoolsGnuConfigScriptsPhase
  40. 9.05 s [gammaloop-nextest-binaries-core-gammaloop-tracing-filter-macros] Phase: configurePhase
  41. 9.06 s [gammaloop-nextest-binaries-core-gammaloop-tracing-filter-macros] will append /build/source/.cargo-home/config.toml with contents of /nix/store/1sigmg52bb61pfngmk9k8wq5fz9r7bf1-vendor-cargo-deps/config.toml
  42. 9.06 s [gammaloop-nextest-binaries-core-gammaloop-tracing-filter-macros] default configurePhase, nothing to do
  43. 9.06 s [gammaloop-nextest-binaries-core-gammaloop-tracing-filter] Phase: configurePhase
  44. 9.06 s [gammaloop-nextest-binaries-core-gammaloop-tracing-filter-macros] Phase: buildPhase
  45. 9.07 s [gammaloop-nextest-binaries-core-gammaloop-tracing-filter] will append /build/source/.cargo-home/config.toml with contents of /nix/store/1sigmg52bb61pfngmk9k8wq5fz9r7bf1-vendor-cargo-deps/config.toml
  46. 9.07 s [gammaloop-nextest-binaries-core-gammaloop-tracing-filter-macros] +++ command cargo --version
  47. 9.07 s [gammaloop-nextest-binaries-core-gammaloop-tracing-filter] default configurePhase, nothing to do
  48. 9.08 s [gammaloop-nextest-binaries-core-gammaloop-tracing-filter] Phase: buildPhase
  49. 9.08 s [gammaloop-nextest-binaries-core-gammaloop-tracing-filter-macros] cargo 1.97.0 (c980f4866 2026-06-30)
  50. 9.08 s [gammaloop-nextest-binaries-core-gammaloop-tracing-filter] +++ command cargo --version
  51. 9.09 s [gammaloop-nextest-binaries-core-gammaloop-tracing-filter] cargo 1.97.0 (c980f4866 2026-06-30)
  52. 9.12 s [gammaloop-nextest-binaries-core-gammaloop-tracing-filter-macros] +++ command cargo nextest --version
  53. 9.13 s [gammaloop-nextest-binaries-core-gammaloop-tracing-filter-macros] cargo-nextest 0.9.140
  54. 9.13 s [gammaloop-nextest-binaries-core-gammaloop-tracing-filter-macros] release: 0.9.140
  55. 9.13 s [gammaloop-nextest-binaries-core-gammaloop-tracing-filter-macros] host: x86_64-unknown-linux-gnu
  56. 9.13 s [gammaloop-nextest-binaries-core-gammaloop-tracing-filter-macros] +++ command cargo nextest archive --cargo-profile ci-optim --offline -p gammaloop-tracing-filter-macros -E 'package(gammaloop-tracing-filter-macros)' --profile ci_gammaloop --archive-file /nix/store/4h3wsw9f8k0w3fp5mqlmzgdxp68avlvg-gammaloop-nextest-binaries-core-gammaloop-tracing-filter-macros-0.1.0/gammaloop-nextest-core-gammaloop-tracing-filter-macros.tar.zst
  57. 9.14 s [gammaloop-nextest-binaries-core-gammaloop-tracing-filter] +++ command cargo nextest --version
  58. 9.15 s [gammaloop-nextest-binaries-core-gammaloop-tracing-filter] cargo-nextest 0.9.140
  59. 9.15 s [gammaloop-nextest-binaries-core-gammaloop-tracing-filter] release: 0.9.140
  60. 9.15 s [gammaloop-nextest-binaries-core-gammaloop-tracing-filter] host: x86_64-unknown-linux-gnu
  61. 9.15 s [gammaloop-nextest-binaries-core-gammaloop-tracing-filter] +++ command cargo nextest archive --cargo-profile ci-optim --offline -p gammaloop-tracing-filter --features gammaloop-tracing-filter/clap,gammaloop-tracing-filter/symbolica -E 'package(gammaloop-tracing-filter)' --profile ci_gammaloop --archive-file /nix/store/bzmilc3f8vgwcg5bnxn2lp59ijj2625i-gammaloop-nextest-binaries-core-gammaloop-tracing-filter-0.1.0/gammaloop-nextest-core-gammaloop-tracing-filter.tar.zst
  62. 9.22 s [gammaloop-crate-test-binaries-three-dimensional-reps-50150770f831b638-deps] Compiling three-dimensional-reps v0.1.0 (/build/source/crates/three-dimensional-reps)
  63. 9.45 s [gammaloop-crate-test-binaries-three-dimensional-reps-50150770f831b638-deps] error[E0433]: cannot find `eval` in `crate`
  64. 9.45 s [gammaloop-crate-test-binaries-three-dimensional-reps-50150770f831b638-deps] --> crates/three-dimensional-reps/src/generation.rs:8045:28
  65. 9.45 s [gammaloop-crate-test-binaries-three-dimensional-reps-50150770f831b638-deps] |
  66. 9.45 s [gammaloop-crate-test-binaries-three-dimensional-reps-50150770f831b638-deps] 8045 | let input = crate::eval::EvaluationInput {
  67. 9.45 s [gammaloop-crate-test-binaries-three-dimensional-reps-50150770f831b638-deps] | ^^^^ could not find `eval` in the crate root
  68. 9.45 s [gammaloop-crate-test-binaries-three-dimensional-reps-50150770f831b638-deps] |
  69. 9.45 s [gammaloop-crate-test-binaries-three-dimensional-reps-50150770f831b638-deps] note: found an item that was configured out
  70. 9.45 s [gammaloop-crate-test-binaries-three-dimensional-reps-50150770f831b638-deps] --> crates/three-dimensional-reps/src/lib.rs:7:9
  71. 9.45 s [gammaloop-crate-test-binaries-three-dimensional-reps-50150770f831b638-deps] |
  72. 9.45 s [gammaloop-crate-test-binaries-three-dimensional-reps-50150770f831b638-deps] 6 | #[cfg(feature = "eval")]
  73. 9.45 s [gammaloop-crate-test-binaries-three-dimensional-reps-50150770f831b638-deps] | ---------------- the item is gated behind the `eval` feature
  74. 9.45 s [gammaloop-crate-test-binaries-three-dimensional-reps-50150770f831b638-deps] 7 | pub mod eval;
  75. 9.46 s [gammaloop-crate-test-binaries-three-dimensional-reps-50150770f831b638-deps] | ^^^^
  76. 9.46 s [gammaloop-crate-test-binaries-three-dimensional-reps-50150770f831b638-deps]
  77. 9.46 s [gammaloop-crate-test-binaries-three-dimensional-reps-50150770f831b638-deps] error[E0433]: cannot find `eval` in `crate`
  78. 9.46 s [gammaloop-crate-test-binaries-three-dimensional-reps-50150770f831b638-deps] --> crates/three-dimensional-reps/src/generation.rs:8052:30
  79. 9.46 s [gammaloop-crate-test-binaries-three-dimensional-reps-50150770f831b638-deps] |
  80. 9.46 s [gammaloop-crate-test-binaries-three-dimensional-reps-50150770f831b638-deps] 8052 | let contact = crate::eval::evaluate_expression(
  81. 9.46 s [gammaloop-crate-test-binaries-three-dimensional-reps-50150770f831b638-deps] | ^^^^ could not find `eval` in the crate root
  82. 9.46 s [gammaloop-crate-test-binaries-three-dimensional-reps-50150770f831b638-deps] |
  83. 9.46 s [gammaloop-crate-test-binaries-three-dimensional-reps-50150770f831b638-deps] note: found an item that was configured out
  84. 9.46 s [gammaloop-crate-test-binaries-three-dimensional-reps-50150770f831b638-deps] --> crates/three-dimensional-reps/src/lib.rs:7:9
  85. 9.46 s [gammaloop-crate-test-binaries-three-dimensional-reps-50150770f831b638-deps] |
  86. 9.46 s [gammaloop-crate-test-binaries-three-dimensional-reps-50150770f831b638-deps] 6 | #[cfg(feature = "eval")]
  87. 9.46 s [gammaloop-crate-test-binaries-three-dimensional-reps-50150770f831b638-deps] | ---------------- the item is gated behind the `eval` feature
  88. 9.46 s [gammaloop-crate-test-binaries-three-dimensional-reps-50150770f831b638-deps] 7 | pub mod eval;
  89. 9.46 s [gammaloop-crate-test-binaries-three-dimensional-reps-50150770f831b638-deps] | ^^^^
  90. 9.46 s [gammaloop-crate-test-binaries-three-dimensional-reps-50150770f831b638-deps]
  91. 9.47 s [gammaloop-crate-test-binaries-three-dimensional-reps-50150770f831b638-deps] error[E0433]: cannot find `eval` in `crate`
  92. 9.47 s [gammaloop-crate-test-binaries-three-dimensional-reps-50150770f831b638-deps] --> crates/three-dimensional-reps/src/generation.rs:8060:32
  93. 9.47 s [gammaloop-crate-test-binaries-three-dimensional-reps-50150770f831b638-deps] |
  94. 9.47 s [gammaloop-crate-test-binaries-three-dimensional-reps-50150770f831b638-deps] 8060 | let remainder = crate::eval::evaluate_expression(
  95. 9.47 s [gammaloop-crate-test-binaries-three-dimensional-reps-50150770f831b638-deps] | ^^^^ could not find `eval` in the crate root
  96. 9.47 s [gammaloop-crate-test-binaries-three-dimensional-reps-50150770f831b638-deps] |
  97. 9.47 s [gammaloop-crate-test-binaries-three-dimensional-reps-50150770f831b638-deps] note: found an item that was configured out
  98. 9.47 s [gammaloop-crate-test-binaries-three-dimensional-reps-50150770f831b638-deps] --> crates/three-dimensional-reps/src/lib.rs:7:9
  99. 9.47 s [gammaloop-crate-test-binaries-three-dimensional-reps-50150770f831b638-deps] |
  100. 9.47 s [gammaloop-crate-test-binaries-three-dimensional-reps-50150770f831b638-deps] 6 | #[cfg(feature = "eval")]
  101. 9.47 s [gammaloop-crate-test-binaries-three-dimensional-reps-50150770f831b638-deps] | ---------------- the item is gated behind the `eval` feature
  102. 9.47 s [gammaloop-crate-test-binaries-three-dimensional-reps-50150770f831b638-deps] 7 | pub mod eval;
  103. 9.47 s [gammaloop-crate-test-binaries-three-dimensional-reps-50150770f831b638-deps] | ^^^^
  104. 9.47 s [gammaloop-crate-test-binaries-three-dimensional-reps-50150770f831b638-deps]
  105. 9.48 s [gammaloop-crate-test-binaries-three-dimensional-reps-50150770f831b638-deps] error[E0433]: cannot find `eval` in `crate`
  106. 9.48 s [gammaloop-crate-test-binaries-three-dimensional-reps-50150770f831b638-deps] --> crates/three-dimensional-reps/src/generation.rs:8068:28
  107. 9.48 s [gammaloop-crate-test-binaries-three-dimensional-reps-50150770f831b638-deps] |
  108. 9.48 s [gammaloop-crate-test-binaries-three-dimensional-reps-50150770f831b638-deps] 8068 | let total = crate::eval::evaluate_expression(&powered, &expression, numerator, &input)
  109. 9.48 s [gammaloop-crate-test-binaries-three-dimensional-reps-50150770f831b638-deps] | ^^^^ could not find `eval` in the crate root
  110. 9.48 s [gammaloop-crate-test-binaries-three-dimensional-reps-50150770f831b638-deps] |
  111. 9.48 s [gammaloop-crate-test-binaries-three-dimensional-reps-50150770f831b638-deps] note: found an item that was configured out
  112. 9.48 s [gammaloop-crate-test-binaries-three-dimensional-reps-50150770f831b638-deps] --> crates/three-dimensional-reps/src/lib.rs:7:9
  113. 9.48 s [gammaloop-crate-test-binaries-three-dimensional-reps-50150770f831b638-deps] |
  114. 9.48 s [gammaloop-crate-test-binaries-three-dimensional-reps-50150770f831b638-deps] 6 | #[cfg(feature = "eval")]
  115. 9.48 s [gammaloop-crate-test-binaries-three-dimensional-reps-50150770f831b638-deps] | ---------------- the item is gated behind the `eval` feature
  116. 9.48 s [gammaloop-crate-test-binaries-three-dimensional-reps-50150770f831b638-deps] 7 | pub mod eval;
  117. 9.48 s [gammaloop-crate-test-binaries-three-dimensional-reps-50150770f831b638-deps] | ^^^^
  118. 9.48 s [gammaloop-crate-test-binaries-three-dimensional-reps-50150770f831b638-deps]
  119. 10.65 s [gammaloop-nextest-binaries-core-gammaloop-tracing-filter-macros] Finished `ci-optim` profile [optimized] target(s) in 0.19s
  120. 10.69 s [gammaloop-nextest-binaries-core-gammaloop-tracing-filter-macros] Archiving 1 binary and 1 standard library to /nix/store/4h3wsw9f8k0w3fp5mqlmzgdxp68avlvg-gammaloop-nextest-binaries-core-gammaloop-tracing-filter-macros-0.1.0/gammaloop-nextest-core-gammaloop-tracing-filter-macros.tar.zst
  121. 10.73 s [gammaloop-nextest-binaries-core-gammaloop-tracing-filter-macros] Archived 4 files to /nix/store/4h3wsw9f8k0w3fp5mqlmzgdxp68avlvg-gammaloop-nextest-binaries-core-gammaloop-tracing-filter-macros-0.1.0/gammaloop-nextest-core-gammaloop-tracing-filter-macros.tar.zst in 0.05s
  122. 10.74 s [gammaloop-nextest-binaries-core-gammaloop-tracing-filter-macros] Phase: installPhase
  123. 10.75 s [gammaloop-nextest-binaries-core-gammaloop-tracing-filter-macros] Phase: fixupPhase
  124. 10.77 s [gammaloop-nextest-binaries-core-gammaloop-tracing-filter-macros] shrinking RPATHs of ELF executables and libraries in /nix/store/4h3wsw9f8k0w3fp5mqlmzgdxp68avlvg-gammaloop-nextest-binaries-core-gammaloop-tracing-filter-macros-0.1.0
  125. 10.77 s [gammaloop-nextest-binaries-core-gammaloop-tracing-filter-macros] checking for references to /build/ in /nix/store/4h3wsw9f8k0w3fp5mqlmzgdxp68avlvg-gammaloop-nextest-binaries-core-gammaloop-tracing-filter-macros-0.1.0...
  126. 10.78 s [gammaloop-nextest-binaries-core-gammaloop-tracing-filter-macros] patching script interpreter paths in /nix/store/4h3wsw9f8k0w3fp5mqlmzgdxp68avlvg-gammaloop-nextest-binaries-core-gammaloop-tracing-filter-macros-0.1.0
  127. 11.02 s [gammaloop-nextest-binaries-core-gammaloop-tracing-filter-macros:post-build] Uploading to the NixCI cache: /nix/store/4h3wsw9f8k0w3fp5mqlmzgdxp68avlvg-gammaloop-nextest-binaries-core-gammaloop-tracing-filter-macros-0.1.0
  128. 11.09 s [gammaloop-nextest-binaries-core-gammaloop-tracing-filter-macros:post-build] warning: 'warn-short-path-literals' is deprecated, use 'lint-short-path-literals = ignore' instead
  129. 11.10 s [gammaloop-nextest-binaries-core-gammaloop-tracing-filter-macros:post-build] copying 1 paths...
  130. 11.10 s [gammaloop-nextest-binaries-core-gammaloop-tracing-filter-macros:post-build] copying path '/nix/store/4h3wsw9f8k0w3fp5mqlmzgdxp68avlvg-gammaloop-nextest-binaries-core-gammaloop-tracing-filter-macros-0.1.0' to 'https://cache.nix-ci.com'...
  131. 11.91 s [gammaloop-nextest-binaries-core-gammaloop-tracing-filter-macros:post-build] warning: 'warn-short-path-literals' is deprecated, use 'lint-short-path-literals = ignore' instead
  132. 12.14 s [gammaloop-nextest-binaries-core-gammaloop-tracing-filter-macros:post-build] copying 2 paths...
  133. 12.14 s [gammaloop-nextest-binaries-core-gammaloop-tracing-filter-macros:post-build] copying path '/nix/store/nsc45kyypqv5aw6m0z9w3b4wbx1yi2km-source' to 'https://cache.nix-ci.com'...
  134. 12.31 s [gammaloop-nextest-binaries-core-gammaloop-tracing-filter-macros:post-build] copying path '/nix/store/27i97c6xhk0vdw2qmyrhrq17jh733sag-gammaloop-nextest-binaries-core-gammaloop-tracing-filter-macros-0.1.0.drv' to 'https://cache.nix-ci.com'...
  135. 12.48 s Uploaded gammaloop-nextest-binaries-core-gammaloop-tracing-filter-macros in 1.5s
  136. 12.48 s Progress: 1 of 10 built (2 building), 0 of 4 downloaded from cache (2 downloading)
  137. 12.48 s Built gammaloop-nextest-binaries-core-gammaloop-tracing-filter-macros in 7.2s
  138. 12.48 s [gammaloop-crate-test-binaries-three-dimensional-reps-50150770f831b638-deps] For more information about this error, try `rustc --explain E0433`.
  139. 12.48 s [gammaloop-crate-test-binaries-three-dimensional-reps-50150770f831b638-deps] error: could not compile `three-dimensional-reps` (lib test) due to 4 previous errors
  140. 12.48 s [gammaloop-nextest-binaries-core-gammaloop-tracing-filter] Finished `ci-optim` profile [optimized] target(s) in 0.31s
  141. 12.48 s [gammaloop-nextest-binaries-core-gammaloop-tracing-filter] warning: the following packages contain code that will be rejected by a future version of Rust: proc-macro-error2 v2.0.1
  142. 12.48 s [gammaloop-nextest-binaries-core-gammaloop-tracing-filter] note: to see what the problems were, use the option `--future-incompat-report`, or run `cargo report future-incompatibilities --id 1`
  143. 12.48 s [gammaloop-nextest-binaries-core-gammaloop-tracing-filter] Archiving 1 binary, 1 linked path, and 1 standard library to /nix/store/bzmilc3f8vgwcg5bnxn2lp59ijj2625i-gammaloop-nextest-binaries-core-gammaloop-tracing-filter-0.1.0/gammaloop-nextest-core-gammaloop-tracing-filter.tar.zst
  144. 12.48 s [gammaloop-nextest-binaries-core-gammaloop-tracing-filter] Archived 7 files to /nix/store/bzmilc3f8vgwcg5bnxn2lp59ijj2625i-gammaloop-nextest-binaries-core-gammaloop-tracing-filter-0.1.0/gammaloop-nextest-core-gammaloop-tracing-filter.tar.zst in 0.11s
  145. 12.48 s [gammaloop-nextest-binaries-core-gammaloop-tracing-filter] Phase: installPhase
  146. 12.48 s [gammaloop-nextest-binaries-core-gammaloop-tracing-filter] Phase: fixupPhase
  147. 12.48 s [gammaloop-nextest-binaries-core-gammaloop-tracing-filter] shrinking RPATHs of ELF executables and libraries in /nix/store/bzmilc3f8vgwcg5bnxn2lp59ijj2625i-gammaloop-nextest-binaries-core-gammaloop-tracing-filter-0.1.0
  148. 12.48 s [gammaloop-nextest-binaries-core-gammaloop-tracing-filter] checking for references to /build/ in /nix/store/bzmilc3f8vgwcg5bnxn2lp59ijj2625i-gammaloop-nextest-binaries-core-gammaloop-tracing-filter-0.1.0...
  149. 12.48 s [gammaloop-nextest-binaries-core-gammaloop-tracing-filter] patching script interpreter paths in /nix/store/bzmilc3f8vgwcg5bnxn2lp59ijj2625i-gammaloop-nextest-binaries-core-gammaloop-tracing-filter-0.1.0
  150. 12.72 s Progress: 1 of 9 built (1 building, 1 failed), 0 of 4 downloaded from cache (2 downloading)
  151. 12.72 s Failed to build gammaloop-crate-test-binaries-three-dimensional-reps-50150770f831b638-deps after 7.3s
  152. 12.94 s [gammaloop-nextest-binaries-core-gammaloop-tracing-filter:post-build] Uploading to the NixCI cache: /nix/store/bzmilc3f8vgwcg5bnxn2lp59ijj2625i-gammaloop-nextest-binaries-core-gammaloop-tracing-filter-0.1.0
  153. 12.98 s [gammaloop-nextest-binaries-core-gammaloop-tracing-filter:post-build] warning: 'warn-short-path-literals' is deprecated, use 'lint-short-path-literals = ignore' instead
  154. 12.99 s [gammaloop-nextest-binaries-core-gammaloop-tracing-filter:post-build] copying 1 paths...
  155. 12.99 s [gammaloop-nextest-binaries-core-gammaloop-tracing-filter:post-build] copying path '/nix/store/bzmilc3f8vgwcg5bnxn2lp59ijj2625i-gammaloop-nextest-binaries-core-gammaloop-tracing-filter-0.1.0' to 'https://cache.nix-ci.com'...
  156. 16.32 s [gammaloop-nextest-binaries-core-gammaloop-tracing-filter:post-build] warning: 'warn-short-path-literals' is deprecated, use 'lint-short-path-literals = ignore' instead
  157. 16.55 s [gammaloop-nextest-binaries-core-gammaloop-tracing-filter:post-build] copying 2 paths...
  158. 16.55 s [gammaloop-nextest-binaries-core-gammaloop-tracing-filter:post-build] copying path '/nix/store/2d3120xrfvxkkiskdx2ds014jixzy3vp-source' to 'https://cache.nix-ci.com'...
  159. 17.42 s [gammaloop-nextest-binaries-core-gammaloop-tracing-filter:post-build] copying path '/nix/store/arx10qm23ci8dfj1niv2y32y83wbg9dj-gammaloop-nextest-binaries-core-gammaloop-tracing-filter-0.1.0.drv' to 'https://cache.nix-ci.com'...
  160. 17.58 s Uploaded gammaloop-nextest-binaries-core-gammaloop-tracing-filter in 4.6s
  161. 17.58 s Progress: 2 of 10 built (1 failed), 0 of 4 downloaded from cache (2 downloading)
  162. 17.58 s Built gammaloop-nextest-binaries-core-gammaloop-tracing-filter in 12.4s
  163. 17.58 s error: Cannot build '/nix/store/jw4czjjdv1cc9jr1gsiygk91yx66v8ip-gammaloop-crate-test-binaries-three-dimensional-reps-50150770f831b638-deps-0.1.0.drv'.
  164. 17.58 s Reason: builder failed with exit code 101.
  165. 17.58 s Output paths:
  166. 17.58 s /nix/store/vf8ksab94faladqcwqcly6amf5fvpg1h-gammaloop-crate-test-binaries-three-dimensional-reps-50150770f831b638-deps-0.1.0
  167. 17.58 s Last 74 log lines:
  168. 17.58 s > Running phase: unpackPhase
  169. 17.58 s > unpacking source archive /nix/store/s1ajjdsb6bzj5dvvg360rj0kxnvgb27s-source
  170. 17.58 s > source root is source
  171. 17.58 s > Running phase: patchPhase
  172. 17.58 s > Executing configureCargoCommonVars
  173. 17.58 s > copying cargo artifacts from /nix/store/71lg5z9qr6b69cp7v2y427r8blvhr0lh-gammaloop-crate-test-binaries-three-dimensional-reps-50150770f831b638-inputs/target to target
  174. 17.58 s > will deep copy artifacts (instead of symlinking) as requested
  175. 17.58 s > Running phase: updateAutotoolsGnuConfigScriptsPhase
  176. 17.58 s > Running phase: configurePhase
  177. 17.58 s > will append /build/source/.cargo-home/config.toml with contents of /nix/store/1sigmg52bb61pfngmk9k8wq5fz9r7bf1-vendor-cargo-deps/config.toml
  178. 17.58 s > default configurePhase, nothing to do
  179. 17.58 s > Running phase: buildPhase
  180. 17.58 s > +++ command cargo --version
  181. 17.58 s > cargo 1.97.0 (c980f4866 2026-06-30)
  182. 17.58 s > +++ command cargo test --profile ci-optim --no-run --offline -p three-dimensional-reps --features three-dimensional-reps/serde
  183. 17.58 s > Compiling three-dimensional-reps v0.1.0 (/build/source/crates/three-dimensional-reps)
  184. 17.58 s > error[E0433]: cannot find `eval` in `crate`
  185. 17.58 s > --> crates/three-dimensional-reps/src/generation.rs:8045:28
  186. 17.58 s > |
  187. 17.58 s > 8045 | let input = crate::eval::EvaluationInput {
  188. 17.58 s > | ^^^^ could not find `eval` in the crate root
  189. 17.58 s > |
  190. 17.58 s > note: found an item that was configured out
  191. 17.58 s > --> crates/three-dimensional-reps/src/lib.rs:7:9
  192. 17.58 s > |
  193. 17.58 s > 6 | #[cfg(feature = "eval")]
  194. 17.58 s > | ---------------- the item is gated behind the `eval` feature
  195. 17.58 s > 7 | pub mod eval;
  196. 17.58 s > | ^^^^
  197. 17.58 s >
  198. 17.58 s > error[E0433]: cannot find `eval` in `crate`
  199. 17.58 s > --> crates/three-dimensional-reps/src/generation.rs:8052:30
  200. 17.58 s > |
  201. 17.58 s > 8052 | let contact = crate::eval::evaluate_expression(
  202. 17.58 s > | ^^^^ could not find `eval` in the crate root
  203. 17.58 s > |
  204. 17.58 s > note: found an item that was configured out
  205. 17.58 s > --> crates/three-dimensional-reps/src/lib.rs:7:9
  206. 17.58 s > |
  207. 17.58 s > 6 | #[cfg(feature = "eval")]
  208. 17.58 s > | ---------------- the item is gated behind the `eval` feature
  209. 17.58 s > 7 | pub mod eval;
  210. 17.58 s > | ^^^^
  211. 17.58 s >
  212. 17.58 s > error[E0433]: cannot find `eval` in `crate`
  213. 17.58 s > --> crates/three-dimensional-reps/src/generation.rs:8060:32
  214. 17.58 s > |
  215. 17.58 s > 8060 | let remainder = crate::eval::evaluate_expression(
  216. 17.58 s > | ^^^^ could not find `eval` in the crate root
  217. 17.58 s > |
  218. 17.58 s > note: found an item that was configured out
  219. 17.58 s > --> crates/three-dimensional-reps/src/lib.rs:7:9
  220. 17.58 s > |
  221. 17.58 s > 6 | #[cfg(feature = "eval")]
  222. 17.58 s > | ---------------- the item is gated behind the `eval` feature
  223. 17.58 s > 7 | pub mod eval;
  224. 17.58 s > | ^^^^
  225. 17.58 s >
  226. 17.58 s > error[E0433]: cannot find `eval` in `crate`
  227. 17.58 s > --> crates/three-dimensional-reps/src/generation.rs:8068:28
  228. 17.58 s > |
  229. 17.58 s > 8068 | let total = crate::eval::evaluate_expression(&powered, &expression, numerator, &input)
  230. 17.58 s > | ^^^^ could not find `eval` in the crate root
  231. 17.58 s > |
  232. 17.58 s > note: found an item that was configured out
  233. 17.58 s > --> crates/three-dimensional-reps/src/lib.rs:7:9
  234. 17.58 s > |
  235. 17.58 s > 6 | #[cfg(feature = "eval")]
  236. 17.58 s > | ---------------- the item is gated behind the `eval` feature
  237. 17.58 s > 7 | pub mod eval;
  238. 17.58 s > | ^^^^
  239. 17.58 s >
  240. 17.58 s > For more information about this error, try `rustc --explain E0433`.
  241. 17.58 s > error: could not compile `three-dimensional-reps` (lib test) due to 4 previous errors
  242. 17.58 s For full logs, run:
  243. 17.58 s nix log /nix/store/jw4czjjdv1cc9jr1gsiygk91yx66v8ip-gammaloop-crate-test-binaries-three-dimensional-reps-50150770f831b638-deps-0.1.0.drv
  244. 17.58 s error: Cannot build '/nix/store/pfkcjvmdnwdq2i09nhm6wz0lwsd0i651-gammaloop-nextest-binaries-core-three-dimensional-reps-0.1.0.drv'.
  245. 17.58 s Reason: 1 dependency failed.
  246. 17.58 s Output paths:
  247. 17.58 s /nix/store/3013vncxrnlsyyvsdflnvapva4vwh3h3-gammaloop-nextest-binaries-core-three-dimensional-reps-0.1.0
  248. 17.58 s error: Build failed due to failed dependency
  249. 17.58 s error: Cannot build '/nix/store/16ldzq2pwwz202d9jrl0ix81imnzvb9q-gammaloop-nextest-binaries-core.drv'.
  250. 17.58 s Reason: 1 dependency failed.
  251. 17.58 s Output paths:
  252. 17.58 s /nix/store/f5x93xd8jya5mmwp0xqk8xzq9hgcs3kz-gammaloop-nextest-binaries-core
  253. 23.13 s Downloaded cached gammaloop-crate-test-binaries-gammalooprs-247ff5d63201fb2c-inputs (2.3 GiB) in 18.1s
  254. 26.78 s Downloaded cached gammaloop-crate-test-binaries-gammaloop-api-f0f952c3f8c3050c-inputs (3 GiB) in 21.7s
  255. 26.79 s Build failed due to failed dependency
  256. 26.84 s Build failed.