build packages.x86_64-linux.crate-test-binaries-three-dimensional-reps

Reproduce this run
Retry Run
  1. 0.00 s $ /nix/store/9ypz3flqsrl5xl495mm8h645gadjsxi1-coreutils-9.11/bin/timeout --kill-after=15s 7200s /nix/store/23zk8sgzamrbmj1fday15szf7f2279s8-nix-2.34.7/bin/nix --extra-experimental-features nix-command --extra-experimental-features flakes --log-format internal-json build --no-link --print-out-paths git+https://github.com/alphal00p/gammaloop?ref=raised_energy_cff_wip&rev=1b760f6389d8bafaf27d81526df58d777b0d9cdc&shallow=1#packages.x86_64-linux.crate-test-binaries-three-dimensional-reps --print-build-logs
  2. 0.65 s error (ignored): SQLite database '/var/cache/nix-ci-worker/eval-cache-v6/c95e80f94b32785e9a43dce9c701a3fb92c38d4174189b2aa3971848dbdbf027.sqlite' is busy
  3. 2.67 s
  4. 3.48 s Building /nix/store/jw4czjjdv1cc9jr1gsiygk91yx66v8ip-gammaloop-crate-test-binaries-three-dimensional-reps-50150770f831b638-deps-0.1.0.drv
  5. 3.69 s [gammaloop-crate-test-binaries-three-dimensional-reps-50150770f831b638-deps] Phase: unpackPhase
  6. 3.69 s [gammaloop-crate-test-binaries-three-dimensional-reps-50150770f831b638-deps] unpacking source archive /nix/store/s1ajjdsb6bzj5dvvg360rj0kxnvgb27s-source
  7. 3.92 s [gammaloop-crate-test-binaries-three-dimensional-reps-50150770f831b638-deps] source root is source
  8. 3.94 s [gammaloop-crate-test-binaries-three-dimensional-reps-50150770f831b638-deps] Phase: patchPhase
  9. 4.29 s [gammaloop-crate-test-binaries-three-dimensional-reps-50150770f831b638-deps] Executing configureCargoCommonVars
  10. 4.30 s [gammaloop-crate-test-binaries-three-dimensional-reps-50150770f831b638-deps] copying cargo artifacts from /nix/store/71lg5z9qr6b69cp7v2y427r8blvhr0lh-gammaloop-crate-test-binaries-three-dimensional-reps-50150770f831b638-inputs/target to target
  11. 4.30 s [gammaloop-crate-test-binaries-three-dimensional-reps-50150770f831b638-deps] will deep copy artifacts (instead of symlinking) as requested
  12. 13.33 s [gammaloop-crate-test-binaries-three-dimensional-reps-50150770f831b638-deps] Phase: updateAutotoolsGnuConfigScriptsPhase
  13. 13.38 s [gammaloop-crate-test-binaries-three-dimensional-reps-50150770f831b638-deps] Phase: configurePhase
  14. 13.38 s [gammaloop-crate-test-binaries-three-dimensional-reps-50150770f831b638-deps] will append /build/source/.cargo-home/config.toml with contents of /nix/store/1sigmg52bb61pfngmk9k8wq5fz9r7bf1-vendor-cargo-deps/config.toml
  15. 13.39 s [gammaloop-crate-test-binaries-three-dimensional-reps-50150770f831b638-deps] default configurePhase, nothing to do
  16. 13.40 s [gammaloop-crate-test-binaries-three-dimensional-reps-50150770f831b638-deps] Phase: buildPhase
  17. 13.41 s [gammaloop-crate-test-binaries-three-dimensional-reps-50150770f831b638-deps] +++ command cargo --version
  18. 13.41 s [gammaloop-crate-test-binaries-three-dimensional-reps-50150770f831b638-deps] cargo 1.97.0 (c980f4866 2026-06-30)
  19. 13.41 s [gammaloop-crate-test-binaries-three-dimensional-reps-50150770f831b638-deps] +++ command cargo test --profile ci-optim --no-run --offline -p three-dimensional-reps --features three-dimensional-reps/serde
  20. 13.84 s [gammaloop-crate-test-binaries-three-dimensional-reps-50150770f831b638-deps] Compiling three-dimensional-reps v0.1.0 (/build/source/crates/three-dimensional-reps)
  21. 14.06 s [gammaloop-crate-test-binaries-three-dimensional-reps-50150770f831b638-deps] error[E0433]: cannot find `eval` in `crate`
  22. 14.06 s [gammaloop-crate-test-binaries-three-dimensional-reps-50150770f831b638-deps] --> crates/three-dimensional-reps/src/generation.rs:8045:28
  23. 14.06 s [gammaloop-crate-test-binaries-three-dimensional-reps-50150770f831b638-deps] |
  24. 14.06 s [gammaloop-crate-test-binaries-three-dimensional-reps-50150770f831b638-deps] 8045 | let input = crate::eval::EvaluationInput {
  25. 14.06 s [gammaloop-crate-test-binaries-three-dimensional-reps-50150770f831b638-deps] | ^^^^ could not find `eval` in the crate root
  26. 14.06 s [gammaloop-crate-test-binaries-three-dimensional-reps-50150770f831b638-deps] |
  27. 14.06 s [gammaloop-crate-test-binaries-three-dimensional-reps-50150770f831b638-deps] note: found an item that was configured out
  28. 14.06 s [gammaloop-crate-test-binaries-three-dimensional-reps-50150770f831b638-deps] --> crates/three-dimensional-reps/src/lib.rs:7:9
  29. 14.06 s [gammaloop-crate-test-binaries-three-dimensional-reps-50150770f831b638-deps] |
  30. 14.06 s [gammaloop-crate-test-binaries-three-dimensional-reps-50150770f831b638-deps] 6 | #[cfg(feature = "eval")]
  31. 14.06 s [gammaloop-crate-test-binaries-three-dimensional-reps-50150770f831b638-deps] | ---------------- the item is gated behind the `eval` feature
  32. 14.06 s [gammaloop-crate-test-binaries-three-dimensional-reps-50150770f831b638-deps] 7 | pub mod eval;
  33. 14.06 s [gammaloop-crate-test-binaries-three-dimensional-reps-50150770f831b638-deps] | ^^^^
  34. 14.06 s [gammaloop-crate-test-binaries-three-dimensional-reps-50150770f831b638-deps]
  35. 14.06 s [gammaloop-crate-test-binaries-three-dimensional-reps-50150770f831b638-deps] error[E0433]: cannot find `eval` in `crate`
  36. 14.06 s [gammaloop-crate-test-binaries-three-dimensional-reps-50150770f831b638-deps] --> crates/three-dimensional-reps/src/generation.rs:8052:30
  37. 14.06 s [gammaloop-crate-test-binaries-three-dimensional-reps-50150770f831b638-deps] |
  38. 14.06 s [gammaloop-crate-test-binaries-three-dimensional-reps-50150770f831b638-deps] 8052 | let contact = crate::eval::evaluate_expression(
  39. 14.06 s [gammaloop-crate-test-binaries-three-dimensional-reps-50150770f831b638-deps] | ^^^^ could not find `eval` in the crate root
  40. 14.06 s [gammaloop-crate-test-binaries-three-dimensional-reps-50150770f831b638-deps] |
  41. 14.06 s [gammaloop-crate-test-binaries-three-dimensional-reps-50150770f831b638-deps] note: found an item that was configured out
  42. 14.06 s [gammaloop-crate-test-binaries-three-dimensional-reps-50150770f831b638-deps] --> crates/three-dimensional-reps/src/lib.rs:7:9
  43. 14.06 s [gammaloop-crate-test-binaries-three-dimensional-reps-50150770f831b638-deps] |
  44. 14.06 s [gammaloop-crate-test-binaries-three-dimensional-reps-50150770f831b638-deps] 6 | #[cfg(feature = "eval")]
  45. 14.06 s [gammaloop-crate-test-binaries-three-dimensional-reps-50150770f831b638-deps] | ---------------- the item is gated behind the `eval` feature
  46. 14.06 s [gammaloop-crate-test-binaries-three-dimensional-reps-50150770f831b638-deps] 7 | pub mod eval;
  47. 14.06 s [gammaloop-crate-test-binaries-three-dimensional-reps-50150770f831b638-deps] | ^^^^
  48. 14.06 s [gammaloop-crate-test-binaries-three-dimensional-reps-50150770f831b638-deps]
  49. 14.07 s [gammaloop-crate-test-binaries-three-dimensional-reps-50150770f831b638-deps] error[E0433]: cannot find `eval` in `crate`
  50. 14.07 s [gammaloop-crate-test-binaries-three-dimensional-reps-50150770f831b638-deps] --> crates/three-dimensional-reps/src/generation.rs:8060:32
  51. 14.07 s [gammaloop-crate-test-binaries-three-dimensional-reps-50150770f831b638-deps] |
  52. 14.07 s [gammaloop-crate-test-binaries-three-dimensional-reps-50150770f831b638-deps] 8060 | let remainder = crate::eval::evaluate_expression(
  53. 14.07 s [gammaloop-crate-test-binaries-three-dimensional-reps-50150770f831b638-deps] | ^^^^ could not find `eval` in the crate root
  54. 14.07 s [gammaloop-crate-test-binaries-three-dimensional-reps-50150770f831b638-deps] |
  55. 14.07 s [gammaloop-crate-test-binaries-three-dimensional-reps-50150770f831b638-deps] note: found an item that was configured out
  56. 14.07 s [gammaloop-crate-test-binaries-three-dimensional-reps-50150770f831b638-deps] --> crates/three-dimensional-reps/src/lib.rs:7:9
  57. 14.07 s [gammaloop-crate-test-binaries-three-dimensional-reps-50150770f831b638-deps] |
  58. 14.07 s [gammaloop-crate-test-binaries-three-dimensional-reps-50150770f831b638-deps] 6 | #[cfg(feature = "eval")]
  59. 14.07 s [gammaloop-crate-test-binaries-three-dimensional-reps-50150770f831b638-deps] | ---------------- the item is gated behind the `eval` feature
  60. 14.07 s [gammaloop-crate-test-binaries-three-dimensional-reps-50150770f831b638-deps] 7 | pub mod eval;
  61. 14.07 s [gammaloop-crate-test-binaries-three-dimensional-reps-50150770f831b638-deps] | ^^^^
  62. 14.07 s [gammaloop-crate-test-binaries-three-dimensional-reps-50150770f831b638-deps]
  63. 14.08 s [gammaloop-crate-test-binaries-three-dimensional-reps-50150770f831b638-deps] error[E0433]: cannot find `eval` in `crate`
  64. 14.08 s [gammaloop-crate-test-binaries-three-dimensional-reps-50150770f831b638-deps] --> crates/three-dimensional-reps/src/generation.rs:8068:28
  65. 14.08 s [gammaloop-crate-test-binaries-three-dimensional-reps-50150770f831b638-deps] |
  66. 14.08 s [gammaloop-crate-test-binaries-three-dimensional-reps-50150770f831b638-deps] 8068 | let total = crate::eval::evaluate_expression(&powered, &expression, numerator, &input)
  67. 14.08 s [gammaloop-crate-test-binaries-three-dimensional-reps-50150770f831b638-deps] | ^^^^ could not find `eval` in the crate root
  68. 14.08 s [gammaloop-crate-test-binaries-three-dimensional-reps-50150770f831b638-deps] |
  69. 14.08 s [gammaloop-crate-test-binaries-three-dimensional-reps-50150770f831b638-deps] note: found an item that was configured out
  70. 14.08 s [gammaloop-crate-test-binaries-three-dimensional-reps-50150770f831b638-deps] --> crates/three-dimensional-reps/src/lib.rs:7:9
  71. 14.08 s [gammaloop-crate-test-binaries-three-dimensional-reps-50150770f831b638-deps] |
  72. 14.08 s [gammaloop-crate-test-binaries-three-dimensional-reps-50150770f831b638-deps] 6 | #[cfg(feature = "eval")]
  73. 14.08 s [gammaloop-crate-test-binaries-three-dimensional-reps-50150770f831b638-deps] | ---------------- the item is gated behind the `eval` feature
  74. 14.08 s [gammaloop-crate-test-binaries-three-dimensional-reps-50150770f831b638-deps] 7 | pub mod eval;
  75. 14.08 s [gammaloop-crate-test-binaries-three-dimensional-reps-50150770f831b638-deps] | ^^^^
  76. 14.08 s [gammaloop-crate-test-binaries-three-dimensional-reps-50150770f831b638-deps]
  77. 15.94 s [gammaloop-crate-test-binaries-three-dimensional-reps-50150770f831b638-deps] For more information about this error, try `rustc --explain E0433`.
  78. 15.96 s [gammaloop-crate-test-binaries-three-dimensional-reps-50150770f831b638-deps] error: could not compile `three-dimensional-reps` (lib test) due to 4 previous errors
  79. 16.26 s Progress: 0 of 2 built (1 failed)
  80. 16.26 s Failed to build gammaloop-crate-test-binaries-three-dimensional-reps-50150770f831b638-deps after 12.7s
  81. 16.26 s error: Cannot build '/nix/store/jw4czjjdv1cc9jr1gsiygk91yx66v8ip-gammaloop-crate-test-binaries-three-dimensional-reps-50150770f831b638-deps-0.1.0.drv'.
  82. 16.26 s Reason: builder failed with exit code 101.
  83. 16.26 s Output paths:
  84. 16.26 s /nix/store/vf8ksab94faladqcwqcly6amf5fvpg1h-gammaloop-crate-test-binaries-three-dimensional-reps-50150770f831b638-deps-0.1.0
  85. 16.26 s Last 74 log lines:
  86. 16.26 s > Running phase: unpackPhase
  87. 16.26 s > unpacking source archive /nix/store/s1ajjdsb6bzj5dvvg360rj0kxnvgb27s-source
  88. 16.26 s > source root is source
  89. 16.26 s > Running phase: patchPhase
  90. 16.26 s > Executing configureCargoCommonVars
  91. 16.26 s > copying cargo artifacts from /nix/store/71lg5z9qr6b69cp7v2y427r8blvhr0lh-gammaloop-crate-test-binaries-three-dimensional-reps-50150770f831b638-inputs/target to target
  92. 16.26 s > will deep copy artifacts (instead of symlinking) as requested
  93. 16.26 s > Running phase: updateAutotoolsGnuConfigScriptsPhase
  94. 16.26 s > Running phase: configurePhase
  95. 16.26 s > will append /build/source/.cargo-home/config.toml with contents of /nix/store/1sigmg52bb61pfngmk9k8wq5fz9r7bf1-vendor-cargo-deps/config.toml
  96. 16.26 s > default configurePhase, nothing to do
  97. 16.26 s > Running phase: buildPhase
  98. 16.26 s > +++ command cargo --version
  99. 16.26 s > cargo 1.97.0 (c980f4866 2026-06-30)
  100. 16.26 s > +++ command cargo test --profile ci-optim --no-run --offline -p three-dimensional-reps --features three-dimensional-reps/serde
  101. 16.26 s > Compiling three-dimensional-reps v0.1.0 (/build/source/crates/three-dimensional-reps)
  102. 16.26 s > error[E0433]: cannot find `eval` in `crate`
  103. 16.26 s > --> crates/three-dimensional-reps/src/generation.rs:8045:28
  104. 16.26 s > |
  105. 16.26 s > 8045 | let input = crate::eval::EvaluationInput {
  106. 16.26 s > | ^^^^ could not find `eval` in the crate root
  107. 16.26 s > |
  108. 16.26 s > note: found an item that was configured out
  109. 16.26 s > --> crates/three-dimensional-reps/src/lib.rs:7:9
  110. 16.26 s > |
  111. 16.26 s > 6 | #[cfg(feature = "eval")]
  112. 16.26 s > | ---------------- the item is gated behind the `eval` feature
  113. 16.26 s > 7 | pub mod eval;
  114. 16.26 s > | ^^^^
  115. 16.26 s >
  116. 16.26 s > error[E0433]: cannot find `eval` in `crate`
  117. 16.26 s > --> crates/three-dimensional-reps/src/generation.rs:8052:30
  118. 16.26 s > |
  119. 16.26 s > 8052 | let contact = crate::eval::evaluate_expression(
  120. 16.26 s > | ^^^^ could not find `eval` in the crate root
  121. 16.26 s > |
  122. 16.26 s > note: found an item that was configured out
  123. 16.26 s > --> crates/three-dimensional-reps/src/lib.rs:7:9
  124. 16.26 s > |
  125. 16.26 s > 6 | #[cfg(feature = "eval")]
  126. 16.26 s > | ---------------- the item is gated behind the `eval` feature
  127. 16.26 s > 7 | pub mod eval;
  128. 16.26 s > | ^^^^
  129. 16.26 s >
  130. 16.26 s > error[E0433]: cannot find `eval` in `crate`
  131. 16.26 s > --> crates/three-dimensional-reps/src/generation.rs:8060:32
  132. 16.26 s > |
  133. 16.26 s > 8060 | let remainder = crate::eval::evaluate_expression(
  134. 16.26 s > | ^^^^ could not find `eval` in the crate root
  135. 16.26 s > |
  136. 16.26 s > note: found an item that was configured out
  137. 16.26 s > --> crates/three-dimensional-reps/src/lib.rs:7:9
  138. 16.26 s > |
  139. 16.26 s > 6 | #[cfg(feature = "eval")]
  140. 16.26 s > | ---------------- the item is gated behind the `eval` feature
  141. 16.26 s > 7 | pub mod eval;
  142. 16.26 s > | ^^^^
  143. 16.26 s >
  144. 16.26 s > error[E0433]: cannot find `eval` in `crate`
  145. 16.26 s > --> crates/three-dimensional-reps/src/generation.rs:8068:28
  146. 16.26 s > |
  147. 16.26 s > 8068 | let total = crate::eval::evaluate_expression(&powered, &expression, numerator, &input)
  148. 16.26 s > | ^^^^ could not find `eval` in the crate root
  149. 16.26 s > |
  150. 16.26 s > note: found an item that was configured out
  151. 16.26 s > --> crates/three-dimensional-reps/src/lib.rs:7:9
  152. 16.26 s > |
  153. 16.26 s > 6 | #[cfg(feature = "eval")]
  154. 16.26 s > | ---------------- the item is gated behind the `eval` feature
  155. 16.26 s > 7 | pub mod eval;
  156. 16.26 s > | ^^^^
  157. 16.26 s >
  158. 16.26 s > For more information about this error, try `rustc --explain E0433`.
  159. 16.26 s > error: could not compile `three-dimensional-reps` (lib test) due to 4 previous errors
  160. 16.26 s For full logs, run:
  161. 16.26 s nix log /nix/store/jw4czjjdv1cc9jr1gsiygk91yx66v8ip-gammaloop-crate-test-binaries-three-dimensional-reps-50150770f831b638-deps-0.1.0.drv
  162. 16.26 s error: Cannot build '/nix/store/82q0w19lk465i1vkzypp1wsrbnq1hx6q-nix-ci-artifact-barrier-crate-test-binaries-three-dimensional-reps.drv'.
  163. 16.26 s Reason: 1 dependency failed.
  164. 16.26 s Output paths:
  165. 16.26 s /nix/store/7va6sdnzmy18jfp62ndfb0j5jsfy4981-nix-ci-artifact-barrier-crate-test-binaries-three-dimensional-reps
  166. 16.26 s Build failed due to failed dependency
  167. 16.35 s Build failed.