0.00 s
$ /nix/store/9ypz3flqsrl5xl495mm8h645gadjsxi1-coreutils-9.11/bin/timeout --kill-after=15s 7200s /nix/store/23zk8sgzamrbmj1fday15szf7f2279s8-nix-2.34.7/bin/nix --extra-experimental-features nix-command --extra-experimental-features flakes --log-format internal-json build --no-link --print-out-paths git+https://github.com/alphal00p/gammaloop?ref=raised_energy_cff_wip&rev=1b760f6389d8bafaf27d81526df58d777b0d9cdc&shallow=1#checks.x86_64-linux.gammaloop-nextest-binaries-core --print-build-logs
0.36 s
error (ignored): SQLite database '/var/cache/nix-ci-worker/eval-cache-v6/c95e80f94b32785e9a43dce9c701a3fb92c38d4174189b2aa3971848dbdbf027.sqlite ' is busy
4.24 s
4.95 s
Downloading cached gammaloop-nextest-binaries-core-gammaloop-tracing-filter-macros from https://cache.nix-ci.com
4.95 s
Downloading cached gammaloop-nextest-binaries-core-gammaloop-tracing-filter from https://cache.nix-ci.com
5.00 s
Downloading cached gammaloop-crate-test-binaries-gammalooprs-247ff5d63201fb2c-inputs from https://cache.nix-ci.com
5.22 s
Downloaded cached gammaloop-nextest-binaries-core-gammaloop-tracing-filter-macros (1.7 MiB) in 268ms
5.34 s
Downloaded cached gammaloop-nextest-binaries-core-gammaloop-tracing-filter (8.1 MiB) in 391ms
5.46 s
Building /nix/store/kp5yaiakkmc4yba6yzjdjd7vv2iiv844-gammaloop-nextest-binaries-core-gammaloop-api-0.1.0.drv
5.56 s
Building /nix/store/jw4czjjdv1cc9jr1gsiygk91yx66v8ip-gammaloop-crate-test-binaries-three-dimensional-reps-50150770f831b638-deps-0.1.0.drv
5.56 s
Progress: 0 of 8 built (2 building), 1 of 4 downloaded from cache (2 downloading)
5.56 s
Progress: 0 of 8 built (2 building), 2 of 4 downloaded from cache (1 downloading)
5.65 s
[gammaloop-nextest-binaries-core-gammaloop-api] Phase: unpackPhase
5.66 s
[gammaloop-nextest-binaries-core-gammaloop-api] unpacking source archive /nix/store/syjrbz4l9k76lwn4jr5993qwlqw2bhp1-source
5.71 s
[gammaloop-crate-test-binaries-three-dimensional-reps-50150770f831b638-deps] Phase: unpackPhase
5.71 s
[gammaloop-crate-test-binaries-three-dimensional-reps-50150770f831b638-deps] unpacking source archive /nix/store/s1ajjdsb6bzj5dvvg360rj0kxnvgb27s-source
5.73 s
[gammaloop-crate-test-binaries-three-dimensional-reps-50150770f831b638-deps] source root is source
5.75 s
[gammaloop-crate-test-binaries-three-dimensional-reps-50150770f831b638-deps] Phase: patchPhase
5.86 s
[gammaloop-crate-test-binaries-three-dimensional-reps-50150770f831b638-deps] Executing configureCargoCommonVars
5.87 s
[gammaloop-crate-test-binaries-three-dimensional-reps-50150770f831b638-deps] copying cargo artifacts from /nix/store/71lg5z9qr6b69cp7v2y427r8blvhr0lh-gammaloop-crate-test-binaries-three-dimensional-reps-50150770f831b638-inputs/target to target
5.87 s
[gammaloop-crate-test-binaries-three-dimensional-reps-50150770f831b638-deps] will deep copy artifacts (instead of symlinking) as requested
6.08 s
[gammaloop-nextest-binaries-core-gammaloop-api] source root is source
6.11 s
[gammaloop-nextest-binaries-core-gammaloop-api] Phase: patchPhase
6.40 s
[gammaloop-nextest-binaries-core-gammaloop-api] copying cargo artifacts from /nix/store/ljcp3i8k8dah00zw155a0w2mpfqp9sfq-gammaloop-crate-test-binaries-gammaloop-api-f0f952c3f8c3050c-inputs/target to target
10.49 s
[gammaloop-crate-test-binaries-three-dimensional-reps-50150770f831b638-deps] Phase: updateAutotoolsGnuConfigScriptsPhase
10.54 s
[gammaloop-crate-test-binaries-three-dimensional-reps-50150770f831b638-deps] Phase: configurePhase
10.55 s
[gammaloop-crate-test-binaries-three-dimensional-reps-50150770f831b638-deps] will append /build/source/.cargo-home/config.toml with contents of /nix/store/1sigmg52bb61pfngmk9k8wq5fz9r7bf1-vendor-cargo-deps/config.toml
10.56 s
[gammaloop-crate-test-binaries-three-dimensional-reps-50150770f831b638-deps] default configurePhase, nothing to do
10.57 s
[gammaloop-crate-test-binaries-three-dimensional-reps-50150770f831b638-deps] Phase: buildPhase
10.59 s
[gammaloop-crate-test-binaries-three-dimensional-reps-50150770f831b638-deps] +++ command cargo --version
10.59 s
[gammaloop-crate-test-binaries-three-dimensional-reps-50150770f831b638-deps] cargo 1.97.0 (c980f4866 2026-06-30)
10.59 s
[gammaloop-crate-test-binaries-three-dimensional-reps-50150770f831b638-deps] +++ command cargo test --profile ci-optim --no-run --offline -p three-dimensional-reps --features three-dimensional-reps/serde
11.06 s
[gammaloop-crate-test-binaries-three-dimensional-reps-50150770f831b638-deps] Compiling three-dimensional-reps v0.1.0 (/build/source/crates/three-dimensional-reps)
11.27 s
[gammaloop-crate-test-binaries-three-dimensional-reps-50150770f831b638-deps] error[E0433] : cannot find `eval` in `crate`
11.27 s
[gammaloop-crate-test-binaries-three-dimensional-reps-50150770f831b638-deps] --> crates/three-dimensional-reps/src/generation.rs:8045:28
11.27 s
[gammaloop-crate-test-binaries-three-dimensional-reps-50150770f831b638-deps] |
11.27 s
[gammaloop-crate-test-binaries-three-dimensional-reps-50150770f831b638-deps] 8045 | let input = crate::eval::EvaluationInput {
11.27 s
[gammaloop-crate-test-binaries-three-dimensional-reps-50150770f831b638-deps] | ^^^^ could not find `eval` in the crate root
11.27 s
[gammaloop-crate-test-binaries-three-dimensional-reps-50150770f831b638-deps] |
11.27 s
[gammaloop-crate-test-binaries-three-dimensional-reps-50150770f831b638-deps] note : found an item that was configured out
11.27 s
[gammaloop-crate-test-binaries-three-dimensional-reps-50150770f831b638-deps] --> crates/three-dimensional-reps/src/lib.rs:7:9
11.27 s
[gammaloop-crate-test-binaries-three-dimensional-reps-50150770f831b638-deps] |
11.27 s
[gammaloop-crate-test-binaries-three-dimensional-reps-50150770f831b638-deps] 6 | #[cfg(feature = "eval")]
11.27 s
[gammaloop-crate-test-binaries-three-dimensional-reps-50150770f831b638-deps] | ---------------- the item is gated behind the `eval` feature
11.27 s
[gammaloop-crate-test-binaries-three-dimensional-reps-50150770f831b638-deps] 7 | pub mod eval;
11.27 s
[gammaloop-crate-test-binaries-three-dimensional-reps-50150770f831b638-deps] | ^^^^
11.27 s
[gammaloop-crate-test-binaries-three-dimensional-reps-50150770f831b638-deps]
11.27 s
[gammaloop-crate-test-binaries-three-dimensional-reps-50150770f831b638-deps] error[E0433] : cannot find `eval` in `crate`
11.27 s
[gammaloop-crate-test-binaries-three-dimensional-reps-50150770f831b638-deps] --> crates/three-dimensional-reps/src/generation.rs:8052:30
11.27 s
[gammaloop-crate-test-binaries-three-dimensional-reps-50150770f831b638-deps] |
11.27 s
[gammaloop-crate-test-binaries-three-dimensional-reps-50150770f831b638-deps] 8052 | let contact = crate::eval::evaluate_expression(
11.27 s
[gammaloop-crate-test-binaries-three-dimensional-reps-50150770f831b638-deps] | ^^^^ could not find `eval` in the crate root
11.27 s
[gammaloop-crate-test-binaries-three-dimensional-reps-50150770f831b638-deps] |
11.27 s
[gammaloop-crate-test-binaries-three-dimensional-reps-50150770f831b638-deps] note : found an item that was configured out
11.27 s
[gammaloop-crate-test-binaries-three-dimensional-reps-50150770f831b638-deps] --> crates/three-dimensional-reps/src/lib.rs:7:9
11.27 s
[gammaloop-crate-test-binaries-three-dimensional-reps-50150770f831b638-deps] |
11.27 s
[gammaloop-crate-test-binaries-three-dimensional-reps-50150770f831b638-deps] 6 | #[cfg(feature = "eval")]
11.27 s
[gammaloop-crate-test-binaries-three-dimensional-reps-50150770f831b638-deps] | ---------------- the item is gated behind the `eval` feature
11.27 s
[gammaloop-crate-test-binaries-three-dimensional-reps-50150770f831b638-deps] 7 | pub mod eval;
11.27 s
[gammaloop-crate-test-binaries-three-dimensional-reps-50150770f831b638-deps] | ^^^^
11.27 s
[gammaloop-crate-test-binaries-three-dimensional-reps-50150770f831b638-deps]
11.28 s
[gammaloop-crate-test-binaries-three-dimensional-reps-50150770f831b638-deps] error[E0433] : cannot find `eval` in `crate`
11.28 s
[gammaloop-crate-test-binaries-three-dimensional-reps-50150770f831b638-deps] --> crates/three-dimensional-reps/src/generation.rs:8060:32
11.28 s
[gammaloop-crate-test-binaries-three-dimensional-reps-50150770f831b638-deps] |
11.28 s
[gammaloop-crate-test-binaries-three-dimensional-reps-50150770f831b638-deps] 8060 | let remainder = crate::eval::evaluate_expression(
11.28 s
[gammaloop-crate-test-binaries-three-dimensional-reps-50150770f831b638-deps] | ^^^^ could not find `eval` in the crate root
11.28 s
[gammaloop-crate-test-binaries-three-dimensional-reps-50150770f831b638-deps] |
11.28 s
[gammaloop-crate-test-binaries-three-dimensional-reps-50150770f831b638-deps] note : found an item that was configured out
11.28 s
[gammaloop-crate-test-binaries-three-dimensional-reps-50150770f831b638-deps] --> crates/three-dimensional-reps/src/lib.rs:7:9
11.28 s
[gammaloop-crate-test-binaries-three-dimensional-reps-50150770f831b638-deps] |
11.28 s
[gammaloop-crate-test-binaries-three-dimensional-reps-50150770f831b638-deps] 6 | #[cfg(feature = "eval")]
11.28 s
[gammaloop-crate-test-binaries-three-dimensional-reps-50150770f831b638-deps] | ---------------- the item is gated behind the `eval` feature
11.28 s
[gammaloop-crate-test-binaries-three-dimensional-reps-50150770f831b638-deps] 7 | pub mod eval;
11.28 s
[gammaloop-crate-test-binaries-three-dimensional-reps-50150770f831b638-deps] | ^^^^
11.28 s
[gammaloop-crate-test-binaries-three-dimensional-reps-50150770f831b638-deps]
11.29 s
[gammaloop-crate-test-binaries-three-dimensional-reps-50150770f831b638-deps] error[E0433] : cannot find `eval` in `crate`
11.29 s
[gammaloop-crate-test-binaries-three-dimensional-reps-50150770f831b638-deps] --> crates/three-dimensional-reps/src/generation.rs:8068:28
11.29 s
[gammaloop-crate-test-binaries-three-dimensional-reps-50150770f831b638-deps] |
11.29 s
[gammaloop-crate-test-binaries-three-dimensional-reps-50150770f831b638-deps] 8068 | let total = crate::eval::evaluate_expression(&powered, &expression, numerator, &input)
11.29 s
[gammaloop-crate-test-binaries-three-dimensional-reps-50150770f831b638-deps] | ^^^^ could not find `eval` in the crate root
11.29 s
[gammaloop-crate-test-binaries-three-dimensional-reps-50150770f831b638-deps] |
11.29 s
[gammaloop-crate-test-binaries-three-dimensional-reps-50150770f831b638-deps] note : found an item that was configured out
11.29 s
[gammaloop-crate-test-binaries-three-dimensional-reps-50150770f831b638-deps] --> crates/three-dimensional-reps/src/lib.rs:7:9
11.29 s
[gammaloop-crate-test-binaries-three-dimensional-reps-50150770f831b638-deps] |
11.29 s
[gammaloop-crate-test-binaries-three-dimensional-reps-50150770f831b638-deps] 6 | #[cfg(feature = "eval")]
11.29 s
[gammaloop-crate-test-binaries-three-dimensional-reps-50150770f831b638-deps] | ---------------- the item is gated behind the `eval` feature
11.29 s
[gammaloop-crate-test-binaries-three-dimensional-reps-50150770f831b638-deps] 7 | pub mod eval;
11.29 s
[gammaloop-crate-test-binaries-three-dimensional-reps-50150770f831b638-deps] | ^^^^
11.29 s
[gammaloop-crate-test-binaries-three-dimensional-reps-50150770f831b638-deps]
12.98 s
[gammaloop-crate-test-binaries-three-dimensional-reps-50150770f831b638-deps] For more information about this error, try `rustc --explain E0433`.
12.99 s
[gammaloop-crate-test-binaries-three-dimensional-reps-50150770f831b638-deps] error : could not compile `three-dimensional-reps` (lib test) due to 4 previous errors
13.26 s
Progress: 0 of 6 built (1 building, 1 failed), 2 of 4 downloaded from cache (1 downloading)
13.26 s
Failed to build gammaloop-crate-test-binaries-three-dimensional-reps-50150770f831b638-deps after 7.6s
13.26 s
error: Cannot build '/nix/store/jw4czjjdv1cc9jr1gsiygk91yx66v8ip-gammaloop-crate-test-binaries-three-dimensional-reps-50150770f831b638-deps-0.1.0.drv '.
13.26 s
Reason: builder failed with exit code 101 .
13.26 s
Output paths:
13.26 s
/nix/store/vf8ksab94faladqcwqcly6amf5fvpg1h-gammaloop-crate-test-binaries-three-dimensional-reps-50150770f831b638-deps-0.1.0
13.26 s
Last 74 log lines:
13.26 s
> Running phase: unpackPhase
13.26 s
> unpacking source archive /nix/store/s1ajjdsb6bzj5dvvg360rj0kxnvgb27s-source
13.26 s
> source root is source
13.26 s
> Running phase: patchPhase
13.26 s
> Executing configureCargoCommonVars
13.26 s
> copying cargo artifacts from /nix/store/71lg5z9qr6b69cp7v2y427r8blvhr0lh-gammaloop-crate-test-binaries-three-dimensional-reps-50150770f831b638-inputs/target to target
13.26 s
> will deep copy artifacts (instead of symlinking) as requested
13.26 s
> Running phase: updateAutotoolsGnuConfigScriptsPhase
13.26 s
> Running phase: configurePhase
13.26 s
> will append /build/source/.cargo-home/config.toml with contents of /nix/store/1sigmg52bb61pfngmk9k8wq5fz9r7bf1-vendor-cargo-deps/config.toml
13.26 s
> default configurePhase, nothing to do
13.26 s
> Running phase: buildPhase
13.26 s
> +++ command cargo --version
13.26 s
> cargo 1.97.0 (c980f4866 2026-06-30)
13.26 s
> +++ command cargo test --profile ci-optim --no-run --offline -p three-dimensional-reps --features three-dimensional-reps/serde
13.26 s
> Compiling three-dimensional-reps v0.1.0 (/build/source/crates/three-dimensional-reps)
13.26 s
> error[E0433] : cannot find `eval` in `crate`
13.26 s
> --> crates/three-dimensional-reps/src/generation.rs:8045:28
13.26 s
> |
13.26 s
> 8045 | let input = crate::eval::EvaluationInput {
13.26 s
> | ^^^^ could not find `eval` in the crate root
13.26 s
> |
13.26 s
> note : found an item that was configured out
13.26 s
> --> crates/three-dimensional-reps/src/lib.rs:7:9
13.26 s
> |
13.26 s
> 6 | #[cfg(feature = "eval")]
13.26 s
> | ---------------- the item is gated behind the `eval` feature
13.26 s
> 7 | pub mod eval;
13.26 s
> | ^^^^
13.26 s
>
13.26 s
> error[E0433] : cannot find `eval` in `crate`
13.26 s
> --> crates/three-dimensional-reps/src/generation.rs:8052:30
13.26 s
> |
13.26 s
> 8052 | let contact = crate::eval::evaluate_expression(
13.26 s
> | ^^^^ could not find `eval` in the crate root
13.26 s
> |
13.26 s
> note : found an item that was configured out
13.26 s
> --> crates/three-dimensional-reps/src/lib.rs:7:9
13.26 s
> |
13.26 s
> 6 | #[cfg(feature = "eval")]
13.26 s
> | ---------------- the item is gated behind the `eval` feature
13.26 s
> 7 | pub mod eval;
13.26 s
> | ^^^^
13.26 s
>
13.26 s
> error[E0433] : cannot find `eval` in `crate`
13.26 s
> --> crates/three-dimensional-reps/src/generation.rs:8060:32
13.26 s
> |
13.26 s
> 8060 | let remainder = crate::eval::evaluate_expression(
13.26 s
> | ^^^^ could not find `eval` in the crate root
13.26 s
> |
13.26 s
> note : found an item that was configured out
13.26 s
> --> crates/three-dimensional-reps/src/lib.rs:7:9
13.26 s
> |
13.26 s
> 6 | #[cfg(feature = "eval")]
13.26 s
> | ---------------- the item is gated behind the `eval` feature
13.26 s
> 7 | pub mod eval;
13.26 s
> | ^^^^
13.26 s
>
13.26 s
> error[E0433] : cannot find `eval` in `crate`
13.26 s
> --> crates/three-dimensional-reps/src/generation.rs:8068:28
13.26 s
> |
13.26 s
> 8068 | let total = crate::eval::evaluate_expression(&powered, &expression, numerator, &input)
13.26 s
> | ^^^^ could not find `eval` in the crate root
13.26 s
> |
13.26 s
> note : found an item that was configured out
13.26 s
> --> crates/three-dimensional-reps/src/lib.rs:7:9
13.26 s
> |
13.26 s
> 6 | #[cfg(feature = "eval")]
13.26 s
> | ---------------- the item is gated behind the `eval` feature
13.26 s
> 7 | pub mod eval;
13.26 s
> | ^^^^
13.26 s
>
13.26 s
> For more information about this error, try `rustc --explain E0433`.
13.26 s
> error : could not compile `three-dimensional-reps` (lib test) due to 4 previous errors
13.26 s
For full logs, run:
13.26 s
nix log /nix/store/jw4czjjdv1cc9jr1gsiygk91yx66v8ip-gammaloop-crate-test-binaries-three-dimensional-reps-50150770f831b638-deps-0.1.0.drv
13.26 s
error: Cannot build '/nix/store/pfkcjvmdnwdq2i09nhm6wz0lwsd0i651-gammaloop-nextest-binaries-core-three-dimensional-reps-0.1.0.drv '.
13.26 s
Reason: 1 dependency failed .
13.26 s
Output paths:
13.26 s
/nix/store/3013vncxrnlsyyvsdflnvapva4vwh3h3-gammaloop-nextest-binaries-core-three-dimensional-reps-0.1.0
13.26 s
error: Build failed due to failed dependency
13.26 s
error: Cannot build '/nix/store/16ldzq2pwwz202d9jrl0ix81imnzvb9q-gammaloop-nextest-binaries-core.drv '.
13.26 s
Reason: 1 dependency failed .
13.26 s
Output paths:
13.26 s
/nix/store/f5x93xd8jya5mmwp0xqk8xzq9hgcs3kz-gammaloop-nextest-binaries-core
22.51 s
Downloaded cached gammaloop-crate-test-binaries-gammalooprs-247ff5d63201fb2c-inputs (2.3 GiB) in 17.5s
22.73 s
Built gammaloop-nextest-binaries-core-gammaloop-api in 17.2s
22.74 s
Build failed due to failed dependency
22.78 s
Build failed.