build checks.x86_64-linux.gammaloop-nextest-binaries-core

Reproduce this run
Original Run
  1. 0.00 s $ /nix/store/9ypz3flqsrl5xl495mm8h645gadjsxi1-coreutils-9.11/bin/timeout --kill-after=15s 7200s /nix/store/23zk8sgzamrbmj1fday15szf7f2279s8-nix-2.34.7/bin/nix --extra-experimental-features nix-command --extra-experimental-features flakes --log-format internal-json build --no-link --print-out-paths git+https://github.com/alphal00p/gammaloop?ref=raised_energy_cff_wip&rev=89a52f17698621bf30dda0fb3d143a0fe6be4ba6&shallow=1#checks.x86_64-linux.gammaloop-nextest-binaries-core --print-build-logs
  2. 0.13 s error (ignored): SQLite database '/var/cache/nix-ci-worker/eval-cache-v6/febf65cebb124b41fa341daa40dd6a01e21e6de99ae6a887cbbc318825bc2de8.sqlite' is busy
  3. 6.24 s
  4. 6.91 s Downloading cached gammaloop-nextest-binaries-core-gammaloop-tracing-filter-macros from https://cache.nix-ci.com
  5. 6.93 s Downloading cached gammaloop-ci-test-binary-dependencies-f0f952c3f8c3050c-Cargo.toml from https://cache.nix-ci.com
  6. 6.94 s Downloading cached gammaloop-ci-test-binary-dependencies-31e37aec92971227-Cargo.toml from https://cache.nix-ci.com
  7. 6.94 s Downloading cached gammaloop-ci-test-binary-dependencies-247ff5d63201fb2c-Cargo.toml from https://cache.nix-ci.com
  8. 6.95 s Downloaded cached gammaloop-ci-test-binary-dependencies-f0f952c3f8c3050c-Cargo.toml (1320 B) in 18ms
  9. 6.96 s Downloaded cached gammaloop-nextest-binaries-core-gammaloop-tracing-filter-macros (1.7 MiB) in 44ms
  10. 6.97 s Downloaded cached gammaloop-ci-test-binary-dependencies-247ff5d63201fb2c-Cargo.toml (1368 B) in 31ms
  11. 6.97 s Downloaded cached gammaloop-ci-test-binary-dependencies-31e37aec92971227-Cargo.toml (824 B) in 34ms
  12. 7.00 s Downloading cached gammaloop-crate-test-dependencies-247ff5d63201fb2c-inputs from https://cache.nix-ci.com
  13. 7.04 s Downloading cached gammaloop-crate-test-binaries-three-dimensional-reps-50150770f831b638-inputs from https://cache.nix-ci.com
  14. 7.10 s Building /nix/store/d803fdhy5vdmwg1bxnrdbbh443q5b2l1-gammaloop-ci-test-binary-dependencies-247ff5d63201fb2c-gammalooprs-dev-dependency.toml.drv
  15. 7.16 s Building /nix/store/8n7av5d2xzacvwsymvrcwygl7s0wgynb-gammaloop-ci-test-binary-dependencies-31e37aec92971227-gammaloop-tracing-filter-dev-dependency.toml.drv
  16. 7.23 s Building /nix/store/620cg4lxjsln105525v3nij0sy75ni31-gammaloop-ci-test-binary-dependencies-50150770f831b638-three-dimensional-reps-dev-dependency.toml.drv
  17. 7.31 s Building /nix/store/4wx7g7wm0incs1bkkmd6hnsr8bjq7s41-gammaloop-ci-test-binary-dependencies-f0f952c3f8c3050c-gammaloop-api-dev-dependency.toml.drv
  18. 7.31 s Progress: 0 of 17 built (4 building), 1 of 13 downloaded from cache (5 downloading)
  19. 7.31 s Progress: 0 of 17 built (4 building), 2 of 13 downloaded from cache (4 downloading)
  20. 7.31 s Progress: 0 of 17 built (4 building), 3 of 13 downloaded from cache (3 downloading)
  21. 7.31 s Progress: 0 of 17 built (4 building), 4 of 13 downloaded from cache (2 downloading)
  22. 7.46 s [gammaloop-ci-test-binary-dependencies-247ff5d63201fb2c-gammalooprs-dev-dependency.toml:post-build] Uploading to the NixCI cache: /nix/store/fzwgaj7lkfphcc1g09xfmk55hmkxkr0x-gammaloop-ci-test-binary-dependencies-247ff5d63201fb2c-gammalooprs-dev-dependency.toml
  23. 8.06 s [gammaloop-ci-test-binary-dependencies-247ff5d63201fb2c-gammalooprs-dev-dependency.toml:post-build] warning: 'warn-short-path-literals' is deprecated, use 'lint-short-path-literals = ignore' instead
  24. 8.18 s [gammaloop-ci-test-binary-dependencies-247ff5d63201fb2c-gammalooprs-dev-dependency.toml:post-build] copying 0 paths...
  25. 9.12 s [gammaloop-ci-test-binary-dependencies-247ff5d63201fb2c-gammalooprs-dev-dependency.toml:post-build] warning: 'warn-short-path-literals' is deprecated, use 'lint-short-path-literals = ignore' instead
  26. 9.31 s [gammaloop-ci-test-binary-dependencies-247ff5d63201fb2c-gammalooprs-dev-dependency.toml:post-build] copying 0 paths...
  27. 9.58 s Uploaded gammaloop-ci-test-binary-dependencies-247ff5d63201fb2c-gammalooprs-dev-dependency.toml in 2.2s
  28. 9.59 s Progress: 1 of 18 built (3 building), 4 of 13 downloaded from cache (2 downloading)
  29. 9.59 s Built gammaloop-ci-test-binary-dependencies-247ff5d63201fb2c-gammalooprs-dev-dependency.toml in 2.4s
  30. 9.74 s [gammaloop-ci-test-binary-dependencies-31e37aec92971227-gammaloop-tracing-filter-dev-dependency.toml:post-build] Uploading to the NixCI cache: /nix/store/a90w47vskdc47wbbm7xrpzbp3hjc6n01-gammaloop-ci-test-binary-dependencies-31e37aec92971227-gammaloop-tracing-filter-dev-dependency.toml
  31. 10.45 s [gammaloop-ci-test-binary-dependencies-31e37aec92971227-gammaloop-tracing-filter-dev-dependency.toml:post-build] warning: 'warn-short-path-literals' is deprecated, use 'lint-short-path-literals = ignore' instead
  32. 10.56 s [gammaloop-ci-test-binary-dependencies-31e37aec92971227-gammaloop-tracing-filter-dev-dependency.toml:post-build] copying 0 paths...
  33. 11.48 s [gammaloop-ci-test-binary-dependencies-31e37aec92971227-gammaloop-tracing-filter-dev-dependency.toml:post-build] warning: 'warn-short-path-literals' is deprecated, use 'lint-short-path-literals = ignore' instead
  34. 11.58 s [gammaloop-ci-test-binary-dependencies-31e37aec92971227-gammaloop-tracing-filter-dev-dependency.toml:post-build] copying 0 paths...
  35. 11.74 s Uploaded gammaloop-ci-test-binary-dependencies-31e37aec92971227-gammaloop-tracing-filter-dev-dependency.toml in 2.1s
  36. 11.74 s Progress: 2 of 19 built (2 building), 4 of 13 downloaded from cache (2 downloading)
  37. 11.74 s Built gammaloop-ci-test-binary-dependencies-31e37aec92971227-gammaloop-tracing-filter-dev-dependency.toml in 4.5s
  38. 11.90 s [gammaloop-ci-test-binary-dependencies-50150770f831b638-three-dimensional-reps-dev-dependency.toml:post-build] Uploading to the NixCI cache: /nix/store/nkd9p6h639pp1ya2nb2yngjw7qb80nfg-gammaloop-ci-test-binary-dependencies-50150770f831b638-three-dimensional-reps-dev-dependency.toml
  39. 12.55 s [gammaloop-ci-test-binary-dependencies-50150770f831b638-three-dimensional-reps-dev-dependency.toml:post-build] warning: 'warn-short-path-literals' is deprecated, use 'lint-short-path-literals = ignore' instead
  40. 12.67 s [gammaloop-ci-test-binary-dependencies-50150770f831b638-three-dimensional-reps-dev-dependency.toml:post-build] copying 0 paths...
  41. 12.87 s [gammaloop-ci-test-binary-dependencies-50150770f831b638-three-dimensional-reps-dev-dependency.toml:post-build] warning: 'warn-short-path-literals' is deprecated, use 'lint-short-path-literals = ignore' instead
  42. 12.96 s [gammaloop-ci-test-binary-dependencies-50150770f831b638-three-dimensional-reps-dev-dependency.toml:post-build] copying 0 paths...
  43. 12.99 s Uploaded gammaloop-ci-test-binary-dependencies-50150770f831b638-three-dimensional-reps-dev-dependency.toml in 1.2s
  44. 12.99 s Progress: 3 of 20 built (1 building), 4 of 13 downloaded from cache (2 downloading)
  45. 13.00 s Built gammaloop-ci-test-binary-dependencies-50150770f831b638-three-dimensional-reps-dev-dependency.toml in 5.7s
  46. 13.64 s Building /nix/store/5szmjlzyk11bszgllnyyjxr0crbfnyr4-gammaloop-nextest-binaries-core-gammaloop-tracing-filter-0.1.0.drv
  47. 13.68 s [gammaloop-ci-test-binary-dependencies-f0f952c3f8c3050c-gammaloop-api-dev-dependency.toml:post-build] Uploading to the NixCI cache: /nix/store/8n1xwz3n1glb8aw2nw1zp5k5wfk62wm4-gammaloop-ci-test-binary-dependencies-f0f952c3f8c3050c-gammaloop-api-dev-dependency.toml
  48. 13.74 s [gammaloop-ci-test-binary-dependencies-f0f952c3f8c3050c-gammaloop-api-dev-dependency.toml:post-build] warning: 'warn-short-path-literals' is deprecated, use 'lint-short-path-literals = ignore' instead
  49. 13.79 s [gammaloop-ci-test-binary-dependencies-f0f952c3f8c3050c-gammaloop-api-dev-dependency.toml:post-build] copying 0 paths...
  50. 14.72 s [gammaloop-ci-test-binary-dependencies-f0f952c3f8c3050c-gammaloop-api-dev-dependency.toml:post-build] warning: 'warn-short-path-literals' is deprecated, use 'lint-short-path-literals = ignore' instead
  51. 14.84 s [gammaloop-ci-test-binary-dependencies-f0f952c3f8c3050c-gammaloop-api-dev-dependency.toml:post-build] copying 0 paths...
  52. 14.98 s Uploaded gammaloop-ci-test-binary-dependencies-f0f952c3f8c3050c-gammaloop-api-dev-dependency.toml in 1.3s
  53. 14.98 s Progress: 4 of 14 built (1 building), 4 of 13 downloaded from cache (2 downloading)
  54. 14.98 s Built gammaloop-ci-test-binary-dependencies-f0f952c3f8c3050c-gammaloop-api-dev-dependency.toml in 7.6s
  55. 14.98 s [gammaloop-nextest-binaries-core-gammaloop-tracing-filter] Phase: unpackPhase
  56. 14.98 s [gammaloop-nextest-binaries-core-gammaloop-tracing-filter] unpacking source archive /nix/store/793yc59hmqpmq9sqax0g6lp3vvyk2gq8-source
  57. 14.98 s [gammaloop-nextest-binaries-core-gammaloop-tracing-filter] source root is source
  58. 14.98 s [gammaloop-nextest-binaries-core-gammaloop-tracing-filter] Phase: patchPhase
  59. 14.99 s [gammaloop-nextest-binaries-core-gammaloop-tracing-filter] copying cargo artifacts from /nix/store/lgn6wk4i6f2451awf9glwm8laradl4ql-gammaloop-crate-test-binaries-gammaloop-tracing-filter-31e37aec92971227-inputs/target to target
  60. 22.71 s [gammaloop-nextest-binaries-core-gammaloop-tracing-filter] Executing configureCargoCommonVars
  61. 22.72 s [gammaloop-nextest-binaries-core-gammaloop-tracing-filter] decompressing cargo artifacts from /nix/store/2i2i3807jj9rprc1fwnhwlrfqp3igybl-gammaloop-crate-test-binaries-gammaloop-tracing-filter-31e37aec92971227-deps-0.1.0/target.tar.zst to target
  62. 23.32 s [gammaloop-nextest-binaries-core-gammaloop-tracing-filter] Phase: updateAutotoolsGnuConfigScriptsPhase
  63. 23.38 s [gammaloop-nextest-binaries-core-gammaloop-tracing-filter] Phase: configurePhase
  64. 23.39 s [gammaloop-nextest-binaries-core-gammaloop-tracing-filter] will append /build/source/.cargo-home/config.toml with contents of /nix/store/1sigmg52bb61pfngmk9k8wq5fz9r7bf1-vendor-cargo-deps/config.toml
  65. 23.39 s [gammaloop-nextest-binaries-core-gammaloop-tracing-filter] default configurePhase, nothing to do
  66. 23.39 s [gammaloop-nextest-binaries-core-gammaloop-tracing-filter] Phase: buildPhase
  67. 23.41 s [gammaloop-nextest-binaries-core-gammaloop-tracing-filter] +++ command cargo --version
  68. 23.41 s [gammaloop-nextest-binaries-core-gammaloop-tracing-filter] cargo 1.97.0 (c980f4866 2026-06-30)
  69. 23.48 s [gammaloop-nextest-binaries-core-gammaloop-tracing-filter] +++ command cargo nextest --version
  70. 23.50 s [gammaloop-nextest-binaries-core-gammaloop-tracing-filter] cargo-nextest 0.9.140
  71. 23.50 s [gammaloop-nextest-binaries-core-gammaloop-tracing-filter] release: 0.9.140
  72. 23.50 s [gammaloop-nextest-binaries-core-gammaloop-tracing-filter] host: x86_64-unknown-linux-gnu
  73. 23.50 s [gammaloop-nextest-binaries-core-gammaloop-tracing-filter] +++ command cargo nextest archive --cargo-profile ci-optim --offline -p gammaloop-tracing-filter --features gammaloop-tracing-filter/clap,gammaloop-tracing-filter/symbolica -E 'package(gammaloop-tracing-filter)' --profile ci_gammaloop --archive-file /nix/store/m1lpz6vqlpawq72s0xmbpqszf5n99n4j-gammaloop-nextest-binaries-core-gammaloop-tracing-filter-0.1.0/gammaloop-nextest-core-gammaloop-tracing-filter.tar.zst
  74. 24.38 s [gammaloop-nextest-binaries-core-gammaloop-tracing-filter] Finished `ci-optim` profile [optimized] target(s) in 0.28s
  75. 24.51 s [gammaloop-nextest-binaries-core-gammaloop-tracing-filter] warning: the following packages contain code that will be rejected by a future version of Rust: proc-macro-error2 v2.0.1
  76. 24.51 s [gammaloop-nextest-binaries-core-gammaloop-tracing-filter] note: to see what the problems were, use the option `--future-incompat-report`, or run `cargo report future-incompatibilities --id 1`
  77. 24.58 s [gammaloop-nextest-binaries-core-gammaloop-tracing-filter] Archiving 1 binary, 1 linked path, and 1 standard library to /nix/store/m1lpz6vqlpawq72s0xmbpqszf5n99n4j-gammaloop-nextest-binaries-core-gammaloop-tracing-filter-0.1.0/gammaloop-nextest-core-gammaloop-tracing-filter.tar.zst
  78. 25.01 s [gammaloop-nextest-binaries-core-gammaloop-tracing-filter] Archived 7 files to /nix/store/m1lpz6vqlpawq72s0xmbpqszf5n99n4j-gammaloop-nextest-binaries-core-gammaloop-tracing-filter-0.1.0/gammaloop-nextest-core-gammaloop-tracing-filter.tar.zst in 0.45s
  79. 25.02 s [gammaloop-nextest-binaries-core-gammaloop-tracing-filter] Phase: installPhase
  80. 25.04 s [gammaloop-nextest-binaries-core-gammaloop-tracing-filter] Phase: fixupPhase
  81. 25.11 s [gammaloop-nextest-binaries-core-gammaloop-tracing-filter] shrinking RPATHs of ELF executables and libraries in /nix/store/m1lpz6vqlpawq72s0xmbpqszf5n99n4j-gammaloop-nextest-binaries-core-gammaloop-tracing-filter-0.1.0
  82. 25.11 s [gammaloop-nextest-binaries-core-gammaloop-tracing-filter] checking for references to /build/ in /nix/store/m1lpz6vqlpawq72s0xmbpqszf5n99n4j-gammaloop-nextest-binaries-core-gammaloop-tracing-filter-0.1.0...
  83. 25.13 s [gammaloop-nextest-binaries-core-gammaloop-tracing-filter] patching script interpreter paths in /nix/store/m1lpz6vqlpawq72s0xmbpqszf5n99n4j-gammaloop-nextest-binaries-core-gammaloop-tracing-filter-0.1.0
  84. 25.49 s [gammaloop-nextest-binaries-core-gammaloop-tracing-filter:post-build] Uploading to the NixCI cache: /nix/store/m1lpz6vqlpawq72s0xmbpqszf5n99n4j-gammaloop-nextest-binaries-core-gammaloop-tracing-filter-0.1.0
  85. 25.52 s Downloaded cached gammaloop-crate-test-binaries-three-dimensional-reps-50150770f831b638-inputs (1.5 GiB) in 18.4s
  86. 26.04 s [gammaloop-nextest-binaries-core-gammaloop-tracing-filter:post-build] warning: 'warn-short-path-literals' is deprecated, use 'lint-short-path-literals = ignore' instead
  87. 26.09 s [gammaloop-nextest-binaries-core-gammaloop-tracing-filter:post-build] copying 1 paths...
  88. 26.09 s [gammaloop-nextest-binaries-core-gammaloop-tracing-filter:post-build] copying path '/nix/store/m1lpz6vqlpawq72s0xmbpqszf5n99n4j-gammaloop-nextest-binaries-core-gammaloop-tracing-filter-0.1.0' to 'https://cache.nix-ci.com'...
  89. 29.26 s Downloaded cached gammaloop-crate-test-dependencies-247ff5d63201fb2c-inputs (1.8 GiB) in 22.2s
  90. 29.74 s [gammaloop-nextest-binaries-core-gammaloop-tracing-filter:post-build] warning: 'warn-short-path-literals' is deprecated, use 'lint-short-path-literals = ignore' instead
  91. 29.96 s [gammaloop-nextest-binaries-core-gammaloop-tracing-filter:post-build] copying 2 paths...
  92. 29.96 s [gammaloop-nextest-binaries-core-gammaloop-tracing-filter:post-build] copying path '/nix/store/793yc59hmqpmq9sqax0g6lp3vvyk2gq8-source' to 'https://cache.nix-ci.com'...
  93. 30.98 s [gammaloop-nextest-binaries-core-gammaloop-tracing-filter:post-build] copying path '/nix/store/5szmjlzyk11bszgllnyyjxr0crbfnyr4-gammaloop-nextest-binaries-core-gammaloop-tracing-filter-0.1.0.drv' to 'https://cache.nix-ci.com'...
  94. 31.22 s Uploaded gammaloop-nextest-binaries-core-gammaloop-tracing-filter in 5.8s
  95. 31.22 s Progress: 5 of 14 built, 4 of 13 downloaded from cache (2 downloading)
  96. 31.22 s Built gammaloop-nextest-binaries-core-gammaloop-tracing-filter in 17.5s
  97. 31.22 s Progress: 5 of 13 built, 5 of 13 downloaded from cache (1 downloading)
  98. 31.22 s Progress: 5 of 13 built, 6 of 13 downloaded from cache
  99. 31.22 s Downloading cached gammaloop-crate-test-dependencies-247ff5d63201fb2c-deps from https://cache.nix-ci.com
  100. 31.29 s Building /nix/store/a7vgascj2khj5w2bmd7mjjn1614pfyfz-gammaloop-crate-test-binaries-three-dimensional-reps-50150770f831b638-deps-0.1.0.drv
  101. 31.36 s [gammaloop-crate-test-binaries-three-dimensional-reps-50150770f831b638-deps] Phase: unpackPhase
  102. 31.37 s [gammaloop-crate-test-binaries-three-dimensional-reps-50150770f831b638-deps] unpacking source archive /nix/store/78hj0zga692a2q922cw28xhn5c6pic94-source
  103. 31.39 s [gammaloop-crate-test-binaries-three-dimensional-reps-50150770f831b638-deps] source root is source
  104. 31.40 s [gammaloop-crate-test-binaries-three-dimensional-reps-50150770f831b638-deps] Phase: patchPhase
  105. 31.51 s [gammaloop-crate-test-binaries-three-dimensional-reps-50150770f831b638-deps] Executing configureCargoCommonVars
  106. 31.52 s [gammaloop-crate-test-binaries-three-dimensional-reps-50150770f831b638-deps] copying cargo artifacts from /nix/store/fgh2l3z56pmcypaz8sm5lgiicyijyiz4-gammaloop-crate-test-binaries-three-dimensional-reps-50150770f831b638-inputs/target to target
  107. 31.52 s [gammaloop-crate-test-binaries-three-dimensional-reps-50150770f831b638-deps] will deep copy artifacts (instead of symlinking) as requested
  108. 32.08 s Downloaded cached gammaloop-crate-test-dependencies-247ff5d63201fb2c-deps (79.8 MiB) in 854ms
  109. 32.08 s Progress: 5 of 12 built (1 building), 7 of 13 downloaded from cache
  110. 32.08 s Downloading cached gammaloop-crate-test-binaries-gammalooprs-247ff5d63201fb2c-inputs from https://cache.nix-ci.com
  111. 32.08 s Downloading cached gammaloop-crate-test-dependencies-f0f952c3f8c3050c-inputs from https://cache.nix-ci.com
  112. 32.77 s [gammaloop-crate-test-binaries-three-dimensional-reps-50150770f831b638-deps] Phase: updateAutotoolsGnuConfigScriptsPhase
  113. 32.81 s [gammaloop-crate-test-binaries-three-dimensional-reps-50150770f831b638-deps] Phase: configurePhase
  114. 32.81 s [gammaloop-crate-test-binaries-three-dimensional-reps-50150770f831b638-deps] will append /build/source/.cargo-home/config.toml with contents of /nix/store/1sigmg52bb61pfngmk9k8wq5fz9r7bf1-vendor-cargo-deps/config.toml
  115. 32.81 s [gammaloop-crate-test-binaries-three-dimensional-reps-50150770f831b638-deps] default configurePhase, nothing to do
  116. 32.82 s [gammaloop-crate-test-binaries-three-dimensional-reps-50150770f831b638-deps] Phase: buildPhase
  117. 32.82 s [gammaloop-crate-test-binaries-three-dimensional-reps-50150770f831b638-deps] +++ command cargo --version
  118. 32.82 s [gammaloop-crate-test-binaries-three-dimensional-reps-50150770f831b638-deps] cargo 1.97.0 (c980f4866 2026-06-30)
  119. 32.83 s [gammaloop-crate-test-binaries-three-dimensional-reps-50150770f831b638-deps] +++ command cargo test --profile ci-optim --no-run --offline -p three-dimensional-reps --features three-dimensional-reps/serde
  120. 33.25 s [gammaloop-crate-test-binaries-three-dimensional-reps-50150770f831b638-deps] Compiling three-dimensional-reps v0.1.0 (/build/source/crates/three-dimensional-reps)
  121. 33.46 s [gammaloop-crate-test-binaries-three-dimensional-reps-50150770f831b638-deps] error[E0433]: cannot find `eval` in `crate`
  122. 33.46 s [gammaloop-crate-test-binaries-three-dimensional-reps-50150770f831b638-deps] --> crates/three-dimensional-reps/src/generation.rs:7255:28
  123. 33.46 s [gammaloop-crate-test-binaries-three-dimensional-reps-50150770f831b638-deps] |
  124. 33.46 s [gammaloop-crate-test-binaries-three-dimensional-reps-50150770f831b638-deps] 7255 | let input = crate::eval::EvaluationInput {
  125. 33.46 s [gammaloop-crate-test-binaries-three-dimensional-reps-50150770f831b638-deps] | ^^^^ could not find `eval` in the crate root
  126. 33.46 s [gammaloop-crate-test-binaries-three-dimensional-reps-50150770f831b638-deps] |
  127. 33.46 s [gammaloop-crate-test-binaries-three-dimensional-reps-50150770f831b638-deps] note: found an item that was configured out
  128. 33.46 s [gammaloop-crate-test-binaries-three-dimensional-reps-50150770f831b638-deps] --> crates/three-dimensional-reps/src/lib.rs:7:9
  129. 33.46 s [gammaloop-crate-test-binaries-three-dimensional-reps-50150770f831b638-deps] |
  130. 33.46 s [gammaloop-crate-test-binaries-three-dimensional-reps-50150770f831b638-deps] 6 | #[cfg(feature = "eval")]
  131. 33.46 s [gammaloop-crate-test-binaries-three-dimensional-reps-50150770f831b638-deps] | ---------------- the item is gated behind the `eval` feature
  132. 33.46 s [gammaloop-crate-test-binaries-three-dimensional-reps-50150770f831b638-deps] 7 | pub mod eval;
  133. 33.46 s [gammaloop-crate-test-binaries-three-dimensional-reps-50150770f831b638-deps] | ^^^^
  134. 33.46 s [gammaloop-crate-test-binaries-three-dimensional-reps-50150770f831b638-deps]
  135. 33.47 s [gammaloop-crate-test-binaries-three-dimensional-reps-50150770f831b638-deps] error[E0433]: cannot find `eval` in `crate`
  136. 33.47 s [gammaloop-crate-test-binaries-three-dimensional-reps-50150770f831b638-deps] --> crates/three-dimensional-reps/src/generation.rs:7262:30
  137. 33.47 s [gammaloop-crate-test-binaries-three-dimensional-reps-50150770f831b638-deps] |
  138. 33.47 s [gammaloop-crate-test-binaries-three-dimensional-reps-50150770f831b638-deps] 7262 | let contact = crate::eval::evaluate_expression(
  139. 33.47 s [gammaloop-crate-test-binaries-three-dimensional-reps-50150770f831b638-deps] | ^^^^ could not find `eval` in the crate root
  140. 33.47 s [gammaloop-crate-test-binaries-three-dimensional-reps-50150770f831b638-deps] |
  141. 33.47 s [gammaloop-crate-test-binaries-three-dimensional-reps-50150770f831b638-deps] note: found an item that was configured out
  142. 33.47 s [gammaloop-crate-test-binaries-three-dimensional-reps-50150770f831b638-deps] --> crates/three-dimensional-reps/src/lib.rs:7:9
  143. 33.47 s [gammaloop-crate-test-binaries-three-dimensional-reps-50150770f831b638-deps] |
  144. 33.47 s [gammaloop-crate-test-binaries-three-dimensional-reps-50150770f831b638-deps] 6 | #[cfg(feature = "eval")]
  145. 33.47 s [gammaloop-crate-test-binaries-three-dimensional-reps-50150770f831b638-deps] | ---------------- the item is gated behind the `eval` feature
  146. 33.47 s [gammaloop-crate-test-binaries-three-dimensional-reps-50150770f831b638-deps] 7 | pub mod eval;
  147. 33.47 s [gammaloop-crate-test-binaries-three-dimensional-reps-50150770f831b638-deps] | ^^^^
  148. 33.47 s [gammaloop-crate-test-binaries-three-dimensional-reps-50150770f831b638-deps]
  149. 33.48 s [gammaloop-crate-test-binaries-three-dimensional-reps-50150770f831b638-deps] error[E0433]: cannot find `eval` in `crate`
  150. 33.48 s [gammaloop-crate-test-binaries-three-dimensional-reps-50150770f831b638-deps] --> crates/three-dimensional-reps/src/generation.rs:7270:32
  151. 33.48 s [gammaloop-crate-test-binaries-three-dimensional-reps-50150770f831b638-deps] |
  152. 33.48 s [gammaloop-crate-test-binaries-three-dimensional-reps-50150770f831b638-deps] 7270 | let remainder = crate::eval::evaluate_expression(
  153. 33.48 s [gammaloop-crate-test-binaries-three-dimensional-reps-50150770f831b638-deps] | ^^^^ could not find `eval` in the crate root
  154. 33.48 s [gammaloop-crate-test-binaries-three-dimensional-reps-50150770f831b638-deps] |
  155. 33.48 s [gammaloop-crate-test-binaries-three-dimensional-reps-50150770f831b638-deps] note: found an item that was configured out
  156. 33.48 s [gammaloop-crate-test-binaries-three-dimensional-reps-50150770f831b638-deps] --> crates/three-dimensional-reps/src/lib.rs:7:9
  157. 33.48 s [gammaloop-crate-test-binaries-three-dimensional-reps-50150770f831b638-deps] |
  158. 33.48 s [gammaloop-crate-test-binaries-three-dimensional-reps-50150770f831b638-deps] 6 | #[cfg(feature = "eval")]
  159. 33.48 s [gammaloop-crate-test-binaries-three-dimensional-reps-50150770f831b638-deps] | ---------------- the item is gated behind the `eval` feature
  160. 33.48 s [gammaloop-crate-test-binaries-three-dimensional-reps-50150770f831b638-deps] 7 | pub mod eval;
  161. 33.48 s [gammaloop-crate-test-binaries-three-dimensional-reps-50150770f831b638-deps] | ^^^^
  162. 33.48 s [gammaloop-crate-test-binaries-three-dimensional-reps-50150770f831b638-deps]
  163. 33.48 s [gammaloop-crate-test-binaries-three-dimensional-reps-50150770f831b638-deps] error[E0433]: cannot find `eval` in `crate`
  164. 33.48 s [gammaloop-crate-test-binaries-three-dimensional-reps-50150770f831b638-deps] --> crates/three-dimensional-reps/src/generation.rs:7278:28
  165. 33.48 s [gammaloop-crate-test-binaries-three-dimensional-reps-50150770f831b638-deps] |
  166. 33.48 s [gammaloop-crate-test-binaries-three-dimensional-reps-50150770f831b638-deps] 7278 | let total = crate::eval::evaluate_expression(&powered, &expression, numerator, &input)
  167. 33.48 s [gammaloop-crate-test-binaries-three-dimensional-reps-50150770f831b638-deps] | ^^^^ could not find `eval` in the crate root
  168. 33.48 s [gammaloop-crate-test-binaries-three-dimensional-reps-50150770f831b638-deps] |
  169. 33.48 s [gammaloop-crate-test-binaries-three-dimensional-reps-50150770f831b638-deps] note: found an item that was configured out
  170. 33.48 s [gammaloop-crate-test-binaries-three-dimensional-reps-50150770f831b638-deps] --> crates/three-dimensional-reps/src/lib.rs:7:9
  171. 33.48 s [gammaloop-crate-test-binaries-three-dimensional-reps-50150770f831b638-deps] |
  172. 33.48 s [gammaloop-crate-test-binaries-three-dimensional-reps-50150770f831b638-deps] 6 | #[cfg(feature = "eval")]
  173. 33.48 s [gammaloop-crate-test-binaries-three-dimensional-reps-50150770f831b638-deps] | ---------------- the item is gated behind the `eval` feature
  174. 33.48 s [gammaloop-crate-test-binaries-three-dimensional-reps-50150770f831b638-deps] 7 | pub mod eval;
  175. 33.48 s [gammaloop-crate-test-binaries-three-dimensional-reps-50150770f831b638-deps] | ^^^^
  176. 33.48 s [gammaloop-crate-test-binaries-three-dimensional-reps-50150770f831b638-deps]
  177. 35.38 s [gammaloop-crate-test-binaries-three-dimensional-reps-50150770f831b638-deps] For more information about this error, try `rustc --explain E0433`.
  178. 35.41 s [gammaloop-crate-test-binaries-three-dimensional-reps-50150770f831b638-deps] error: could not compile `three-dimensional-reps` (lib test) due to 4 previous errors
  179. 35.69 s Progress: 5 of 12 built (1 failed), 7 of 13 downloaded from cache (2 downloading)
  180. 35.69 s Failed to build gammaloop-crate-test-binaries-three-dimensional-reps-50150770f831b638-deps after 4.3s
  181. 35.69 s error: Cannot build '/nix/store/a7vgascj2khj5w2bmd7mjjn1614pfyfz-gammaloop-crate-test-binaries-three-dimensional-reps-50150770f831b638-deps-0.1.0.drv'.
  182. 35.69 s Reason: builder failed with exit code 101.
  183. 35.69 s Output paths:
  184. 35.69 s /nix/store/a34ri5gifn73ay8schaga92mdazmbvv5-gammaloop-crate-test-binaries-three-dimensional-reps-50150770f831b638-deps-0.1.0
  185. 35.69 s Last 74 log lines:
  186. 35.69 s > Running phase: unpackPhase
  187. 35.69 s > unpacking source archive /nix/store/78hj0zga692a2q922cw28xhn5c6pic94-source
  188. 35.69 s > source root is source
  189. 35.69 s > Running phase: patchPhase
  190. 35.69 s > Executing configureCargoCommonVars
  191. 35.69 s > copying cargo artifacts from /nix/store/fgh2l3z56pmcypaz8sm5lgiicyijyiz4-gammaloop-crate-test-binaries-three-dimensional-reps-50150770f831b638-inputs/target to target
  192. 35.69 s > will deep copy artifacts (instead of symlinking) as requested
  193. 35.69 s > Running phase: updateAutotoolsGnuConfigScriptsPhase
  194. 35.69 s > Running phase: configurePhase
  195. 35.69 s > will append /build/source/.cargo-home/config.toml with contents of /nix/store/1sigmg52bb61pfngmk9k8wq5fz9r7bf1-vendor-cargo-deps/config.toml
  196. 35.69 s > default configurePhase, nothing to do
  197. 35.69 s > Running phase: buildPhase
  198. 35.69 s > +++ command cargo --version
  199. 35.69 s > cargo 1.97.0 (c980f4866 2026-06-30)
  200. 35.69 s > +++ command cargo test --profile ci-optim --no-run --offline -p three-dimensional-reps --features three-dimensional-reps/serde
  201. 35.69 s > Compiling three-dimensional-reps v0.1.0 (/build/source/crates/three-dimensional-reps)
  202. 35.69 s > error[E0433]: cannot find `eval` in `crate`
  203. 35.69 s > --> crates/three-dimensional-reps/src/generation.rs:7255:28
  204. 35.69 s > |
  205. 35.69 s > 7255 | let input = crate::eval::EvaluationInput {
  206. 35.69 s > | ^^^^ could not find `eval` in the crate root
  207. 35.69 s > |
  208. 35.69 s > note: found an item that was configured out
  209. 35.69 s > --> crates/three-dimensional-reps/src/lib.rs:7:9
  210. 35.69 s > |
  211. 35.69 s > 6 | #[cfg(feature = "eval")]
  212. 35.69 s > | ---------------- the item is gated behind the `eval` feature
  213. 35.69 s > 7 | pub mod eval;
  214. 35.69 s > | ^^^^
  215. 35.69 s >
  216. 35.69 s > error[E0433]: cannot find `eval` in `crate`
  217. 35.69 s > --> crates/three-dimensional-reps/src/generation.rs:7262:30
  218. 35.69 s > |
  219. 35.69 s > 7262 | let contact = crate::eval::evaluate_expression(
  220. 35.69 s > | ^^^^ could not find `eval` in the crate root
  221. 35.69 s > |
  222. 35.69 s > note: found an item that was configured out
  223. 35.69 s > --> crates/three-dimensional-reps/src/lib.rs:7:9
  224. 35.69 s > |
  225. 35.69 s > 6 | #[cfg(feature = "eval")]
  226. 35.69 s > | ---------------- the item is gated behind the `eval` feature
  227. 35.69 s > 7 | pub mod eval;
  228. 35.69 s > | ^^^^
  229. 35.69 s >
  230. 35.69 s > error[E0433]: cannot find `eval` in `crate`
  231. 35.69 s > --> crates/three-dimensional-reps/src/generation.rs:7270:32
  232. 35.69 s > |
  233. 35.69 s > 7270 | let remainder = crate::eval::evaluate_expression(
  234. 35.69 s > | ^^^^ could not find `eval` in the crate root
  235. 35.69 s > |
  236. 35.69 s > note: found an item that was configured out
  237. 35.69 s > --> crates/three-dimensional-reps/src/lib.rs:7:9
  238. 35.69 s > |
  239. 35.69 s > 6 | #[cfg(feature = "eval")]
  240. 35.69 s > | ---------------- the item is gated behind the `eval` feature
  241. 35.69 s > 7 | pub mod eval;
  242. 35.69 s > | ^^^^
  243. 35.69 s >
  244. 35.69 s > error[E0433]: cannot find `eval` in `crate`
  245. 35.69 s > --> crates/three-dimensional-reps/src/generation.rs:7278:28
  246. 35.69 s > |
  247. 35.69 s > 7278 | let total = crate::eval::evaluate_expression(&powered, &expression, numerator, &input)
  248. 35.69 s > | ^^^^ could not find `eval` in the crate root
  249. 35.69 s > |
  250. 35.69 s > note: found an item that was configured out
  251. 35.69 s > --> crates/three-dimensional-reps/src/lib.rs:7:9
  252. 35.69 s > |
  253. 35.69 s > 6 | #[cfg(feature = "eval")]
  254. 35.69 s > | ---------------- the item is gated behind the `eval` feature
  255. 35.69 s > 7 | pub mod eval;
  256. 35.69 s > | ^^^^
  257. 35.69 s >
  258. 35.69 s > For more information about this error, try `rustc --explain E0433`.
  259. 35.69 s > error: could not compile `three-dimensional-reps` (lib test) due to 4 previous errors
  260. 35.69 s For full logs, run:
  261. 35.69 s nix log /nix/store/a7vgascj2khj5w2bmd7mjjn1614pfyfz-gammaloop-crate-test-binaries-three-dimensional-reps-50150770f831b638-deps-0.1.0.drv
  262. 35.69 s error: Cannot build '/nix/store/v9nw2a9ks6ddvij598f8kv32hv90fs6b-gammaloop-nextest-binaries-core-three-dimensional-reps-0.1.0.drv'.
  263. 35.69 s Reason: 1 dependency failed.
  264. 35.69 s Output paths:
  265. 35.69 s /nix/store/76li3770yybifc9q5g9dinyscnnz557r-gammaloop-nextest-binaries-core-three-dimensional-reps-0.1.0
  266. 35.69 s error: Build failed due to failed dependency
  267. 35.69 s error: Cannot build '/nix/store/4cb29gl4l8ra2lg6apawq67j93nkjir8-gammaloop-nextest-binaries-core.drv'.
  268. 35.69 s Reason: 1 dependency failed.
  269. 35.69 s Output paths:
  270. 35.69 s /nix/store/66lyvifccrkps63sir1v1wskzk61q7xz-gammaloop-nextest-binaries-core
  271. 49.57 s Downloaded cached gammaloop-crate-test-dependencies-f0f952c3f8c3050c-inputs (2.3 GiB) in 17.4s
  272. 49.64 s Downloaded cached gammaloop-crate-test-binaries-gammalooprs-247ff5d63201fb2c-inputs (2.3 GiB) in 17.5s
  273. 49.65 s Build failed due to failed dependency
  274. 49.71 s Build failed.