1. 0.00 s $ /nix/store/9ypz3flqsrl5xl495mm8h645gadjsxi1-coreutils-9.11/bin/timeout --kill-after=15s 7200s /nix/store/23zk8sgzamrbmj1fday15szf7f2279s8-nix-2.34.7/bin/nix --extra-experimental-features nix-command --extra-experimental-features flakes --log-format internal-json build --no-link --print-out-paths git+https://github.com/alphal00p/gammaloop?ref=raised_energy_cff_wip&rev=89a52f17698621bf30dda0fb3d143a0fe6be4ba6&shallow=1#checks.x86_64-linux.gammaloop-nextest-binaries-core --print-build-logs
  2. 5.70 s
  3. 6.60 s Downloading cached gammaloop-ci-test-binary-dependencies-1b17e1ec025c6580-Cargo.toml from https://cache.nix-ci.com
  4. 6.60 s Downloading cached gammaloop-ci-test-binary-dependencies-247ff5d63201fb2c-Cargo.toml from https://cache.nix-ci.com
  5. 6.60 s Downloading cached gammaloop-ci-test-binary-dependencies-31e37aec92971227-Cargo.toml from https://cache.nix-ci.com
  6. 6.60 s Downloading cached gammaloop-ci-test-binary-dependencies-50150770f831b638-Cargo.toml from https://cache.nix-ci.com
  7. 6.60 s Downloading cached gammaloop-ci-test-binary-dependencies-f0f952c3f8c3050c-Cargo.toml from https://cache.nix-ci.com
  8. 6.65 s Downloading cached cargo-nextest from https://cache.nix-ci.com
  9. 6.65 s Downloaded cached gammaloop-ci-test-binary-dependencies-247ff5d63201fb2c-Cargo.toml (1368 B) in 48ms
  10. 6.65 s Downloaded cached gammaloop-ci-test-binary-dependencies-1b17e1ec025c6580-Cargo.toml (280 B) in 49ms
  11. 6.65 s Downloaded cached gammaloop-ci-test-binary-dependencies-f0f952c3f8c3050c-Cargo.toml (1320 B) in 49ms
  12. 6.65 s Downloaded cached gammaloop-ci-test-binary-dependencies-50150770f831b638-Cargo.toml (584 B) in 49ms
  13. 6.65 s Downloaded cached gammaloop-ci-test-binary-dependencies-31e37aec92971227-Cargo.toml (824 B) in 50ms
  14. 6.72 s Downloading cached gammaloop-crate-gammaloop-workspace-hack-deps from https://cache.nix-ci.com
  15. 6.73 s Downloading cached gf2x from https://cache.nix-ci.com
  16. 6.73 s Downloading cached gfortran-15.2.0-libgcc from https://cache.nix-ci.com
  17. 6.81 s Building /nix/store/lw1x11cpmlidxcnakx6xvy0laaxvcp34-crane-dummy-cargo-target.rs.drv
  18. 6.86 s Downloaded cached cargo-nextest (26.3 MiB) in 206ms
  19. 6.86 s Building /nix/store/9d5pq3a3kirmah8ad81bjkjxw8qcs37i-crane-dummy-proc-macro-cargo-target.rs.drv
  20. 6.87 s Downloaded cached gfortran-15.2.0-libgcc (193 KiB) in 144ms
  21. 6.87 s Downloaded cached gf2x (163 KiB) in 146ms
  22. 6.90 s Building /nix/store/hb7vrvwgsdv3zmb4nk4r2bwgj32kasrf-gammaloop-ci-test-binary-dependencies-1b17e1ec025c6580-gammaloop-tracing-filter-macros-dev-dependency.toml.drv
  23. 6.92 s Building /nix/store/d803fdhy5vdmwg1bxnrdbbh443q5b2l1-gammaloop-ci-test-binary-dependencies-247ff5d63201fb2c-gammalooprs-dev-dependency.toml.drv
  24. 6.96 s Building /nix/store/8n7av5d2xzacvwsymvrcwygl7s0wgynb-gammaloop-ci-test-binary-dependencies-31e37aec92971227-gammaloop-tracing-filter-dev-dependency.toml.drv
  25. 7.00 s Building /nix/store/620cg4lxjsln105525v3nij0sy75ni31-gammaloop-ci-test-binary-dependencies-50150770f831b638-three-dimensional-reps-dev-dependency.toml.drv
  26. 7.04 s Building /nix/store/4wx7g7wm0incs1bkkmd6hnsr8bjq7s41-gammaloop-ci-test-binary-dependencies-f0f952c3f8c3050c-gammaloop-api-dev-dependency.toml.drv
  27. 7.04 s Progress: 0 of 26 built (7 building), 1 of 40 downloaded from cache (8 downloading)
  28. 7.04 s Progress: 0 of 26 built (7 building), 2 of 40 downloaded from cache (7 downloading)
  29. 7.04 s Progress: 0 of 26 built (7 building), 3 of 40 downloaded from cache (6 downloading)
  30. 7.04 s Progress: 0 of 26 built (7 building), 4 of 40 downloaded from cache (5 downloading)
  31. 7.04 s Progress: 0 of 26 built (7 building), 5 of 40 downloaded from cache (4 downloading)
  32. 7.04 s Progress: 0 of 26 built (7 building), 6 of 40 downloaded from cache (3 downloading)
  33. 7.04 s Progress: 0 of 26 built (7 building), 7 of 40 downloaded from cache (2 downloading)
  34. 7.04 s Progress: 0 of 26 built (7 building), 8 of 40 downloaded from cache (1 downloading)
  35. 7.06 s [crane-dummy-cargo-target.rs:post-build] Uploading to the NixCI cache: /nix/store/hd50hqi25fymr09a2w4xdiy5jmb2cfl5-crane-dummy-cargo-target.rs
  36. 7.12 s [crane-dummy-cargo-target.rs:post-build] warning: 'warn-short-path-literals' is deprecated, use 'lint-short-path-literals = ignore' instead
  37. 7.25 s [crane-dummy-cargo-target.rs:post-build] copying 0 paths...
  38. 7.33 s [crane-dummy-cargo-target.rs:post-build] warning: 'warn-short-path-literals' is deprecated, use 'lint-short-path-literals = ignore' instead
  39. 7.50 s [crane-dummy-cargo-target.rs:post-build] copying 0 paths...
  40. 7.52 s Uploaded crane-dummy-cargo-target.rs in 470ms
  41. 7.52 s Progress: 1 of 27 built (6 building), 8 of 40 downloaded from cache (1 downloading)
  42. 7.52 s Built crane-dummy-cargo-target.rs in 707ms
  43. 7.54 s [crane-dummy-proc-macro-cargo-target.rs:post-build] Uploading to the NixCI cache: /nix/store/z0b4s6pznqwlbyw5v4bbq7k1kp721g19-crane-dummy-proc-macro-cargo-target.rs
  44. 7.61 s [crane-dummy-proc-macro-cargo-target.rs:post-build] warning: 'warn-short-path-literals' is deprecated, use 'lint-short-path-literals = ignore' instead
  45. 7.74 s [crane-dummy-proc-macro-cargo-target.rs:post-build] copying 0 paths...
  46. 7.82 s [crane-dummy-proc-macro-cargo-target.rs:post-build] warning: 'warn-short-path-literals' is deprecated, use 'lint-short-path-literals = ignore' instead
  47. 7.98 s [crane-dummy-proc-macro-cargo-target.rs:post-build] copying 0 paths...
  48. 8.00 s Uploaded crane-dummy-proc-macro-cargo-target.rs in 480ms
  49. 8.00 s Progress: 2 of 28 built (5 building), 8 of 40 downloaded from cache (1 downloading)
  50. 8.00 s Built crane-dummy-proc-macro-cargo-target.rs in 1.1s
  51. 8.03 s [gammaloop-ci-test-binary-dependencies-1b17e1ec025c6580-gammaloop-tracing-filter-macros-dev-dependency.toml:post-build] Uploading to the NixCI cache: /nix/store/gczxq1jnxb2f6nwcbl5zwmigdpgim7v7-gammaloop-ci-test-binary-dependencies-1b17e1ec025c6580-gammaloop-tracing-filter-macros-dev-dependency.toml
  52. 8.10 s [gammaloop-ci-test-binary-dependencies-1b17e1ec025c6580-gammaloop-tracing-filter-macros-dev-dependency.toml:post-build] warning: 'warn-short-path-literals' is deprecated, use 'lint-short-path-literals = ignore' instead
  53. 8.23 s [gammaloop-ci-test-binary-dependencies-1b17e1ec025c6580-gammaloop-tracing-filter-macros-dev-dependency.toml:post-build] copying 0 paths...
  54. 8.30 s [gammaloop-ci-test-binary-dependencies-1b17e1ec025c6580-gammaloop-tracing-filter-macros-dev-dependency.toml:post-build] warning: 'warn-short-path-literals' is deprecated, use 'lint-short-path-literals = ignore' instead
  55. 8.47 s [gammaloop-ci-test-binary-dependencies-1b17e1ec025c6580-gammaloop-tracing-filter-macros-dev-dependency.toml:post-build] copying 0 paths...
  56. 8.49 s Uploaded gammaloop-ci-test-binary-dependencies-1b17e1ec025c6580-gammaloop-tracing-filter-macros-dev-dependency.toml in 483ms
  57. 8.50 s Progress: 3 of 29 built (4 building), 8 of 40 downloaded from cache (1 downloading)
  58. 8.50 s Built gammaloop-ci-test-binary-dependencies-1b17e1ec025c6580-gammaloop-tracing-filter-macros-dev-dependency.toml in 1.6s
  59. 8.52 s [gammaloop-ci-test-binary-dependencies-247ff5d63201fb2c-gammalooprs-dev-dependency.toml:post-build] Uploading to the NixCI cache: /nix/store/fzwgaj7lkfphcc1g09xfmk55hmkxkr0x-gammaloop-ci-test-binary-dependencies-247ff5d63201fb2c-gammalooprs-dev-dependency.toml
  60. 8.59 s [gammaloop-ci-test-binary-dependencies-247ff5d63201fb2c-gammalooprs-dev-dependency.toml:post-build] warning: 'warn-short-path-literals' is deprecated, use 'lint-short-path-literals = ignore' instead
  61. 8.72 s [gammaloop-ci-test-binary-dependencies-247ff5d63201fb2c-gammalooprs-dev-dependency.toml:post-build] copying 0 paths...
  62. 8.79 s [gammaloop-ci-test-binary-dependencies-247ff5d63201fb2c-gammalooprs-dev-dependency.toml:post-build] warning: 'warn-short-path-literals' is deprecated, use 'lint-short-path-literals = ignore' instead
  63. 8.96 s [gammaloop-ci-test-binary-dependencies-247ff5d63201fb2c-gammalooprs-dev-dependency.toml:post-build] copying 0 paths...
  64. 8.98 s Uploaded gammaloop-ci-test-binary-dependencies-247ff5d63201fb2c-gammalooprs-dev-dependency.toml in 482ms
  65. 8.98 s Progress: 4 of 30 built (3 building), 8 of 40 downloaded from cache (1 downloading)
  66. 8.98 s Built gammaloop-ci-test-binary-dependencies-247ff5d63201fb2c-gammalooprs-dev-dependency.toml in 2.0s
  67. 9.01 s [gammaloop-ci-test-binary-dependencies-31e37aec92971227-gammaloop-tracing-filter-dev-dependency.toml:post-build] Uploading to the NixCI cache: /nix/store/a90w47vskdc47wbbm7xrpzbp3hjc6n01-gammaloop-ci-test-binary-dependencies-31e37aec92971227-gammaloop-tracing-filter-dev-dependency.toml
  68. 9.07 s [gammaloop-ci-test-binary-dependencies-31e37aec92971227-gammaloop-tracing-filter-dev-dependency.toml:post-build] warning: 'warn-short-path-literals' is deprecated, use 'lint-short-path-literals = ignore' instead
  69. 9.20 s [gammaloop-ci-test-binary-dependencies-31e37aec92971227-gammaloop-tracing-filter-dev-dependency.toml:post-build] copying 0 paths...
  70. 9.27 s [gammaloop-ci-test-binary-dependencies-31e37aec92971227-gammaloop-tracing-filter-dev-dependency.toml:post-build] warning: 'warn-short-path-literals' is deprecated, use 'lint-short-path-literals = ignore' instead
  71. 9.43 s [gammaloop-ci-test-binary-dependencies-31e37aec92971227-gammaloop-tracing-filter-dev-dependency.toml:post-build] copying 0 paths...
  72. 9.45 s Uploaded gammaloop-ci-test-binary-dependencies-31e37aec92971227-gammaloop-tracing-filter-dev-dependency.toml in 455ms
  73. 9.45 s Progress: 5 of 31 built (2 building), 8 of 40 downloaded from cache (1 downloading)
  74. 9.45 s Built gammaloop-ci-test-binary-dependencies-31e37aec92971227-gammaloop-tracing-filter-dev-dependency.toml in 2.4s
  75. 9.45 s Downloading cached ntl from https://cache.nix-ci.com
  76. 9.45 s Downloading cached gfortran-15.2.0-lib from https://cache.nix-ci.com
  77. 9.47 s [gammaloop-ci-test-binary-dependencies-50150770f831b638-three-dimensional-reps-dev-dependency.toml:post-build] Uploading to the NixCI cache: /nix/store/nkd9p6h639pp1ya2nb2yngjw7qb80nfg-gammaloop-ci-test-binary-dependencies-50150770f831b638-three-dimensional-reps-dev-dependency.toml
  78. 9.54 s [gammaloop-ci-test-binary-dependencies-50150770f831b638-three-dimensional-reps-dev-dependency.toml:post-build] warning: 'warn-short-path-literals' is deprecated, use 'lint-short-path-literals = ignore' instead
  79. 9.66 s [gammaloop-ci-test-binary-dependencies-50150770f831b638-three-dimensional-reps-dev-dependency.toml:post-build] copying 0 paths...
  80. 9.68 s Downloaded cached ntl (12.1 MiB) in 235ms
  81. 9.69 s Downloaded cached gfortran-15.2.0-lib (13.3 MiB) in 239ms
  82. 9.74 s [gammaloop-ci-test-binary-dependencies-50150770f831b638-three-dimensional-reps-dev-dependency.toml:post-build] warning: 'warn-short-path-literals' is deprecated, use 'lint-short-path-literals = ignore' instead
  83. 9.90 s [gammaloop-ci-test-binary-dependencies-50150770f831b638-three-dimensional-reps-dev-dependency.toml:post-build] copying 0 paths...
  84. 9.92 s Uploaded gammaloop-ci-test-binary-dependencies-50150770f831b638-three-dimensional-reps-dev-dependency.toml in 462ms
  85. 9.92 s Progress: 6 of 21 built (1 building), 8 of 40 downloaded from cache (3 downloading)
  86. 9.92 s Built gammaloop-ci-test-binary-dependencies-50150770f831b638-three-dimensional-reps-dev-dependency.toml in 2.9s
  87. 9.95 s [gammaloop-ci-test-binary-dependencies-f0f952c3f8c3050c-gammaloop-api-dev-dependency.toml:post-build] Uploading to the NixCI cache: /nix/store/8n1xwz3n1glb8aw2nw1zp5k5wfk62wm4-gammaloop-ci-test-binary-dependencies-f0f952c3f8c3050c-gammaloop-api-dev-dependency.toml
  88. 10.01 s [gammaloop-ci-test-binary-dependencies-f0f952c3f8c3050c-gammaloop-api-dev-dependency.toml:post-build] warning: 'warn-short-path-literals' is deprecated, use 'lint-short-path-literals = ignore' instead
  89. 10.13 s [gammaloop-ci-test-binary-dependencies-f0f952c3f8c3050c-gammaloop-api-dev-dependency.toml:post-build] copying 0 paths...
  90. 10.22 s [gammaloop-ci-test-binary-dependencies-f0f952c3f8c3050c-gammaloop-api-dev-dependency.toml:post-build] warning: 'warn-short-path-literals' is deprecated, use 'lint-short-path-literals = ignore' instead
  91. 10.37 s [gammaloop-ci-test-binary-dependencies-f0f952c3f8c3050c-gammaloop-api-dev-dependency.toml:post-build] copying 0 paths...
  92. 10.39 s Uploaded gammaloop-ci-test-binary-dependencies-f0f952c3f8c3050c-gammaloop-api-dev-dependency.toml in 463ms
  93. 10.39 s Progress: 7 of 22 built, 8 of 40 downloaded from cache (3 downloading)
  94. 10.39 s Built gammaloop-ci-test-binary-dependencies-f0f952c3f8c3050c-gammaloop-api-dev-dependency.toml in 3.3s
  95. 10.39 s Progress: 7 of 20 built, 9 of 40 downloaded from cache (2 downloading)
  96. 10.39 s Progress: 7 of 20 built, 10 of 40 downloaded from cache (1 downloading)
  97. 10.39 s Downloading cached openblas from https://cache.nix-ci.com
  98. 10.68 s Downloaded cached openblas (32.8 MiB) in 288ms
  99. 10.68 s Progress: 7 of 20 built, 11 of 40 downloaded from cache (1 downloading)
  100. 10.68 s Downloading cached flint from https://cache.nix-ci.com
  101. 10.97 s Downloaded cached flint (16.1 MiB) in 291ms
  102. 10.97 s Progress: 7 of 20 built, 12 of 40 downloaded from cache (1 downloading)
  103. 10.98 s Downloading cached form from https://cache.nix-ci.com
  104. 11.24 s Downloaded cached form (4.8 MiB) in 261ms
  105. 11.24 s Progress: 7 of 20 built, 13 of 40 downloaded from cache (1 downloading)
  106. 21.67 s Downloaded cached gammaloop-crate-gammaloop-workspace-hack-deps (186.1 MiB) in 14.9s
  107. 21.67 s Progress: 7 of 19 built, 14 of 40 downloaded from cache
  108. 21.67 s Downloading cached gammaloop-crate-gammaloop-workspace-hack-build from https://cache.nix-ci.com
  109. 21.71 s Downloaded cached gammaloop-crate-gammaloop-workspace-hack-build (195 KiB) in 43ms
  110. 21.71 s Progress: 7 of 19 built, 15 of 40 downloaded from cache
  111. 21.72 s Downloading cached gammaloop-crate-test-dependencies-1b17e1ec025c6580-inputs from https://cache.nix-ci.com
  112. 21.72 s Downloading cached gammaloop-crate-test-dependencies-78814cb8a1862b52-inputs from https://cache.nix-ci.com
  113. 29.60 s Downloaded cached gammaloop-crate-test-dependencies-1b17e1ec025c6580-inputs (1.1 GiB) in 7.8s
  114. 29.60 s Progress: 7 of 19 built, 16 of 40 downloaded from cache (1 downloading)
  115. 29.60 s Downloading cached gammaloop-crate-test-dependencies-1b17e1ec025c6580-deps from https://cache.nix-ci.com
  116. 29.65 s Downloaded cached gammaloop-crate-test-dependencies-1b17e1ec025c6580-deps (306 KiB) in 47ms
  117. 29.65 s Progress: 7 of 19 built, 17 of 40 downloaded from cache (1 downloading)
  118. 29.65 s Downloading cached gammaloop-crate-test-binaries-gammaloop-tracing-filter-macros-1b17e1ec025c6580-inputs from https://cache.nix-ci.com
  119. 33.04 s Downloaded cached gammaloop-crate-test-dependencies-78814cb8a1862b52-inputs (1.1 GiB) in 11.3s
  120. 33.04 s Progress: 7 of 19 built, 18 of 40 downloaded from cache (1 downloading)
  121. 33.04 s Downloading cached gammaloop-crate-test-dependencies-78814cb8a1862b52-deps from https://cache.nix-ci.com
  122. 33.95 s Downloaded cached gammaloop-crate-test-dependencies-78814cb8a1862b52-deps (60.8 MiB) in 916ms
  123. 33.95 s Progress: 7 of 19 built, 19 of 40 downloaded from cache (1 downloading)
  124. 33.96 s Downloading cached gammaloop-crate-test-dependencies-50150770f831b638-inputs from https://cache.nix-ci.com
  125. 33.96 s Downloading cached gammaloop-crate-test-dependencies-b6a0734be42e3503-inputs from https://cache.nix-ci.com
  126. 36.57 s Downloaded cached gammaloop-crate-test-binaries-gammaloop-tracing-filter-macros-1b17e1ec025c6580-inputs (1.1 GiB) in 6.9s
  127. 36.57 s Progress: 7 of 19 built, 20 of 40 downloaded from cache (2 downloading)
  128. 36.57 s Downloading cached gammaloop-crate-test-binaries-gammaloop-tracing-filter-macros-1b17e1ec025c6580-deps from https://cache.nix-ci.com
  129. 36.76 s Downloaded cached gammaloop-crate-test-binaries-gammaloop-tracing-filter-macros-1b17e1ec025c6580-deps (183 KiB) in 187ms
  130. 36.76 s Progress: 7 of 19 built, 21 of 40 downloaded from cache (2 downloading)
  131. 36.91 s Building /nix/store/xxrx85yhmmvzhfisdn6gs3xilp9k5hx7-gammaloop-nextest-binaries-core-gammaloop-tracing-filter-macros-0.1.0.drv
  132. 36.99 s [gammaloop-nextest-binaries-core-gammaloop-tracing-filter-macros] Phase: unpackPhase
  133. 37.00 s [gammaloop-nextest-binaries-core-gammaloop-tracing-filter-macros] unpacking source archive /nix/store/rxjdmvmk0l286dw52rnvj8jmmik8v82x-source
  134. 37.01 s [gammaloop-nextest-binaries-core-gammaloop-tracing-filter-macros] source root is source
  135. 37.02 s [gammaloop-nextest-binaries-core-gammaloop-tracing-filter-macros] Phase: patchPhase
  136. 37.14 s [gammaloop-nextest-binaries-core-gammaloop-tracing-filter-macros] copying cargo artifacts from /nix/store/zysfpfhnm2bfh5jzvdfv215bjaxy09vk-gammaloop-crate-test-binaries-gammaloop-tracing-filter-macros-1b17e1ec025c6580-inputs/target to target
  137. 38.89 s [gammaloop-nextest-binaries-core-gammaloop-tracing-filter-macros] Executing configureCargoCommonVars
  138. 38.89 s [gammaloop-nextest-binaries-core-gammaloop-tracing-filter-macros] decompressing cargo artifacts from /nix/store/zaxi7228db23jvkb274ippgv91hnlim8-gammaloop-crate-test-binaries-gammaloop-tracing-filter-macros-1b17e1ec025c6580-deps-0.1.0/target.tar.zst to target
  139. 38.90 s [gammaloop-nextest-binaries-core-gammaloop-tracing-filter-macros] Phase: updateAutotoolsGnuConfigScriptsPhase
  140. 38.93 s [gammaloop-nextest-binaries-core-gammaloop-tracing-filter-macros] Phase: configurePhase
  141. 38.94 s [gammaloop-nextest-binaries-core-gammaloop-tracing-filter-macros] will append /build/source/.cargo-home/config.toml with contents of /nix/store/1sigmg52bb61pfngmk9k8wq5fz9r7bf1-vendor-cargo-deps/config.toml
  142. 38.94 s [gammaloop-nextest-binaries-core-gammaloop-tracing-filter-macros] default configurePhase, nothing to do
  143. 38.94 s [gammaloop-nextest-binaries-core-gammaloop-tracing-filter-macros] Phase: buildPhase
  144. 38.95 s [gammaloop-nextest-binaries-core-gammaloop-tracing-filter-macros] +++ command cargo --version
  145. 38.95 s [gammaloop-nextest-binaries-core-gammaloop-tracing-filter-macros] cargo 1.97.0 (c980f4866 2026-06-30)
  146. 38.99 s [gammaloop-nextest-binaries-core-gammaloop-tracing-filter-macros] +++ command cargo nextest --version
  147. 39.00 s [gammaloop-nextest-binaries-core-gammaloop-tracing-filter-macros] cargo-nextest 0.9.140
  148. 39.00 s [gammaloop-nextest-binaries-core-gammaloop-tracing-filter-macros] release: 0.9.140
  149. 39.00 s [gammaloop-nextest-binaries-core-gammaloop-tracing-filter-macros] host: x86_64-unknown-linux-gnu
  150. 39.00 s [gammaloop-nextest-binaries-core-gammaloop-tracing-filter-macros] +++ command cargo nextest archive --cargo-profile ci-optim --offline -p gammaloop-tracing-filter-macros -E 'package(gammaloop-tracing-filter-macros)' --profile ci_gammaloop --archive-file /nix/store/3km1y4r4wk88cg6whrdxv2bsvpn9rjmm-gammaloop-nextest-binaries-core-gammaloop-tracing-filter-macros-0.1.0/gammaloop-nextest-core-gammaloop-tracing-filter-macros.tar.zst
  151. 39.56 s [gammaloop-nextest-binaries-core-gammaloop-tracing-filter-macros] Finished `ci-optim` profile [optimized] target(s) in 0.17s
  152. 39.59 s [gammaloop-nextest-binaries-core-gammaloop-tracing-filter-macros] Archiving 1 binary and 1 standard library to /nix/store/3km1y4r4wk88cg6whrdxv2bsvpn9rjmm-gammaloop-nextest-binaries-core-gammaloop-tracing-filter-macros-0.1.0/gammaloop-nextest-core-gammaloop-tracing-filter-macros.tar.zst
  153. 39.70 s [gammaloop-nextest-binaries-core-gammaloop-tracing-filter-macros] Archived 4 files to /nix/store/3km1y4r4wk88cg6whrdxv2bsvpn9rjmm-gammaloop-nextest-binaries-core-gammaloop-tracing-filter-macros-0.1.0/gammaloop-nextest-core-gammaloop-tracing-filter-macros.tar.zst in 0.11s
  154. 39.71 s [gammaloop-nextest-binaries-core-gammaloop-tracing-filter-macros] Phase: installPhase
  155. 39.71 s [gammaloop-nextest-binaries-core-gammaloop-tracing-filter-macros] Phase: fixupPhase
  156. 39.73 s [gammaloop-nextest-binaries-core-gammaloop-tracing-filter-macros] shrinking RPATHs of ELF executables and libraries in /nix/store/3km1y4r4wk88cg6whrdxv2bsvpn9rjmm-gammaloop-nextest-binaries-core-gammaloop-tracing-filter-macros-0.1.0
  157. 39.73 s [gammaloop-nextest-binaries-core-gammaloop-tracing-filter-macros] checking for references to /build/ in /nix/store/3km1y4r4wk88cg6whrdxv2bsvpn9rjmm-gammaloop-nextest-binaries-core-gammaloop-tracing-filter-macros-0.1.0...
  158. 39.74 s [gammaloop-nextest-binaries-core-gammaloop-tracing-filter-macros] patching script interpreter paths in /nix/store/3km1y4r4wk88cg6whrdxv2bsvpn9rjmm-gammaloop-nextest-binaries-core-gammaloop-tracing-filter-macros-0.1.0
  159. 39.90 s [gammaloop-nextest-binaries-core-gammaloop-tracing-filter-macros:post-build] Uploading to the NixCI cache: /nix/store/3km1y4r4wk88cg6whrdxv2bsvpn9rjmm-gammaloop-nextest-binaries-core-gammaloop-tracing-filter-macros-0.1.0
  160. 39.94 s [gammaloop-nextest-binaries-core-gammaloop-tracing-filter-macros:post-build] warning: 'warn-short-path-literals' is deprecated, use 'lint-short-path-literals = ignore' instead
  161. 39.94 s [gammaloop-nextest-binaries-core-gammaloop-tracing-filter-macros:post-build] copying 1 paths...
  162. 39.94 s [gammaloop-nextest-binaries-core-gammaloop-tracing-filter-macros:post-build] copying path '/nix/store/3km1y4r4wk88cg6whrdxv2bsvpn9rjmm-gammaloop-nextest-binaries-core-gammaloop-tracing-filter-macros-0.1.0' to 'https://cache.nix-ci.com'...
  163. 41.01 s [gammaloop-nextest-binaries-core-gammaloop-tracing-filter-macros:post-build] warning: 'warn-short-path-literals' is deprecated, use 'lint-short-path-literals = ignore' instead
  164. 42.49 s [gammaloop-nextest-binaries-core-gammaloop-tracing-filter-macros:post-build] copying 2 paths...
  165. 42.49 s [gammaloop-nextest-binaries-core-gammaloop-tracing-filter-macros:post-build] copying path '/nix/store/rxjdmvmk0l286dw52rnvj8jmmik8v82x-source' to 'https://cache.nix-ci.com'...
  166. 42.76 s [gammaloop-nextest-binaries-core-gammaloop-tracing-filter-macros:post-build] copying path '/nix/store/xxrx85yhmmvzhfisdn6gs3xilp9k5hx7-gammaloop-nextest-binaries-core-gammaloop-tracing-filter-macros-0.1.0.drv' to 'https://cache.nix-ci.com'...
  167. 43.02 s Uploaded gammaloop-nextest-binaries-core-gammaloop-tracing-filter-macros in 3.1s
  168. 43.02 s Progress: 8 of 19 built, 21 of 40 downloaded from cache (2 downloading)
  169. 43.02 s Built gammaloop-nextest-binaries-core-gammaloop-tracing-filter-macros in 6.1s
  170. 43.15 s Downloaded cached gammaloop-crate-test-dependencies-50150770f831b638-inputs (1.4 GiB) in 9.1s
  171. 43.16 s Progress: 8 of 18 built, 22 of 40 downloaded from cache (1 downloading)
  172. 43.16 s Downloading cached gammaloop-crate-test-dependencies-50150770f831b638-deps from https://cache.nix-ci.com
  173. 43.24 s Downloaded cached gammaloop-crate-test-dependencies-b6a0734be42e3503-inputs (1.4 GiB) in 9.2s
  174. 43.24 s Progress: 8 of 18 built, 23 of 40 downloaded from cache (1 downloading)
  175. 43.24 s Downloading cached gammaloop-crate-test-dependencies-b6a0734be42e3503-deps from https://cache.nix-ci.com
  176. 43.71 s Downloaded cached gammaloop-crate-test-dependencies-50150770f831b638-deps (20.5 MiB) in 549ms
  177. 43.71 s Progress: 8 of 18 built, 24 of 40 downloaded from cache (1 downloading)
  178. 43.71 s Downloading cached gammaloop-crate-test-binaries-three-dimensional-reps-50150770f831b638-inputs from https://cache.nix-ci.com
  179. 44.19 s Downloaded cached gammaloop-crate-test-dependencies-b6a0734be42e3503-deps (35.8 MiB) in 952ms
  180. 44.19 s Progress: 8 of 18 built, 25 of 40 downloaded from cache (1 downloading)
  181. 44.20 s Downloading cached gammaloop-crate-test-dependencies-31e37aec92971227-inputs from https://cache.nix-ci.com
  182. 44.20 s Downloading cached gammaloop-crate-test-dependencies-91f21e5f130440bb-inputs from https://cache.nix-ci.com
  183. 55.51 s Downloaded cached gammaloop-crate-test-binaries-three-dimensional-reps-50150770f831b638-inputs (1.5 GiB) in 11.8s
  184. 55.51 s Progress: 8 of 18 built, 26 of 40 downloaded from cache (2 downloading)
  185. 55.60 s Building /nix/store/a7vgascj2khj5w2bmd7mjjn1614pfyfz-gammaloop-crate-test-binaries-three-dimensional-reps-50150770f831b638-deps-0.1.0.drv
  186. 55.69 s [gammaloop-crate-test-binaries-three-dimensional-reps-50150770f831b638-deps] Phase: unpackPhase
  187. 55.69 s [gammaloop-crate-test-binaries-three-dimensional-reps-50150770f831b638-deps] unpacking source archive /nix/store/78hj0zga692a2q922cw28xhn5c6pic94-source
  188. 55.70 s [gammaloop-crate-test-binaries-three-dimensional-reps-50150770f831b638-deps] source root is source
  189. 55.71 s [gammaloop-crate-test-binaries-three-dimensional-reps-50150770f831b638-deps] Phase: patchPhase
  190. 55.83 s [gammaloop-crate-test-binaries-three-dimensional-reps-50150770f831b638-deps] Executing configureCargoCommonVars
  191. 55.83 s [gammaloop-crate-test-binaries-three-dimensional-reps-50150770f831b638-deps] copying cargo artifacts from /nix/store/fgh2l3z56pmcypaz8sm5lgiicyijyiz4-gammaloop-crate-test-binaries-three-dimensional-reps-50150770f831b638-inputs/target to target
  192. 55.83 s [gammaloop-crate-test-binaries-three-dimensional-reps-50150770f831b638-deps] will deep copy artifacts (instead of symlinking) as requested
  193. 56.26 s Downloaded cached gammaloop-crate-test-dependencies-31e37aec92971227-inputs (1.5 GiB) in 12.0s
  194. 56.26 s Progress: 8 of 17 built (1 building), 27 of 40 downloaded from cache (1 downloading)
  195. 56.26 s Downloading cached gammaloop-crate-test-dependencies-31e37aec92971227-deps from https://cache.nix-ci.com
  196. 56.77 s Downloaded cached gammaloop-crate-test-dependencies-31e37aec92971227-deps (17.8 MiB) in 506ms
  197. 56.77 s Progress: 8 of 17 built (1 building), 28 of 40 downloaded from cache (1 downloading)
  198. 56.77 s Downloading cached gammaloop-crate-test-binaries-gammaloop-tracing-filter-31e37aec92971227-inputs from https://cache.nix-ci.com
  199. 57.28 s [gammaloop-crate-test-binaries-three-dimensional-reps-50150770f831b638-deps] Phase: updateAutotoolsGnuConfigScriptsPhase
  200. 57.36 s [gammaloop-crate-test-binaries-three-dimensional-reps-50150770f831b638-deps] Phase: configurePhase
  201. 57.37 s [gammaloop-crate-test-binaries-three-dimensional-reps-50150770f831b638-deps] will append /build/source/.cargo-home/config.toml with contents of /nix/store/1sigmg52bb61pfngmk9k8wq5fz9r7bf1-vendor-cargo-deps/config.toml
  202. 57.37 s [gammaloop-crate-test-binaries-three-dimensional-reps-50150770f831b638-deps] default configurePhase, nothing to do
  203. 57.37 s [gammaloop-crate-test-binaries-three-dimensional-reps-50150770f831b638-deps] Phase: buildPhase
  204. 57.38 s [gammaloop-crate-test-binaries-three-dimensional-reps-50150770f831b638-deps] +++ command cargo --version
  205. 57.38 s [gammaloop-crate-test-binaries-three-dimensional-reps-50150770f831b638-deps] cargo 1.97.0 (c980f4866 2026-06-30)
  206. 57.38 s [gammaloop-crate-test-binaries-three-dimensional-reps-50150770f831b638-deps] +++ command cargo test --profile ci-optim --no-run --offline -p three-dimensional-reps --features three-dimensional-reps/serde
  207. 58.20 s [gammaloop-crate-test-binaries-three-dimensional-reps-50150770f831b638-deps] Compiling three-dimensional-reps v0.1.0 (/build/source/crates/three-dimensional-reps)
  208. 58.49 s [gammaloop-crate-test-binaries-three-dimensional-reps-50150770f831b638-deps] error[E0433]: cannot find `eval` in `crate`
  209. 58.49 s [gammaloop-crate-test-binaries-three-dimensional-reps-50150770f831b638-deps] --> crates/three-dimensional-reps/src/generation.rs:7255:28
  210. 58.49 s [gammaloop-crate-test-binaries-three-dimensional-reps-50150770f831b638-deps] |
  211. 58.49 s [gammaloop-crate-test-binaries-three-dimensional-reps-50150770f831b638-deps] 7255 | let input = crate::eval::EvaluationInput {
  212. 58.49 s [gammaloop-crate-test-binaries-three-dimensional-reps-50150770f831b638-deps] | ^^^^ could not find `eval` in the crate root
  213. 58.49 s [gammaloop-crate-test-binaries-three-dimensional-reps-50150770f831b638-deps] |
  214. 58.49 s [gammaloop-crate-test-binaries-three-dimensional-reps-50150770f831b638-deps] note: found an item that was configured out
  215. 58.49 s [gammaloop-crate-test-binaries-three-dimensional-reps-50150770f831b638-deps] --> crates/three-dimensional-reps/src/lib.rs:7:9
  216. 58.49 s [gammaloop-crate-test-binaries-three-dimensional-reps-50150770f831b638-deps] |
  217. 58.49 s [gammaloop-crate-test-binaries-three-dimensional-reps-50150770f831b638-deps] 6 | #[cfg(feature = "eval")]
  218. 58.49 s [gammaloop-crate-test-binaries-three-dimensional-reps-50150770f831b638-deps] | ---------------- the item is gated behind the `eval` feature
  219. 58.49 s [gammaloop-crate-test-binaries-three-dimensional-reps-50150770f831b638-deps] 7 | pub mod eval;
  220. 58.49 s [gammaloop-crate-test-binaries-three-dimensional-reps-50150770f831b638-deps] | ^^^^
  221. 58.49 s [gammaloop-crate-test-binaries-three-dimensional-reps-50150770f831b638-deps]
  222. 58.50 s [gammaloop-crate-test-binaries-three-dimensional-reps-50150770f831b638-deps] error[E0433]: cannot find `eval` in `crate`
  223. 58.50 s [gammaloop-crate-test-binaries-three-dimensional-reps-50150770f831b638-deps] --> crates/three-dimensional-reps/src/generation.rs:7262:30
  224. 58.50 s [gammaloop-crate-test-binaries-three-dimensional-reps-50150770f831b638-deps] |
  225. 58.50 s [gammaloop-crate-test-binaries-three-dimensional-reps-50150770f831b638-deps] 7262 | let contact = crate::eval::evaluate_expression(
  226. 58.50 s [gammaloop-crate-test-binaries-three-dimensional-reps-50150770f831b638-deps] | ^^^^ could not find `eval` in the crate root
  227. 58.50 s [gammaloop-crate-test-binaries-three-dimensional-reps-50150770f831b638-deps] |
  228. 58.50 s [gammaloop-crate-test-binaries-three-dimensional-reps-50150770f831b638-deps] note: found an item that was configured out
  229. 58.50 s [gammaloop-crate-test-binaries-three-dimensional-reps-50150770f831b638-deps] --> crates/three-dimensional-reps/src/lib.rs:7:9
  230. 58.50 s [gammaloop-crate-test-binaries-three-dimensional-reps-50150770f831b638-deps] |
  231. 58.50 s [gammaloop-crate-test-binaries-three-dimensional-reps-50150770f831b638-deps] 6 | #[cfg(feature = "eval")]
  232. 58.50 s [gammaloop-crate-test-binaries-three-dimensional-reps-50150770f831b638-deps] | ---------------- the item is gated behind the `eval` feature
  233. 58.50 s [gammaloop-crate-test-binaries-three-dimensional-reps-50150770f831b638-deps] 7 | pub mod eval;
  234. 58.50 s [gammaloop-crate-test-binaries-three-dimensional-reps-50150770f831b638-deps] | ^^^^
  235. 58.50 s [gammaloop-crate-test-binaries-three-dimensional-reps-50150770f831b638-deps]
  236. 58.50 s [gammaloop-crate-test-binaries-three-dimensional-reps-50150770f831b638-deps] error[E0433]: cannot find `eval` in `crate`
  237. 58.50 s [gammaloop-crate-test-binaries-three-dimensional-reps-50150770f831b638-deps] --> crates/three-dimensional-reps/src/generation.rs:7270:32
  238. 58.50 s [gammaloop-crate-test-binaries-three-dimensional-reps-50150770f831b638-deps] |
  239. 58.50 s [gammaloop-crate-test-binaries-three-dimensional-reps-50150770f831b638-deps] 7270 | let remainder = crate::eval::evaluate_expression(
  240. 58.50 s [gammaloop-crate-test-binaries-three-dimensional-reps-50150770f831b638-deps] | ^^^^ could not find `eval` in the crate root
  241. 58.50 s [gammaloop-crate-test-binaries-three-dimensional-reps-50150770f831b638-deps] |
  242. 58.50 s [gammaloop-crate-test-binaries-three-dimensional-reps-50150770f831b638-deps] note: found an item that was configured out
  243. 58.50 s [gammaloop-crate-test-binaries-three-dimensional-reps-50150770f831b638-deps] --> crates/three-dimensional-reps/src/lib.rs:7:9
  244. 58.50 s [gammaloop-crate-test-binaries-three-dimensional-reps-50150770f831b638-deps] |
  245. 58.50 s [gammaloop-crate-test-binaries-three-dimensional-reps-50150770f831b638-deps] 6 | #[cfg(feature = "eval")]
  246. 58.50 s [gammaloop-crate-test-binaries-three-dimensional-reps-50150770f831b638-deps] | ---------------- the item is gated behind the `eval` feature
  247. 58.50 s [gammaloop-crate-test-binaries-three-dimensional-reps-50150770f831b638-deps] 7 | pub mod eval;
  248. 58.50 s [gammaloop-crate-test-binaries-three-dimensional-reps-50150770f831b638-deps] | ^^^^
  249. 58.50 s [gammaloop-crate-test-binaries-three-dimensional-reps-50150770f831b638-deps]
  250. 58.51 s [gammaloop-crate-test-binaries-three-dimensional-reps-50150770f831b638-deps] error[E0433]: cannot find `eval` in `crate`
  251. 58.51 s [gammaloop-crate-test-binaries-three-dimensional-reps-50150770f831b638-deps] --> crates/three-dimensional-reps/src/generation.rs:7278:28
  252. 58.51 s [gammaloop-crate-test-binaries-three-dimensional-reps-50150770f831b638-deps] |
  253. 58.51 s [gammaloop-crate-test-binaries-three-dimensional-reps-50150770f831b638-deps] 7278 | let total = crate::eval::evaluate_expression(&powered, &expression, numerator, &input)
  254. 58.51 s [gammaloop-crate-test-binaries-three-dimensional-reps-50150770f831b638-deps] | ^^^^ could not find `eval` in the crate root
  255. 58.51 s [gammaloop-crate-test-binaries-three-dimensional-reps-50150770f831b638-deps] |
  256. 58.51 s [gammaloop-crate-test-binaries-three-dimensional-reps-50150770f831b638-deps] note: found an item that was configured out
  257. 58.51 s [gammaloop-crate-test-binaries-three-dimensional-reps-50150770f831b638-deps] --> crates/three-dimensional-reps/src/lib.rs:7:9
  258. 58.51 s [gammaloop-crate-test-binaries-three-dimensional-reps-50150770f831b638-deps] |
  259. 58.51 s [gammaloop-crate-test-binaries-three-dimensional-reps-50150770f831b638-deps] 6 | #[cfg(feature = "eval")]
  260. 58.51 s [gammaloop-crate-test-binaries-three-dimensional-reps-50150770f831b638-deps] | ---------------- the item is gated behind the `eval` feature
  261. 58.51 s [gammaloop-crate-test-binaries-three-dimensional-reps-50150770f831b638-deps] 7 | pub mod eval;
  262. 58.51 s [gammaloop-crate-test-binaries-three-dimensional-reps-50150770f831b638-deps] | ^^^^
  263. 58.51 s [gammaloop-crate-test-binaries-three-dimensional-reps-50150770f831b638-deps]
  264. 59.48 s Downloaded cached gammaloop-crate-test-dependencies-91f21e5f130440bb-inputs (1.5 GiB) in 15.2s
  265. 59.48 s Progress: 8 of 17 built (1 building), 29 of 40 downloaded from cache (1 downloading)
  266. 59.48 s Downloading cached gammaloop-crate-test-dependencies-91f21e5f130440bb-deps from https://cache.nix-ci.com
  267. 60.08 s [gammaloop-crate-test-binaries-three-dimensional-reps-50150770f831b638-deps] For more information about this error, try `rustc --explain E0433`.
  268. 60.10 s [gammaloop-crate-test-binaries-three-dimensional-reps-50150770f831b638-deps] error: could not compile `three-dimensional-reps` (lib test) due to 4 previous errors
  269. 60.48 s Progress: 8 of 17 built (1 failed), 29 of 40 downloaded from cache (2 downloading)
  270. 60.48 s Failed to build gammaloop-crate-test-binaries-three-dimensional-reps-50150770f831b638-deps after 4.8s
  271. 60.48 s error: Cannot build '/nix/store/a7vgascj2khj5w2bmd7mjjn1614pfyfz-gammaloop-crate-test-binaries-three-dimensional-reps-50150770f831b638-deps-0.1.0.drv'.
  272. 60.48 s Reason: builder failed with exit code 101.
  273. 60.48 s Output paths:
  274. 60.48 s /nix/store/a34ri5gifn73ay8schaga92mdazmbvv5-gammaloop-crate-test-binaries-three-dimensional-reps-50150770f831b638-deps-0.1.0
  275. 60.48 s Last 74 log lines:
  276. 60.48 s > Running phase: unpackPhase
  277. 60.48 s > unpacking source archive /nix/store/78hj0zga692a2q922cw28xhn5c6pic94-source
  278. 60.48 s > source root is source
  279. 60.48 s > Running phase: patchPhase
  280. 60.48 s > Executing configureCargoCommonVars
  281. 60.48 s > copying cargo artifacts from /nix/store/fgh2l3z56pmcypaz8sm5lgiicyijyiz4-gammaloop-crate-test-binaries-three-dimensional-reps-50150770f831b638-inputs/target to target
  282. 60.48 s > will deep copy artifacts (instead of symlinking) as requested
  283. 60.48 s > Running phase: updateAutotoolsGnuConfigScriptsPhase
  284. 60.48 s > Running phase: configurePhase
  285. 60.48 s > will append /build/source/.cargo-home/config.toml with contents of /nix/store/1sigmg52bb61pfngmk9k8wq5fz9r7bf1-vendor-cargo-deps/config.toml
  286. 60.48 s > default configurePhase, nothing to do
  287. 60.48 s > Running phase: buildPhase
  288. 60.48 s > +++ command cargo --version
  289. 60.48 s > cargo 1.97.0 (c980f4866 2026-06-30)
  290. 60.48 s > +++ command cargo test --profile ci-optim --no-run --offline -p three-dimensional-reps --features three-dimensional-reps/serde
  291. 60.48 s > Compiling three-dimensional-reps v0.1.0 (/build/source/crates/three-dimensional-reps)
  292. 60.48 s > error[E0433]: cannot find `eval` in `crate`
  293. 60.48 s > --> crates/three-dimensional-reps/src/generation.rs:7255:28
  294. 60.48 s > |
  295. 60.48 s > 7255 | let input = crate::eval::EvaluationInput {
  296. 60.48 s > | ^^^^ could not find `eval` in the crate root
  297. 60.48 s > |
  298. 60.48 s > note: found an item that was configured out
  299. 60.48 s > --> crates/three-dimensional-reps/src/lib.rs:7:9
  300. 60.48 s > |
  301. 60.48 s > 6 | #[cfg(feature = "eval")]
  302. 60.48 s > | ---------------- the item is gated behind the `eval` feature
  303. 60.48 s > 7 | pub mod eval;
  304. 60.48 s > | ^^^^
  305. 60.48 s >
  306. 60.48 s > error[E0433]: cannot find `eval` in `crate`
  307. 60.48 s > --> crates/three-dimensional-reps/src/generation.rs:7262:30
  308. 60.48 s > |
  309. 60.48 s > 7262 | let contact = crate::eval::evaluate_expression(
  310. 60.48 s > | ^^^^ could not find `eval` in the crate root
  311. 60.48 s > |
  312. 60.48 s > note: found an item that was configured out
  313. 60.48 s > --> crates/three-dimensional-reps/src/lib.rs:7:9
  314. 60.48 s > |
  315. 60.48 s > 6 | #[cfg(feature = "eval")]
  316. 60.48 s > | ---------------- the item is gated behind the `eval` feature
  317. 60.48 s > 7 | pub mod eval;
  318. 60.48 s > | ^^^^
  319. 60.48 s >
  320. 60.48 s > error[E0433]: cannot find `eval` in `crate`
  321. 60.48 s > --> crates/three-dimensional-reps/src/generation.rs:7270:32
  322. 60.48 s > |
  323. 60.48 s > 7270 | let remainder = crate::eval::evaluate_expression(
  324. 60.48 s > | ^^^^ could not find `eval` in the crate root
  325. 60.48 s > |
  326. 60.48 s > note: found an item that was configured out
  327. 60.48 s > --> crates/three-dimensional-reps/src/lib.rs:7:9
  328. 60.48 s > |
  329. 60.48 s > 6 | #[cfg(feature = "eval")]
  330. 60.48 s > | ---------------- the item is gated behind the `eval` feature
  331. 60.48 s > 7 | pub mod eval;
  332. 60.48 s > | ^^^^
  333. 60.48 s >
  334. 60.48 s > error[E0433]: cannot find `eval` in `crate`
  335. 60.48 s > --> crates/three-dimensional-reps/src/generation.rs:7278:28
  336. 60.48 s > |
  337. 60.48 s > 7278 | let total = crate::eval::evaluate_expression(&powered, &expression, numerator, &input)
  338. 60.48 s > | ^^^^ could not find `eval` in the crate root
  339. 60.48 s > |
  340. 60.48 s > note: found an item that was configured out
  341. 60.48 s > --> crates/three-dimensional-reps/src/lib.rs:7:9
  342. 60.48 s > |
  343. 60.48 s > 6 | #[cfg(feature = "eval")]
  344. 60.48 s > | ---------------- the item is gated behind the `eval` feature
  345. 60.48 s > 7 | pub mod eval;
  346. 60.48 s > | ^^^^
  347. 60.48 s >
  348. 60.48 s > For more information about this error, try `rustc --explain E0433`.
  349. 60.48 s > error: could not compile `three-dimensional-reps` (lib test) due to 4 previous errors
  350. 60.48 s For full logs, run:
  351. 60.48 s nix log /nix/store/a7vgascj2khj5w2bmd7mjjn1614pfyfz-gammaloop-crate-test-binaries-three-dimensional-reps-50150770f831b638-deps-0.1.0.drv
  352. 60.48 s error: Cannot build '/nix/store/v9nw2a9ks6ddvij598f8kv32hv90fs6b-gammaloop-nextest-binaries-core-three-dimensional-reps-0.1.0.drv'.
  353. 60.48 s Reason: 1 dependency failed.
  354. 60.48 s Output paths:
  355. 60.48 s /nix/store/76li3770yybifc9q5g9dinyscnnz557r-gammaloop-nextest-binaries-core-three-dimensional-reps-0.1.0
  356. 60.48 s error: Build failed due to failed dependency
  357. 60.48 s error: Cannot build '/nix/store/4cb29gl4l8ra2lg6apawq67j93nkjir8-gammaloop-nextest-binaries-core.drv'.
  358. 60.48 s Reason: 1 dependency failed.
  359. 60.48 s Output paths:
  360. 60.48 s /nix/store/66lyvifccrkps63sir1v1wskzk61q7xz-gammaloop-nextest-binaries-core
  361. 60.76 s Downloaded cached gammaloop-crate-test-dependencies-91f21e5f130440bb-deps (29.6 MiB) in 1.2s
  362. 66.89 s Downloaded cached gammaloop-crate-test-binaries-gammaloop-tracing-filter-31e37aec92971227-inputs (1.6 GiB) in 10.1s
  363. 66.90 s Build failed due to failed dependency
  364. 66.94 s Build failed.