test packages.x86_64-linux.nix-ci-check-gammaloop-nextest-core

Reproduce this run
Retry Run
  1. 38.01 s gammaloop-nextest-core> at <unknown source file>:<unknown line>
  2. 38.01 s gammaloop-nextest-core> 5: std[bcb96dfbba0ab899]::sys::backtrace::__rust_end_short_backtrace::<std[bcb96dfbba0ab899]::panicking::panic_handler::{closure#0}, !><unknown>
  3. 38.01 s gammaloop-nextest-core> at <unknown source file>:<unknown line>
  4. 38.01 s gammaloop-nextest-core> 6: __rustc[6c289b9f9c454d21]::rust_begin_unwind<unknown>
  5. 38.01 s gammaloop-nextest-core> at <unknown source file>:<unknown line>
  6. 38.01 s gammaloop-nextest-core> 7: core[940e698046960fd5]::panicking::panic_fmt<unknown>
  7. 38.01 s gammaloop-nextest-core> at <unknown source file>:<unknown line>
  8. 38.01 s gammaloop-nextest-core> 8: core[940e698046960fd5]::result::unwrap_failed<unknown>
  9. 38.01 s gammaloop-nextest-core> at <unknown source file>:<unknown line>
  10. 38.01 s gammaloop-nextest-core> 9: test_renormalization[879b57236d814a44]::finite_part_ghost_2loop<unknown>
  11. 38.01 s gammaloop-nextest-core> at <unknown source file>:<unknown line>
  12. 38.01 s gammaloop-nextest-core> 10: <test_renormalization[879b57236d814a44]::finite_part_ghost_2loop::{closure#0} as core[940e698046960fd5]::ops::function::FnOnce<()>>::call_once<unknown>
  13. 38.01 s gammaloop-nextest-core> at <unknown source file>:<unknown line>
  14. 38.01 s gammaloop-nextest-core> 11: test[75d6903177b1d7e9]::__rust_begin_short_backtrace::<core[940e698046960fd5]::result::Result<(), alloc[2ea6bcb46fca0c42]::string::String>, fn() -> core[940e698046960fd5]::result::Result<(), alloc[2ea6bcb46fca0c42]::string::String>><unknown>
  15. 38.01 s gammaloop-nextest-core> at <unknown source file>:<unknown line>
  16. 38.01 s gammaloop-nextest-core> 12: test[75d6903177b1d7e9]::run_test::{closure#0}<unknown>
  17. 38.01 s gammaloop-nextest-core> at <unknown source file>:<unknown line>
  18. 38.01 s gammaloop-nextest-core> 13: std[bcb96dfbba0ab899]::sys::backtrace::__rust_begin_short_backtrace::<test[75d6903177b1d7e9]::run_test::{closure#1}, ()><unknown>
  19. 38.01 s gammaloop-nextest-core> at <unknown source file>:<unknown line>
  20. 38.01 s gammaloop-nextest-core> 14: <std[bcb96dfbba0ab899]::thread::lifecycle::spawn_unchecked<test[75d6903177b1d7e9]::run_test::{closure#1}, ()>::{closure#1} as core[940e698046960fd5]::ops::function::FnOnce<()>>::call_once::{shim:vtable#0}<unknown>
  21. 38.01 s gammaloop-nextest-core> at <unknown source file>:<unknown line>
  22. 38.01 s gammaloop-nextest-core> 15: <std[bcb96dfbba0ab899]::sys::thread::unix::Thread>::new::thread_start<unknown>
  23. 38.01 s gammaloop-nextest-core> at <unknown source file>:<unknown line>
  24. 38.01 s gammaloop-nextest-core> 16: start_thread<unknown>
  25. 38.01 s gammaloop-nextest-core> at <unknown source file>:<unknown line>
  26. 38.01 s gammaloop-nextest-core> 17: __clone3<unknown>
  27. 38.01 s gammaloop-nextest-core> at <unknown source file>:<unknown line>
  28. 38.01 s gammaloop-nextest-core>
  29. 38.01 s gammaloop-nextest-core> Run with COLORBT_SHOW_HIDDEN=1 environment variable to disable frame filtering.
  30. 38.01 s gammaloop-nextest-core> Run with RUST_BACKTRACE=full to include source snippets.
  31. 38.01 s gammaloop-nextest-core> =========================================
  32. 38.01 s gammaloop-nextest-core> Extracting 1 binary and 1 linked path to /build/nextest-archive-Rx8B7s
  33. 38.07 s gammaloop-nextest-core> Extracted 7 files to /build/nextest-archive-Rx8B7s in 0.06s
  34. 38.08 s gammaloop-nextest-core> ------------
  35. 38.08 s gammaloop-nextest-core> Nextest run ID 56180749-d1c0-44f3-8b29-e75332440f15 with nextest profile: ci_gammaloop
  36. 38.08 s gammaloop-nextest-core> Starting 56 tests across 1 binary
  37. 38.09 s gammaloop-nextest-core> FAIL [ 0.006s] (17/56) three-dimensional-reps generation::cff_tests::causal_repeated_generation_handles_energy_dependent_bubble_source
  38. 38.09 s gammaloop-nextest-core> stdout ---
  39. 38.09 s gammaloop-nextest-core>
  40. 38.09 s gammaloop-nextest-core> running 1 test
  41. 38.09 s gammaloop-nextest-core> test generation::cff_tests::causal_repeated_generation_handles_energy_dependent_bubble_source ... FAILED
  42. 38.09 s gammaloop-nextest-core>
  43. 38.09 s gammaloop-nextest-core> failures:
  44. 38.09 s gammaloop-nextest-core>
  45. 38.09 s gammaloop-nextest-core> failures:
  46. 38.09 s gammaloop-nextest-core> generation::cff_tests::causal_repeated_generation_handles_energy_dependent_bubble_source
  47. 38.09 s gammaloop-nextest-core>
  48. 38.09 s gammaloop-nextest-core> test result: FAILED. 0 passed; 1 failed; 0 ignored; 0 measured; 55 filtered out; finished in 0.00s
  49. 38.09 s gammaloop-nextest-core>
  50. 38.09 s gammaloop-nextest-core> stderr ---
  51. 38.09 s gammaloop-nextest-core>
  52. 38.09 s gammaloop-nextest-core> thread 'generation::cff_tests::causal_repeated_generation_handles_energy_dependent_bubble_source' (3278) panicked at crates/three-dimensional-reps/src/generation.rs:5979:9:
  53. 38.09 s gammaloop-nextest-core> assertion `left == right` failed
  54. 38.09 s gammaloop-nextest-core> left: GlobalSourceProduct
  55. 38.09 s gammaloop-nextest-core> right: VariantLocal
  56. 38.09 s gammaloop-nextest-core> stack backtrace:
  57. 38.09 s gammaloop-nextest-core> 0: __rustc::rust_begin_unwind
  58. 38.09 s gammaloop-nextest-core> 1: core::panicking::panic_fmt
  59. 38.09 s gammaloop-nextest-core> 2: core::panicking::assert_failed_inner
  60. 38.09 s gammaloop-nextest-core> 3: core::panicking::assert_failed::<three_dimensional_reps::generation::CffEnergyFactorOwnership, three_dimensional_reps::generation::CffEnergyFactorOwnership>
  61. 38.09 s gammaloop-nextest-core> 4: three_dimensional_reps::generation::cff_tests::causal_repeated_generation_handles_energy_dependent_bubble_source
  62. 38.09 s gammaloop-nextest-core> 5: <three_dimensional_reps::generation::cff_tests::causal_repeated_generation_handles_energy_dependent_bubble_source::{closure#0} as core::ops::function::FnOnce<()>>::call_once
  63. 38.09 s gammaloop-nextest-core> note: Some details are omitted, run with `RUST_BACKTRACE=full` for a verbose backtrace.
  64. 38.09 s gammaloop-nextest-core>
  65. 38.11 s gammaloop-nextest-core> FAIL [ 0.011s] (30/56) three-dimensional-reps generation::cff_tests::disconnected_mixed_energy_factor_ownership_keeps_both_component_factors
  66. 38.11 s gammaloop-nextest-core> stdout ---
  67. 38.11 s gammaloop-nextest-core>
  68. 38.11 s gammaloop-nextest-core> running 1 test
  69. 38.11 s gammaloop-nextest-core> test generation::cff_tests::disconnected_mixed_energy_factor_ownership_keeps_both_component_factors ... FAILED
  70. 38.11 s gammaloop-nextest-core>
  71. 38.11 s gammaloop-nextest-core> failures:
  72. 38.11 s gammaloop-nextest-core>
  73. 38.11 s gammaloop-nextest-core> failures:
  74. 38.11 s gammaloop-nextest-core> generation::cff_tests::disconnected_mixed_energy_factor_ownership_keeps_both_component_factors
  75. 38.11 s gammaloop-nextest-core>
  76. 38.11 s gammaloop-nextest-core> test result: FAILED. 0 passed; 1 failed; 0 ignored; 0 measured; 55 filtered out; finished in 0.01s
  77. 38.11 s gammaloop-nextest-core>
  78. 38.11 s gammaloop-nextest-core> stderr ---
  79. 38.11 s gammaloop-nextest-core>
  80. 38.11 s gammaloop-nextest-core> thread 'generation::cff_tests::disconnected_mixed_energy_factor_ownership_keeps_both_component_factors' (3315) panicked at crates/three-dimensional-reps/src/generation.rs:5795:9:
  81. 38.11 s gammaloop-nextest-core> assertion `left == right` failed
  82. 38.11 s gammaloop-nextest-core> left: [GlobalSourceProduct, GlobalSourceProduct]
  83. 38.11 s gammaloop-nextest-core> right: [VariantLocal, GlobalSourceProduct]
  84. 38.11 s gammaloop-nextest-core> stack backtrace:
  85. 38.11 s gammaloop-nextest-core> 0: __rustc::rust_begin_unwind
  86. 38.11 s gammaloop-nextest-core> 1: core::panicking::panic_fmt
  87. 38.11 s gammaloop-nextest-core> 2: core::panicking::assert_failed_inner
  88. 38.11 s gammaloop-nextest-core> 3: core::panicking::assert_failed::<alloc::vec::Vec<three_dimensional_reps::generation::CffEnergyFactorOwnership>, alloc::vec::Vec<three_dimensional_reps::generation::CffEnergyFactorOwnership>>
  89. 38.11 s gammaloop-nextest-core> 4: three_dimensional_reps::generation::cff_tests::disconnected_mixed_energy_factor_ownership_keeps_both_component_factors
  90. 38.11 s gammaloop-nextest-core> 5: <three_dimensional_reps::generation::cff_tests::disconnected_mixed_energy_factor_ownership_keeps_both_component_factors::{closure#0} as core::ops::function::FnOnce<()>>::call_once
  91. 38.11 s gammaloop-nextest-core> note: Some details are omitted, run with `RUST_BACKTRACE=full` for a verbose backtrace.
  92. 38.11 s gammaloop-nextest-core>
  93. 38.14 s gammaloop-nextest-core> FAIL [ 0.058s] (48/56) three-dimensional-reps generation::cff_tests::cff_generation_builds_multiloop_repeated_high_power_known_factor_completion
  94. 38.14 s gammaloop-nextest-core> stdout ---
  95. 38.14 s gammaloop-nextest-core>
  96. 38.14 s gammaloop-nextest-core> running 1 test
  97. 38.14 s gammaloop-nextest-core> test generation::cff_tests::cff_generation_builds_multiloop_repeated_high_power_known_factor_completion ... FAILED
  98. 38.14 s gammaloop-nextest-core>
  99. 38.14 s gammaloop-nextest-core> failures:
  100. 38.14 s gammaloop-nextest-core>
  101. 38.14 s gammaloop-nextest-core> failures:
  102. 38.14 s gammaloop-nextest-core> generation::cff_tests::cff_generation_builds_multiloop_repeated_high_power_known_factor_completion
  103. 38.14 s gammaloop-nextest-core>
  104. 38.14 s gammaloop-nextest-core> test result: FAILED. 0 passed; 1 failed; 0 ignored; 0 measured; 55 filtered out; finished in 0.05s
  105. 38.14 s gammaloop-nextest-core>
  106. 38.14 s gammaloop-nextest-core> stderr ---
  107. 38.14 s gammaloop-nextest-core>
  108. 38.14 s gammaloop-nextest-core> thread 'generation::cff_tests::cff_generation_builds_multiloop_repeated_high_power_known_factor_completion' (3280) panicked at crates/three-dimensional-reps/src/generation.rs:6038:9:
  109. 38.14 s gammaloop-nextest-core> assertion failed: variants.iter().any(|variant|
  110. 38.14 s gammaloop-nextest-core> {
  111. 38.14 s gammaloop-nextest-core> variant.origin.as_deref().is_some_and(|origin|
  112. 38.14 s gammaloop-nextest-core> {
  113. 38.14 s gammaloop-nextest-core> origin.starts_with("bounded_degree_quadratic_recursive_remainder")
  114. 38.14 s gammaloop-nextest-core> })
  115. 38.14 s gammaloop-nextest-core> })
  116. 38.14 s gammaloop-nextest-core> stack backtrace:
  117. 38.14 s gammaloop-nextest-core> 0: __rustc::rust_begin_unwind
  118. 38.14 s gammaloop-nextest-core> 1: core::panicking::panic_fmt
  119. 38.14 s gammaloop-nextest-core> 2: core::panicking::panic
  120. 38.14 s gammaloop-nextest-core> 3: three_dimensional_reps::generation::cff_tests::cff_generation_builds_multiloop_repeated_high_power_known_factor_completion
  121. 38.14 s gammaloop-nextest-core> 4: <three_dimensional_reps::generation::cff_tests::cff_generation_builds_multiloop_repeated_high_power_known_factor_completion::{closure#0} as core::ops::function::FnOnce<()>>::call_once
  122. 38.14 s gammaloop-nextest-core> note: Some details are omitted, run with `RUST_BACKTRACE=full` for a verbose backtrace.
  123. 38.14 s gammaloop-nextest-core>
  124. 38.19 s gammaloop-nextest-core> FAIL [ 0.099s] (52/56) three-dimensional-reps generation::cff_tests::cff_generation_builds_one_loop_high_power_with_repeated_spectators
  125. 38.19 s gammaloop-nextest-core> stdout ---
  126. 38.19 s gammaloop-nextest-core>
  127. 38.19 s gammaloop-nextest-core> running 1 test
  128. 38.19 s gammaloop-nextest-core> test generation::cff_tests::cff_generation_builds_one_loop_high_power_with_repeated_spectators ... FAILED
  129. 38.19 s gammaloop-nextest-core>
  130. 38.19 s gammaloop-nextest-core> failures:
  131. 38.19 s gammaloop-nextest-core>
  132. 38.19 s gammaloop-nextest-core> failures:
  133. 38.19 s gammaloop-nextest-core> generation::cff_tests::cff_generation_builds_one_loop_high_power_with_repeated_spectators
  134. 38.19 s gammaloop-nextest-core>
  135. 38.19 s gammaloop-nextest-core> test result: FAILED. 0 passed; 1 failed; 0 ignored; 0 measured; 55 filtered out; finished in 0.09s
  136. 38.19 s gammaloop-nextest-core>
  137. 38.19 s gammaloop-nextest-core> stderr ---
  138. 38.19 s gammaloop-nextest-core>
  139. 38.19 s gammaloop-nextest-core> thread 'generation::cff_tests::cff_generation_builds_one_loop_high_power_with_repeated_spectators' (3279) panicked at crates/three-dimensional-reps/src/generation.rs:6494:9:
  140. 38.19 s gammaloop-nextest-core> assertion failed: variants.iter().any(|variant|
  141. 38.19 s gammaloop-nextest-core> {
  142. 38.19 s gammaloop-nextest-core> variant.origin.as_deref().is_some_and(|origin|
  143. 38.19 s gammaloop-nextest-core> {
  144. 38.19 s gammaloop-nextest-core> origin.starts_with("bounded_degree_quadratic_recursive_remainder")
  145. 38.19 s gammaloop-nextest-core> })
  146. 38.19 s gammaloop-nextest-core> })
  147. 38.19 s gammaloop-nextest-core> stack backtrace:
  148. 38.19 s gammaloop-nextest-core> 0: __rustc::rust_begin_unwind
  149. 38.19 s gammaloop-nextest-core> 1: core::panicking::panic_fmt
  150. 38.19 s gammaloop-nextest-core> 2: core::panicking::panic
  151. 38.19 s gammaloop-nextest-core> 3: three_dimensional_reps::generation::cff_tests::cff_generation_builds_one_loop_high_power_with_repeated_spectators
  152. 38.19 s gammaloop-nextest-core> 4: <three_dimensional_reps::generation::cff_tests::cff_generation_builds_one_loop_high_power_with_repeated_spectators::{closure#0} as core::ops::function::FnOnce<()>>::call_once
  153. 38.19 s gammaloop-nextest-core> note: Some details are omitted, run with `RUST_BACKTRACE=full` for a verbose backtrace.
  154. 38.19 s gammaloop-nextest-core>
  155. 38.52 s gammaloop-nextest-core> ------------
  156. 38.52 s gammaloop-nextest-core> Summary [ 0.436s] 56 tests run: 52 passed, 4 failed, 0 skipped
  157. 38.52 s gammaloop-nextest-core> FAIL [ 0.006s] (17/56) three-dimensional-reps generation::cff_tests::causal_repeated_generation_handles_energy_dependent_bubble_source
  158. 38.52 s gammaloop-nextest-core> stdout ---
  159. 38.52 s gammaloop-nextest-core>
  160. 38.52 s gammaloop-nextest-core> running 1 test
  161. 38.52 s gammaloop-nextest-core> test generation::cff_tests::causal_repeated_generation_handles_energy_dependent_bubble_source ... FAILED
  162. 38.52 s gammaloop-nextest-core>
  163. 38.52 s gammaloop-nextest-core> failures:
  164. 38.52 s gammaloop-nextest-core>
  165. 38.52 s gammaloop-nextest-core> failures:
  166. 38.52 s gammaloop-nextest-core> generation::cff_tests::causal_repeated_generation_handles_energy_dependent_bubble_source
  167. 38.52 s gammaloop-nextest-core>
  168. 38.52 s gammaloop-nextest-core> test result: FAILED. 0 passed; 1 failed; 0 ignored; 0 measured; 55 filtered out; finished in 0.00s
  169. 38.52 s gammaloop-nextest-core>
  170. 38.52 s gammaloop-nextest-core> stderr ---
  171. 38.52 s gammaloop-nextest-core>
  172. 38.52 s gammaloop-nextest-core> thread 'generation::cff_tests::causal_repeated_generation_handles_energy_dependent_bubble_source' (3278) panicked at crates/three-dimensional-reps/src/generation.rs:5979:9:
  173. 38.52 s gammaloop-nextest-core> assertion `left == right` failed
  174. 38.52 s gammaloop-nextest-core> left: GlobalSourceProduct
  175. 38.52 s gammaloop-nextest-core> right: VariantLocal
  176. 38.52 s gammaloop-nextest-core> stack backtrace:
  177. 38.52 s gammaloop-nextest-core> 0: __rustc::rust_begin_unwind
  178. 38.52 s gammaloop-nextest-core> 1: core::panicking::panic_fmt
  179. 38.52 s gammaloop-nextest-core> 2: core::panicking::assert_failed_inner
  180. 38.52 s gammaloop-nextest-core> 3: core::panicking::assert_failed::<three_dimensional_reps::generation::CffEnergyFactorOwnership, three_dimensional_reps::generation::CffEnergyFactorOwnership>
  181. 38.52 s gammaloop-nextest-core> 4: three_dimensional_reps::generation::cff_tests::causal_repeated_generation_handles_energy_dependent_bubble_source
  182. 38.52 s gammaloop-nextest-core> 5: <three_dimensional_reps::generation::cff_tests::causal_repeated_generation_handles_energy_dependent_bubble_source::{closure#0} as core::ops::function::FnOnce<()>>::call_once
  183. 38.52 s gammaloop-nextest-core> note: Some details are omitted, run with `RUST_BACKTRACE=full` for a verbose backtrace.
  184. 38.52 s gammaloop-nextest-core>
  185. 38.52 s gammaloop-nextest-core> FAIL [ 0.011s] (30/56) three-dimensional-reps generation::cff_tests::disconnected_mixed_energy_factor_ownership_keeps_both_component_factors
  186. 38.52 s gammaloop-nextest-core> stdout ---
  187. 38.52 s gammaloop-nextest-core>
  188. 38.52 s gammaloop-nextest-core> running 1 test
  189. 38.52 s gammaloop-nextest-core> test generation::cff_tests::disconnected_mixed_energy_factor_ownership_keeps_both_component_factors ... FAILED
  190. 38.52 s gammaloop-nextest-core>
  191. 38.52 s gammaloop-nextest-core> failures:
  192. 38.52 s gammaloop-nextest-core>
  193. 38.52 s gammaloop-nextest-core> failures:
  194. 38.52 s gammaloop-nextest-core> generation::cff_tests::disconnected_mixed_energy_factor_ownership_keeps_both_component_factors
  195. 38.52 s gammaloop-nextest-core>
  196. 38.52 s gammaloop-nextest-core> test result: FAILED. 0 passed; 1 failed; 0 ignored; 0 measured; 55 filtered out; finished in 0.01s
  197. 38.52 s gammaloop-nextest-core>
  198. 38.52 s gammaloop-nextest-core> stderr ---
  199. 38.52 s gammaloop-nextest-core>
  200. 38.52 s gammaloop-nextest-core> thread 'generation::cff_tests::disconnected_mixed_energy_factor_ownership_keeps_both_component_factors' (3315) panicked at crates/three-dimensional-reps/src/generation.rs:5795:9:
  201. 38.52 s gammaloop-nextest-core> assertion `left == right` failed
  202. 38.52 s gammaloop-nextest-core> left: [GlobalSourceProduct, GlobalSourceProduct]
  203. 38.52 s gammaloop-nextest-core> right: [VariantLocal, GlobalSourceProduct]
  204. 38.52 s gammaloop-nextest-core> stack backtrace:
  205. 38.52 s gammaloop-nextest-core> 0: __rustc::rust_begin_unwind
  206. 38.52 s gammaloop-nextest-core> 1: core::panicking::panic_fmt
  207. 38.52 s gammaloop-nextest-core> 2: core::panicking::assert_failed_inner
  208. 38.52 s gammaloop-nextest-core> 3: core::panicking::assert_failed::<alloc::vec::Vec<three_dimensional_reps::generation::CffEnergyFactorOwnership>, alloc::vec::Vec<three_dimensional_reps::generation::CffEnergyFactorOwnership>>
  209. 38.52 s gammaloop-nextest-core> 4: three_dimensional_reps::generation::cff_tests::disconnected_mixed_energy_factor_ownership_keeps_both_component_factors
  210. 38.52 s gammaloop-nextest-core> 5: <three_dimensional_reps::generation::cff_tests::disconnected_mixed_energy_factor_ownership_keeps_both_component_factors::{closure#0} as core::ops::function::FnOnce<()>>::call_once
  211. 38.52 s gammaloop-nextest-core> note: Some details are omitted, run with `RUST_BACKTRACE=full` for a verbose backtrace.
  212. 38.52 s gammaloop-nextest-core>
  213. 38.52 s gammaloop-nextest-core> FAIL [ 0.058s] (48/56) three-dimensional-reps generation::cff_tests::cff_generation_builds_multiloop_repeated_high_power_known_factor_completion
  214. 38.52 s gammaloop-nextest-core> stdout ---
  215. 38.52 s gammaloop-nextest-core>
  216. 38.52 s gammaloop-nextest-core> running 1 test
  217. 38.52 s gammaloop-nextest-core> test generation::cff_tests::cff_generation_builds_multiloop_repeated_high_power_known_factor_completion ... FAILED
  218. 38.52 s gammaloop-nextest-core>
  219. 38.52 s gammaloop-nextest-core> failures:
  220. 38.52 s gammaloop-nextest-core>
  221. 38.52 s gammaloop-nextest-core> failures:
  222. 38.52 s gammaloop-nextest-core> generation::cff_tests::cff_generation_builds_multiloop_repeated_high_power_known_factor_completion
  223. 38.52 s gammaloop-nextest-core>
  224. 38.52 s gammaloop-nextest-core> test result: FAILED. 0 passed; 1 failed; 0 ignored; 0 measured; 55 filtered out; finished in 0.05s
  225. 38.52 s gammaloop-nextest-core>
  226. 38.52 s gammaloop-nextest-core> stderr ---
  227. 38.52 s gammaloop-nextest-core>
  228. 38.52 s gammaloop-nextest-core> thread 'generation::cff_tests::cff_generation_builds_multiloop_repeated_high_power_known_factor_completion' (3280) panicked at crates/three-dimensional-reps/src/generation.rs:6038:9:
  229. 38.52 s gammaloop-nextest-core> assertion failed: variants.iter().any(|variant|
  230. 38.52 s gammaloop-nextest-core> {
  231. 38.52 s gammaloop-nextest-core> variant.origin.as_deref().is_some_and(|origin|
  232. 38.52 s gammaloop-nextest-core> {
  233. 38.52 s gammaloop-nextest-core> origin.starts_with("bounded_degree_quadratic_recursive_remainder")
  234. 38.52 s gammaloop-nextest-core> })
  235. 38.52 s gammaloop-nextest-core> })
  236. 38.52 s gammaloop-nextest-core> stack backtrace:
  237. 38.52 s gammaloop-nextest-core> 0: __rustc::rust_begin_unwind
  238. 38.52 s gammaloop-nextest-core> 1: core::panicking::panic_fmt
  239. 38.52 s gammaloop-nextest-core> 2: core::panicking::panic
  240. 38.52 s gammaloop-nextest-core> 3: three_dimensional_reps::generation::cff_tests::cff_generation_builds_multiloop_repeated_high_power_known_factor_completion
  241. 38.52 s gammaloop-nextest-core> 4: <three_dimensional_reps::generation::cff_tests::cff_generation_builds_multiloop_repeated_high_power_known_factor_completion::{closure#0} as core::ops::function::FnOnce<()>>::call_once
  242. 38.52 s gammaloop-nextest-core> note: Some details are omitted, run with `RUST_BACKTRACE=full` for a verbose backtrace.
  243. 38.52 s gammaloop-nextest-core>
  244. 38.52 s gammaloop-nextest-core> FAIL [ 0.099s] (52/56) three-dimensional-reps generation::cff_tests::cff_generation_builds_one_loop_high_power_with_repeated_spectators
  245. 38.52 s gammaloop-nextest-core> stdout ---
  246. 38.52 s gammaloop-nextest-core>
  247. 38.52 s gammaloop-nextest-core> running 1 test
  248. 38.52 s gammaloop-nextest-core> test generation::cff_tests::cff_generation_builds_one_loop_high_power_with_repeated_spectators ... FAILED
  249. 38.52 s gammaloop-nextest-core>
  250. 38.52 s gammaloop-nextest-core> failures:
  251. 38.52 s gammaloop-nextest-core>
  252. 38.52 s gammaloop-nextest-core> failures:
  253. 38.52 s gammaloop-nextest-core> generation::cff_tests::cff_generation_builds_one_loop_high_power_with_repeated_spectators
  254. 38.52 s gammaloop-nextest-core>
  255. 38.52 s gammaloop-nextest-core> test result: FAILED. 0 passed; 1 failed; 0 ignored; 0 measured; 55 filtered out; finished in 0.09s
  256. 38.52 s gammaloop-nextest-core>
  257. 38.52 s gammaloop-nextest-core> stderr ---
  258. 38.52 s gammaloop-nextest-core>
  259. 38.52 s gammaloop-nextest-core> thread 'generation::cff_tests::cff_generation_builds_one_loop_high_power_with_repeated_spectators' (3279) panicked at crates/three-dimensional-reps/src/generation.rs:6494:9:
  260. 38.52 s gammaloop-nextest-core> assertion failed: variants.iter().any(|variant|
  261. 38.52 s gammaloop-nextest-core> {
  262. 38.52 s gammaloop-nextest-core> variant.origin.as_deref().is_some_and(|origin|
  263. 38.52 s gammaloop-nextest-core> {
  264. 38.52 s gammaloop-nextest-core> origin.starts_with("bounded_degree_quadratic_recursive_remainder")
  265. 38.52 s gammaloop-nextest-core> })
  266. 38.52 s gammaloop-nextest-core> })
  267. 38.52 s gammaloop-nextest-core> stack backtrace:
  268. 38.52 s gammaloop-nextest-core> 0: __rustc::rust_begin_unwind
  269. 38.52 s gammaloop-nextest-core> 1: core::panicking::panic_fmt
  270. 38.52 s gammaloop-nextest-core> 2: core::panicking::panic
  271. 38.52 s gammaloop-nextest-core> 3: three_dimensional_reps::generation::cff_tests::cff_generation_builds_one_loop_high_power_with_repeated_spectators
  272. 38.52 s gammaloop-nextest-core> 4: <three_dimensional_reps::generation::cff_tests::cff_generation_builds_one_loop_high_power_with_repeated_spectators::{closure#0} as core::ops::function::FnOnce<()>>::call_once
  273. 38.52 s gammaloop-nextest-core> note: Some details are omitted, run with `RUST_BACKTRACE=full` for a verbose backtrace.
  274. 38.52 s gammaloop-nextest-core>
  275. 38.53 s gammaloop-nextest-core> error: test run failed
  276. 38.55 s gammaloop-nextest-core>
  277. 38.55 s gammaloop-nextest-core> ========== nextest test summary ==========
  278. 38.55 s gammaloop-nextest-core> report: target/nextest/ci_gammaloop/junit.xml
  279. 38.55 s gammaloop-nextest-core> tests: 56, failures: 4, errors: 0
  280. 38.55 s gammaloop-nextest-core>
  281. 38.55 s gammaloop-nextest-core> 1. three-dimensional-reps::generation::cff_tests::causal_repeated_generation_handles_energy_dependent_bubble_source
  282. 38.55 s gammaloop-nextest-core> failure: test failure with exit code 101
  283. 38.55 s gammaloop-nextest-core> thread 'generation::cff_tests::causal_repeated_generation_handles_energy_dependent_bubble_source' (3278) panicked at crates/three-dimensional-reps/src/generation.rs:5979:9:
  284. 38.55 s gammaloop-nextest-core> assertion `left == right` failed
  285. 38.55 s gammaloop-nextest-core> left: GlobalSourceProduct
  286. 38.55 s gammaloop-nextest-core> right: VariantLocal
  287. 38.55 s gammaloop-nextest-core> stack backtrace:
  288. 38.55 s gammaloop-nextest-core> 0: __rustc::rust_begin_unwind
  289. 38.55 s gammaloop-nextest-core> 1: core::panicking::panic_fmt
  290. 38.55 s gammaloop-nextest-core> 2: core::panicking::assert_failed_inner
  291. 38.55 s gammaloop-nextest-core> 3: core::panicking::assert_failed::<three_dimensional_reps::generation::CffEnergyFactorOwnership, three_dimensional_reps::generation::CffEnergyFactorOwnership>
  292. 38.55 s gammaloop-nextest-core> 4: three_dimensional_reps::generation::cff_tests::causal_repeated_generation_handles_energy_dependent_bubble_source
  293. 38.55 s gammaloop-nextest-core> 5: <three_dimensional_reps::generation::cff_tests::causal_repeated_generation_handles_energy_dependent_bubble_source::{closure#0} as core::ops::function::FnOnce<()>>::call_once
  294. 38.55 s gammaloop-nextest-core> note: Some details are omitted, run with `RUST_BACKTRACE=full` for a verbose backtrace.
  295. 38.55 s gammaloop-nextest-core> system-out
  296. 38.55 s gammaloop-nextest-core> running 1 test
  297. 38.55 s gammaloop-nextest-core> test generation::cff_tests::causal_repeated_generation_handles_energy_dependent_bubble_source ... FAILED
  298. 38.55 s gammaloop-nextest-core>
  299. 38.55 s gammaloop-nextest-core> failures:
  300. 38.55 s gammaloop-nextest-core>
  301. 38.55 s gammaloop-nextest-core> failures:
  302. 38.55 s gammaloop-nextest-core> generation::cff_tests::causal_repeated_generation_handles_energy_dependent_bubble_source
  303. 38.55 s gammaloop-nextest-core>
  304. 38.55 s gammaloop-nextest-core> test result: FAILED. 0 passed; 1 failed; 0 ignored; 0 measured; 55 filtered out; finished in 0.00s
  305. 38.55 s gammaloop-nextest-core> system-err
  306. 38.55 s gammaloop-nextest-core> thread 'generation::cff_tests::causal_repeated_generation_handles_energy_dependent_bubble_source' (3278) panicked at crates/three-dimensional-reps/src/generation.rs:5979:9:
  307. 38.55 s gammaloop-nextest-core> assertion `left == right` failed
  308. 38.55 s gammaloop-nextest-core> left: GlobalSourceProduct
  309. 38.55 s gammaloop-nextest-core> right: VariantLocal
  310. 38.55 s gammaloop-nextest-core> stack backtrace:
  311. 38.55 s gammaloop-nextest-core> 0: __rustc::rust_begin_unwind
  312. 38.55 s gammaloop-nextest-core> 1: core::panicking::panic_fmt
  313. 38.55 s gammaloop-nextest-core> 2: core::panicking::assert_failed_inner
  314. 38.55 s gammaloop-nextest-core> 3: core::panicking::assert_failed::<three_dimensional_reps::generation::CffEnergyFactorOwnership, three_dimensional_reps::generation::CffEnergyFactorOwnership>
  315. 38.55 s gammaloop-nextest-core> 4: three_dimensional_reps::generation::cff_tests::causal_repeated_generation_handles_energy_dependent_bubble_source
  316. 38.55 s gammaloop-nextest-core> 5: <three_dimensional_reps::generation::cff_tests::causal_repeated_generation_handles_energy_dependent_bubble_source::{closure#0} as core::ops::function::FnOnce<()>>::call_once
  317. 38.55 s gammaloop-nextest-core> note: Some details are omitted, run with `RUST_BACKTRACE=full` for a verbose backtrace.
  318. 38.55 s gammaloop-nextest-core>
  319. 38.55 s gammaloop-nextest-core> 2. three-dimensional-reps::generation::cff_tests::disconnected_mixed_energy_factor_ownership_keeps_both_component_factors
  320. 38.55 s gammaloop-nextest-core> failure: test failure with exit code 101
  321. 38.55 s gammaloop-nextest-core> thread 'generation::cff_tests::disconnected_mixed_energy_factor_ownership_keeps_both_component_factors' (3315) panicked at crates/three-dimensional-reps/src/generation.rs:5795:9:
  322. 38.55 s gammaloop-nextest-core> assertion `left == right` failed
  323. 38.55 s gammaloop-nextest-core> left: [GlobalSourceProduct, GlobalSourceProduct]
  324. 38.55 s gammaloop-nextest-core> right: [VariantLocal, GlobalSourceProduct]
  325. 38.55 s gammaloop-nextest-core> stack backtrace:
  326. 38.55 s gammaloop-nextest-core> 0: __rustc::rust_begin_unwind
  327. 38.55 s gammaloop-nextest-core> 1: core::panicking::panic_fmt
  328. 38.55 s gammaloop-nextest-core> 2: core::panicking::assert_failed_inner
  329. 38.55 s gammaloop-nextest-core> 3: core::panicking::assert_failed::<alloc::vec::Vec<three_dimensional_reps::generation::CffEnergyFactorOwnership>, alloc::vec::Vec<three_dimensional_reps::generation::CffEnergyFactorOwnership>>
  330. 38.55 s gammaloop-nextest-core> 4: three_dimensional_reps::generation::cff_tests::disconnected_mixed_energy_factor_ownership_keeps_both_component_factors
  331. 38.55 s gammaloop-nextest-core> 5: <three_dimensional_reps::generation::cff_tests::disconnected_mixed_energy_factor_ownership_keeps_both_component_factors::{closure#0} as core::ops::function::FnOnce<()>>::call_once
  332. 38.55 s gammaloop-nextest-core> note: Some details are omitted, run with `RUST_BACKTRACE=full` for a verbose backtrace.
  333. 38.55 s gammaloop-nextest-core> system-out
  334. 38.55 s gammaloop-nextest-core> running 1 test
  335. 38.55 s gammaloop-nextest-core> test generation::cff_tests::disconnected_mixed_energy_factor_ownership_keeps_both_component_factors ... FAILED
  336. 38.55 s gammaloop-nextest-core>
  337. 38.55 s gammaloop-nextest-core> failures:
  338. 38.55 s gammaloop-nextest-core>
  339. 38.55 s gammaloop-nextest-core> failures:
  340. 38.55 s gammaloop-nextest-core> generation::cff_tests::disconnected_mixed_energy_factor_ownership_keeps_both_component_factors
  341. 38.55 s gammaloop-nextest-core>
  342. 38.55 s gammaloop-nextest-core> test result: FAILED. 0 passed; 1 failed; 0 ignored; 0 measured; 55 filtered out; finished in 0.01s
  343. 38.55 s gammaloop-nextest-core> system-err
  344. 38.55 s gammaloop-nextest-core> thread 'generation::cff_tests::disconnected_mixed_energy_factor_ownership_keeps_both_component_factors' (3315) panicked at crates/three-dimensional-reps/src/generation.rs:5795:9:
  345. 38.55 s gammaloop-nextest-core> assertion `left == right` failed
  346. 38.55 s gammaloop-nextest-core> left: [GlobalSourceProduct, GlobalSourceProduct]
  347. 38.55 s gammaloop-nextest-core> right: [VariantLocal, GlobalSourceProduct]
  348. 38.55 s gammaloop-nextest-core> stack backtrace:
  349. 38.55 s gammaloop-nextest-core> 0: __rustc::rust_begin_unwind
  350. 38.55 s gammaloop-nextest-core> 1: core::panicking::panic_fmt
  351. 38.55 s gammaloop-nextest-core> 2: core::panicking::assert_failed_inner
  352. 38.55 s gammaloop-nextest-core> 3: core::panicking::assert_failed::<alloc::vec::Vec<three_dimensional_reps::generation::CffEnergyFactorOwnership>, alloc::vec::Vec<three_dimensional_reps::generation::CffEnergyFactorOwnership>>
  353. 38.55 s gammaloop-nextest-core> 4: three_dimensional_reps::generation::cff_tests::disconnected_mixed_energy_factor_ownership_keeps_both_component_factors
  354. 38.55 s gammaloop-nextest-core> 5: <three_dimensional_reps::generation::cff_tests::disconnected_mixed_energy_factor_ownership_keeps_both_component_factors::{closure#0} as core::ops::function::FnOnce<()>>::call_once
  355. 38.55 s gammaloop-nextest-core> note: Some details are omitted, run with `RUST_BACKTRACE=full` for a verbose backtrace.
  356. 38.55 s gammaloop-nextest-core>
  357. 38.55 s gammaloop-nextest-core> 3. three-dimensional-reps::generation::cff_tests::cff_generation_builds_multiloop_repeated_high_power_known_factor_completion
  358. 38.55 s gammaloop-nextest-core> failure: test failure with exit code 101
  359. 38.55 s gammaloop-nextest-core> thread 'generation::cff_tests::cff_generation_builds_multiloop_repeated_high_power_known_factor_completion' (3280) panicked at crates/three-dimensional-reps/src/generation.rs:6038:9:
  360. 38.55 s gammaloop-nextest-core> assertion failed: variants.iter().any(|variant|
  361. 38.55 s gammaloop-nextest-core> {
  362. 38.55 s gammaloop-nextest-core> variant.origin.as_deref().is_some_and(|origin|
  363. 38.55 s gammaloop-nextest-core> {
  364. 38.55 s gammaloop-nextest-core> origin.starts_with("bounded_degree_quadratic_recursive_remainder")
  365. 38.55 s gammaloop-nextest-core> })
  366. 38.55 s gammaloop-nextest-core> })
  367. 38.55 s gammaloop-nextest-core> stack backtrace:
  368. 38.55 s gammaloop-nextest-core> 0: __rustc::rust_begin_unwind
  369. 38.55 s gammaloop-nextest-core> 1: core::panicking::panic_fmt
  370. 38.55 s gammaloop-nextest-core> 2: core::panicking::panic
  371. 38.55 s gammaloop-nextest-core> 3: three_dimensional_reps::generation::cff_tests::cff_generation_builds_multiloop_repeated_high_power_known_factor_completion
  372. 38.55 s gammaloop-nextest-core> 4: <three_dimensional_reps::generation::cff_tests::cff_generation_builds_multiloop_repeated_high_power_known_factor_completion::{closure#0} as core::ops::function::FnOnce<()>>::call_once
  373. 38.55 s gammaloop-nextest-core> note: Some details are omitted, run with `RUST_BACKTRACE=full` for a verbose backtrace.
  374. 38.55 s gammaloop-nextest-core> system-out
  375. 38.55 s gammaloop-nextest-core> running 1 test
  376. 38.55 s gammaloop-nextest-core> test generation::cff_tests::cff_generation_builds_multiloop_repeated_high_power_known_factor_completion ... FAILED
  377. 38.55 s gammaloop-nextest-core>
  378. 38.55 s gammaloop-nextest-core> failures:
  379. 38.55 s gammaloop-nextest-core>
  380. 38.55 s gammaloop-nextest-core> failures:
  381. 38.55 s gammaloop-nextest-core> generation::cff_tests::cff_generation_builds_multiloop_repeated_high_power_known_factor_completion
  382. 38.55 s gammaloop-nextest-core>
  383. 38.55 s gammaloop-nextest-core> test result: FAILED. 0 passed; 1 failed; 0 ignored; 0 measured; 55 filtered out; finished in 0.05s
  384. 38.55 s gammaloop-nextest-core> system-err
  385. 38.55 s gammaloop-nextest-core> thread 'generation::cff_tests::cff_generation_builds_multiloop_repeated_high_power_known_factor_completion' (3280) panicked at crates/three-dimensional-reps/src/generation.rs:6038:9:
  386. 38.55 s gammaloop-nextest-core> assertion failed: variants.iter().any(|variant|
  387. 38.55 s gammaloop-nextest-core> {
  388. 38.55 s gammaloop-nextest-core> variant.origin.as_deref().is_some_and(|origin|
  389. 38.55 s gammaloop-nextest-core> {
  390. 38.55 s gammaloop-nextest-core> origin.starts_with("bounded_degree_quadratic_recursive_remainder")
  391. 38.55 s gammaloop-nextest-core> })
  392. 38.55 s gammaloop-nextest-core> })
  393. 38.55 s gammaloop-nextest-core> stack backtrace:
  394. 38.55 s gammaloop-nextest-core> 0: __rustc::rust_begin_unwind
  395. 38.55 s gammaloop-nextest-core> 1: core::panicking::panic_fmt
  396. 38.55 s gammaloop-nextest-core> 2: core::panicking::panic
  397. 38.55 s gammaloop-nextest-core> 3: three_dimensional_reps::generation::cff_tests::cff_generation_builds_multiloop_repeated_high_power_known_factor_completion
  398. 38.55 s gammaloop-nextest-core> 4: <three_dimensional_reps::generation::cff_tests::cff_generation_builds_multiloop_repeated_high_power_known_factor_completion::{closure#0} as core::ops::function::FnOnce<()>>::call_once
  399. 38.55 s gammaloop-nextest-core> note: Some details are omitted, run with `RUST_BACKTRACE=full` for a verbose backtrace.
  400. 38.55 s gammaloop-nextest-core>
  401. 38.55 s gammaloop-nextest-core> 4. three-dimensional-reps::generation::cff_tests::cff_generation_builds_one_loop_high_power_with_repeated_spectators
  402. 38.55 s gammaloop-nextest-core> failure: test failure with exit code 101
  403. 38.55 s gammaloop-nextest-core> thread 'generation::cff_tests::cff_generation_builds_one_loop_high_power_with_repeated_spectators' (3279) panicked at crates/three-dimensional-reps/src/generation.rs:6494:9:
  404. 38.55 s gammaloop-nextest-core> assertion failed: variants.iter().any(|variant|
  405. 38.55 s gammaloop-nextest-core> {
  406. 38.55 s gammaloop-nextest-core> variant.origin.as_deref().is_some_and(|origin|
  407. 38.55 s gammaloop-nextest-core> {
  408. 38.55 s gammaloop-nextest-core> origin.starts_with("bounded_degree_quadratic_recursive_remainder")
  409. 38.55 s gammaloop-nextest-core> })
  410. 38.55 s gammaloop-nextest-core> })
  411. 38.55 s gammaloop-nextest-core> stack backtrace:
  412. 38.55 s gammaloop-nextest-core> 0: __rustc::rust_begin_unwind
  413. 38.55 s gammaloop-nextest-core> 1: core::panicking::panic_fmt
  414. 38.55 s gammaloop-nextest-core> 2: core::panicking::panic
  415. 38.55 s gammaloop-nextest-core> 3: three_dimensional_reps::generation::cff_tests::cff_generation_builds_one_loop_high_power_with_repeated_spectators
  416. 38.55 s gammaloop-nextest-core> 4: <three_dimensional_reps::generation::cff_tests::cff_generation_builds_one_loop_high_power_with_repeated_spectators::{closure#0} as core::ops::function::FnOnce<()>>::call_once
  417. 38.55 s gammaloop-nextest-core> note: Some details are omitted, run with `RUST_BACKTRACE=full` for a verbose backtrace.
  418. 38.55 s gammaloop-nextest-core> system-out
  419. 38.55 s gammaloop-nextest-core> running 1 test
  420. 38.55 s gammaloop-nextest-core> test generation::cff_tests::cff_generation_builds_one_loop_high_power_with_repeated_spectators ... FAILED
  421. 38.55 s gammaloop-nextest-core>
  422. 38.55 s gammaloop-nextest-core> failures:
  423. 38.55 s gammaloop-nextest-core>
  424. 38.55 s gammaloop-nextest-core> failures:
  425. 38.55 s gammaloop-nextest-core> generation::cff_tests::cff_generation_builds_one_loop_high_power_with_repeated_spectators
  426. 38.55 s gammaloop-nextest-core>
  427. 38.55 s gammaloop-nextest-core> test result: FAILED. 0 passed; 1 failed; 0 ignored; 0 measured; 55 filtered out; finished in 0.09s
  428. 38.55 s gammaloop-nextest-core> system-err
  429. 38.55 s gammaloop-nextest-core> thread 'generation::cff_tests::cff_generation_builds_one_loop_high_power_with_repeated_spectators' (3279) panicked at crates/three-dimensional-reps/src/generation.rs:6494:9:
  430. 38.55 s gammaloop-nextest-core> assertion failed: variants.iter().any(|variant|
  431. 38.55 s gammaloop-nextest-core> {
  432. 38.55 s gammaloop-nextest-core> variant.origin.as_deref().is_some_and(|origin|
  433. 38.55 s gammaloop-nextest-core> {
  434. 38.55 s gammaloop-nextest-core> origin.starts_with("bounded_degree_quadratic_recursive_remainder")
  435. 38.55 s gammaloop-nextest-core> })
  436. 38.55 s gammaloop-nextest-core> })
  437. 38.55 s gammaloop-nextest-core> stack backtrace:
  438. 38.55 s gammaloop-nextest-core> 0: __rustc::rust_begin_unwind
  439. 38.55 s gammaloop-nextest-core> 1: core::panicking::panic_fmt
  440. 38.55 s gammaloop-nextest-core> 2: core::panicking::panic
  441. 38.55 s gammaloop-nextest-core> 3: three_dimensional_reps::generation::cff_tests::cff_generation_builds_one_loop_high_power_with_repeated_spectators
  442. 38.55 s gammaloop-nextest-core> 4: <three_dimensional_reps::generation::cff_tests::cff_generation_builds_one_loop_high_power_with_repeated_spectators::{closure#0} as core::ops::function::FnOnce<()>>::call_once
  443. 38.55 s gammaloop-nextest-core> note: Some details are omitted, run with `RUST_BACKTRACE=full` for a verbose backtrace.
  444. 38.55 s gammaloop-nextest-core> =========================================
  445. 38.60 s error: Cannot build '/nix/store/s66h2dc5d00kx7psx8nhg0r1sa3b96yv-gammaloop-nextest-core.drv'.
  446. 38.60 s Reason: builder failed with exit code 100.
  447. 38.60 s Output paths:
  448. 38.60 s /nix/store/iy9b27fs2bgsd87hpm7v9492d3j6f87z-gammaloop-nextest-core
  449. 38.60 s Last 2048 log lines:
  450. 38.60 s > 16: start_thread<unknown>
  451. 38.60 s > at <unknown source file>:<unknown line>
  452. 38.60 s > 17: __clone3<unknown>
  453. 38.60 s > at <unknown source file>:<unknown line>
  454. 38.60 s >
  455. 38.60 s > Run with COLORBT_SHOW_HIDDEN=1 environment variable to disable frame filtering.
  456. 38.60 s > Run with RUST_BACKTRACE=full to include source snippets.
  457. 38.60 s >
  458. 38.60 s > FAIL [ 3.816s] (535/539) gammalooprs::test_renormalization finite_part_ghost_2loop
  459. 38.60 s > stdout ---
  460. 38.60 s >
  461. 38.60 s > running 1 test
  462. 38.60 s > test finite_part_ghost_2loop ... FAILED
  463. 38.60 s >
  464. 38.60 s > failures:
  465. 38.60 s >
  466. 38.60 s > failures:
  467. 38.60 s > finite_part_ghost_2loop
  468. 38.60 s >
  469. 38.60 s > test result: FAILED. 0 passed; 1 failed; 0 ignored; 0 measured; 5 filtered out; finished in 3.80s
  470. 38.60 s >
  471. 38.60 s > stderr ---
  472. 38.60 s > [00:01:29.623] @gammalooprs::processes::amplitude ERROR :
  473. 38.60 s > field value
  474. 38.60 s > error generalized CFF expression generation failed for graph `d5` with source-edge numerator energy-degree bounds Some([(1, 1), (2, 1), (3, 1), (5, 2), (6, 2)]): energy-degree bounds do not certify vanishing residues at infinity under the conservative cap check: EnergyDivergenceReport { edge_degree_bounds: [1, 1, 1, 2, 2], loops: [EnergyDirectionReport { loop_id: Some(0), zero_edges: [], active_edges: [0, 1, 2, 4], nullity: None, numerator_degree_bound: 5, denominator_degree: 8, divergence_degree: -3, convergent: true }, EnergyDirectionReport { loop_id: Some(1), zero_edges: [], active_edges: [3, 4], nullity: None, numerator_degree_bound: 4, denominator_degree: 4, divergence_degree: 0, convergent: false }], directions: [EnergyDirectionReport { loop_id: None, zero_edges: [0, 1, 2], active_edges: [3, 4], nullity: Some(1), numerator_degree_bound: 4, denominator_degree: 4, divergence_degree: 0, convergent: false }, EnergyDirectionReport { loop_id: None, zero_edges: [], active_edges: [0, 1, 2, 3, 4], nullity: Some(2), numerator_degree_bound: 7, denominator_degree: 10, divergence_degree: -3, convergent: true }, EnergyDirectionReport { loop_id: None, zero_edges: [3], active_edges: [0, 1, 2, 4], nullity: Some(1), numerator_degree_bound: 5, denominator_degree: 8, divergence_degree: -3, convergent: true }, EnergyDirectionReport { loop_id: None, zero_edges: [4], active_edges: [0, 1, 2, 3], nullity: Some(1), numerator_degree_bound: 5, denominator_degree: 8, divergence_degree: -3, convergent: true }], coordinate_convergent: false, directional_convergent: false, convergent: false }
  475. 38.60 s > 3D source has 2 loop names ["e1", "e5"], 5 internal edges [edge 0: 0 -> 1, loops=[1, 0], externals=[0, 0]; edge 1: 0 -> 2, loops=[-1, 0], externals=[1, 0]; edge 2: 1 -> 3, loops=[1, 0], externals=[-1, 0]; edge 3: 2 -> 3, loops=[0, 1], externals=[0, 0]; edge 4: 2 -> 3, loops=[-1, -1], externals=[1, 0]]
  476. 38.60 s > at crates/gammalooprs/src/processes/amplitude.rs:826
  477. 38.60 s > The application panicked (crashed).
  478. 38.60 s > Message: called `Result::unwrap()` on an `Err` value:
  479. 38.60 s > 0: generalized CFF expression generation failed for graph `d5` with source-edge numerator energy-degree bounds Some([(1, 1), (2, 1), (3, 1), (5, 2), (6, 2)]): energy-degree bounds do not certify vanishing residues at infinity under the conservative cap check: EnergyDivergenceReport { edge_degree_bounds: [1, 1, 1, 2, 2], loops: [EnergyDirectionReport { loop_id: Some(0), zero_edges: [], active_edges: [0, 1, 2, 4], nullity: None, numerator_degree_bound: 5, denominator_degree: 8, divergence_degree: -3, convergent: true }, EnergyDirectionReport { loop_id: Some(1), zero_edges: [], active_edges: [3, 4], nullity: None, numerator_degree_bound: 4, denominator_degree: 4, divergence_degree: 0, convergent: false }], directions: [EnergyDirectionReport { loop_id: None, zero_edges: [0, 1, 2], active_edges: [3, 4], nullity: Some(1), numerator_degree_bound: 4, denominator_degree: 4, divergence_degree: 0, convergent: false }, EnergyDirectionReport { loop_id: None, zero_edges: [], active_edges: [0, 1, 2, 3, 4], nullity: Some(2), numerator_degree_bound: 7, denominator_degree: 10, divergence_degree: -3, convergent: true }, EnergyDirectionReport { loop_id: None, zero_edges: [3], active_edges: [0, 1, 2, 4], nullity: Some(1), numerator_degree_bound: 5, denominator_degree: 8, divergence_degree: -3, convergent: true }, EnergyDirectionReport { loop_id: None, zero_edges: [4], active_edges: [0, 1, 2, 3], nullity: Some(1), numerator_degree_bound: 5, denominator_degree: 8, divergence_degree: -3, convergent: true }], coordinate_convergent: false, directional_convergent: false, convergent: false }
  480. 38.60 s > 3D source has 2 loop names ["e1", "e5"], 5 internal edges [edge 0: 0 -> 1, loops=[1, 0], externals=[0, 0]; edge 1: 0 -> 2, loops=[-1, 0], externals=[1, 0]; edge 2: 1 -> 3, loops=[1, 0], externals=[-1, 0]; edge 3: 2 -> 3, loops=[0, 1], externals=[0, 0]; edge 4: 2 -> 3, loops=[-1, -1], externals=[1, 0]]
  481. 38.60 s >
  482. 38.60 s > Location:
  483. 38.60 s > crates/gammalooprs/src/cff/generation.rs:227
  484. 38.60 s >
  485. 38.60 s > ━━━━━━━━━━━━━━━━━━━━━━━━━━━━━━━━━━ BACKTRACE ━━━━━━━━━━━━━━━━━━━━━━━━━━━━━━━━━━━
  486. 38.60 s > 1: <color_eyre[51793ea62743adbd]::config::EyreHook>::into_eyre_hook::{closure#0}<unknown>
  487. 38.60 s > at <unknown source file>:<unknown line>
  488. 38.60 s > 2: eyre[cb2fd339c0c40fca]::capture_handler<unknown>
  489. 38.60 s > at <unknown source file>:<unknown line>
  490. 38.60 s > 3: <eyre[cb2fd339c0c40fca]::Report>::from_adhoc::<alloc[2ea6bcb46fca0c42]::string::String><unknown>
  491. 38.60 s > at <unknown source file>:<unknown line>
  492. 38.60 s > 4: <gammalooprs[1d0b14476f7eb2f8]::graph::Graph>::generate_3d_expression_for_integrand<unknown>
  493. 38.60 s > at <unknown source file>:<unknown line>
  494. 38.60 s > 5: <gammalooprs[1d0b14476f7eb2f8]::processes::amplitude::AmplitudeGraph>::generate_cff<unknown>
  495. 38.60 s > at <unknown source file>:<unknown line>
  496. 38.60 s > 6: <gammalooprs[1d0b14476f7eb2f8]::processes::amplitude::AmplitudeGraph>::renormalization_part<unknown>
  497. 38.60 s > at <unknown source file>:<unknown line>
  498. 38.60 s > 7: test_renormalization[879b57236d814a44]::finite_part_ghost_2loop<unknown>
  499. 38.60 s > at <unknown source file>:<unknown line>
  500. 38.60 s > 8: <test_renormalization[879b57236d814a44]::finite_part_ghost_2loop::{closure#0} as core[940e698046960fd5]::ops::function::FnOnce<()>>::call_once<unknown>
  501. 38.60 s > at <unknown source file>:<unknown line>
  502. 38.60 s > 9: test[75d6903177b1d7e9]::__rust_begin_short_backtrace::<core[940e698046960fd5]::result::Result<(), alloc[2ea6bcb46fca0c42]::string::String>, fn() -> core[940e698046960fd5]::result::Result<(), alloc[2ea6bcb46fca0c42]::string::String>><unknown>
  503. 38.60 s > at <unknown source file>:<unknown line>
  504. 38.60 s > 10: test[75d6903177b1d7e9]::run_test::{closure#0}<unknown>
  505. 38.60 s > at <unknown source file>:<unknown line>
  506. 38.60 s > 11: std[bcb96dfbba0ab899]::sys::backtrace::__rust_begin_short_backtrace::<test[75d6903177b1d7e9]::run_test::{closure#1}, ()><unknown>
  507. 38.60 s > at <unknown source file>:<unknown line>
  508. 38.60 s > 12: <std[bcb96dfbba0ab899]::thread::lifecycle::spawn_unchecked<test[75d6903177b1d7e9]::run_test::{closure#1}, ()>::{closure#1} as core[940e698046960fd5]::ops::function::FnOnce<()>>::call_once::{shim:vtable#0}<unknown>
  509. 38.60 s > at <unknown source file>:<unknown line>
  510. 38.60 s > 13: <std[bcb96dfbba0ab899]::sys::thread::unix::Thread>::new::thread_start<unknown>
  511. 38.60 s > at <unknown source file>:<unknown line>
  512. 38.60 s > 14: start_thread<unknown>
  513. 38.60 s > at <unknown source file>:<unknown line>
  514. 38.60 s > 15: __clone3<unknown>
  515. 38.60 s > at <unknown source file>:<unknown line>
  516. 38.60 s >
  517. 38.60 s > Run with COLORBT_SHOW_HIDDEN=1 environment variable to disable frame filtering.
  518. 38.60 s > Run with RUST_BACKTRACE=full to include source snippets.
  519. 38.60 s > Warning: SpanTrace capture is Unsupported.
  520. 38.60 s > Ensure that you've setup a tracing-error ErrorLayer and the semver versions are compatible
  521. 38.60 s > Location: crates/gammalooprs/tests/test_renormalization.rs:534
  522. 38.60 s >
  523. 38.60 s > ━━━━━━━━━━━━━━━━━━━━━━━━━━━━━━━━━━ BACKTRACE ━━━━━━━━━━━━━━━━━━━━━━━━━━━━━━━━━━━
  524. 38.60 s > 1: <color_eyre[51793ea62743adbd]::config::PanicHook>::panic_report<unknown>
  525. 38.60 s > at <unknown source file>:<unknown line>
  526. 38.60 s > 2: <color_eyre[51793ea62743adbd]::config::PanicHook>::into_panic_hook::{closure#0}<unknown>
  527. 38.60 s > at <unknown source file>:<unknown line>
  528. 38.60 s > 3: std[bcb96dfbba0ab899]::panicking::panic_with_hook<unknown>
  529. 38.60 s > at <unknown source file>:<unknown line>
  530. 38.60 s > 4: std[bcb96dfbba0ab899]::panicking::panic_handler::{closure#0}<unknown>
  531. 38.60 s > at <unknown source file>:<unknown line>
  532. 38.60 s > 5: std[bcb96dfbba0ab899]::sys::backtrace::__rust_end_short_backtrace::<std[bcb96dfbba0ab899]::panicking::panic_handler::{closure#0}, !><unknown>
  533. 38.60 s > at <unknown source file>:<unknown line>
  534. 38.60 s > 6: __rustc[6c289b9f9c454d21]::rust_begin_unwind<unknown>
  535. 38.60 s > at <unknown source file>:<unknown line>
  536. 38.60 s > 7: core[940e698046960fd5]::panicking::panic_fmt<unknown>
  537. 38.60 s > at <unknown source file>:<unknown line>
  538. 38.60 s > 8: core[940e698046960fd5]::result::unwrap_failed<unknown>
  539. 38.60 s > at <unknown source file>:<unknown line>
  540. 38.60 s > 9: test_renormalization[879b57236d814a44]::finite_part_ghost_2loop<unknown>
  541. 38.60 s > at <unknown source file>:<unknown line>
  542. 38.60 s > 10: <test_renormalization[879b57236d814a44]::finite_part_ghost_2loop::{closure#0} as core[940e698046960fd5]::ops::function::FnOnce<()>>::call_once<unknown>
  543. 38.60 s > at <unknown source file>:<unknown line>
  544. 38.60 s > 11: test[75d6903177b1d7e9]::__rust_begin_short_backtrace::<core[940e698046960fd5]::result::Result<(), alloc[2ea6bcb46fca0c42]::string::String>, fn() -> core[940e698046960fd5]::result::Result<(), alloc[2ea6bcb46fca0c42]::string::String>><unknown>
  545. 38.60 s > at <unknown source file>:<unknown line>
  546. 38.60 s > 12: test[75d6903177b1d7e9]::run_test::{closure#0}<unknown>
  547. 38.60 s > at <unknown source file>:<unknown line>
  548. 38.60 s > 13: std[bcb96dfbba0ab899]::sys::backtrace::__rust_begin_short_backtrace::<test[75d6903177b1d7e9]::run_test::{closure#1}, ()><unknown>
  549. 38.60 s > at <unknown source file>:<unknown line>
  550. 38.60 s > 14: <std[bcb96dfbba0ab899]::thread::lifecycle::spawn_unchecked<test[75d6903177b1d7e9]::run_test::{closure#1}, ()>::{closure#1} as core[940e698046960fd5]::ops::function::FnOnce<()>>::call_once::{shim:vtable#0}<unknown>
  551. 38.60 s > at <unknown source file>:<unknown line>
  552. 38.60 s > 15: <std[bcb96dfbba0ab899]::sys::thread::unix::Thread>::new::thread_start<unknown>
  553. 38.60 s > at <unknown source file>:<unknown line>
  554. 38.60 s > 16: start_thread<unknown>
  555. 38.60 s > at <unknown source file>:<unknown line>
  556. 38.60 s > 17: __clone3<unknown>
  557. 38.60 s > at <unknown source file>:<unknown line>
  558. 38.60 s >
  559. 38.60 s > Run with COLORBT_SHOW_HIDDEN=1 environment variable to disable frame filtering.
  560. 38.60 s > Run with RUST_BACKTRACE=full to include source snippets.
  561. 38.60 s >
  562. 38.60 s > FAIL [ 5.826s] (537/539) gammalooprs uv::tests::scalars_profile
  563. 38.60 s > stdout ---
  564. 38.60 s >
  565. 38.60 s > running 1 test
  566. 38.60 s > test uv::tests::scalars_profile ... FAILED
  567. 38.60 s >
  568. 38.60 s > failures:
  569. 38.60 s >
  570. 38.60 s > failures:
  571. 38.60 s > uv::tests::scalars_profile
  572. 38.60 s >
  573. 38.60 s > test result: FAILED. 0 passed; 1 failed; 0 ignored; 0 measured; 589 filtered out; finished in 5.81s
  574. 38.60 s >
  575. 38.60 s > stderr ---
  576. 38.60 s > [00:01:31.088] @gammalooprs::settings::runtime WARNING : No external kinematics were provided; using default-generated external momenta and helicities.
  577. 38.60 s > field value
  578. 38.60 s > span build_integrand{amplitude.name=bub}
  579. 38.60 s > at crates/gammalooprs/src/settings/runtime.rs:131
  580. 38.60 s > [00:01:31.089] @gammalooprs::integrands::process::amplitude INFO : Input is below threshold: 0 existing threshold E-surfaces across 0/3 graph groups
  581. 38.60 s > field value
  582. 38.60 s > existing_esurfaces 0
  583. 38.60 s > group_count 3
  584. 38.60 s > groups_above_threshold 0
  585. 38.60 s > integrand bub
  586. 38.60 s > span warm_up{integrand.name=bub}
  587. 38.60 s > threshold_status below threshold
  588. 38.60 s > at crates/gammalooprs/src/integrands/process/amplitude/mod.rs:1666
  589. 38.60 s > [00:01:31.089] @gammalooprs::integrands::process::amplitude INFO : overlap structure of group 0: [0: []]
  590. 38.60 s > field value
  591. 38.60 s > span warm_up{integrand.name=bub}
  592. 38.60 s > at crates/gammalooprs/src/integrands/process/amplitude/mod.rs:2015
  593. 38.60 s > [00:01:31.089] @gammalooprs::integrands::process::amplitude INFO : overlap structure of group 1: [0: []]
  594. 38.60 s > field value
  595. 38.60 s > span warm_up{integrand.name=bub}
  596. 38.60 s > at crates/gammalooprs/src/integrands/process/amplitude/mod.rs:2015
  597. 38.60 s > [00:01:31.089] @gammalooprs::integrands::process::amplitude INFO : overlap structure of group 2: [0: []]
  598. 38.60 s > field value
  599. 38.60 s > span warm_up{integrand.name=bub}
  600. 38.60 s > at crates/gammalooprs/src/integrands/process/amplitude/mod.rs:2015
  601. 38.60 s > The application panicked (crashed).
  602. 38.60 s > Message: assertion `left == right` failed: subtracted scalar UV profile failed:
  603. 38.60 s > UVProfilePassFail {
  604. 38.60 s > max_dod: -0.9,
  605. 38.60 s > total: 16,
  606. 38.60 s > failed: 1,
  607. 38.60 s > failures: [
  608. 38.60 s > UVProfileFailure {
  609. 38.60 s > graph_index: 0,
  610. 38.60 s > graph_name: "banana",
  611. 38.60 s > cutkosky_cut: None,
  612. 38.60 s > lmb_index: 1,
  613. 38.60 s > fixed: [
  614. 38.60 s > EdgeIndex(
  615. 38.60 s > 2,
  616. 38.60 s > ),
  617. 38.60 s > EdgeIndex(
  618. 38.60 s > 0,
  619. 38.60 s > ),
  620. 38.60 s > ],
  621. 38.60 s > free: [
  622. 38.60 s > EdgeIndex(
  623. 38.60 s > 3,
  624. 38.60 s > ),
  625. 38.60 s > ],
  626. 38.60 s > orientation_label: None,
  627. 38.60 s > reason: "dod_exceeds_threshold",
  628. 38.60 s > },
  629. 38.60 s > ],
  630. 38.60 s > }
  631. 38.60 s >
  632. 38.60 s > ╭─────────┬────────────┬───────────┬───────┬─────┬──────────┬───────────╮
  633. 38.60 s > │ fixed │ → ∞ │ slope │ r2 │ DOD │ bare DOD │ inspect │
  634. 38.60 s > ├─────────┼────────────┼───────────┼───────┼─────┼──────────┼───────────┤
  635. 38.60 s > │ {e1,e2} │ {e3} │ -0.996752 │ 1.000 │ -1 │ 0 │ arb retry │
  636. 38.60 s > │ {e1,e3} │ {e2} │ -1.065665 │ 0.997 │ -1 │ 0 │ arb retry │
  637. 38.60 s > │ {e1} │ {e2,e3} │ -0.937151 │ 0.943 │ -1 │ 2 │ │
  638. 38.60 s > │ {e2,e3} │ {e1} │ -1.001075 │ 1.000 │ -1 │ 0 │ arb retry │
  639. 38.60 s > │ {e2} │ {e1,e3} │ -0.984146 │ 0.998 │ -1 │ 2 │ │
  640. 38.60 s > │ {e3} │ {e1,e2} │ -1.383911 │ 0.982 │ -1 │ 2 │ arb retry │
  641. 38.60 s > │ {} │ {e1,e2,e3} │ -1.094213 │ 0.258 │ -1 │ 4 │ │
  642. 38.60 s > │ {e2,e0} │ {e3} │ -0.803348 │ 0.861 │ -1 │ 0 │ arb retry │
  643. 38.60 s > │ {e3,e0} │ {e2} │ -0.999257 │ 1.000 │ -1 │ 0 │ │
  644. 38.60 s > │ {e0} │ {e2,e3} │ -1.000893 │ 1.000 │ -1 │ 2 │ │
  645. 38.60 s > │ {e1,e0} │ {e3} │ -0.997860 │ 1.000 │ -1 │ 0 │ │
  646. 38.60 s > ╰─────────┴────────────┴───────────┴───────┴─────┴──────────┴───────────╯
  647. 38.60 s >
  648. 38.60 s > ╭───────┬─────────┬───────────┬───────┬─────┬──────────┬───────────╮
  649. 38.60 s > │ fixed │ → ∞ │ slope │ r2 │ DOD │ bare DOD │ inspect │
  650. 38.60 s > ├───────┼─────────┼───────────┼───────┼─────┼──────────┼───────────┤
  651. 38.60 s > │ {e1} │ {e2} │ -1.005039 │ 1.000 │ -1 │ 0 │ arb retry │
  652. 38.60 s > │ {e2} │ {e1} │ -1.001098 │ 1.000 │ -1 │ 0 │ arb retry │
  653. 38.60 s > │ {} │ {e1,e2} │ -1.011289 │ 1.000 │ -1 │ 2 │ │
  654. 38.60 s > │ {e0} │ {e2} │ -0.998140 │ 1.000 │ -1 │ 0 │ │
  655. 38.60 s > ╰───────┴─────────┴───────────┴───────┴─────┴──────────┴───────────╯
  656. 38.60 s >
  657. 38.60 s > ╭───────┬──────┬───────────┬───────┬─────┬──────────┬─────────╮
  658. 38.60 s > │ fixed │ → ∞ │ slope │ r2 │ DOD │ bare DOD │ inspect │
  659. 38.60 s > ├───────┼──────┼───────────┼───────┼─────┼──────────┼─────────┤
  660. 38.60 s > │ {} │ {e1} │ -0.989949 │ 1.000 │ -1 │ 0 │ │
  661. 38.60 s > ╰───────┴──────┴───────────┴───────┴─────┴──────────┴─────────╯
  662. 38.60 s > left: 1
  663. 38.60 s > right: 0
  664. 38.60 s > Location: crates/gammalooprs/src/uv/tests.rs:259
  665. 38.60 s >
  666. 38.60 s > ━━━━━━━━━━━━━━━━━━━━━━━━━━━━━━━━━━ BACKTRACE ━━━━━━━━━━━━━━━━━━━━━━━━━━━━━━━━━━━
  667. 38.60 s > 1: <color_eyre[51793ea62743adbd]::config::PanicHook>::panic_report<unknown>
  668. 38.60 s > at <unknown source file>:<unknown line>
  669. 38.60 s > 2: <color_eyre[51793ea62743adbd]::config::PanicHook>::into_panic_hook::{closure#0}<unknown>
  670. 38.60 s > at <unknown source file>:<unknown line>
  671. 38.60 s > 3: std[bcb96dfbba0ab899]::panicking::panic_with_hook<unknown>
  672. 38.60 s > at <unknown source file>:<unknown line>
  673. 38.60 s > 4: std[bcb96dfbba0ab899]::panicking::panic_handler::{closure#0}<unknown>
  674. 38.60 s > at <unknown source file>:<unknown line>
  675. 38.60 s > 5: std[bcb96dfbba0ab899]::sys::backtrace::__rust_end_short_backtrace::<std[bcb96dfbba0ab899]::panicking::panic_handler::{closure#0}, !><unknown>
  676. 38.60 s > at <unknown source file>:<unknown line>
  677. 38.60 s > 6: __rustc[6c289b9f9c454d21]::rust_begin_unwind<unknown>
  678. 38.60 s > at <unknown source file>:<unknown line>
  679. 38.60 s > 7: core[940e698046960fd5]::panicking::panic_fmt<unknown>
  680. 38.60 s > at <unknown source file>:<unknown line>
  681. 38.60 s > 8: core[940e698046960fd5]::panicking::assert_failed_inner<unknown>
  682. 38.60 s > at <unknown source file>:<unknown line>
  683. 38.60 s > 9: core[940e698046960fd5]::panicking::assert_failed::<usize, usize><unknown>
  684. 38.60 s > at <unknown source file>:<unknown line>
  685. 38.60 s > 10: gammalooprs[6dc202c8af9e2ddf]::uv::tests::scalars_profile<unknown>
  686. 38.60 s > at <unknown source file>:<unknown line>
  687. 38.60 s > 11: <gammalooprs[6dc202c8af9e2ddf]::uv::tests::scalars_profile::{closure#0} as core[940e698046960fd5]::ops::function::FnOnce<()>>::call_once<unknown>
  688. 38.60 s > at <unknown source file>:<unknown line>
  689. 38.60 s > 12: test[75d6903177b1d7e9]::__rust_begin_short_backtrace::<core[940e698046960fd5]::result::Result<(), alloc[2ea6bcb46fca0c42]::string::String>, fn() -> core[940e698046960fd5]::result::Result<(), alloc[2ea6bcb46fca0c42]::string::String>><unknown>
  690. 38.60 s > at <unknown source file>:<unknown line>
  691. 38.60 s > 13: test[75d6903177b1d7e9]::run_test::{closure#0}<unknown>
  692. 38.60 s > at <unknown source file>:<unknown line>
  693. 38.60 s > 14: std[bcb96dfbba0ab899]::sys::backtrace::__rust_begin_short_backtrace::<test[75d6903177b1d7e9]::run_test::{closure#1}, ()><unknown>
  694. 38.60 s > at <unknown source file>:<unknown line>
  695. 38.60 s > 15: <std[bcb96dfbba0ab899]::thread::lifecycle::spawn_unchecked<test[75d6903177b1d7e9]::run_test::{closure#1}, ()>::{closure#1} as core[940e698046960fd5]::ops::function::FnOnce<()>>::call_once::{shim:vtable#0}<unknown>
  696. 38.60 s > at <unknown source file>:<unknown line>
  697. 38.60 s > 16: <std[bcb96dfbba0ab899]::sys::thread::unix::Thread>::new::thread_start<unknown>
  698. 38.60 s > at <unknown source file>:<unknown line>
  699. 38.60 s > 17: start_thread<unknown>
  700. 38.60 s > at <unknown source file>:<unknown line>
  701. 38.60 s > 18: __clone3<unknown>
  702. 38.60 s > at <unknown source file>:<unknown line>
  703. 38.60 s >
  704. 38.60 s > Run with COLORBT_SHOW_HIDDEN=1 environment variable to disable frame filtering.
  705. 38.60 s > Run with RUST_BACKTRACE=full to include source snippets.
  706. 38.60 s >
  707. 38.60 s > FAIL [ 5.925s] (538/539) gammalooprs uv::tests::scalars_profile_new
  708. 38.60 s > stdout ---
  709. 38.60 s >
  710. 38.60 s > running 1 test
  711. 38.60 s > test uv::tests::scalars_profile_new ... FAILED
  712. 38.60 s >
  713. 38.60 s > failures:
  714. 38.60 s >
  715. 38.60 s > failures:
  716. 38.60 s > uv::tests::scalars_profile_new
  717. 38.60 s >
  718. 38.60 s > test result: FAILED. 0 passed; 1 failed; 0 ignored; 0 measured; 589 filtered out; finished in 5.91s
  719. 38.60 s >
  720. 38.60 s > stderr ---
  721. 38.60 s > [00:01:31.195] @gammalooprs::settings::runtime WARNING : No external kinematics were provided; using default-generated external momenta and helicities.
  722. 38.60 s > field value
  723. 38.60 s > span build_integrand{amplitude.name=bub}
  724. 38.60 s > at crates/gammalooprs/src/settings/runtime.rs:131
  725. 38.60 s > [00:01:31.197] @gammalooprs::integrands::process::amplitude INFO : Input is below threshold: 0 existing threshold E-surfaces across 0/3 graph groups
  726. 38.60 s > field value
  727. 38.60 s > existing_esurfaces 0
  728. 38.60 s > group_count 3
  729. 38.60 s > groups_above_threshold 0
  730. 38.60 s > integrand bub
  731. 38.60 s > span warm_up{integrand.name=bub}
  732. 38.60 s > threshold_status below threshold
  733. 38.60 s > at crates/gammalooprs/src/integrands/process/amplitude/mod.rs:1666
  734. 38.60 s > [00:01:31.197] @gammalooprs::integrands::process::amplitude INFO : overlap structure of group 0: [0: []]
  735. 38.60 s > field value
  736. 38.60 s > span warm_up{integrand.name=bub}
  737. 38.60 s > at crates/gammalooprs/src/integrands/process/amplitude/mod.rs:2015
  738. 38.60 s > [00:01:31.197] @gammalooprs::integrands::process::amplitude INFO : overlap structure of group 1: [0: []]
  739. 38.60 s > field value
  740. 38.60 s > span warm_up{integrand.name=bub}
  741. 38.60 s > at crates/gammalooprs/src/integrands/process/amplitude/mod.rs:2015
  742. 38.60 s > [00:01:31.197] @gammalooprs::integrands::process::amplitude INFO : overlap structure of group 2: [0: []]
  743. 38.60 s > field value
  744. 38.60 s > span warm_up{integrand.name=bub}
  745. 38.60 s > at crates/gammalooprs/src/integrands/process/amplitude/mod.rs:2015
  746. 38.60 s > The application panicked (crashed).
  747. 38.60 s > Message: assertion `left == right` failed: subtracted scalar UV profile failed:
  748. 38.60 s > UVProfilePassFail {
  749. 38.60 s > max_dod: -0.9,
  750. 38.60 s > total: 16,
  751. 38.60 s > failed: 1,
  752. 38.60 s > failures: [
  753. 38.60 s > UVProfileFailure {
  754. 38.60 s > graph_index: 0,
  755. 38.60 s > graph_name: "banana",
  756. 38.60 s > cutkosky_cut: None,
  757. 38.60 s > lmb_index: 1,
  758. 38.60 s > fixed: [
  759. 38.60 s > EdgeIndex(
  760. 38.60 s > 2,
  761. 38.60 s > ),
  762. 38.60 s > EdgeIndex(
  763. 38.60 s > 0,
  764. 38.60 s > ),
  765. 38.60 s > ],
  766. 38.60 s > free: [
  767. 38.60 s > EdgeIndex(
  768. 38.60 s > 3,
  769. 38.60 s > ),
  770. 38.60 s > ],
  771. 38.60 s > orientation_label: None,
  772. 38.60 s > reason: "dod_exceeds_threshold",
  773. 38.60 s > },
  774. 38.60 s > ],
  775. 38.60 s > }
  776. 38.60 s >
  777. 38.60 s > ╭─────────┬────────────┬───────────┬───────┬─────┬──────────┬───────────╮
  778. 38.60 s > │ fixed │ → ∞ │ slope │ r2 │ DOD │ bare DOD │ inspect │
  779. 38.60 s > ├─────────┼────────────┼───────────┼───────┼─────┼──────────┼───────────┤
  780. 38.60 s > │ {e1,e2} │ {e3} │ -0.996752 │ 1.000 │ -1 │ 0 │ arb retry │
  781. 38.60 s > │ {e1,e3} │ {e2} │ -1.065665 │ 0.997 │ -1 │ 0 │ arb retry │
  782. 38.60 s > │ {e1} │ {e2,e3} │ -0.937151 │ 0.943 │ -1 │ 2 │ │
  783. 38.60 s > │ {e2,e3} │ {e1} │ -1.001075 │ 1.000 │ -1 │ 0 │ arb retry │
  784. 38.60 s > │ {e2} │ {e1,e3} │ -0.984146 │ 0.998 │ -1 │ 2 │ │
  785. 38.60 s > │ {e3} │ {e1,e2} │ -1.383911 │ 0.982 │ -1 │ 2 │ arb retry │
  786. 38.60 s > │ {} │ {e1,e2,e3} │ -1.094213 │ 0.258 │ -1 │ 4 │ │
  787. 38.60 s > │ {e2,e0} │ {e3} │ -0.803348 │ 0.861 │ -1 │ 0 │ arb retry │
  788. 38.60 s > │ {e3,e0} │ {e2} │ -0.999257 │ 1.000 │ -1 │ 0 │ │
  789. 38.60 s > │ {e0} │ {e2,e3} │ -1.000893 │ 1.000 │ -1 │ 2 │ │
  790. 38.60 s > │ {e1,e0} │ {e3} │ -0.997860 │ 1.000 │ -1 │ 0 │ │
  791. 38.60 s > ╰─────────┴────────────┴───────────┴───────┴─────┴──────────┴───────────╯
  792. 38.60 s >
  793. 38.60 s > ╭───────┬─────────┬───────────┬───────┬─────┬──────────┬───────────╮
  794. 38.60 s > │ fixed │ → ∞ │ slope │ r2 │ DOD │ bare DOD │ inspect │
  795. 38.60 s > ├───────┼─────────┼───────────┼───────┼─────┼──────────┼───────────┤
  796. 38.60 s > │ {e1} │ {e2} │ -1.005039 │ 1.000 │ -1 │ 0 │ arb retry │
  797. 38.60 s > │ {e2} │ {e1} │ -1.001098 │ 1.000 │ -1 │ 0 │ arb retry │
  798. 38.60 s > │ {} │ {e1,e2} │ -1.011289 │ 1.000 │ -1 │ 2 │ │
  799. 38.60 s > │ {e0} │ {e2} │ -0.998140 │ 1.000 │ -1 │ 0 │ │
  800. 38.60 s > ╰───────┴─────────┴───────────┴───────┴─────┴──────────┴───────────╯
  801. 38.60 s >
  802. 38.60 s > ╭───────┬──────┬───────────┬───────┬─────┬──────────┬─────────╮
  803. 38.60 s > │ fixed │ → ∞ │ slope │ r2 │ DOD │ bare DOD │ inspect │
  804. 38.60 s > ├───────┼──────┼───────────┼───────┼─────┼──────────┼─────────┤
  805. 38.60 s > │ {} │ {e1} │ -0.989949 │ 1.000 │ -1 │ 0 │ │
  806. 38.60 s > ╰───────┴──────┴───────────┴───────┴─────┴──────────┴─────────╯
  807. 38.60 s > left: 1
  808. 38.60 s > right: 0
  809. 38.60 s > Location: crates/gammalooprs/src/uv/tests.rs:325
  810. 38.60 s >
  811. 38.60 s > ━━━━━━━━━━━━━━━━━━━━━━━━━━━━━━━━━━ BACKTRACE ━━━━━━━━━━━━━━━━━━━━━━━━━━━━━━━━━━━
  812. 38.60 s > 1: <color_eyre[51793ea62743adbd]::config::PanicHook>::panic_report<unknown>
  813. 38.60 s > at <unknown source file>:<unknown line>
  814. 38.60 s > 2: <color_eyre[51793ea62743adbd]::config::PanicHook>::into_panic_hook::{closure#0}<unknown>
  815. 38.60 s > at <unknown source file>:<unknown line>
  816. 38.60 s > 3: std[bcb96dfbba0ab899]::panicking::panic_with_hook<unknown>
  817. 38.60 s > at <unknown source file>:<unknown line>
  818. 38.60 s > 4: std[bcb96dfbba0ab899]::panicking::panic_handler::{closure#0}<unknown>
  819. 38.60 s > at <unknown source file>:<unknown line>
  820. 38.60 s > 5: std[bcb96dfbba0ab899]::sys::backtrace::__rust_end_short_backtrace::<std[bcb96dfbba0ab899]::panicking::panic_handler::{closure#0}, !><unknown>
  821. 38.60 s > at <unknown source file>:<unknown line>
  822. 38.60 s > 6: __rustc[6c289b9f9c454d21]::rust_begin_unwind<unknown>
  823. 38.60 s > at <unknown source file>:<unknown line>
  824. 38.60 s > 7: core[940e698046960fd5]::panicking::panic_fmt<unknown>
  825. 38.60 s > at <unknown source file>:<unknown line>
  826. 38.60 s > 8: core[940e698046960fd5]::panicking::assert_failed_inner<unknown>
  827. 38.60 s > at <unknown source file>:<unknown line>
  828. 38.60 s > 9: core[940e698046960fd5]::panicking::assert_failed::<usize, usize><unknown>
  829. 38.60 s > at <unknown source file>:<unknown line>
  830. 38.60 s > 10: gammalooprs[6dc202c8af9e2ddf]::uv::tests::scalars_profile_new<unknown>
  831. 38.60 s > at <unknown source file>:<unknown line>
  832. 38.60 s > 11: <gammalooprs[6dc202c8af9e2ddf]::uv::tests::scalars_profile_new::{closure#0} as core[940e698046960fd5]::ops::function::FnOnce<()>>::call_once<unknown>
  833. 38.60 s > at <unknown source file>:<unknown line>
  834. 38.60 s > 12: test[75d6903177b1d7e9]::__rust_begin_short_backtrace::<core[940e698046960fd5]::result::Result<(), alloc[2ea6bcb46fca0c42]::string::String>, fn() -> core[940e698046960fd5]::result::Result<(), alloc[2ea6bcb46fca0c42]::string::String>><unknown>
  835. 38.60 s > at <unknown source file>:<unknown line>
  836. 38.60 s > 13: test[75d6903177b1d7e9]::run_test::{closure#0}<unknown>
  837. 38.60 s > at <unknown source file>:<unknown line>
  838. 38.60 s > 14: std[bcb96dfbba0ab899]::sys::backtrace::__rust_begin_short_backtrace::<test[75d6903177b1d7e9]::run_test::{closure#1}, ()><unknown>
  839. 38.60 s > at <unknown source file>:<unknown line>
  840. 38.60 s > 15: <std[bcb96dfbba0ab899]::thread::lifecycle::spawn_unchecked<test[75d6903177b1d7e9]::run_test::{closure#1}, ()>::{closure#1} as core[940e698046960fd5]::ops::function::FnOnce<()>>::call_once::{shim:vtable#0}<unknown>
  841. 38.60 s > at <unknown source file>:<unknown line>
  842. 38.60 s > 16: <std[bcb96dfbba0ab899]::sys::thread::unix::Thread>::new::thread_start<unknown>
  843. 38.60 s > at <unknown source file>:<unknown line>
  844. 38.60 s > 17: start_thread<unknown>
  845. 38.60 s > at <unknown source file>:<unknown line>
  846. 38.60 s > 18: __clone3<unknown>
  847. 38.60 s > at <unknown source file>:<unknown line>
  848. 38.60 s >
  849. 38.60 s > Run with COLORBT_SHOW_HIDDEN=1 environment variable to disable frame filtering.
  850. 38.60 s > Run with RUST_BACKTRACE=full to include source snippets.
  851. 38.60 s >
  852. 38.60 s > ------------
  853. 38.60 s > Summary [ 8.127s] 539 tests run: 532 passed, 7 failed, 59 skipped
  854. 38.60 s > FAIL [ 0.062s] ( 46/539) gammalooprs cff::tests::stored_production_cff_uses_typed_energy_factor_ownership
  855. 38.60 s > stdout ---
  856. 38.60 s >
  857. 38.60 s > running 1 test
  858. 38.60 s > test cff::tests::stored_production_cff_uses_typed_energy_factor_ownership ... FAILED
  859. 38.60 s >
  860. 38.60 s > failures:
  861. 38.60 s >
  862. 38.60 s > failures:
  863. 38.60 s > cff::tests::stored_production_cff_uses_typed_energy_factor_ownership
  864. 38.60 s >
  865. 38.60 s > test result: FAILED. 0 passed; 1 failed; 0 ignored; 0 measured; 589 filtered out; finished in 0.05s
  866. 38.60 s >
  867. 38.60 s > stderr ---
  868. 38.60 s > The application panicked (crashed).
  869. 38.60 s > Message: assertion `left == right` failed
  870. 38.60 s > left: 1
  871. 38.60 s > right: -1
  872. 38.60 s > Location: crates/gammalooprs/src/cff/mod.rs:1783
  873. 38.60 s >
  874. 38.60 s > ━━━━━━━━━━━━━━━━━━━━━━━━━━━━━━━━━━ BACKTRACE ━━━━━━━━━━━━━━━━━━━━━━━━━━━━━━━━━━━
  875. 38.60 s > 1: <color_eyre[51793ea62743adbd]::config::PanicHook>::panic_report<unknown>
  876. 38.60 s > at <unknown source file>:<unknown line>
  877. 38.60 s > 2: <color_eyre[51793ea62743adbd]::config::PanicHook>::into_panic_hook::{closure#0}<unknown>
  878. 38.60 s > at <unknown source file>:<unknown line>
  879. 38.60 s > 3: std[bcb96dfbba0ab899]::panicking::panic_with_hook<unknown>
  880. 38.60 s > at <unknown source file>:<unknown line>
  881. 38.60 s > 4: std[bcb96dfbba0ab899]::panicking::panic_handler::{closure#0}<unknown>
  882. 38.60 s > at <unknown source file>:<unknown line>
  883. 38.60 s > 5: std[bcb96dfbba0ab899]::sys::backtrace::__rust_end_short_backtrace::<std[bcb96dfbba0ab899]::panicking::panic_handler::{closure#0}, !><unknown>
  884. 38.60 s > at <unknown source file>:<unknown line>
  885. 38.60 s > 6: __rustc[6c289b9f9c454d21]::rust_begin_unwind<unknown>
  886. 38.60 s > at <unknown source file>:<unknown line>
  887. 38.60 s > 7: core[940e698046960fd5]::panicking::panic_fmt<unknown>
  888. 38.60 s > at <unknown source file>:<unknown line>
  889. 38.60 s > 8: core[940e698046960fd5]::panicking::assert_failed_inner<unknown>
  890. 38.60 s > at <unknown source file>:<unknown line>
  891. 38.60 s > 9: core[940e698046960fd5]::panicking::assert_failed::<i64, i64><unknown>
  892. 38.60 s > at <unknown source file>:<unknown line>
  893. 38.60 s > 10: gammalooprs[6dc202c8af9e2ddf]::cff::tests::stored_production_cff_uses_typed_energy_factor_ownership<unknown>
  894. 38.60 s > at <unknown source file>:<unknown line>
  895. 38.60 s > 11: <gammalooprs[6dc202c8af9e2ddf]::cff::tests::stored_production_cff_uses_typed_energy_factor_ownership::{closure#0} as core[940e698046960fd5]::ops::function::FnOnce<()>>::call_once<unknown>
  896. 38.60 s > at <unknown source file>:<unknown line>
  897. 38.60 s > 12: test[75d6903177b1d7e9]::__rust_begin_short_backtrace::<core[940e698046960fd5]::result::Result<(), alloc[2ea6bcb46fca0c42]::string::String>, fn() -> core[940e698046960fd5]::result::Result<(), alloc[2ea6bcb46fca0c42]::string::String>><unknown>
  898. 38.60 s > at <unknown source file>:<unknown line>
  899. 38.60 s > 13: test[75d6903177b1d7e9]::run_test::{closure#0}<unknown>
  900. 38.60 s > at <unknown source file>:<unknown line>
  901. 38.60 s > 14: std[bcb96dfbba0ab899]::sys::backtrace::__rust_begin_short_backtrace::<test[75d6903177b1d7e9]::run_test::{closure#1}, ()><unknown>
  902. 38.60 s > at <unknown source file>:<unknown line>
  903. 38.60 s > 15: <std[bcb96dfbba0ab899]::thread::lifecycle::spawn_unchecked<test[75d6903177b1d7e9]::run_test::{closure#1}, ()>::{closure#1} as core[940e698046960fd5]::ops::function::FnOnce<()>>::call_once::{shim:vtable#0}<unknown>
  904. 38.60 s > at <unknown source file>:<unknown line>
  905. 38.60 s > 16: <std[bcb96dfbba0ab899]::sys::thread::unix::Thread>::new::thread_start<unknown>
  906. 38.60 s > at <unknown source file>:<unknown line>
  907. 38.60 s > 17: start_thread<unknown>
  908. 38.60 s > at <unknown source file>:<unknown line>
  909. 38.60 s > 18: __clone3<unknown>
  910. 38.60 s > at <unknown source file>:<unknown line>
  911. 38.60 s >
  912. 38.60 s > Run with COLORBT_SHOW_HIDDEN=1 environment variable to disable frame filtering.
  913. 38.60 s > Run with RUST_BACKTRACE=full to include source snippets.
  914. 38.60 s >
  915. 38.60 s > FAIL [ 0.041s] ( 82/539) gammalooprs graph::three_d_source::tests::exact_energy_mapper_prefers_source_edge_maps
  916. 38.60 s > stdout ---
  917. 38.60 s >
  918. 38.60 s > running 1 test
  919. 38.60 s > test graph::three_d_source::tests::exact_energy_mapper_prefers_source_edge_maps ... FAILED
  920. 38.60 s >
  921. 38.60 s > failures:
  922. 38.60 s >
  923. 38.60 s > failures:
  924. 38.60 s > graph::three_d_source::tests::exact_energy_mapper_prefers_source_edge_maps
  925. 38.60 s >
  926. 38.60 s > test result: FAILED. 0 passed; 1 failed; 0 ignored; 0 measured; 589 filtered out; finished in 0.04s
  927. 38.60 s >
  928. 38.60 s > stderr ---
  929. 38.60 s > The application panicked (crashed).
  930. 38.60 s > Message: called `Result::unwrap_err()` on an `Ok` value: (2*three_d_source_test::carrier_energy+three_d_source_test::reconstructed_factor)*(2*three_d_source_test::carrier_energy+three_d_source_test::loop_factor)*(-1+4*gammalooprs::M+3*three_d_source_test::literal_energy+three_d_source_test::edge_factor-2*gammalooprs::Q(19,spenso::cind(0)))
  931. 38.60 s > Location: crates/gammalooprs/src/graph/three_d_source.rs:3083
  932. 38.60 s >
  933. 38.60 s > ━━━━━━━━━━━━━━━━━━━━━━━━━━━━━━━━━━ BACKTRACE ━━━━━━━━━━━━━━━━━━━━━━━━━━━━━━━━━━━
  934. 38.60 s > 1: <color_eyre[51793ea62743adbd]::config::PanicHook>::panic_report<unknown>
  935. 38.60 s > at <unknown source file>:<unknown line>
  936. 38.60 s > 2: <color_eyre[51793ea62743adbd]::config::PanicHook>::into_panic_hook::{closure#0}<unknown>
  937. 38.60 s > at <unknown source file>:<unknown line>
  938. 38.60 s > 3: std[bcb96dfbba0ab899]::panicking::panic_with_hook<unknown>
  939. 38.60 s > at <unknown source file>:<unknown line>
  940. 38.60 s > 4: std[bcb96dfbba0ab899]::panicking::panic_handler::{closure#0}<unknown>
  941. 38.60 s > at <unknown source file>:<unknown line>
  942. 38.60 s > 5: std[bcb96dfbba0ab899]::sys::backtrace::__rust_end_short_backtrace::<std[bcb96dfbba0ab899]::panicking::panic_handler::{closure#0}, !><unknown>
  943. 38.60 s > at <unknown source file>:<unknown line>
  944. 38.60 s > 6: __rustc[6c289b9f9c454d21]::rust_begin_unwind<unknown>
  945. 38.60 s > at <unknown source file>:<unknown line>
  946. 38.60 s > 7: core[940e698046960fd5]::panicking::panic_fmt<unknown>
  947. 38.60 s > at <unknown source file>:<unknown line>
  948. 38.60 s > 8: core[940e698046960fd5]::result::unwrap_failed<unknown>
  949. 38.60 s > at <unknown source file>:<unknown line>
  950. 38.60 s > 9: gammalooprs[6dc202c8af9e2ddf]::graph::three_d_source::tests::exact_energy_mapper_prefers_source_edge_maps<unknown>
  951. 38.60 s > at <unknown source file>:<unknown line>
  952. 38.60 s > 10: <gammalooprs[6dc202c8af9e2ddf]::graph::three_d_source::tests::exact_energy_mapper_prefers_source_edge_maps::{closure#0} as core[940e698046960fd5]::ops::function::FnOnce<()>>::call_once<unknown>
  953. 38.60 s > at <unknown source file>:<unknown line>
  954. 38.60 s > 11: test[75d6903177b1d7e9]::__rust_begin_short_backtrace::<core[940e698046960fd5]::result::Result<(), alloc[2ea6bcb46fca0c42]::string::String>, fn() -> core[940e698046960fd5]::result::Result<(), alloc[2ea6bcb46fca0c42]::string::String>><unknown>
  955. 38.60 s > at <unknown source file>:<unknown line>
  956. 38.60 s > 12: test[75d6903177b1d7e9]::run_test::{closure#0}<unknown>
  957. 38.60 s > at <unknown source file>:<unknown line>
  958. 38.60 s > 13: std[bcb96dfbba0ab899]::sys::backtrace::__rust_begin_short_backtrace::<test[75d6903177b1d7e9]::run_test::{closure#1}, ()><unknown>
  959. 38.60 s > at <unknown source file>:<unknown line>
  960. 38.60 s > 14: <std[bcb96dfbba0ab899]::thread::lifecycle::spawn_unchecked<test[75d6903177b1d7e9]::run_test::{closure#1}, ()>::{closure#1} as core[940e698046960fd5]::ops::function::FnOnce<()>>::call_once::{shim:vtable#0}<unknown>
  961. 38.60 s > at <unknown source file>:<unknown line>
  962. 38.60 s > 15: <std[bcb96dfbba0ab899]::sys::thread::unix::Thread>::new::thread_start<unknown>
  963. 38.60 s > at <unknown source file>:<unknown line>
  964. 38.60 s > 16: start_thread<unknown>
  965. 38.60 s > at <unknown source file>:<unknown line>
  966. 38.60 s > 17: __clone3<unknown>
  967. 38.60 s > at <unknown source file>:<unknown line>
  968. 38.60 s >
  969. 38.60 s > Run with COLORBT_SHOW_HIDDEN=1 environment variable to disable frame filtering.
  970. 38.60 s > Run with RUST_BACKTRACE=full to include source snippets.
  971. 38.60 s >
  972. 38.60 s > FAIL [ 0.057s] (465/539) gammalooprs uv::approx::local_3d::tests::production_emr_map_cancels_one_powered_denominator
  973. 38.60 s > stdout ---
  974. 38.60 s >
  975. 38.60 s > running 1 test
  976. 38.60 s > test uv::approx::local_3d::tests::production_emr_map_cancels_one_powered_denominator ... FAILED
  977. 38.60 s >
  978. 38.60 s > failures:
  979. 38.60 s >
  980. 38.60 s > failures:
  981. 38.60 s > uv::approx::local_3d::tests::production_emr_map_cancels_one_powered_denominator
  982. 38.60 s >
  983. 38.60 s > test result: FAILED. 0 passed; 1 failed; 0 ignored; 0 measured; 589 filtered out; finished in 0.05s
  984. 38.60 s >
  985. 38.60 s > stderr ---
  986. 38.60 s > The application panicked (crashed).
  987. 38.60 s > Message: assertion failed: source_map.is_none()
  988. 38.60 s > Location: crates/gammalooprs/src/uv/approx/local_3d.rs:1897
  989. 38.60 s >
  990. 38.60 s > ━━━━━━━━━━━━━━━━━━━━━━━━━━━━━━━━━━ BACKTRACE ━━━━━━━━━━━━━━━━━━━━━━━━━━━━━━━━━━━
  991. 38.60 s > 1: <color_eyre[51793ea62743adbd]::config::PanicHook>::panic_report<unknown>
  992. 38.60 s > at <unknown source file>:<unknown line>
  993. 38.60 s > 2: <color_eyre[51793ea62743adbd]::config::PanicHook>::into_panic_hook::{closure#0}<unknown>
  994. 38.60 s > at <unknown source file>:<unknown line>
  995. 38.60 s > 3: std[bcb96dfbba0ab899]::panicking::panic_with_hook<unknown>
  996. 38.60 s > at <unknown source file>:<unknown line>
  997. 38.60 s > 4: std[bcb96dfbba0ab899]::panicking::panic_handler::{closure#0}<unknown>
  998. 38.60 s > at <unknown source file>:<unknown line>
  999. 38.60 s > 5: std[bcb96dfbba0ab899]::sys::backtrace::__rust_end_short_backtrace::<std[bcb96dfbba0ab899]::panicking::panic_handler::{closure#0}, !><unknown>
  1000. 38.60 s > at <unknown source file>:<unknown line>
  1001. 38.60 s > 6: __rustc[6c289b9f9c454d21]::rust_begin_unwind<unknown>
  1002. 38.60 s > at <unknown source file>:<unknown line>
  1003. 38.60 s > 7: core[940e698046960fd5]::panicking::panic_fmt<unknown>
  1004. 38.60 s > at <unknown source file>:<unknown line>
  1005. 38.60 s > 8: core[940e698046960fd5]::panicking::panic<unknown>
  1006. 38.60 s > at <unknown source file>:<unknown line>
  1007. 38.60 s > 9: gammalooprs[6dc202c8af9e2ddf]::uv::approx::local_3d::tests::production_emr_map_cancels_one_powered_denominator<unknown>
  1008. 38.60 s > at <unknown source file>:<unknown line>
  1009. 38.60 s > 10: <gammalooprs[6dc202c8af9e2ddf]::uv::approx::local_3d::tests::production_emr_map_cancels_one_powered_denominator::{closure#0} as core[940e698046960fd5]::ops::function::FnOnce<()>>::call_once<unknown>
  1010. 38.60 s > at <unknown source file>:<unknown line>
  1011. 38.60 s > 11: test[75d6903177b1d7e9]::__rust_begin_short_backtrace::<core[940e698046960fd5]::result::Result<(), alloc[2ea6bcb46fca0c42]::string::String>, fn() -> core[940e698046960fd5]::result::Result<(), alloc[2ea6bcb46fca0c42]::string::String>><unknown>
  1012. 38.60 s > at <unknown source file>:<unknown line>
  1013. 38.60 s > 12: test[75d6903177b1d7e9]::run_test::{closure#0}<unknown>
  1014. 38.60 s > at <unknown source file>:<unknown line>
  1015. 38.60 s > 13: std[bcb96dfbba0ab899]::sys::backtrace::__rust_begin_short_backtrace::<test[75d6903177b1d7e9]::run_test::{closure#1}, ()><unknown>
  1016. 38.60 s > at <unknown source file>:<unknown line>
  1017. 38.60 s > 14: <std[bcb96dfbba0ab899]::thread::lifecycle::spawn_unchecked<test[75d6903177b1d7e9]::run_test::{closure#1}, ()>::{closure#1} as core[940e698046960fd5]::ops::function::FnOnce<()>>::call_once::{shim:vtable#0}<unknown>
  1018. 38.60 s > at <unknown source file>:<unknown line>
  1019. 38.60 s > 15: <std[bcb96dfbba0ab899]::sys::thread::unix::Thread>::new::thread_start<unknown>
  1020. 38.60 s > at <unknown source file>:<unknown line>
  1021. 38.60 s > 16: start_thread<unknown>
  1022. 38.60 s > at <unknown source file>:<unknown line>
  1023. 38.60 s > 17: __clone3<unknown>
  1024. 38.60 s > at <unknown source file>:<unknown line>
  1025. 38.60 s >
  1026. 38.60 s > Run with COLORBT_SHOW_HIDDEN=1 environment variable to disable frame filtering.
  1027. 38.60 s > Run with RUST_BACKTRACE=full to include source snippets.
  1028. 38.60 s >
  1029. 38.60 s > FAIL [ 0.050s] (466/539) gammalooprs uv::approx::local_3d::tests::typed_4d_projection_analyzes_each_term_owned_numerator
  1030. 38.60 s > stdout ---
  1031. 38.60 s >
  1032. 38.60 s > running 1 test
  1033. 38.60 s > test uv::approx::local_3d::tests::typed_4d_projection_analyzes_each_term_owned_numerator ... FAILED
  1034. 38.60 s >
  1035. 38.60 s > failures:
  1036. 38.60 s >
  1037. 38.60 s > failures:
  1038. 38.60 s > uv::approx::local_3d::tests::typed_4d_projection_analyzes_each_term_owned_numerator
  1039. 38.60 s >
  1040. 38.60 s > test result: FAILED. 0 passed; 1 failed; 0 ignored; 0 measured; 589 filtered out; finished in 0.04s
  1041. 38.60 s >
  1042. 38.60 s > stderr ---
  1043. 38.60 s > The application panicked (crashed).
  1044. 38.60 s > Message: assertion failed: error.to_string().contains("could not analyze numerator in the contracted-source loop basis")
  1045. 38.60 s > Location: crates/gammalooprs/src/uv/approx/local_3d.rs:2965
  1046. 38.60 s >
  1047. 38.60 s > ━━━━━━━━━━━━━━━━━━━━━━━━━━━━━━━━━━ BACKTRACE ━━━━━━━━━━━━━━━━━━━━━━━━━━━━━━━━━━━
  1048. 38.60 s > 1: <color_eyre[51793ea62743adbd]::config::PanicHook>::panic_report<unknown>
  1049. 38.60 s > at <unknown source file>:<unknown line>
  1050. 38.60 s > 2: <color_eyre[51793ea62743adbd]::config::PanicHook>::into_panic_hook::{closure#0}<unknown>
  1051. 38.60 s > at <unknown source file>:<unknown line>
  1052. 38.60 s > 3: std[bcb96dfbba0ab899]::panicking::panic_with_hook<unknown>
  1053. 38.60 s > at <unknown source file>:<unknown line>
  1054. 38.60 s > 4: std[bcb96dfbba0ab899]::panicking::panic_handler::{closure#0}<unknown>
  1055. 38.60 s > at <unknown source file>:<unknown line>
  1056. 38.60 s > 5: std[bcb96dfbba0ab899]::sys::backtrace::__rust_end_short_backtrace::<std[bcb96dfbba0ab899]::panicking::panic_handler::{closure#0}, !><unknown>
  1057. 38.60 s > at <unknown source file>:<unknown line>
  1058. 38.60 s > 6: __rustc[6c289b9f9c454d21]::rust_begin_unwind<unknown>
  1059. 38.60 s > at <unknown source file>:<unknown line>
  1060. 38.60 s > 7: core[940e698046960fd5]::panicking::panic_fmt<unknown>
  1061. 38.60 s > at <unknown source file>:<unknown line>
  1062. 38.60 s > 8: core[940e698046960fd5]::panicking::panic<unknown>
  1063. 38.60 s > at <unknown source file>:<unknown line>
  1064. 38.60 s > 9: gammalooprs[6dc202c8af9e2ddf]::uv::approx::local_3d::tests::typed_4d_projection_analyzes_each_term_owned_numerator<unknown>
  1065. 38.60 s > at <unknown source file>:<unknown line>
  1066. 38.60 s > 10: <gammalooprs[6dc202c8af9e2ddf]::uv::approx::local_3d::tests::typed_4d_projection_analyzes_each_term_owned_numerator::{closure#0} as core[940e698046960fd5]::ops::function::FnOnce<()>>::call_once<unknown>
  1067. 38.60 s > at <unknown source file>:<unknown line>
  1068. 38.60 s > 11: test[75d6903177b1d7e9]::__rust_begin_short_backtrace::<core[940e698046960fd5]::result::Result<(), alloc[2ea6bcb46fca0c42]::string::String>, fn() -> core[940e698046960fd5]::result::Result<(), alloc[2ea6bcb46fca0c42]::string::String>><unknown>
  1069. 38.60 s > at <unknown source file>:<unknown line>
  1070. 38.60 s > 12: test[75d6903177b1d7e9]::run_test::{closure#0}<unknown>
  1071. 38.60 s > at <unknown source file>:<unknown line>
  1072. 38.60 s > 13: std[bcb96dfbba0ab899]::sys::backtrace::__rust_begin_short_backtrace::<test[75d6903177b1d7e9]::run_test::{closure#1}, ()><unknown>
  1073. 38.60 s > at <unknown source file>:<unknown line>
  1074. 38.60 s > 14: <std[bcb96dfbba0ab899]::thread::lifecycle::spawn_unchecked<test[75d6903177b1d7e9]::run_test::{closure#1}, ()>::{closure#1} as core[940e698046960fd5]::ops::function::FnOnce<()>>::call_once::{shim:vtable#0}<unknown>
  1075. 38.60 s > at <unknown source file>:<unknown line>
  1076. 38.60 s > 15: <std[bcb96dfbba0ab899]::sys::thread::unix::Thread>::new::thread_start<unknown>
  1077. 38.60 s > at <unknown source file>:<unknown line>
  1078. 38.60 s > 16: start_thread<unknown>
  1079. 38.60 s > at <unknown source file>:<unknown line>
  1080. 38.60 s > 17: __clone3<unknown>
  1081. 38.60 s > at <unknown source file>:<unknown line>
  1082. 38.60 s >
  1083. 38.60 s > Run with COLORBT_SHOW_HIDDEN=1 environment variable to disable frame filtering.
  1084. 38.60 s > Run with RUST_BACKTRACE=full to include source snippets.
  1085. 38.60 s >
  1086. 38.60 s > FAIL [ 3.816s] (535/539) gammalooprs::test_renormalization finite_part_ghost_2loop
  1087. 38.60 s > stdout ---
  1088. 38.60 s >
  1089. 38.60 s > running 1 test
  1090. 38.60 s > test finite_part_ghost_2loop ... FAILED
  1091. 38.60 s >
  1092. 38.60 s > failures:
  1093. 38.60 s >
  1094. 38.60 s > failures:
  1095. 38.60 s > finite_part_ghost_2loop
  1096. 38.60 s >
  1097. 38.60 s > test result: FAILED. 0 passed; 1 failed; 0 ignored; 0 measured; 5 filtered out; finished in 3.80s
  1098. 38.60 s >
  1099. 38.60 s > stderr ---
  1100. 38.60 s > [00:01:29.623] @gammalooprs::processes::amplitude ERROR :
  1101. 38.60 s > field value
  1102. 38.60 s > error generalized CFF expression generation failed for graph `d5` with source-edge numerator energy-degree bounds Some([(1, 1), (2, 1), (3, 1), (5, 2), (6, 2)]): energy-degree bounds do not certify vanishing residues at infinity under the conservative cap check: EnergyDivergenceReport { edge_degree_bounds: [1, 1, 1, 2, 2], loops: [EnergyDirectionReport { loop_id: Some(0), zero_edges: [], active_edges: [0, 1, 2, 4], nullity: None, numerator_degree_bound: 5, denominator_degree: 8, divergence_degree: -3, convergent: true }, EnergyDirectionReport { loop_id: Some(1), zero_edges: [], active_edges: [3, 4], nullity: None, numerator_degree_bound: 4, denominator_degree: 4, divergence_degree: 0, convergent: false }], directions: [EnergyDirectionReport { loop_id: None, zero_edges: [0, 1, 2], active_edges: [3, 4], nullity: Some(1), numerator_degree_bound: 4, denominator_degree: 4, divergence_degree: 0, convergent: false }, EnergyDirectionReport { loop_id: None, zero_edges: [], active_edges: [0, 1, 2, 3, 4], nullity: Some(2), numerator_degree_bound: 7, denominator_degree: 10, divergence_degree: -3, convergent: true }, EnergyDirectionReport { loop_id: None, zero_edges: [3], active_edges: [0, 1, 2, 4], nullity: Some(1), numerator_degree_bound: 5, denominator_degree: 8, divergence_degree: -3, convergent: true }, EnergyDirectionReport { loop_id: None, zero_edges: [4], active_edges: [0, 1, 2, 3], nullity: Some(1), numerator_degree_bound: 5, denominator_degree: 8, divergence_degree: -3, convergent: true }], coordinate_convergent: false, directional_convergent: false, convergent: false }
  1103. 38.60 s > 3D source has 2 loop names ["e1", "e5"], 5 internal edges [edge 0: 0 -> 1, loops=[1, 0], externals=[0, 0]; edge 1: 0 -> 2, loops=[-1, 0], externals=[1, 0]; edge 2: 1 -> 3, loops=[1, 0], externals=[-1, 0]; edge 3: 2 -> 3, loops=[0, 1], externals=[0, 0]; edge 4: 2 -> 3, loops=[-1, -1], externals=[1, 0]]
  1104. 38.60 s > at crates/gammalooprs/src/processes/amplitude.rs:826
  1105. 38.60 s > The application panicked (crashed).
  1106. 38.60 s > Message: called `Result::unwrap()` on an `Err` value:
  1107. 38.60 s > 0: generalized CFF expression generation failed for graph `d5` with source-edge numerator energy-degree bounds Some([(1, 1), (2, 1), (3, 1), (5, 2), (6, 2)]): energy-degree bounds do not certify vanishing residues at infinity under the conservative cap check: EnergyDivergenceReport { edge_degree_bounds: [1, 1, 1, 2, 2], loops: [EnergyDirectionReport { loop_id: Some(0), zero_edges: [], active_edges: [0, 1, 2, 4], nullity: None, numerator_degree_bound: 5, denominator_degree: 8, divergence_degree: -3, convergent: true }, EnergyDirectionReport { loop_id: Some(1), zero_edges: [], active_edges: [3, 4], nullity: None, numerator_degree_bound: 4, denominator_degree: 4, divergence_degree: 0, convergent: false }], directions: [EnergyDirectionReport { loop_id: None, zero_edges: [0, 1, 2], active_edges: [3, 4], nullity: Some(1), numerator_degree_bound: 4, denominator_degree: 4, divergence_degree: 0, convergent: false }, EnergyDirectionReport { loop_id: None, zero_edges: [], active_edges: [0, 1, 2, 3, 4], nullity: Some(2), numerator_degree_bound: 7, denominator_degree: 10, divergence_degree: -3, convergent: true }, EnergyDirectionReport { loop_id: None, zero_edges: [3], active_edges: [0, 1, 2, 4], nullity: Some(1), numerator_degree_bound: 5, denominator_degree: 8, divergence_degree: -3, convergent: true }, EnergyDirectionReport { loop_id: None, zero_edges: [4], active_edges: [0, 1, 2, 3], nullity: Some(1), numerator_degree_bound: 5, denominator_degree: 8, divergence_degree: -3, convergent: true }], coordinate_convergent: false, directional_convergent: false, convergent: false }
  1108. 38.60 s > 3D source has 2 loop names ["e1", "e5"], 5 internal edges [edge 0: 0 -> 1, loops=[1, 0], externals=[0, 0]; edge 1: 0 -> 2, loops=[-1, 0], externals=[1, 0]; edge 2: 1 -> 3, loops=[1, 0], externals=[-1, 0]; edge 3: 2 -> 3, loops=[0, 1], externals=[0, 0]; edge 4: 2 -> 3, loops=[-1, -1], externals=[1, 0]]
  1109. 38.60 s >
  1110. 38.60 s > Location:
  1111. 38.60 s > crates/gammalooprs/src/cff/generation.rs:227
  1112. 38.60 s >
  1113. 38.60 s > ━━━━━━━━━━━━━━━━━━━━━━━━━━━━━━━━━━ BACKTRACE ━━━━━━━━━━━━━━━━━━━━━━━━━━━━━━━━━━━
  1114. 38.60 s > 1: <color_eyre[51793ea62743adbd]::config::EyreHook>::into_eyre_hook::{closure#0}<unknown>
  1115. 38.60 s > at <unknown source file>:<unknown line>
  1116. 38.60 s > 2: eyre[cb2fd339c0c40fca]::capture_handler<unknown>
  1117. 38.60 s > at <unknown source file>:<unknown line>
  1118. 38.60 s > 3: <eyre[cb2fd339c0c40fca]::Report>::from_adhoc::<alloc[2ea6bcb46fca0c42]::string::String><unknown>
  1119. 38.60 s > at <unknown source file>:<unknown line>
  1120. 38.60 s > 4: <gammalooprs[1d0b14476f7eb2f8]::graph::Graph>::generate_3d_expression_for_integrand<unknown>
  1121. 38.60 s > at <unknown source file>:<unknown line>
  1122. 38.60 s > 5: <gammalooprs[1d0b14476f7eb2f8]::processes::amplitude::AmplitudeGraph>::generate_cff<unknown>
  1123. 38.60 s > at <unknown source file>:<unknown line>
  1124. 38.60 s > 6: <gammalooprs[1d0b14476f7eb2f8]::processes::amplitude::AmplitudeGraph>::renormalization_part<unknown>
  1125. 38.60 s > at <unknown source file>:<unknown line>
  1126. 38.60 s > 7: test_renormalization[879b57236d814a44]::finite_part_ghost_2loop<unknown>
  1127. 38.60 s > at <unknown source file>:<unknown line>
  1128. 38.60 s > 8: <test_renormalization[879b57236d814a44]::finite_part_ghost_2loop::{closure#0} as core[940e698046960fd5]::ops::function::FnOnce<()>>::call_once<unknown>
  1129. 38.60 s > at <unknown source file>:<unknown line>
  1130. 38.60 s > 9: test[75d6903177b1d7e9]::__rust_begin_short_backtrace::<core[940e698046960fd5]::result::Result<(), alloc[2ea6bcb46fca0c42]::string::String>, fn() -> core[940e698046960fd5]::result::Result<(), alloc[2ea6bcb46fca0c42]::string::String>><unknown>
  1131. 38.60 s > at <unknown source file>:<unknown line>
  1132. 38.60 s > 10: test[75d6903177b1d7e9]::run_test::{closure#0}<unknown>
  1133. 38.60 s > at <unknown source file>:<unknown line>
  1134. 38.60 s > 11: std[bcb96dfbba0ab899]::sys::backtrace::__rust_begin_short_backtrace::<test[75d6903177b1d7e9]::run_test::{closure#1}, ()><unknown>
  1135. 38.60 s > at <unknown source file>:<unknown line>
  1136. 38.60 s > 12: <std[bcb96dfbba0ab899]::thread::lifecycle::spawn_unchecked<test[75d6903177b1d7e9]::run_test::{closure#1}, ()>::{closure#1} as core[940e698046960fd5]::ops::function::FnOnce<()>>::call_once::{shim:vtable#0}<unknown>
  1137. 38.60 s > at <unknown source file>:<unknown line>
  1138. 38.60 s > 13: <std[bcb96dfbba0ab899]::sys::thread::unix::Thread>::new::thread_start<unknown>
  1139. 38.60 s > at <unknown source file>:<unknown line>
  1140. 38.60 s > 14: start_thread<unknown>
  1141. 38.60 s > at <unknown source file>:<unknown line>
  1142. 38.60 s > 15: __clone3<unknown>
  1143. 38.60 s > at <unknown source file>:<unknown line>
  1144. 38.60 s >
  1145. 38.60 s > Run with COLORBT_SHOW_HIDDEN=1 environment variable to disable frame filtering.
  1146. 38.60 s > Run with RUST_BACKTRACE=full to include source snippets.
  1147. 38.60 s > Warning: SpanTrace capture is Unsupported.
  1148. 38.60 s > Ensure that you've setup a tracing-error ErrorLayer and the semver versions are compatible
  1149. 38.60 s > Location: crates/gammalooprs/tests/test_renormalization.rs:534
  1150. 38.60 s >
  1151. 38.60 s > ━━━━━━━━━━━━━━━━━━━━━━━━━━━━━━━━━━ BACKTRACE ━━━━━━━━━━━━━━━━━━━━━━━━━━━━━━━━━━━
  1152. 38.60 s > 1: <color_eyre[51793ea62743adbd]::config::PanicHook>::panic_report<unknown>
  1153. 38.60 s > at <unknown source file>:<unknown line>
  1154. 38.60 s > 2: <color_eyre[51793ea62743adbd]::config::PanicHook>::into_panic_hook::{closure#0}<unknown>
  1155. 38.60 s > at <unknown source file>:<unknown line>
  1156. 38.60 s > 3: std[bcb96dfbba0ab899]::panicking::panic_with_hook<unknown>
  1157. 38.60 s > at <unknown source file>:<unknown line>
  1158. 38.60 s > 4: std[bcb96dfbba0ab899]::panicking::panic_handler::{closure#0}<unknown>
  1159. 38.60 s > at <unknown source file>:<unknown line>
  1160. 38.60 s > 5: std[bcb96dfbba0ab899]::sys::backtrace::__rust_end_short_backtrace::<std[bcb96dfbba0ab899]::panicking::panic_handler::{closure#0}, !><unknown>
  1161. 38.60 s > at <unknown source file>:<unknown line>
  1162. 38.60 s > 6: __rustc[6c289b9f9c454d21]::rust_begin_unwind<unknown>
  1163. 38.60 s > at <unknown source file>:<unknown line>
  1164. 38.60 s > 7: core[940e698046960fd5]::panicking::panic_fmt<unknown>
  1165. 38.60 s > at <unknown source file>:<unknown line>
  1166. 38.60 s > 8: core[940e698046960fd5]::result::unwrap_failed<unknown>
  1167. 38.60 s > at <unknown source file>:<unknown line>
  1168. 38.60 s > 9: test_renormalization[879b57236d814a44]::finite_part_ghost_2loop<unknown>
  1169. 38.60 s > at <unknown source file>:<unknown line>
  1170. 38.60 s > 10: <test_renormalization[879b57236d814a44]::finite_part_ghost_2loop::{closure#0} as core[940e698046960fd5]::ops::function::FnOnce<()>>::call_once<unknown>
  1171. 38.60 s > at <unknown source file>:<unknown line>
  1172. 38.60 s > 11: test[75d6903177b1d7e9]::__rust_begin_short_backtrace::<core[940e698046960fd5]::result::Result<(), alloc[2ea6bcb46fca0c42]::string::String>, fn() -> core[940e698046960fd5]::result::Result<(), alloc[2ea6bcb46fca0c42]::string::String>><unknown>
  1173. 38.60 s > at <unknown source file>:<unknown line>
  1174. 38.60 s > 12: test[75d6903177b1d7e9]::run_test::{closure#0}<unknown>
  1175. 38.60 s > at <unknown source file>:<unknown line>
  1176. 38.60 s > 13: std[bcb96dfbba0ab899]::sys::backtrace::__rust_begin_short_backtrace::<test[75d6903177b1d7e9]::run_test::{closure#1}, ()><unknown>
  1177. 38.60 s > at <unknown source file>:<unknown line>
  1178. 38.60 s > 14: <std[bcb96dfbba0ab899]::thread::lifecycle::spawn_unchecked<test[75d6903177b1d7e9]::run_test::{closure#1}, ()>::{closure#1} as core[940e698046960fd5]::ops::function::FnOnce<()>>::call_once::{shim:vtable#0}<unknown>
  1179. 38.60 s > at <unknown source file>:<unknown line>
  1180. 38.60 s > 15: <std[bcb96dfbba0ab899]::sys::thread::unix::Thread>::new::thread_start<unknown>
  1181. 38.60 s > at <unknown source file>:<unknown line>
  1182. 38.60 s > 16: start_thread<unknown>
  1183. 38.60 s > at <unknown source file>:<unknown line>
  1184. 38.60 s > 17: __clone3<unknown>
  1185. 38.60 s > at <unknown source file>:<unknown line>
  1186. 38.60 s >
  1187. 38.60 s > Run with COLORBT_SHOW_HIDDEN=1 environment variable to disable frame filtering.
  1188. 38.60 s > Run with RUST_BACKTRACE=full to include source snippets.
  1189. 38.60 s >
  1190. 38.60 s > FAIL [ 5.826s] (537/539) gammalooprs uv::tests::scalars_profile
  1191. 38.60 s > stdout ---
  1192. 38.60 s >
  1193. 38.60 s > running 1 test
  1194. 38.60 s > test uv::tests::scalars_profile ... FAILED
  1195. 38.60 s >
  1196. 38.60 s > failures:
  1197. 38.60 s >
  1198. 38.60 s > failures:
  1199. 38.60 s > uv::tests::scalars_profile
  1200. 38.60 s >
  1201. 38.60 s > test result: FAILED. 0 passed; 1 failed; 0 ignored; 0 measured; 589 filtered out; finished in 5.81s
  1202. 38.60 s >
  1203. 38.60 s > stderr ---
  1204. 38.60 s > [00:01:31.088] @gammalooprs::settings::runtime WARNING : No external kinematics were provided; using default-generated external momenta and helicities.
  1205. 38.60 s > field value
  1206. 38.60 s > span build_integrand{amplitude.name=bub}
  1207. 38.60 s > at crates/gammalooprs/src/settings/runtime.rs:131
  1208. 38.60 s > [00:01:31.089] @gammalooprs::integrands::process::amplitude INFO : Input is below threshold: 0 existing threshold E-surfaces across 0/3 graph groups
  1209. 38.60 s > field value
  1210. 38.60 s > existing_esurfaces 0
  1211. 38.60 s > group_count 3
  1212. 38.60 s > groups_above_threshold 0
  1213. 38.60 s > integrand bub
  1214. 38.60 s > span warm_up{integrand.name=bub}
  1215. 38.60 s > threshold_status below threshold
  1216. 38.60 s > at crates/gammalooprs/src/integrands/process/amplitude/mod.rs:1666
  1217. 38.60 s > [00:01:31.089] @gammalooprs::integrands::process::amplitude INFO : overlap structure of group 0: [0: []]
  1218. 38.60 s > field value
  1219. 38.60 s > span warm_up{integrand.name=bub}
  1220. 38.60 s > at crates/gammalooprs/src/integrands/process/amplitude/mod.rs:2015
  1221. 38.60 s > [00:01:31.089] @gammalooprs::integrands::process::amplitude INFO : overlap structure of group 1: [0: []]
  1222. 38.60 s > field value
  1223. 38.60 s > span warm_up{integrand.name=bub}
  1224. 38.60 s > at crates/gammalooprs/src/integrands/process/amplitude/mod.rs:2015
  1225. 38.60 s > [00:01:31.089] @gammalooprs::integrands::process::amplitude INFO : overlap structure of group 2: [0: []]
  1226. 38.60 s > field value
  1227. 38.60 s > span warm_up{integrand.name=bub}
  1228. 38.60 s > at crates/gammalooprs/src/integrands/process/amplitude/mod.rs:2015
  1229. 38.60 s > The application panicked (crashed).
  1230. 38.60 s > Message: assertion `left == right` failed: subtracted scalar UV profile failed:
  1231. 38.60 s > UVProfilePassFail {
  1232. 38.60 s > max_dod: -0.9,
  1233. 38.60 s > total: 16,
  1234. 38.60 s > failed: 1,
  1235. 38.60 s > failures: [
  1236. 38.60 s > UVProfileFailure {
  1237. 38.60 s > graph_index: 0,
  1238. 38.60 s > graph_name: "banana",
  1239. 38.60 s > cutkosky_cut: None,
  1240. 38.60 s > lmb_index: 1,
  1241. 38.60 s > fixed: [
  1242. 38.60 s > EdgeIndex(
  1243. 38.60 s > 2,
  1244. 38.60 s > ),
  1245. 38.60 s > EdgeIndex(
  1246. 38.60 s > 0,
  1247. 38.60 s > ),
  1248. 38.60 s > ],
  1249. 38.60 s > free: [
  1250. 38.60 s > EdgeIndex(
  1251. 38.60 s > 3,
  1252. 38.60 s > ),
  1253. 38.60 s > ],
  1254. 38.60 s > orientation_label: None,
  1255. 38.60 s > reason: "dod_exceeds_threshold",
  1256. 38.60 s > },
  1257. 38.60 s > ],
  1258. 38.60 s > }
  1259. 38.60 s >
  1260. 38.60 s > ╭─────────┬────────────┬───────────┬───────┬─────┬──────────┬───────────╮
  1261. 38.60 s > │ fixed │ → ∞ │ slope │ r2 │ DOD │ bare DOD │ inspect │
  1262. 38.60 s > ├─────────┼────────────┼───────────┼───────┼─────┼──────────┼───────────┤
  1263. 38.60 s > │ {e1,e2} │ {e3} │ -0.996752 │ 1.000 │ -1 │ 0 │ arb retry │
  1264. 38.60 s > │ {e1,e3} │ {e2} │ -1.065665 │ 0.997 │ -1 │ 0 │ arb retry │
  1265. 38.60 s > │ {e1} │ {e2,e3} │ -0.937151 │ 0.943 │ -1 │ 2 │ │
  1266. 38.60 s > │ {e2,e3} │ {e1} │ -1.001075 │ 1.000 │ -1 │ 0 │ arb retry │
  1267. 38.60 s > │ {e2} │ {e1,e3} │ -0.984146 │ 0.998 │ -1 │ 2 │ │
  1268. 38.60 s > │ {e3} │ {e1,e2} │ -1.383911 │ 0.982 │ -1 │ 2 │ arb retry │
  1269. 38.60 s > │ {} │ {e1,e2,e3} │ -1.094213 │ 0.258 │ -1 │ 4 │ │
  1270. 38.60 s > │ {e2,e0} │ {e3} │ -0.803348 │ 0.861 │ -1 │ 0 │ arb retry │
  1271. 38.60 s > │ {e3,e0} │ {e2} │ -0.999257 │ 1.000 │ -1 │ 0 │ │
  1272. 38.60 s > │ {e0} │ {e2,e3} │ -1.000893 │ 1.000 │ -1 │ 2 │ │
  1273. 38.60 s > │ {e1,e0} │ {e3} │ -0.997860 │ 1.000 │ -1 │ 0 │ │
  1274. 38.60 s > ╰─────────┴────────────┴───────────┴───────┴─────┴──────────┴───────────╯
  1275. 38.60 s >
  1276. 38.60 s > ╭───────┬─────────┬───────────┬───────┬─────┬──────────┬───────────╮
  1277. 38.60 s > │ fixed │ → ∞ │ slope │ r2 │ DOD │ bare DOD │ inspect │
  1278. 38.60 s > ├───────┼─────────┼───────────┼───────┼─────┼──────────┼───────────┤
  1279. 38.60 s > │ {e1} │ {e2} │ -1.005039 │ 1.000 │ -1 │ 0 │ arb retry │
  1280. 38.60 s > │ {e2} │ {e1} │ -1.001098 │ 1.000 │ -1 │ 0 │ arb retry │
  1281. 38.60 s > │ {} │ {e1,e2} │ -1.011289 │ 1.000 │ -1 │ 2 │ │
  1282. 38.60 s > │ {e0} │ {e2} │ -0.998140 │ 1.000 │ -1 │ 0 │ │
  1283. 38.60 s > ╰───────┴─────────┴───────────┴───────┴─────┴──────────┴───────────╯
  1284. 38.60 s >
  1285. 38.60 s > ╭───────┬──────┬───────────┬───────┬─────┬──────────┬─────────╮
  1286. 38.60 s > │ fixed │ → ∞ │ slope │ r2 │ DOD │ bare DOD │ inspect │
  1287. 38.60 s > ├───────┼──────┼───────────┼───────┼─────┼──────────┼─────────┤
  1288. 38.60 s > │ {} │ {e1} │ -0.989949 │ 1.000 │ -1 │ 0 │ │
  1289. 38.60 s > ╰───────┴──────┴───────────┴───────┴─────┴──────────┴─────────╯
  1290. 38.60 s > left: 1
  1291. 38.60 s > right: 0
  1292. 38.60 s > Location: crates/gammalooprs/src/uv/tests.rs:259
  1293. 38.60 s >
  1294. 38.60 s > ━━━━━━━━━━━━━━━━━━━━━━━━━━━━━━━━━━ BACKTRACE ━━━━━━━━━━━━━━━━━━━━━━━━━━━━━━━━━━━
  1295. 38.60 s > 1: <color_eyre[51793ea62743adbd]::config::PanicHook>::panic_report<unknown>
  1296. 38.60 s > at <unknown source file>:<unknown line>
  1297. 38.60 s > 2: <color_eyre[51793ea62743adbd]::config::PanicHook>::into_panic_hook::{closure#0}<unknown>
  1298. 38.60 s > at <unknown source file>:<unknown line>
  1299. 38.60 s > 3: std[bcb96dfbba0ab899]::panicking::panic_with_hook<unknown>
  1300. 38.60 s > at <unknown source file>:<unknown line>
  1301. 38.60 s > 4: std[bcb96dfbba0ab899]::panicking::panic_handler::{closure#0}<unknown>
  1302. 38.60 s > at <unknown source file>:<unknown line>
  1303. 38.60 s > 5: std[bcb96dfbba0ab899]::sys::backtrace::__rust_end_short_backtrace::<std[bcb96dfbba0ab899]::panicking::panic_handler::{closure#0}, !><unknown>
  1304. 38.60 s > at <unknown source file>:<unknown line>
  1305. 38.60 s > 6: __rustc[6c289b9f9c454d21]::rust_begin_unwind<unknown>
  1306. 38.60 s > at <unknown source file>:<unknown line>
  1307. 38.60 s > 7: core[940e698046960fd5]::panicking::panic_fmt<unknown>
  1308. 38.60 s > at <unknown source file>:<unknown line>
  1309. 38.60 s > 8: core[940e698046960fd5]::panicking::assert_failed_inner<unknown>
  1310. 38.60 s > at <unknown source file>:<unknown line>
  1311. 38.60 s > 9: core[940e698046960fd5]::panicking::assert_failed::<usize, usize><unknown>
  1312. 38.60 s > at <unknown source file>:<unknown line>
  1313. 38.60 s > 10: gammalooprs[6dc202c8af9e2ddf]::uv::tests::scalars_profile<unknown>
  1314. 38.60 s > at <unknown source file>:<unknown line>
  1315. 38.60 s > 11: <gammalooprs[6dc202c8af9e2ddf]::uv::tests::scalars_profile::{closure#0} as core[940e698046960fd5]::ops::function::FnOnce<()>>::call_once<unknown>
  1316. 38.60 s > at <unknown source file>:<unknown line>
  1317. 38.60 s > 12: test[75d6903177b1d7e9]::__rust_begin_short_backtrace::<core[940e698046960fd5]::result::Result<(), alloc[2ea6bcb46fca0c42]::string::String>, fn() -> core[940e698046960fd5]::result::Result<(), alloc[2ea6bcb46fca0c42]::string::String>><unknown>
  1318. 38.60 s > at <unknown source file>:<unknown line>
  1319. 38.60 s > 13: test[75d6903177b1d7e9]::run_test::{closure#0}<unknown>
  1320. 38.60 s > at <unknown source file>:<unknown line>
  1321. 38.60 s > 14: std[bcb96dfbba0ab899]::sys::backtrace::__rust_begin_short_backtrace::<test[75d6903177b1d7e9]::run_test::{closure#1}, ()><unknown>
  1322. 38.60 s > at <unknown source file>:<unknown line>
  1323. 38.60 s > 15: <std[bcb96dfbba0ab899]::thread::lifecycle::spawn_unchecked<test[75d6903177b1d7e9]::run_test::{closure#1}, ()>::{closure#1} as core[940e698046960fd5]::ops::function::FnOnce<()>>::call_once::{shim:vtable#0}<unknown>
  1324. 38.60 s > at <unknown source file>:<unknown line>
  1325. 38.60 s > 16: <std[bcb96dfbba0ab899]::sys::thread::unix::Thread>::new::thread_start<unknown>
  1326. 38.60 s > at <unknown source file>:<unknown line>
  1327. 38.60 s > 17: start_thread<unknown>
  1328. 38.60 s > at <unknown source file>:<unknown line>
  1329. 38.60 s > 18: __clone3<unknown>
  1330. 38.60 s > at <unknown source file>:<unknown line>
  1331. 38.60 s >
  1332. 38.60 s > Run with COLORBT_SHOW_HIDDEN=1 environment variable to disable frame filtering.
  1333. 38.60 s > Run with RUST_BACKTRACE=full to include source snippets.
  1334. 38.60 s >
  1335. 38.60 s > FAIL [ 5.925s] (538/539) gammalooprs uv::tests::scalars_profile_new
  1336. 38.60 s > stdout ---
  1337. 38.60 s >
  1338. 38.60 s > running 1 test
  1339. 38.60 s > test uv::tests::scalars_profile_new ... FAILED
  1340. 38.60 s >
  1341. 38.60 s > failures:
  1342. 38.60 s >
  1343. 38.60 s > failures:
  1344. 38.60 s > uv::tests::scalars_profile_new
  1345. 38.60 s >
  1346. 38.60 s > test result: FAILED. 0 passed; 1 failed; 0 ignored; 0 measured; 589 filtered out; finished in 5.91s
  1347. 38.60 s >
  1348. 38.60 s > stderr ---
  1349. 38.60 s > [00:01:31.195] @gammalooprs::settings::runtime WARNING : No external kinematics were provided; using default-generated external momenta and helicities.
  1350. 38.60 s > field value
  1351. 38.60 s > span build_integrand{amplitude.name=bub}
  1352. 38.60 s > at crates/gammalooprs/src/settings/runtime.rs:131
  1353. 38.60 s > [00:01:31.197] @gammalooprs::integrands::process::amplitude INFO : Input is below threshold: 0 existing threshold E-surfaces across 0/3 graph groups
  1354. 38.60 s > field value
  1355. 38.60 s > existing_esurfaces 0
  1356. 38.60 s > group_count 3
  1357. 38.60 s > groups_above_threshold 0
  1358. 38.60 s > integrand bub
  1359. 38.60 s > span warm_up{integrand.name=bub}
  1360. 38.60 s > threshold_status below threshold
  1361. 38.60 s > at crates/gammalooprs/src/integrands/process/amplitude/mod.rs:1666
  1362. 38.60 s > [00:01:31.197] @gammalooprs::integrands::process::amplitude INFO : overlap structure of group 0: [0: []]
  1363. 38.60 s > field value
  1364. 38.60 s > span warm_up{integrand.name=bub}
  1365. 38.60 s > at crates/gammalooprs/src/integrands/process/amplitude/mod.rs:2015
  1366. 38.60 s > [00:01:31.197] @gammalooprs::integrands::process::amplitude INFO : overlap structure of group 1: [0: []]
  1367. 38.60 s > field value
  1368. 38.60 s > span warm_up{integrand.name=bub}
  1369. 38.60 s > at crates/gammalooprs/src/integrands/process/amplitude/mod.rs:2015
  1370. 38.60 s > [00:01:31.197] @gammalooprs::integrands::process::amplitude INFO : overlap structure of group 2: [0: []]
  1371. 38.60 s > field value
  1372. 38.60 s > span warm_up{integrand.name=bub}
  1373. 38.60 s > at crates/gammalooprs/src/integrands/process/amplitude/mod.rs:2015
  1374. 38.60 s > The application panicked (crashed).
  1375. 38.60 s > Message: assertion `left == right` failed: subtracted scalar UV profile failed:
  1376. 38.60 s > UVProfilePassFail {
  1377. 38.60 s > max_dod: -0.9,
  1378. 38.60 s > total: 16,
  1379. 38.60 s > failed: 1,
  1380. 38.60 s > failures: [
  1381. 38.60 s > UVProfileFailure {
  1382. 38.60 s > graph_index: 0,
  1383. 38.60 s > graph_name: "banana",
  1384. 38.60 s > cutkosky_cut: None,
  1385. 38.60 s > lmb_index: 1,
  1386. 38.60 s > fixed: [
  1387. 38.60 s > EdgeIndex(
  1388. 38.60 s > 2,
  1389. 38.60 s > ),
  1390. 38.60 s > EdgeIndex(
  1391. 38.60 s > 0,
  1392. 38.60 s > ),
  1393. 38.60 s > ],
  1394. 38.60 s > free: [
  1395. 38.60 s > EdgeIndex(
  1396. 38.60 s > 3,
  1397. 38.60 s > ),
  1398. 38.60 s > ],
  1399. 38.60 s > orientation_label: None,
  1400. 38.60 s > reason: "dod_exceeds_threshold",
  1401. 38.60 s > },
  1402. 38.60 s > ],
  1403. 38.60 s > }
  1404. 38.60 s >
  1405. 38.60 s > ╭─────────┬────────────┬───────────┬───────┬─────┬──────────┬───────────╮
  1406. 38.60 s > │ fixed │ → ∞ │ slope │ r2 │ DOD │ bare DOD │ inspect │
  1407. 38.60 s > ├─────────┼────────────┼───────────┼───────┼─────┼──────────┼───────────┤
  1408. 38.60 s > │ {e1,e2} │ {e3} │ -0.996752 │ 1.000 │ -1 │ 0 │ arb retry │
  1409. 38.60 s > │ {e1,e3} │ {e2} │ -1.065665 │ 0.997 │ -1 │ 0 │ arb retry │
  1410. 38.60 s > │ {e1} │ {e2,e3} │ -0.937151 │ 0.943 │ -1 │ 2 │ │
  1411. 38.60 s > │ {e2,e3} │ {e1} │ -1.001075 │ 1.000 │ -1 │ 0 │ arb retry │
  1412. 38.60 s > │ {e2} │ {e1,e3} │ -0.984146 │ 0.998 │ -1 │ 2 │ │
  1413. 38.60 s > │ {e3} │ {e1,e2} │ -1.383911 │ 0.982 │ -1 │ 2 │ arb retry │
  1414. 38.60 s > │ {} │ {e1,e2,e3} │ -1.094213 │ 0.258 │ -1 │ 4 │ │
  1415. 38.60 s > │ {e2,e0} │ {e3} │ -0.803348 │ 0.861 │ -1 │ 0 │ arb retry │
  1416. 38.60 s > │ {e3,e0} │ {e2} │ -0.999257 │ 1.000 │ -1 │ 0 │ │
  1417. 38.60 s > │ {e0} │ {e2,e3} │ -1.000893 │ 1.000 │ -1 │ 2 │ │
  1418. 38.60 s > │ {e1,e0} │ {e3} │ -0.997860 │ 1.000 │ -1 │ 0 │ │
  1419. 38.60 s > ╰─────────┴────────────┴───────────┴───────┴─────┴──────────┴───────────╯
  1420. 38.60 s >
  1421. 38.60 s > ╭───────┬─────────┬───────────┬───────┬─────┬──────────┬───────────╮
  1422. 38.60 s > │ fixed │ → ∞ │ slope │ r2 │ DOD │ bare DOD │ inspect │
  1423. 38.60 s > ├───────┼─────────┼───────────┼───────┼─────┼──────────┼───────────┤
  1424. 38.60 s > │ {e1} │ {e2} │ -1.005039 │ 1.000 │ -1 │ 0 │ arb retry │
  1425. 38.60 s > │ {e2} │ {e1} │ -1.001098 │ 1.000 │ -1 │ 0 │ arb retry │
  1426. 38.60 s > │ {} │ {e1,e2} │ -1.011289 │ 1.000 │ -1 │ 2 │ │
  1427. 38.60 s > │ {e0} │ {e2} │ -0.998140 │ 1.000 │ -1 │ 0 │ │
  1428. 38.60 s > ╰───────┴─────────┴───────────┴───────┴─────┴──────────┴───────────╯
  1429. 38.60 s >
  1430. 38.60 s > ╭───────┬──────┬───────────┬───────┬─────┬──────────┬─────────╮
  1431. 38.60 s > │ fixed │ → ∞ │ slope │ r2 │ DOD │ bare DOD │ inspect │
  1432. 38.60 s > ├───────┼──────┼───────────┼───────┼─────┼──────────┼─────────┤
  1433. 38.60 s > │ {} │ {e1} │ -0.989949 │ 1.000 │ -1 │ 0 │ │
  1434. 38.60 s > ╰───────┴──────┴───────────┴───────┴─────┴──────────┴─────────╯
  1435. 38.60 s > left: 1
  1436. 38.60 s > right: 0
  1437. 38.60 s > Location: crates/gammalooprs/src/uv/tests.rs:325
  1438. 38.60 s >
  1439. 38.60 s > ━━━━━━━━━━━━━━━━━━━━━━━━━━━━━━━━━━ BACKTRACE ━━━━━━━━━━━━━━━━━━━━━━━━━━━━━━━━━━━
  1440. 38.60 s > 1: <color_eyre[51793ea62743adbd]::config::PanicHook>::panic_report<unknown>
  1441. 38.60 s > at <unknown source file>:<unknown line>
  1442. 38.60 s > 2: <color_eyre[51793ea62743adbd]::config::PanicHook>::into_panic_hook::{closure#0}<unknown>
  1443. 38.60 s > at <unknown source file>:<unknown line>
  1444. 38.60 s > 3: std[bcb96dfbba0ab899]::panicking::panic_with_hook<unknown>
  1445. 38.60 s > at <unknown source file>:<unknown line>
  1446. 38.60 s > 4: std[bcb96dfbba0ab899]::panicking::panic_handler::{closure#0}<unknown>
  1447. 38.60 s > at <unknown source file>:<unknown line>
  1448. 38.60 s > 5: std[bcb96dfbba0ab899]::sys::backtrace::__rust_end_short_backtrace::<std[bcb96dfbba0ab899]::panicking::panic_handler::{closure#0}, !><unknown>
  1449. 38.60 s > at <unknown source file>:<unknown line>
  1450. 38.60 s > 6: __rustc[6c289b9f9c454d21]::rust_begin_unwind<unknown>
  1451. 38.60 s > at <unknown source file>:<unknown line>
  1452. 38.60 s > 7: core[940e698046960fd5]::panicking::panic_fmt<unknown>
  1453. 38.60 s > at <unknown source file>:<unknown line>
  1454. 38.60 s > 8: core[940e698046960fd5]::panicking::assert_failed_inner<unknown>
  1455. 38.60 s > at <unknown source file>:<unknown line>
  1456. 38.60 s > 9: core[940e698046960fd5]::panicking::assert_failed::<usize, usize><unknown>
  1457. 38.60 s > at <unknown source file>:<unknown line>
  1458. 38.60 s > 10: gammalooprs[6dc202c8af9e2ddf]::uv::tests::scalars_profile_new<unknown>
  1459. 38.60 s > at <unknown source file>:<unknown line>
  1460. 38.60 s > 11: <gammalooprs[6dc202c8af9e2ddf]::uv::tests::scalars_profile_new::{closure#0} as core[940e698046960fd5]::ops::function::FnOnce<()>>::call_once<unknown>
  1461. 38.60 s > at <unknown source file>:<unknown line>
  1462. 38.60 s > 12: test[75d6903177b1d7e9]::__rust_begin_short_backtrace::<core[940e698046960fd5]::result::Result<(), alloc[2ea6bcb46fca0c42]::string::String>, fn() -> core[940e698046960fd5]::result::Result<(), alloc[2ea6bcb46fca0c42]::string::String>><unknown>
  1463. 38.60 s > at <unknown source file>:<unknown line>
  1464. 38.60 s > 13: test[75d6903177b1d7e9]::run_test::{closure#0}<unknown>
  1465. 38.60 s > at <unknown source file>:<unknown line>
  1466. 38.60 s > 14: std[bcb96dfbba0ab899]::sys::backtrace::__rust_begin_short_backtrace::<test[75d6903177b1d7e9]::run_test::{closure#1}, ()><unknown>
  1467. 38.60 s > at <unknown source file>:<unknown line>
  1468. 38.60 s > 15: <std[bcb96dfbba0ab899]::thread::lifecycle::spawn_unchecked<test[75d6903177b1d7e9]::run_test::{closure#1}, ()>::{closure#1} as core[940e698046960fd5]::ops::function::FnOnce<()>>::call_once::{shim:vtable#0}<unknown>
  1469. 38.60 s > at <unknown source file>:<unknown line>
  1470. 38.60 s > 16: <std[bcb96dfbba0ab899]::sys::thread::unix::Thread>::new::thread_start<unknown>
  1471. 38.60 s > at <unknown source file>:<unknown line>
  1472. 38.60 s > 17: start_thread<unknown>
  1473. 38.60 s > at <unknown source file>:<unknown line>
  1474. 38.60 s > 18: __clone3<unknown>
  1475. 38.60 s > at <unknown source file>:<unknown line>
  1476. 38.60 s >
  1477. 38.60 s > Run with COLORBT_SHOW_HIDDEN=1 environment variable to disable frame filtering.
  1478. 38.60 s > Run with RUST_BACKTRACE=full to include source snippets.
  1479. 38.60 s >
  1480. 38.60 s > error: test run failed
  1481. 38.60 s >
  1482. 38.60 s > ========== nextest test summary ==========
  1483. 38.60 s > report: target/nextest/ci_gammaloop/junit.xml
  1484. 38.60 s > tests: 539, failures: 7, errors: 0
  1485. 38.60 s >
  1486. 38.60 s > 1. gammalooprs::cff::tests::stored_production_cff_uses_typed_energy_factor_ownership
  1487. 38.60 s > failure: test failure with exit code 101
  1488. 38.60 s > system-out
  1489. 38.60 s > running 1 test
  1490. 38.60 s > test cff::tests::stored_production_cff_uses_typed_energy_factor_ownership ... FAILED
  1491. 38.60 s >
  1492. 38.60 s > failures:
  1493. 38.60 s >
  1494. 38.60 s > failures:
  1495. 38.60 s > cff::tests::stored_production_cff_uses_typed_energy_factor_ownership
  1496. 38.60 s >
  1497. 38.60 s > test result: FAILED. 0 passed; 1 failed; 0 ignored; 0 measured; 589 filtered out; finished in 0.05s
  1498. 38.60 s > system-err
  1499. 38.60 s > The application panicked (crashed).
  1500. 38.60 s > Message: assertion `left == right` failed
  1501. 38.60 s > left: 1
  1502. 38.60 s > right: -1
  1503. 38.60 s > Location: crates/gammalooprs/src/cff/mod.rs:1783
  1504. 38.60 s >
  1505. 38.60 s > ━━━━━━━━━━━━━━━━━━━━━━━━━━━━━━━━━━ BACKTRACE ━━━━━━━━━━━━━━━━━━━━━━━━━━━━━━━━━━━
  1506. 38.60 s > 1: <color_eyre[51793ea62743adbd]::config::PanicHook>::panic_report<unknown>
  1507. 38.60 s > at <unknown source file>:<unknown line>
  1508. 38.60 s > 2: <color_eyre[51793ea62743adbd]::config::PanicHook>::into_panic_hook::{closure#0}<unknown>
  1509. 38.60 s > at <unknown source file>:<unknown line>
  1510. 38.60 s > 3: std[bcb96dfbba0ab899]::panicking::panic_with_hook<unknown>
  1511. 38.60 s > at <unknown source file>:<unknown line>
  1512. 38.60 s > 4: std[bcb96dfbba0ab899]::panicking::panic_handler::{closure#0}<unknown>
  1513. 38.60 s > at <unknown source file>:<unknown line>
  1514. 38.60 s > 5: std[bcb96dfbba0ab899]::sys::backtrace::__rust_end_short_backtrace::<std[bcb96dfbba0ab899]::panicking::panic_handler::{closure#0}, !><unknown>
  1515. 38.60 s > at <unknown source file>:<unknown line>
  1516. 38.60 s > 6: __rustc[6c289b9f9c454d21]::rust_begin_unwind<unknown>
  1517. 38.60 s > at <unknown source file>:<unknown line>
  1518. 38.60 s > 7: core[940e698046960fd5]::panicking::panic_fmt<unknown>
  1519. 38.60 s > at <unknown source file>:<unknown line>
  1520. 38.60 s > 8: core[940e698046960fd5]::panicking::assert_failed_inner<unknown>
  1521. 38.60 s > at <unknown source file>:<unknown line>
  1522. 38.60 s > 9: core[940e698046960fd5]::panicking::assert_failed::<i64, i64><unknown>
  1523. 38.60 s > at <unknown source file>:<unknown line>
  1524. 38.60 s > 10: gammalooprs[6dc202c8af9e2ddf]::cff::tests::stored_production_cff_uses_typed_energy_factor_ownership<unknown>
  1525. 38.60 s > at <unknown source file>:<unknown line>
  1526. 38.60 s > 11: <gammalooprs[6dc202c8af9e2ddf]::cff::tests::stored_production_cff_uses_typed_energy_factor_ownership::{closure#0} as core[940e698046960fd5]::ops::function::FnOnce<()>>::call_once<unknown>
  1527. 38.60 s > at <unknown source file>:<unknown line>
  1528. 38.60 s > 12: test[75d6903177b1d7e9]::__rust_begin_short_backtrace::<core[940e698046960fd5]::result::Result<(), alloc[2ea6bcb46fca0c42]::string::String>, fn() -> core[940e698046960fd5]::result::Result<(), alloc[2ea6bcb46fca0c42]::string::String>><unknown>
  1529. 38.60 s > at <unknown source file>:<unknown line>
  1530. 38.60 s > 13: test[75d6903177b1d7e9]::run_test::{closure#0}<unknown>
  1531. 38.60 s > at <unknown source file>:<unknown line>
  1532. 38.60 s > 14: std[bcb96dfbba0ab899]::sys::backtrace::__rust_begin_short_backtrace::<test[75d6903177b1d7e9]::run_test::{closure#1}, ()><unknown>
  1533. 38.60 s > at <unknown source file>:<unknown line>
  1534. 38.60 s > 15: <std[bcb96dfbba0ab899]::thread::lifecycle::spawn_unchecked<test[75d6903177b1d7e9]::run_test::{closure#1}, ()>::{closure#1} as core[940e698046960fd5]::ops::function::FnOnce<()>>::call_once::{shim:vtable#0}<unknown>
  1535. 38.60 s > at <unknown source file>:<unknown line>
  1536. 38.60 s > 16: <std[bcb96dfbba0ab899]::sys::thread::unix::Thread>::new::thread_start<unknown>
  1537. 38.60 s > at <unknown source file>:<unknown line>
  1538. 38.60 s > 17: start_thread<unknown>
  1539. 38.60 s > at <unknown source file>:<unknown line>
  1540. 38.60 s > 18: __clone3<unknown>
  1541. 38.60 s > at <unknown source file>:<unknown line>
  1542. 38.60 s >
  1543. 38.60 s > Run with COLORBT_SHOW_HIDDEN=1 environment variable to disable frame filtering.
  1544. 38.60 s > Run with RUST_BACKTRACE=full to include source snippets.
  1545. 38.60 s >
  1546. 38.60 s > 2. gammalooprs::graph::three_d_source::tests::exact_energy_mapper_prefers_source_edge_maps
  1547. 38.60 s > failure: test failure with exit code 101
  1548. 38.60 s > system-out
  1549. 38.60 s > running 1 test
  1550. 38.60 s > test graph::three_d_source::tests::exact_energy_mapper_prefers_source_edge_maps ... FAILED
  1551. 38.60 s >
  1552. 38.60 s > failures:
  1553. 38.60 s >
  1554. 38.60 s > failures:
  1555. 38.60 s > graph::three_d_source::tests::exact_energy_mapper_prefers_source_edge_maps
  1556. 38.60 s >
  1557. 38.60 s > test result: FAILED. 0 passed; 1 failed; 0 ignored; 0 measured; 589 filtered out; finished in 0.04s
  1558. 38.60 s > system-err
  1559. 38.60 s > The application panicked (crashed).
  1560. 38.60 s > Message: called `Result::unwrap_err()` on an `Ok` value: (2*three_d_source_test::carrier_energy+three_d_source_test::reconstructed_factor)*(2*three_d_source_test::carrier_energy+three_d_source_test::loop_factor)*(-1+4*gammalooprs::M+3*three_d_source_test::literal_energy+three_d_source_test::edge_factor-2*gammalooprs::Q(19,spenso::cind(0)))
  1561. 38.60 s > Location: crates/gammalooprs/src/graph/three_d_source.rs:3083
  1562. 38.60 s >
  1563. 38.60 s > ━━━━━━━━━━━━━━━━━━━━━━━━━━━━━━━━━━ BACKTRACE ━━━━━━━━━━━━━━━━━━━━━━━━━━━━━━━━━━━
  1564. 38.60 s > 1: <color_eyre[51793ea62743adbd]::config::PanicHook>::panic_report<unknown>
  1565. 38.60 s > at <unknown source file>:<unknown line>
  1566. 38.60 s > 2: <color_eyre[51793ea62743adbd]::config::PanicHook>::into_panic_hook::{closure#0}<unknown>
  1567. 38.60 s > at <unknown source file>:<unknown line>
  1568. 38.60 s > 3: std[bcb96dfbba0ab899]::panicking::panic_with_hook<unknown>
  1569. 38.60 s > at <unknown source file>:<unknown line>
  1570. 38.60 s > 4: std[bcb96dfbba0ab899]::panicking::panic_handler::{closure#0}<unknown>
  1571. 38.60 s > at <unknown source file>:<unknown line>
  1572. 38.60 s > 5: std[bcb96dfbba0ab899]::sys::backtrace::__rust_end_short_backtrace::<std[bcb96dfbba0ab899]::panicking::panic_handler::{closure#0}, !><unknown>
  1573. 38.60 s > at <unknown source file>:<unknown line>
  1574. 38.60 s > 6: __rustc[6c289b9f9c454d21]::rust_begin_unwind<unknown>
  1575. 38.60 s > at <unknown source file>:<unknown line>
  1576. 38.60 s > 7: core[940e698046960fd5]::panicking::panic_fmt<unknown>
  1577. 38.60 s > at <unknown source file>:<unknown line>
  1578. 38.60 s > 8: core[940e698046960fd5]::result::unwrap_failed<unknown>
  1579. 38.60 s > at <unknown source file>:<unknown line>
  1580. 38.60 s > 9: gammalooprs[6dc202c8af9e2ddf]::graph::three_d_source::tests::exact_energy_mapper_prefers_source_edge_maps<unknown>
  1581. 38.60 s > at <unknown source file>:<unknown line>
  1582. 38.60 s > 10: <gammalooprs[6dc202c8af9e2ddf]::graph::three_d_source::tests::exact_energy_mapper_prefers_source_edge_maps::{closure#0} as core[940e698046960fd5]::ops::function::FnOnce<()>>::call_once<unknown>
  1583. 38.60 s > at <unknown source file>:<unknown line>
  1584. 38.60 s > 11: test[75d6903177b1d7e9]::__rust_begin_short_backtrace::<core[940e698046960fd5]::result::Result<(), alloc[2ea6bcb46fca0c42]::string::String>, fn() -> core[940e698046960fd5]::result::Result<(), alloc[2ea6bcb46fca0c42]::string::String>><unknown>
  1585. 38.60 s > at <unknown source file>:<unknown line>
  1586. 38.60 s > 12: test[75d6903177b1d7e9]::run_test::{closure#0}<unknown>
  1587. 38.60 s > at <unknown source file>:<unknown line>
  1588. 38.60 s > 13: std[bcb96dfbba0ab899]::sys::backtrace::__rust_begin_short_backtrace::<test[75d6903177b1d7e9]::run_test::{closure#1}, ()><unknown>
  1589. 38.60 s > at <unknown source file>:<unknown line>
  1590. 38.60 s > 14: <std[bcb96dfbba0ab899]::thread::lifecycle::spawn_unchecked<test[75d6903177b1d7e9]::run_test::{closure#1}, ()>::{closure#1} as core[940e698046960fd5]::ops::function::FnOnce<()>>::call_once::{shim:vtable#0}<unknown>
  1591. 38.60 s > at <unknown source file>:<unknown line>
  1592. 38.60 s > 15: <std[bcb96dfbba0ab899]::sys::thread::unix::Thread>::new::thread_start<unknown>
  1593. 38.60 s > at <unknown source file>:<unknown line>
  1594. 38.60 s > 16: start_thread<unknown>
  1595. 38.60 s > at <unknown source file>:<unknown line>
  1596. 38.60 s > 17: __clone3<unknown>
  1597. 38.60 s > at <unknown source file>:<unknown line>
  1598. 38.60 s >
  1599. 38.60 s > Run with COLORBT_SHOW_HIDDEN=1 environment variable to disable frame filtering.
  1600. 38.60 s > Run with RUST_BACKTRACE=full to include source snippets.
  1601. 38.60 s >
  1602. 38.60 s > 3. gammalooprs::uv::approx::local_3d::tests::production_emr_map_cancels_one_powered_denominator
  1603. 38.60 s > failure: test failure with exit code 101
  1604. 38.60 s > system-out
  1605. 38.60 s > running 1 test
  1606. 38.60 s > test uv::approx::local_3d::tests::production_emr_map_cancels_one_powered_denominator ... FAILED
  1607. 38.60 s >
  1608. 38.60 s > failures:
  1609. 38.60 s >
  1610. 38.60 s > failures:
  1611. 38.60 s > uv::approx::local_3d::tests::production_emr_map_cancels_one_powered_denominator
  1612. 38.60 s >
  1613. 38.60 s > test result: FAILED. 0 passed; 1 failed; 0 ignored; 0 measured; 589 filtered out; finished in 0.05s
  1614. 38.60 s > system-err
  1615. 38.60 s > The application panicked (crashed).
  1616. 38.60 s > Message: assertion failed: source_map.is_none()
  1617. 38.60 s > Location: crates/gammalooprs/src/uv/approx/local_3d.rs:1897
  1618. 38.60 s >
  1619. 38.60 s > ━━━━━━━━━━━━━━━━━━━━━━━━━━━━━━━━━━ BACKTRACE ━━━━━━━━━━━━━━━━━━━━━━━━━━━━━━━━━━━
  1620. 38.60 s > 1: <color_eyre[51793ea62743adbd]::config::PanicHook>::panic_report<unknown>
  1621. 38.60 s > at <unknown source file>:<unknown line>
  1622. 38.60 s > 2: <color_eyre[51793ea62743adbd]::config::PanicHook>::into_panic_hook::{closure#0}<unknown>
  1623. 38.60 s > at <unknown source file>:<unknown line>
  1624. 38.60 s > 3: std[bcb96dfbba0ab899]::panicking::panic_with_hook<unknown>
  1625. 38.60 s > at <unknown source file>:<unknown line>
  1626. 38.60 s > 4: std[bcb96dfbba0ab899]::panicking::panic_handler::{closure#0}<unknown>
  1627. 38.60 s > at <unknown source file>:<unknown line>
  1628. 38.60 s > 5: std[bcb96dfbba0ab899]::sys::backtrace::__rust_end_short_backtrace::<std[bcb96dfbba0ab899]::panicking::panic_handler::{closure#0}, !><unknown>
  1629. 38.60 s > at <unknown source file>:<unknown line>
  1630. 38.60 s > 6: __rustc[6c289b9f9c454d21]::rust_begin_unwind<unknown>
  1631. 38.60 s > at <unknown source file>:<unknown line>
  1632. 38.60 s > 7: core[940e698046960fd5]::panicking::panic_fmt<unknown>
  1633. 38.60 s > at <unknown source file>:<unknown line>
  1634. 38.60 s > 8: core[940e698046960fd5]::panicking::panic<unknown>
  1635. 38.60 s > at <unknown source file>:<unknown line>
  1636. 38.60 s > 9: gammalooprs[6dc202c8af9e2ddf]::uv::approx::local_3d::tests::production_emr_map_cancels_one_powered_denominator<unknown>
  1637. 38.60 s > at <unknown source file>:<unknown line>
  1638. 38.60 s > 10: <gammalooprs[6dc202c8af9e2ddf]::uv::approx::local_3d::tests::production_emr_map_cancels_one_powered_denominator::{closure#0} as core[940e698046960fd5]::ops::function::FnOnce<()>>::call_once<unknown>
  1639. 38.60 s > at <unknown source file>:<unknown line>
  1640. 38.60 s > 11: test[75d6903177b1d7e9]::__rust_begin_short_backtrace::<core[940e698046960fd5]::result::Result<(), alloc[2ea6bcb46fca0c42]::string::String>, fn() -> core[940e698046960fd5]::result::Result<(), alloc[2ea6bcb46fca0c42]::string::String>><unknown>
  1641. 38.60 s > at <unknown source file>:<unknown line>
  1642. 38.60 s > 12: test[75d6903177b1d7e9]::run_test::{closure#0}<unknown>
  1643. 38.60 s > at <unknown source file>:<unknown line>
  1644. 38.60 s > 13: std[bcb96dfbba0ab899]::sys::backtrace::__rust_begin_short_backtrace::<test[75d6903177b1d7e9]::run_test::{closure#1}, ()><unknown>
  1645. 38.60 s > at <unknown source file>:<unknown line>
  1646. 38.60 s > 14: <std[bcb96dfbba0ab899]::thread::lifecycle::spawn_unchecked<test[75d6903177b1d7e9]::run_test::{closure#1}, ()>::{closure#1} as core[940e698046960fd5]::ops::function::FnOnce<()>>::call_once::{shim:vtable#0}<unknown>
  1647. 38.60 s > at <unknown source file>:<unknown line>
  1648. 38.60 s > 15: <std[bcb96dfbba0ab899]::sys::thread::unix::Thread>::new::thread_start<unknown>
  1649. 38.60 s > at <unknown source file>:<unknown line>
  1650. 38.60 s > 16: start_thread<unknown>
  1651. 38.60 s > at <unknown source file>:<unknown line>
  1652. 38.60 s > 17: __clone3<unknown>
  1653. 38.60 s > at <unknown source file>:<unknown line>
  1654. 38.60 s >
  1655. 38.60 s > Run with COLORBT_SHOW_HIDDEN=1 environment variable to disable frame filtering.
  1656. 38.60 s > Run with RUST_BACKTRACE=full to include source snippets.
  1657. 38.60 s >
  1658. 38.60 s > 4. gammalooprs::uv::approx::local_3d::tests::typed_4d_projection_analyzes_each_term_owned_numerator
  1659. 38.60 s > failure: test failure with exit code 101
  1660. 38.60 s > system-out
  1661. 38.60 s > running 1 test
  1662. 38.60 s > test uv::approx::local_3d::tests::typed_4d_projection_analyzes_each_term_owned_numerator ... FAILED
  1663. 38.60 s >
  1664. 38.60 s > failures:
  1665. 38.60 s >
  1666. 38.60 s > failures:
  1667. 38.60 s > uv::approx::local_3d::tests::typed_4d_projection_analyzes_each_term_owned_numerator
  1668. 38.60 s >
  1669. 38.60 s > test result: FAILED. 0 passed; 1 failed; 0 ignored; 0 measured; 589 filtered out; finished in 0.04s
  1670. 38.60 s > system-err
  1671. 38.60 s > The application panicked (crashed).
  1672. 38.60 s > Message: assertion failed: error.to_string().contains("could not analyze numerator in the contracted-source loop basis")
  1673. 38.60 s > Location: crates/gammalooprs/src/uv/approx/local_3d.rs:2965
  1674. 38.60 s >
  1675. 38.60 s > ━━━━━━━━━━━━━━━━━━━━━━━━━━━━━━━━━━ BACKTRACE ━━━━━━━━━━━━━━━━━━━━━━━━━━━━━━━━━━━
  1676. 38.60 s > 1: <color_eyre[51793ea62743adbd]::config::PanicHook>::panic_report<unknown>
  1677. 38.60 s > at <unknown source file>:<unknown line>
  1678. 38.60 s > 2: <color_eyre[51793ea62743adbd]::config::PanicHook>::into_panic_hook::{closure#0}<unknown>
  1679. 38.60 s > at <unknown source file>:<unknown line>
  1680. 38.60 s > 3: std[bcb96dfbba0ab899]::panicking::panic_with_hook<unknown>
  1681. 38.60 s > at <unknown source file>:<unknown line>
  1682. 38.60 s > 4: std[bcb96dfbba0ab899]::panicking::panic_handler::{closure#0}<unknown>
  1683. 38.60 s > at <unknown source file>:<unknown line>
  1684. 38.60 s > 5: std[bcb96dfbba0ab899]::sys::backtrace::__rust_end_short_backtrace::<std[bcb96dfbba0ab899]::panicking::panic_handler::{closure#0}, !><unknown>
  1685. 38.60 s > at <unknown source file>:<unknown line>
  1686. 38.60 s > 6: __rustc[6c289b9f9c454d21]::rust_begin_unwind<unknown>
  1687. 38.60 s > at <unknown source file>:<unknown line>
  1688. 38.60 s > 7: core[940e698046960fd5]::panicking::panic_fmt<unknown>
  1689. 38.60 s > at <unknown source file>:<unknown line>
  1690. 38.60 s > 8: core[940e698046960fd5]::panicking::panic<unknown>
  1691. 38.60 s > at <unknown source file>:<unknown line>
  1692. 38.60 s > 9: gammalooprs[6dc202c8af9e2ddf]::uv::approx::local_3d::tests::typed_4d_projection_analyzes_each_term_owned_numerator<unknown>
  1693. 38.60 s > at <unknown source file>:<unknown line>
  1694. 38.60 s > 10: <gammalooprs[6dc202c8af9e2ddf]::uv::approx::local_3d::tests::typed_4d_projection_analyzes_each_term_owned_numerator::{closure#0} as core[940e698046960fd5]::ops::function::FnOnce<()>>::call_once<unknown>
  1695. 38.60 s > at <unknown source file>:<unknown line>
  1696. 38.60 s > 11: test[75d6903177b1d7e9]::__rust_begin_short_backtrace::<core[940e698046960fd5]::result::Result<(), alloc[2ea6bcb46fca0c42]::string::String>, fn() -> core[940e698046960fd5]::result::Result<(), alloc[2ea6bcb46fca0c42]::string::String>><unknown>
  1697. 38.60 s > at <unknown source file>:<unknown line>
  1698. 38.60 s > 12: test[75d6903177b1d7e9]::run_test::{closure#0}<unknown>
  1699. 38.60 s > at <unknown source file>:<unknown line>
  1700. 38.60 s > 13: std[bcb96dfbba0ab899]::sys::backtrace::__rust_begin_short_backtrace::<test[75d6903177b1d7e9]::run_test::{closure#1}, ()><unknown>
  1701. 38.60 s > at <unknown source file>:<unknown line>
  1702. 38.60 s > 14: <std[bcb96dfbba0ab899]::thread::lifecycle::spawn_unchecked<test[75d6903177b1d7e9]::run_test::{closure#1}, ()>::{closure#1} as core[940e698046960fd5]::ops::function::FnOnce<()>>::call_once::{shim:vtable#0}<unknown>
  1703. 38.60 s > at <unknown source file>:<unknown line>
  1704. 38.60 s > 15: <std[bcb96dfbba0ab899]::sys::thread::unix::Thread>::new::thread_start<unknown>
  1705. 38.60 s > at <unknown source file>:<unknown line>
  1706. 38.60 s > 16: start_thread<unknown>
  1707. 38.60 s > at <unknown source file>:<unknown line>
  1708. 38.60 s > 17: __clone3<unknown>
  1709. 38.60 s > at <unknown source file>:<unknown line>
  1710. 38.60 s >
  1711. 38.60 s > Run with COLORBT_SHOW_HIDDEN=1 environment variable to disable frame filtering.
  1712. 38.60 s > Run with RUST_BACKTRACE=full to include source snippets.
  1713. 38.60 s >
  1714. 38.60 s > 5. gammalooprs::uv::tests::scalars_profile
  1715. 38.60 s > failure: test failure with exit code 101
  1716. 38.60 s > system-out
  1717. 38.60 s > running 1 test
  1718. 38.60 s > test uv::tests::scalars_profile ... FAILED
  1719. 38.60 s >
  1720. 38.60 s > failures:
  1721. 38.60 s >
  1722. 38.60 s > failures:
  1723. 38.60 s > uv::tests::scalars_profile
  1724. 38.60 s >
  1725. 38.60 s > test result: FAILED. 0 passed; 1 failed; 0 ignored; 0 measured; 589 filtered out; finished in 5.81s
  1726. 38.60 s > system-err
  1727. 38.60 s > [00:01:31.088] @gammalooprs::settings::runtime WARNING : No external kinematics were provided; using default-generated external momenta and helicities.
  1728. 38.60 s > field value
  1729. 38.60 s > span build_integrand{amplitude.name=bub}
  1730. 38.60 s > at crates/gammalooprs/src/settings/runtime.rs:131
  1731. 38.60 s > [00:01:31.089] @gammalooprs::integrands::process::amplitude INFO : Input is below threshold: 0 existing threshold E-surfaces across 0/3 graph groups
  1732. 38.60 s > field value
  1733. 38.60 s > existing_esurfaces 0
  1734. 38.60 s > group_count 3
  1735. 38.60 s > groups_above_threshold 0
  1736. 38.60 s > integrand bub
  1737. 38.60 s > span warm_up{integrand.name=bub}
  1738. 38.60 s > threshold_status below threshold
  1739. 38.60 s > at crates/gammalooprs/src/integrands/process/amplitude/mod.rs:1666
  1740. 38.60 s > [00:01:31.089] @gammalooprs::integrands::process::amplitude INFO : overlap structure of group 0: [0: []]
  1741. 38.60 s > field value
  1742. 38.60 s > span warm_up{integrand.name=bub}
  1743. 38.60 s > at crates/gammalooprs/src/integrands/process/amplitude/mod.rs:2015
  1744. 38.60 s > [00:01:31.089] @gammalooprs::integrands::process::amplitude INFO : overlap structure of group 1: [0: []]
  1745. 38.60 s > field value
  1746. 38.60 s > span warm_up{integrand.name=bub}
  1747. 38.60 s > at crates/gammalooprs/src/integrands/process/amplitude/mod.rs:2015
  1748. 38.60 s > [00:01:31.089] @gammalooprs::integrands::process::amplitude INFO : overlap structure of group 2: [0: []]
  1749. 38.60 s > field value
  1750. 38.60 s > span warm_up{integrand.name=bub}
  1751. 38.60 s > at crates/gammalooprs/src/integrands/process/amplitude/mod.rs:2015
  1752. 38.60 s > The application panicked (crashed).
  1753. 38.60 s > Message: assertion `left == right` failed: subtracted scalar UV profile failed:
  1754. 38.60 s > UVProfilePassFail {
  1755. 38.60 s > max_dod: -0.9,
  1756. 38.60 s > total: 16,
  1757. 38.60 s > failed: 1,
  1758. 38.60 s > failures: [
  1759. 38.60 s > UVProfileFailure {
  1760. 38.60 s > graph_index: 0,
  1761. 38.60 s > graph_name: "banana",
  1762. 38.60 s > cutkosky_cut: None,
  1763. 38.60 s > lmb_index: 1,
  1764. 38.60 s > fixed: [
  1765. 38.60 s > EdgeIndex(
  1766. 38.60 s > 2,
  1767. 38.60 s > ),
  1768. 38.60 s > EdgeIndex(
  1769. 38.60 s > 0,
  1770. 38.60 s > ),
  1771. 38.60 s > ],
  1772. 38.60 s > free: [
  1773. 38.60 s > EdgeIndex(
  1774. 38.60 s > 3,
  1775. 38.60 s > ),
  1776. 38.60 s > ],
  1777. 38.60 s > orientation_label: None,
  1778. 38.60 s > reason: "dod_exceeds_threshold",
  1779. 38.60 s > },
  1780. 38.60 s > ],
  1781. 38.60 s > }
  1782. 38.60 s >
  1783. 38.60 s > ╭─────────┬────────────┬───────────┬───────┬─────┬──────────┬───────────╮
  1784. 38.60 s > │ fixed │ → ∞ │ slope │ r2 │ DOD │ bare DOD │ inspect │
  1785. 38.60 s > ├─────────┼────────────┼───────────┼───────┼─────┼──────────┼───────────┤
  1786. 38.60 s > │ {e1,e2} │ {e3} │ -0.996752 │ 1.000 │ -1 │ 0 │ arb retry │
  1787. 38.60 s > │ {e1,e3} │ {e2} │ -1.065665 │ 0.997 │ -1 │ 0 │ arb retry │
  1788. 38.60 s > │ {e1} │ {e2,e3} │ -0.937151 │ 0.943 │ -1 │ 2 │ │
  1789. 38.60 s > │ {e2,e3} │ {e1} │ -1.001075 │ 1.000 │ -1 │ 0 │ arb retry │
  1790. 38.60 s > │ {e2} │ {e1,e3} │ -0.984146 │ 0.998 │ -1 │ 2 │ │
  1791. 38.60 s > │ {e3} │ {e1,e2} │ -1.383911 │ 0.982 │ -1 │ 2 │ arb retry │
  1792. 38.60 s > │ {} │ {e1,e2,e3} │ -1.094213 │ 0.258 │ -1 │ 4 │ │
  1793. 38.60 s > │ {e2,e0} │ {e3} │ -0.803348 │ 0.861 │ -1 │ 0 │ arb retry │
  1794. 38.60 s > │ {e3,e0} │ {e2} │ -0.999257 │ 1.000 │ -1 │ 0 │ │
  1795. 38.60 s > │ {e0} │ {e2,e3} │ -1.000893 │ 1.000 │ -1 │ 2 │ │
  1796. 38.60 s > │ {e1,e0} │ {e3} │ -0.997860 │ 1.000 │ -1 │ 0 │ │
  1797. 38.60 s > ╰─────────┴────────────┴───────────┴───────┴─────┴──────────┴───────────╯
  1798. 38.60 s >
  1799. 38.60 s > ╭───────┬─────────┬───────────┬───────┬─────┬──────────┬───────────╮
  1800. 38.60 s > │ fixed │ → ∞ │ slope │ r2 │ DOD │ bare DOD │ inspect │
  1801. 38.60 s > ├───────┼─────────┼───────────┼───────┼─────┼──────────┼───────────┤
  1802. 38.60 s > │ {e1} │ {e2} │ -1.005039 │ 1.000 │ -1 │ 0 │ arb retry │
  1803. 38.60 s > │ {e2} │ {e1} │ -1.001098 │ 1.000 │ -1 │ 0 │ arb retry │
  1804. 38.60 s > │ {} │ {e1,e2} │ -1.011289 │ 1.000 │ -1 │ 2 │ │
  1805. 38.60 s > │ {e0} │ {e2} │ -0.998140 │ 1.000 │ -1 │ 0 │ │
  1806. 38.60 s > ╰───────┴─────────┴───────────┴───────┴─────┴──────────┴───────────╯
  1807. 38.60 s >
  1808. 38.60 s > ╭───────┬──────┬───────────┬───────┬─────┬──────────┬─────────╮
  1809. 38.60 s > │ fixed │ → ∞ │ slope │ r2 │ DOD │ bare DOD │ inspect │
  1810. 38.60 s > ├───────┼──────┼───────────┼───────┼─────┼──────────┼─────────┤
  1811. 38.60 s > │ {} │ {e1} │ -0.989949 │ 1.000 │ -1 │ 0 │ │
  1812. 38.60 s > ╰───────┴──────┴───────────┴───────┴─────┴──────────┴─────────╯
  1813. 38.60 s > left: 1
  1814. 38.60 s > right: 0
  1815. 38.60 s > Location: crates/gammalooprs/src/uv/tests.rs:259
  1816. 38.60 s >
  1817. 38.60 s > ━━━━━━━━━━━━━━━━━━━━━━━━━━━━━━━━━━ BACKTRACE ━━━━━━━━━━━━━━━━━━━━━━━━━━━━━━━━━━━
  1818. 38.60 s > 1: <color_eyre[51793ea62743adbd]::config::PanicHook>::panic_report<unknown>
  1819. 38.60 s > at <unknown source file>:<unknown line>
  1820. 38.60 s > 2: <color_eyre[51793ea62743adbd]::config::PanicHook>::into_panic_hook::{closure#0}<unknown>
  1821. 38.60 s > at <unknown source file>:<unknown line>
  1822. 38.60 s > 3: std[bcb96dfbba0ab899]::panicking::panic_with_hook<unknown>
  1823. 38.60 s > at <unknown source file>:<unknown line>
  1824. 38.60 s > 4: std[bcb96dfbba0ab899]::panicking::panic_handler::{closure#0}<unknown>
  1825. 38.60 s > at <unknown source file>:<unknown line>
  1826. 38.60 s > 5: std[bcb96dfbba0ab899]::sys::backtrace::__rust_end_short_backtrace::<std[bcb96dfbba0ab899]::panicking::panic_handler::{closure#0}, !><unknown>
  1827. 38.60 s > at <unknown source file>:<unknown line>
  1828. 38.60 s > 6: __rustc[6c289b9f9c454d21]::rust_begin_unwind<unknown>
  1829. 38.60 s > at <unknown source file>:<unknown line>
  1830. 38.60 s > 7: core[940e698046960fd5]::panicking::panic_fmt<unknown>
  1831. 38.60 s > at <unknown source file>:<unknown line>
  1832. 38.60 s > 8: core[940e698046960fd5]::panicking::assert_failed_inner<unknown>
  1833. 38.60 s > at <unknown source file>:<unknown line>
  1834. 38.60 s > 9: core[940e698046960fd5]::panicking::assert_failed::<usize, usize><unknown>
  1835. 38.60 s > at <unknown source file>:<unknown line>
  1836. 38.60 s > 10: gammalooprs[6dc202c8af9e2ddf]::uv::tests::scalars_profile<unknown>
  1837. 38.60 s > at <unknown source file>:<unknown line>
  1838. 38.60 s > 11: <gammalooprs[6dc202c8af9e2ddf]::uv::tests::scalars_profile::{closure#0} as core[940e698046960fd5]::ops::function::FnOnce<()>>::call_once<unknown>
  1839. 38.60 s > at <unknown source file>:<unknown line>
  1840. 38.60 s > 12: test[75d6903177b1d7e9]::__rust_begin_short_backtrace::<core[940e698046960fd5]::result::Result<(), alloc[2ea6bcb46fca0c42]::string::String>, fn() -> core[940e698046960fd5]::result::Result<(), alloc[2ea6bcb46fca0c42]::string::String>><unknown>
  1841. 38.60 s > at <unknown source file>:<unknown line>
  1842. 38.60 s > 13: test[75d6903177b1d7e9]::run_test::{closure#0}<unknown>
  1843. 38.60 s > at <unknown source file>:<unknown line>
  1844. 38.60 s > 14: std[bcb96dfbba0ab899]::sys::backtrace::__rust_begin_short_backtrace::<test[75d6903177b1d7e9]::run_test::{closure#1}, ()><unknown>
  1845. 38.60 s > at <unknown source file>:<unknown line>
  1846. 38.60 s > ... omitted 11 more lines; see full nextest output above
  1847. 38.60 s >
  1848. 38.60 s > 6. gammalooprs::uv::tests::scalars_profile_new
  1849. 38.60 s > failure: test failure with exit code 101
  1850. 38.60 s > system-out
  1851. 38.60 s > running 1 test
  1852. 38.60 s > test uv::tests::scalars_profile_new ... FAILED
  1853. 38.60 s >
  1854. 38.60 s > failures:
  1855. 38.60 s >
  1856. 38.60 s > failures:
  1857. 38.60 s > uv::tests::scalars_profile_new
  1858. 38.61 s >
  1859. 38.61 s > test result: FAILED. 0 passed; 1 failed; 0 ignored; 0 measured; 589 filtered out; finished in 5.91s
  1860. 38.61 s > system-err
  1861. 38.61 s > [00:01:31.195] @gammalooprs::settings::runtime WARNING : No external kinematics were provided; using default-generated external momenta and helicities.
  1862. 38.61 s > field value
  1863. 38.61 s > span build_integrand{amplitude.name=bub}
  1864. 38.61 s > at crates/gammalooprs/src/settings/runtime.rs:131
  1865. 38.61 s > [00:01:31.197] @gammalooprs::integrands::process::amplitude INFO : Input is below threshold: 0 existing threshold E-surfaces across 0/3 graph groups
  1866. 38.61 s > field value
  1867. 38.61 s > existing_esurfaces 0
  1868. 38.61 s > group_count 3
  1869. 38.61 s > groups_above_threshold 0
  1870. 38.61 s > integrand bub
  1871. 38.61 s > span warm_up{integrand.name=bub}
  1872. 38.61 s > threshold_status below threshold
  1873. 38.61 s > at crates/gammalooprs/src/integrands/process/amplitude/mod.rs:1666
  1874. 38.61 s > [00:01:31.197] @gammalooprs::integrands::process::amplitude INFO : overlap structure of group 0: [0: []]
  1875. 38.61 s > field value
  1876. 38.61 s > span warm_up{integrand.name=bub}
  1877. 38.61 s > at crates/gammalooprs/src/integrands/process/amplitude/mod.rs:2015
  1878. 38.61 s > [00:01:31.197] @gammalooprs::integrands::process::amplitude INFO : overlap structure of group 1: [0: []]
  1879. 38.61 s > field value
  1880. 38.61 s > span warm_up{integrand.name=bub}
  1881. 38.61 s > at crates/gammalooprs/src/integrands/process/amplitude/mod.rs:2015
  1882. 38.61 s > [00:01:31.197] @gammalooprs::integrands::process::amplitude INFO : overlap structure of group 2: [0: []]
  1883. 38.61 s > field value
  1884. 38.61 s > span warm_up{integrand.name=bub}
  1885. 38.61 s > at crates/gammalooprs/src/integrands/process/amplitude/mod.rs:2015
  1886. 38.61 s > The application panicked (crashed).
  1887. 38.61 s > Message: assertion `left == right` failed: subtracted scalar UV profile failed:
  1888. 38.61 s > UVProfilePassFail {
  1889. 38.61 s > max_dod: -0.9,
  1890. 38.61 s > total: 16,
  1891. 38.61 s > failed: 1,
  1892. 38.61 s > failures: [
  1893. 38.61 s > UVProfileFailure {
  1894. 38.61 s > graph_index: 0,
  1895. 38.61 s > graph_name: "banana",
  1896. 38.61 s > cutkosky_cut: None,
  1897. 38.61 s > lmb_index: 1,
  1898. 38.61 s > fixed: [
  1899. 38.61 s > EdgeIndex(
  1900. 38.61 s > 2,
  1901. 38.61 s > ),
  1902. 38.61 s > EdgeIndex(
  1903. 38.61 s > 0,
  1904. 38.61 s > ),
  1905. 38.61 s > ],
  1906. 38.61 s > free: [
  1907. 38.61 s > EdgeIndex(
  1908. 38.61 s > 3,
  1909. 38.61 s > ),
  1910. 38.61 s > ],
  1911. 38.61 s > orientation_label: None,
  1912. 38.61 s > reason: "dod_exceeds_threshold",
  1913. 38.61 s > },
  1914. 38.61 s > ],
  1915. 38.61 s > }
  1916. 38.61 s >
  1917. 38.61 s > ╭─────────┬────────────┬───────────┬───────┬─────┬──────────┬───────────╮
  1918. 38.61 s > │ fixed │ → ∞ │ slope │ r2 │ DOD │ bare DOD │ inspect │
  1919. 38.61 s > ├─────────┼────────────┼───────────┼───────┼─────┼──────────┼───────────┤
  1920. 38.61 s > │ {e1,e2} │ {e3} │ -0.996752 │ 1.000 │ -1 │ 0 │ arb retry │
  1921. 38.61 s > │ {e1,e3} │ {e2} │ -1.065665 │ 0.997 │ -1 │ 0 │ arb retry │
  1922. 38.61 s > │ {e1} │ {e2,e3} │ -0.937151 │ 0.943 │ -1 │ 2 │ │
  1923. 38.61 s > │ {e2,e3} │ {e1} │ -1.001075 │ 1.000 │ -1 │ 0 │ arb retry │
  1924. 38.61 s > │ {e2} │ {e1,e3} │ -0.984146 │ 0.998 │ -1 │ 2 │ │
  1925. 38.61 s > │ {e3} │ {e1,e2} │ -1.383911 │ 0.982 │ -1 │ 2 │ arb retry │
  1926. 38.61 s > │ {} │ {e1,e2,e3} │ -1.094213 │ 0.258 │ -1 │ 4 │ │
  1927. 38.61 s > │ {e2,e0} │ {e3} │ -0.803348 │ 0.861 │ -1 │ 0 │ arb retry │
  1928. 38.61 s > │ {e3,e0} │ {e2} │ -0.999257 │ 1.000 │ -1 │ 0 │ │
  1929. 38.61 s > │ {e0} │ {e2,e3} │ -1.000893 │ 1.000 │ -1 │ 2 │ │
  1930. 38.61 s > │ {e1,e0} │ {e3} │ -0.997860 │ 1.000 │ -1 │ 0 │ │
  1931. 38.61 s > ╰─────────┴────────────┴───────────┴───────┴─────┴──────────┴───────────╯
  1932. 38.61 s >
  1933. 38.61 s > ╭───────┬─────────┬───────────┬───────┬─────┬──────────┬───────────╮
  1934. 38.61 s > │ fixed │ → ∞ │ slope │ r2 │ DOD │ bare DOD │ inspect │
  1935. 38.61 s > ├───────┼─────────┼───────────┼───────┼─────┼──────────┼───────────┤
  1936. 38.61 s > │ {e1} │ {e2} │ -1.005039 │ 1.000 │ -1 │ 0 │ arb retry │
  1937. 38.61 s > │ {e2} │ {e1} │ -1.001098 │ 1.000 │ -1 │ 0 │ arb retry │
  1938. 38.61 s > │ {} │ {e1,e2} │ -1.011289 │ 1.000 │ -1 │ 2 │ │
  1939. 38.61 s > │ {e0} │ {e2} │ -0.998140 │ 1.000 │ -1 │ 0 │ │
  1940. 38.61 s > ╰───────┴─────────┴───────────┴───────┴─────┴──────────┴───────────╯
  1941. 38.61 s >
  1942. 38.61 s > ╭───────┬──────┬───────────┬───────┬─────┬──────────┬─────────╮
  1943. 38.61 s > │ fixed │ → ∞ │ slope │ r2 │ DOD │ bare DOD │ inspect │
  1944. 38.61 s > ├───────┼──────┼───────────┼───────┼─────┼──────────┼─────────┤
  1945. 38.61 s > │ {} │ {e1} │ -0.989949 │ 1.000 │ -1 │ 0 │ │
  1946. 38.61 s > ╰───────┴──────┴───────────┴───────┴─────┴──────────┴─────────╯
  1947. 38.61 s > left: 1
  1948. 38.61 s > right: 0
  1949. 38.61 s > Location: crates/gammalooprs/src/uv/tests.rs:325
  1950. 38.61 s >
  1951. 38.61 s > ━━━━━━━━━━━━━━━━━━━━━━━━━━━━━━━━━━ BACKTRACE ━━━━━━━━━━━━━━━━━━━━━━━━━━━━━━━━━━━
  1952. 38.61 s > 1: <color_eyre[51793ea62743adbd]::config::PanicHook>::panic_report<unknown>
  1953. 38.61 s > at <unknown source file>:<unknown line>
  1954. 38.61 s > 2: <color_eyre[51793ea62743adbd]::config::PanicHook>::into_panic_hook::{closure#0}<unknown>
  1955. 38.61 s > at <unknown source file>:<unknown line>
  1956. 38.61 s > 3: std[bcb96dfbba0ab899]::panicking::panic_with_hook<unknown>
  1957. 38.61 s > at <unknown source file>:<unknown line>
  1958. 38.61 s > 4: std[bcb96dfbba0ab899]::panicking::panic_handler::{closure#0}<unknown>
  1959. 38.61 s > at <unknown source file>:<unknown line>
  1960. 38.61 s > 5: std[bcb96dfbba0ab899]::sys::backtrace::__rust_end_short_backtrace::<std[bcb96dfbba0ab899]::panicking::panic_handler::{closure#0}, !><unknown>
  1961. 38.61 s > at <unknown source file>:<unknown line>
  1962. 38.61 s > 6: __rustc[6c289b9f9c454d21]::rust_begin_unwind<unknown>
  1963. 38.61 s > at <unknown source file>:<unknown line>
  1964. 38.61 s > 7: core[940e698046960fd5]::panicking::panic_fmt<unknown>
  1965. 38.61 s > at <unknown source file>:<unknown line>
  1966. 38.61 s > 8: core[940e698046960fd5]::panicking::assert_failed_inner<unknown>
  1967. 38.61 s > at <unknown source file>:<unknown line>
  1968. 38.61 s > 9: core[940e698046960fd5]::panicking::assert_failed::<usize, usize><unknown>
  1969. 38.61 s > at <unknown source file>:<unknown line>
  1970. 38.61 s > 10: gammalooprs[6dc202c8af9e2ddf]::uv::tests::scalars_profile_new<unknown>
  1971. 38.61 s > at <unknown source file>:<unknown line>
  1972. 38.61 s > 11: <gammalooprs[6dc202c8af9e2ddf]::uv::tests::scalars_profile_new::{closure#0} as core[940e698046960fd5]::ops::function::FnOnce<()>>::call_once<unknown>
  1973. 38.61 s > at <unknown source file>:<unknown line>
  1974. 38.61 s > 12: test[75d6903177b1d7e9]::__rust_begin_short_backtrace::<core[940e698046960fd5]::result::Result<(), alloc[2ea6bcb46fca0c42]::string::String>, fn() -> core[940e698046960fd5]::result::Result<(), alloc[2ea6bcb46fca0c42]::string::String>><unknown>
  1975. 38.61 s > at <unknown source file>:<unknown line>
  1976. 38.61 s > 13: test[75d6903177b1d7e9]::run_test::{closure#0}<unknown>
  1977. 38.61 s > at <unknown source file>:<unknown line>
  1978. 38.61 s > 14: std[bcb96dfbba0ab899]::sys::backtrace::__rust_begin_short_backtrace::<test[75d6903177b1d7e9]::run_test::{closure#1}, ()><unknown>
  1979. 38.61 s > at <unknown source file>:<unknown line>
  1980. 38.61 s > ... omitted 11 more lines; see full nextest output above
  1981. 38.61 s >
  1982. 38.61 s > 7. gammalooprs::test_renormalization::finite_part_ghost_2loop
  1983. 38.61 s > failure: test failure with exit code 101
  1984. 38.61 s > system-out
  1985. 38.61 s > running 1 test
  1986. 38.61 s > test finite_part_ghost_2loop ... FAILED
  1987. 38.61 s >
  1988. 38.61 s > failures:
  1989. 38.61 s >
  1990. 38.61 s > failures:
  1991. 38.61 s > finite_part_ghost_2loop
  1992. 38.61 s >
  1993. 38.61 s > test result: FAILED. 0 passed; 1 failed; 0 ignored; 0 measured; 5 filtered out; finished in 3.80s
  1994. 38.61 s > system-err
  1995. 38.61 s > [00:01:29.623] @gammalooprs::processes::amplitude ERROR :
  1996. 38.61 s > field value
  1997. 38.61 s > error generalized CFF expression generation failed for graph `d5` with source-edge numerator energy-degree bounds Some([(1, 1), (2, 1), (3, 1), (5, 2), (6, 2)]): energy-degree bounds do not certify vanishing residues at infinity under the conservative cap check: EnergyDivergenceReport { edge_degree_bounds: [1, 1, 1, 2, 2], loops: [EnergyDirectionReport { loop_id: Some(0), zero_edges: [], active_edges: [0, 1, 2, 4], nullity: None, numerator_degree_bound: 5, denominator_degree: 8, divergence_degree: -3, convergent: true }, EnergyDirectionReport { loop_id: Some(1), zero_edges: [], active_edges: [3, 4], nullity: None, numerator_degree_bound: 4, denominator_degree: 4, divergence_degree: 0, convergent: false }], directions: [EnergyDirectionReport { loop_id: None, zero_edges: [0, 1, 2], active_edges: [3, 4], nullity: Some(1), numerator_degree_bound: 4, denominator_degree: 4, divergence_degree: 0, convergent: false }, EnergyDirectionReport { loop_id: None, zero_edges: [], active_edges: [0, 1, 2, 3, 4], nullity: Some(2), numerator_degree_bound: 7, denominator_degree: 10, divergence_degree: -3, convergent: true }, EnergyDirectionReport { loop_id: None, zero_edges: [3], active_edges: [0, 1, 2, 4], nullity: Some(1), numerator_degree_bound: 5, denominator_degree: 8, divergence_degree: -3, convergent: true }, EnergyDirectionReport { loop_id: None, zero_edges: [4], active_edges: [0, 1, 2, 3], nullity: Some(1), numerator_degree_bound: 5, denominator_degree: 8, divergence_degree: -3, convergent: true }], coordinate_convergent: false, directional_convergent: false, convergent: false }
  1998. 38.61 s > 3D source has 2 loop names ["e1", "e5"], 5 internal edges [edge 0: 0 -> 1, loops=[1, 0], externals=[0, 0]; edge 1: 0 -> 2, loops=[-1, 0], externals=[1, 0]; edge 2: 1 -> 3, loops=[1, 0], externals=[-1, 0]; edge 3: 2 -> 3, loops=[0, 1], externals=[0, 0]; edge 4: 2 -> 3, loops=[-1, -1], externals=[1, 0]]
  1999. 38.61 s > at crates/gammalooprs/src/processes/amplitude.rs:826
  2000. 38.61 s > The application panicked (crashed).
  2001. 38.61 s > Message: called `Result::unwrap()` on an `Err` value:
  2002. 38.61 s > 0: generalized CFF expression generation failed for graph `d5` with source-edge numerator energy-degree bounds Some([(1, 1), (2, 1), (3, 1), (5, 2), (6, 2)]): energy-degree bounds do not certify vanishing residues at infinity under the conservative cap check: EnergyDivergenceReport { edge_degree_bounds: [1, 1, 1, 2, 2], loops: [EnergyDirectionReport { loop_id: Some(0), zero_edges: [], active_edges: [0, 1, 2, 4], nullity: None, numerator_degree_bound: 5, denominator_degree: 8, divergence_degree: -3, convergent: true }, EnergyDirectionReport { loop_id: Some(1), zero_edges: [], active_edges: [3, 4], nullity: None, numerator_degree_bound: 4, denominator_degree: 4, divergence_degree: 0, convergent: false }], directions: [EnergyDirectionReport { loop_id: None, zero_edges: [0, 1, 2], active_edges: [3, 4], nullity: Some(1), numerator_degree_bound: 4, denominator_degree: 4, divergence_degree: 0, convergent: false }, EnergyDirectionReport { loop_id: None, zero_edges: [], active_edges: [0, 1, 2, 3, 4], nullity: Some(2), numerator_degree_bound: 7, denominator_degree: 10, divergence_degree: -3, convergent: true }, EnergyDirectionReport { loop_id: None, zero_edges: [3], active_edges: [0, 1, 2, 4], nullity: Some(1), numerator_degree_bound: 5, denominator_degree: 8, divergence_degree: -3, convergent: true }, EnergyDirectionReport { loop_id: None, zero_edges: [4], active_edges: [0, 1, 2, 3], nullity: Some(1), numerator_degree_bound: 5, denominator_degree: 8, divergence_degree: -3, convergent: true }], coordinate_convergent: false, directional_convergent: false, convergent: false }
  2003. 38.61 s > 3D source has 2 loop names ["e1", "e5"], 5 internal edges [edge 0: 0 -> 1, loops=[1, 0], externals=[0, 0]; edge 1: 0 -> 2, loops=[-1, 0], externals=[1, 0]; edge 2: 1 -> 3, loops=[1, 0], externals=[-1, 0]; edge 3: 2 -> 3, loops=[0, 1], externals=[0, 0]; edge 4: 2 -> 3, loops=[-1, -1], externals=[1, 0]]
  2004. 38.61 s >
  2005. 38.61 s > Location:
  2006. 38.61 s > crates/gammalooprs/src/cff/generation.rs:227
  2007. 38.61 s >
  2008. 38.61 s > ━━━━━━━━━━━━━━━━━━━━━━━━━━━━━━━━━━ BACKTRACE ━━━━━━━━━━━━━━━━━━━━━━━━━━━━━━━━━━━
  2009. 38.61 s > 1: <color_eyre[51793ea62743adbd]::config::EyreHook>::into_eyre_hook::{closure#0}<unknown>
  2010. 38.61 s > at <unknown source file>:<unknown line>
  2011. 38.61 s > 2: eyre[cb2fd339c0c40fca]::capture_handler<unknown>
  2012. 38.61 s > at <unknown source file>:<unknown line>
  2013. 38.61 s > 3: <eyre[cb2fd339c0c40fca]::Report>::from_adhoc::<alloc[2ea6bcb46fca0c42]::string::String><unknown>
  2014. 38.61 s > at <unknown source file>:<unknown line>
  2015. 38.61 s > 4: <gammalooprs[1d0b14476f7eb2f8]::graph::Graph>::generate_3d_expression_for_integrand<unknown>
  2016. 38.61 s > at <unknown source file>:<unknown line>
  2017. 38.61 s > 5: <gammalooprs[1d0b14476f7eb2f8]::processes::amplitude::AmplitudeGraph>::generate_cff<unknown>
  2018. 38.61 s > at <unknown source file>:<unknown line>
  2019. 38.61 s > 6: <gammalooprs[1d0b14476f7eb2f8]::processes::amplitude::AmplitudeGraph>::renormalization_part<unknown>
  2020. 38.61 s > at <unknown source file>:<unknown line>
  2021. 38.61 s > 7: test_renormalization[879b57236d814a44]::finite_part_ghost_2loop<unknown>
  2022. 38.61 s > at <unknown source file>:<unknown line>
  2023. 38.61 s > 8: <test_renormalization[879b57236d814a44]::finite_part_ghost_2loop::{closure#0} as core[940e698046960fd5]::ops::function::FnOnce<()>>::call_once<unknown>
  2024. 38.61 s > at <unknown source file>:<unknown line>
  2025. 38.61 s > 9: test[75d6903177b1d7e9]::__rust_begin_short_backtrace::<core[940e698046960fd5]::result::Result<(), alloc[2ea6bcb46fca0c42]::string::String>, fn() -> core[940e698046960fd5]::result::Result<(), alloc[2ea6bcb46fca0c42]::string::String>><unknown>
  2026. 38.61 s > at <unknown source file>:<unknown line>
  2027. 38.61 s > 10: test[75d6903177b1d7e9]::run_test::{closure#0}<unknown>
  2028. 38.61 s > at <unknown source file>:<unknown line>
  2029. 38.61 s > 11: std[bcb96dfbba0ab899]::sys::backtrace::__rust_begin_short_backtrace::<test[75d6903177b1d7e9]::run_test::{closure#1}, ()><unknown>
  2030. 38.61 s > at <unknown source file>:<unknown line>
  2031. 38.61 s > 12: <std[bcb96dfbba0ab899]::thread::lifecycle::spawn_unchecked<test[75d6903177b1d7e9]::run_test::{closure#1}, ()>::{closure#1} as core[940e698046960fd5]::ops::function::FnOnce<()>>::call_once::{shim:vtable#0}<unknown>
  2032. 38.61 s > at <unknown source file>:<unknown line>
  2033. 38.61 s > 13: <std[bcb96dfbba0ab899]::sys::thread::unix::Thread>::new::thread_start<unknown>
  2034. 38.61 s > at <unknown source file>:<unknown line>
  2035. 38.61 s > 14: start_thread<unknown>
  2036. 38.61 s > at <unknown source file>:<unknown line>
  2037. 38.61 s > 15: __clone3<unknown>
  2038. 38.61 s > at <unknown source file>:<unknown line>
  2039. 38.61 s >
  2040. 38.61 s > Run with COLORBT_SHOW_HIDDEN=1 environment variable to disable frame filtering.
  2041. 38.61 s > Run with RUST_BACKTRACE=full to include source snippets.
  2042. 38.61 s > Warning: SpanTrace capture is Unsupported.
  2043. 38.61 s > Ensure that you've setup a tracing-error ErrorLayer and the semver versions are compatible
  2044. 38.61 s > Location: crates/gammalooprs/tests/test_renormalization.rs:534
  2045. 38.61 s >
  2046. 38.61 s > ━━━━━━━━━━━━━━━━━━━━━━━━━━━━━━━━━━ BACKTRACE ━━━━━━━━━━━━━━━━━━━━━━━━━━━━━━━━━━━
  2047. 38.61 s > 1: <color_eyre[51793ea62743adbd]::config::PanicHook>::panic_report<unknown>
  2048. 38.61 s > at <unknown source file>:<unknown line>
  2049. 38.61 s > 2: <color_eyre[51793ea62743adbd]::config::PanicHook>::into_panic_hook::{closure#0}<unknown>
  2050. 38.61 s > at <unknown source file>:<unknown line>
  2051. 38.61 s > 3: std[bcb96dfbba0ab899]::panicking::panic_with_hook<unknown>
  2052. 38.61 s > at <unknown source file>:<unknown line>
  2053. 38.61 s > 4: std[bcb96dfbba0ab899]::panicking::panic_handler::{closure#0}<unknown>
  2054. 38.61 s > at <unknown source file>:<unknown line>
  2055. 38.61 s > 5: std[bcb96dfbba0ab899]::sys::backtrace::__rust_end_short_backtrace::<std[bcb96dfbba0ab899]::panicking::panic_handler::{closure#0}, !><unknown>
  2056. 38.61 s > at <unknown source file>:<unknown line>
  2057. 38.61 s > 6: __rustc[6c289b9f9c454d21]::rust_begin_unwind<unknown>
  2058. 38.61 s > at <unknown source file>:<unknown line>
  2059. 38.61 s > 7: core[940e698046960fd5]::panicking::panic_fmt<unknown>
  2060. 38.61 s > at <unknown source file>:<unknown line>
  2061. 38.61 s > 8: core[940e698046960fd5]::result::unwrap_failed<unknown>
  2062. 38.61 s > at <unknown source file>:<unknown line>
  2063. 38.61 s > 9: test_renormalization[879b57236d814a44]::finite_part_ghost_2loop<unknown>
  2064. 38.61 s > at <unknown source file>:<unknown line>
  2065. 38.61 s > 10: <test_renormalization[879b57236d814a44]::finite_part_ghost_2loop::{closure#0} as core[940e698046960fd5]::ops::function::FnOnce<()>>::call_once<unknown>
  2066. 38.61 s > at <unknown source file>:<unknown line>
  2067. 38.61 s > 11: test[75d6903177b1d7e9]::__rust_begin_short_backtrace::<core[940e698046960fd5]::result::Result<(), alloc[2ea6bcb46fca0c42]::string::String>, fn() -> core[940e698046960fd5]::result::Result<(), alloc[2ea6bcb46fca0c42]::string::String>><unknown>
  2068. 38.61 s > at <unknown source file>:<unknown line>
  2069. 38.61 s > 12: test[75d6903177b1d7e9]::run_test::{closure#0}<unknown>
  2070. 38.61 s > at <unknown source file>:<unknown line>
  2071. 38.61 s > 13: std[bcb96dfbba0ab899]::sys::backtrace::__rust_begin_short_backtrace::<test[75d6903177b1d7e9]::run_test::{closure#1}, ()><unknown>
  2072. 38.61 s > at <unknown source file>:<unknown line>
  2073. 38.61 s > 14: <std[bcb96dfbba0ab899]::thread::lifecycle::spawn_unchecked<test[75d6903177b1d7e9]::run_test::{closure#1}, ()>::{closure#1} as core[940e698046960fd5]::ops::function::FnOnce<()>>::call_once::{shim:vtable#0}<unknown>
  2074. 38.61 s > at <unknown source file>:<unknown line>
  2075. 38.61 s > 15: <std[bcb96dfbba0ab899]::sys::thread::unix::Thread>::new::thread_start<unknown>
  2076. 38.61 s > at <unknown source file>:<unknown line>
  2077. 38.61 s > 16: start_thread<unknown>
  2078. 38.61 s > at <unknown source file>:<unknown line>
  2079. 38.61 s > 17: __clone3<unknown>
  2080. 38.61 s > at <unknown source file>:<unknown line>
  2081. 38.61 s >
  2082. 38.61 s > Run with COLORBT_SHOW_HIDDEN=1 environment variable to disable frame filtering.
  2083. 38.61 s > Run with RUST_BACKTRACE=full to include source snippets.
  2084. 38.61 s > =========================================
  2085. 38.61 s > Extracting 1 binary and 1 linked path to /build/nextest-archive-Rx8B7s
  2086. 38.61 s > Extracted 7 files to /build/nextest-archive-Rx8B7s in 0.06s
  2087. 38.61 s > ------------
  2088. 38.61 s > Nextest run ID 56180749-d1c0-44f3-8b29-e75332440f15 with nextest profile: ci_gammaloop
  2089. 38.61 s > Starting 56 tests across 1 binary
  2090. 38.61 s > FAIL [ 0.006s] (17/56) three-dimensional-reps generation::cff_tests::causal_repeated_generation_handles_energy_dependent_bubble_source
  2091. 38.61 s > stdout ---
  2092. 38.61 s >
  2093. 38.61 s > running 1 test
  2094. 38.61 s > test generation::cff_tests::causal_repeated_generation_handles_energy_dependent_bubble_source ... FAILED
  2095. 38.61 s >
  2096. 38.61 s > failures:
  2097. 38.61 s >
  2098. 38.61 s > failures:
  2099. 38.61 s > generation::cff_tests::causal_repeated_generation_handles_energy_dependent_bubble_source
  2100. 38.61 s >
  2101. 38.61 s > test result: FAILED. 0 passed; 1 failed; 0 ignored; 0 measured; 55 filtered out; finished in 0.00s
  2102. 38.61 s >
  2103. 38.61 s > stderr ---
  2104. 38.61 s >
  2105. 38.61 s > thread 'generation::cff_tests::causal_repeated_generation_handles_energy_dependent_bubble_source' (3278) panicked at crates/three-dimensional-reps/src/generation.rs:5979:9:
  2106. 38.61 s > assertion `left == right` failed
  2107. 38.61 s > left: GlobalSourceProduct
  2108. 38.61 s > right: VariantLocal
  2109. 38.61 s > stack backtrace:
  2110. 38.61 s > 0: __rustc::rust_begin_unwind
  2111. 38.61 s > 1: core::panicking::panic_fmt
  2112. 38.61 s > 2: core::panicking::assert_failed_inner
  2113. 38.61 s > 3: core::panicking::assert_failed::<three_dimensional_reps::generation::CffEnergyFactorOwnership, three_dimensional_reps::generation::CffEnergyFactorOwnership>
  2114. 38.61 s > 4: three_dimensional_reps::generation::cff_tests::causal_repeated_generation_handles_energy_dependent_bubble_source
  2115. 38.61 s > 5: <three_dimensional_reps::generation::cff_tests::causal_repeated_generation_handles_energy_dependent_bubble_source::{closure#0} as core::ops::function::FnOnce<()>>::call_once
  2116. 38.61 s > note: Some details are omitted, run with `RUST_BACKTRACE=full` for a verbose backtrace.
  2117. 38.61 s >
  2118. 38.61 s > FAIL [ 0.011s] (30/56) three-dimensional-reps generation::cff_tests::disconnected_mixed_energy_factor_ownership_keeps_both_component_factors
  2119. 38.61 s > stdout ---
  2120. 38.61 s >
  2121. 38.61 s > running 1 test
  2122. 38.61 s > test generation::cff_tests::disconnected_mixed_energy_factor_ownership_keeps_both_component_factors ... FAILED
  2123. 38.61 s >
  2124. 38.61 s > failures:
  2125. 38.61 s >
  2126. 38.61 s > failures:
  2127. 38.61 s > generation::cff_tests::disconnected_mixed_energy_factor_ownership_keeps_both_component_factors
  2128. 38.61 s >
  2129. 38.61 s > test result: FAILED. 0 passed; 1 failed; 0 ignored; 0 measured; 55 filtered out; finished in 0.01s
  2130. 38.61 s >
  2131. 38.61 s > stderr ---
  2132. 38.61 s >
  2133. 38.61 s > thread 'generation::cff_tests::disconnected_mixed_energy_factor_ownership_keeps_both_component_factors' (3315) panicked at crates/three-dimensional-reps/src/generation.rs:5795:9:
  2134. 38.61 s > assertion `left == right` failed
  2135. 38.61 s > left: [GlobalSourceProduct, GlobalSourceProduct]
  2136. 38.61 s > right: [VariantLocal, GlobalSourceProduct]
  2137. 38.61 s > stack backtrace:
  2138. 38.61 s > 0: __rustc::rust_begin_unwind
  2139. 38.61 s > 1: core::panicking::panic_fmt
  2140. 38.61 s > 2: core::panicking::assert_failed_inner
  2141. 38.61 s > 3: core::panicking::assert_failed::<alloc::vec::Vec<three_dimensional_reps::generation::CffEnergyFactorOwnership>, alloc::vec::Vec<three_dimensional_reps::generation::CffEnergyFactorOwnership>>
  2142. 38.61 s > 4: three_dimensional_reps::generation::cff_tests::disconnected_mixed_energy_factor_ownership_keeps_both_component_factors
  2143. 38.61 s > 5: <three_dimensional_reps::generation::cff_tests::disconnected_mixed_energy_factor_ownership_keeps_both_component_factors::{closure#0} as core::ops::function::FnOnce<()>>::call_once
  2144. 38.61 s > note: Some details are omitted, run with `RUST_BACKTRACE=full` for a verbose backtrace.
  2145. 38.61 s >
  2146. 38.61 s > FAIL [ 0.058s] (48/56) three-dimensional-reps generation::cff_tests::cff_generation_builds_multiloop_repeated_high_power_known_factor_completion
  2147. 38.61 s > stdout ---
  2148. 38.61 s >
  2149. 38.61 s > running 1 test
  2150. 38.61 s > test generation::cff_tests::cff_generation_builds_multiloop_repeated_high_power_known_factor_completion ... FAILED
  2151. 38.61 s >
  2152. 38.61 s > failures:
  2153. 38.61 s >
  2154. 38.61 s > failures:
  2155. 38.61 s > generation::cff_tests::cff_generation_builds_multiloop_repeated_high_power_known_factor_completion
  2156. 38.61 s >
  2157. 38.61 s > test result: FAILED. 0 passed; 1 failed; 0 ignored; 0 measured; 55 filtered out; finished in 0.05s
  2158. 38.61 s >
  2159. 38.61 s > stderr ---
  2160. 38.61 s >
  2161. 38.61 s > thread 'generation::cff_tests::cff_generation_builds_multiloop_repeated_high_power_known_factor_completion' (3280) panicked at crates/three-dimensional-reps/src/generation.rs:6038:9:
  2162. 38.61 s > assertion failed: variants.iter().any(|variant|
  2163. 38.61 s > {
  2164. 38.61 s > variant.origin.as_deref().is_some_and(|origin|
  2165. 38.61 s > {
  2166. 38.61 s > origin.starts_with("bounded_degree_quadratic_recursive_remainder")
  2167. 38.61 s > })
  2168. 38.61 s > })
  2169. 38.61 s > stack backtrace:
  2170. 38.61 s > 0: __rustc::rust_begin_unwind
  2171. 38.61 s > 1: core::panicking::panic_fmt
  2172. 38.61 s > 2: core::panicking::panic
  2173. 38.61 s > 3: three_dimensional_reps::generation::cff_tests::cff_generation_builds_multiloop_repeated_high_power_known_factor_completion
  2174. 38.61 s > 4: <three_dimensional_reps::generation::cff_tests::cff_generation_builds_multiloop_repeated_high_power_known_factor_completion::{closure#0} as core::ops::function::FnOnce<()>>::call_once
  2175. 38.61 s > note: Some details are omitted, run with `RUST_BACKTRACE=full` for a verbose backtrace.
  2176. 38.61 s >
  2177. 38.61 s > FAIL [ 0.099s] (52/56) three-dimensional-reps generation::cff_tests::cff_generation_builds_one_loop_high_power_with_repeated_spectators
  2178. 38.61 s > stdout ---
  2179. 38.61 s >
  2180. 38.61 s > running 1 test
  2181. 38.61 s > test generation::cff_tests::cff_generation_builds_one_loop_high_power_with_repeated_spectators ... FAILED
  2182. 38.61 s >
  2183. 38.61 s > failures:
  2184. 38.61 s >
  2185. 38.61 s > failures:
  2186. 38.61 s > generation::cff_tests::cff_generation_builds_one_loop_high_power_with_repeated_spectators
  2187. 38.61 s >
  2188. 38.61 s > test result: FAILED. 0 passed; 1 failed; 0 ignored; 0 measured; 55 filtered out; finished in 0.09s
  2189. 38.61 s >
  2190. 38.61 s > stderr ---
  2191. 38.61 s >
  2192. 38.61 s > thread 'generation::cff_tests::cff_generation_builds_one_loop_high_power_with_repeated_spectators' (3279) panicked at crates/three-dimensional-reps/src/generation.rs:6494:9:
  2193. 38.61 s > assertion failed: variants.iter().any(|variant|
  2194. 38.61 s > {
  2195. 38.61 s > variant.origin.as_deref().is_some_and(|origin|
  2196. 38.61 s > {
  2197. 38.61 s > origin.starts_with("bounded_degree_quadratic_recursive_remainder")
  2198. 38.61 s > })
  2199. 38.61 s > })
  2200. 38.61 s > stack backtrace:
  2201. 38.61 s > 0: __rustc::rust_begin_unwind
  2202. 38.61 s > 1: core::panicking::panic_fmt
  2203. 38.61 s > 2: core::panicking::panic
  2204. 38.61 s > 3: three_dimensional_reps::generation::cff_tests::cff_generation_builds_one_loop_high_power_with_repeated_spectators
  2205. 38.61 s > 4: <three_dimensional_reps::generation::cff_tests::cff_generation_builds_one_loop_high_power_with_repeated_spectators::{closure#0} as core::ops::function::FnOnce<()>>::call_once
  2206. 38.61 s > note: Some details are omitted, run with `RUST_BACKTRACE=full` for a verbose backtrace.
  2207. 38.61 s >
  2208. 38.61 s > ------------
  2209. 38.61 s > Summary [ 0.436s] 56 tests run: 52 passed, 4 failed, 0 skipped
  2210. 38.61 s > FAIL [ 0.006s] (17/56) three-dimensional-reps generation::cff_tests::causal_repeated_generation_handles_energy_dependent_bubble_source
  2211. 38.61 s > stdout ---
  2212. 38.61 s >
  2213. 38.61 s > running 1 test
  2214. 38.61 s > test generation::cff_tests::causal_repeated_generation_handles_energy_dependent_bubble_source ... FAILED
  2215. 38.61 s >
  2216. 38.61 s > failures:
  2217. 38.61 s >
  2218. 38.61 s > failures:
  2219. 38.61 s > generation::cff_tests::causal_repeated_generation_handles_energy_dependent_bubble_source
  2220. 38.61 s >
  2221. 38.61 s > test result: FAILED. 0 passed; 1 failed; 0 ignored; 0 measured; 55 filtered out; finished in 0.00s
  2222. 38.61 s >
  2223. 38.61 s > stderr ---
  2224. 38.61 s >
  2225. 38.61 s > thread 'generation::cff_tests::causal_repeated_generation_handles_energy_dependent_bubble_source' (3278) panicked at crates/three-dimensional-reps/src/generation.rs:5979:9:
  2226. 38.61 s > assertion `left == right` failed
  2227. 38.61 s > left: GlobalSourceProduct
  2228. 38.61 s > right: VariantLocal
  2229. 38.61 s > stack backtrace:
  2230. 38.61 s > 0: __rustc::rust_begin_unwind
  2231. 38.61 s > 1: core::panicking::panic_fmt
  2232. 38.61 s > 2: core::panicking::assert_failed_inner
  2233. 38.61 s > 3: core::panicking::assert_failed::<three_dimensional_reps::generation::CffEnergyFactorOwnership, three_dimensional_reps::generation::CffEnergyFactorOwnership>
  2234. 38.61 s > 4: three_dimensional_reps::generation::cff_tests::causal_repeated_generation_handles_energy_dependent_bubble_source
  2235. 38.61 s > 5: <three_dimensional_reps::generation::cff_tests::causal_repeated_generation_handles_energy_dependent_bubble_source::{closure#0} as core::ops::function::FnOnce<()>>::call_once
  2236. 38.61 s > note: Some details are omitted, run with `RUST_BACKTRACE=full` for a verbose backtrace.
  2237. 38.61 s >
  2238. 38.61 s > FAIL [ 0.011s] (30/56) three-dimensional-reps generation::cff_tests::disconnected_mixed_energy_factor_ownership_keeps_both_component_factors
  2239. 38.61 s > stdout ---
  2240. 38.61 s >
  2241. 38.61 s > running 1 test
  2242. 38.61 s > test generation::cff_tests::disconnected_mixed_energy_factor_ownership_keeps_both_component_factors ... FAILED
  2243. 38.61 s >
  2244. 38.61 s > failures:
  2245. 38.61 s >
  2246. 38.61 s > failures:
  2247. 38.61 s > generation::cff_tests::disconnected_mixed_energy_factor_ownership_keeps_both_component_factors
  2248. 38.61 s >
  2249. 38.61 s > test result: FAILED. 0 passed; 1 failed; 0 ignored; 0 measured; 55 filtered out; finished in 0.01s
  2250. 38.61 s >
  2251. 38.61 s > stderr ---
  2252. 38.61 s >
  2253. 38.61 s > thread 'generation::cff_tests::disconnected_mixed_energy_factor_ownership_keeps_both_component_factors' (3315) panicked at crates/three-dimensional-reps/src/generation.rs:5795:9:
  2254. 38.61 s > assertion `left == right` failed
  2255. 38.61 s > left: [GlobalSourceProduct, GlobalSourceProduct]
  2256. 38.61 s > right: [VariantLocal, GlobalSourceProduct]
  2257. 38.61 s > stack backtrace:
  2258. 38.61 s > 0: __rustc::rust_begin_unwind
  2259. 38.61 s > 1: core::panicking::panic_fmt
  2260. 38.61 s > 2: core::panicking::assert_failed_inner
  2261. 38.61 s > 3: core::panicking::assert_failed::<alloc::vec::Vec<three_dimensional_reps::generation::CffEnergyFactorOwnership>, alloc::vec::Vec<three_dimensional_reps::generation::CffEnergyFactorOwnership>>
  2262. 38.61 s > 4: three_dimensional_reps::generation::cff_tests::disconnected_mixed_energy_factor_ownership_keeps_both_component_factors
  2263. 38.61 s > 5: <three_dimensional_reps::generation::cff_tests::disconnected_mixed_energy_factor_ownership_keeps_both_component_factors::{closure#0} as core::ops::function::FnOnce<()>>::call_once
  2264. 38.61 s > note: Some details are omitted, run with `RUST_BACKTRACE=full` for a verbose backtrace.
  2265. 38.61 s >
  2266. 38.61 s > FAIL [ 0.058s] (48/56) three-dimensional-reps generation::cff_tests::cff_generation_builds_multiloop_repeated_high_power_known_factor_completion
  2267. 38.61 s > stdout ---
  2268. 38.61 s >
  2269. 38.61 s > running 1 test
  2270. 38.61 s > test generation::cff_tests::cff_generation_builds_multiloop_repeated_high_power_known_factor_completion ... FAILED
  2271. 38.61 s >
  2272. 38.61 s > failures:
  2273. 38.61 s >
  2274. 38.61 s > failures:
  2275. 38.61 s > generation::cff_tests::cff_generation_builds_multiloop_repeated_high_power_known_factor_completion
  2276. 38.61 s >
  2277. 38.61 s > test result: FAILED. 0 passed; 1 failed; 0 ignored; 0 measured; 55 filtered out; finished in 0.05s
  2278. 38.61 s >
  2279. 38.61 s > stderr ---
  2280. 38.61 s >
  2281. 38.61 s > thread 'generation::cff_tests::cff_generation_builds_multiloop_repeated_high_power_known_factor_completion' (3280) panicked at crates/three-dimensional-reps/src/generation.rs:6038:9:
  2282. 38.61 s > assertion failed: variants.iter().any(|variant|
  2283. 38.61 s > {
  2284. 38.61 s > variant.origin.as_deref().is_some_and(|origin|
  2285. 38.61 s > {
  2286. 38.61 s > origin.starts_with("bounded_degree_quadratic_recursive_remainder")
  2287. 38.61 s > })
  2288. 38.61 s > })
  2289. 38.61 s > stack backtrace:
  2290. 38.61 s > 0: __rustc::rust_begin_unwind
  2291. 38.61 s > 1: core::panicking::panic_fmt
  2292. 38.61 s > 2: core::panicking::panic
  2293. 38.61 s > 3: three_dimensional_reps::generation::cff_tests::cff_generation_builds_multiloop_repeated_high_power_known_factor_completion
  2294. 38.61 s > 4: <three_dimensional_reps::generation::cff_tests::cff_generation_builds_multiloop_repeated_high_power_known_factor_completion::{closure#0} as core::ops::function::FnOnce<()>>::call_once
  2295. 38.61 s > note: Some details are omitted, run with `RUST_BACKTRACE=full` for a verbose backtrace.
  2296. 38.61 s >
  2297. 38.61 s > FAIL [ 0.099s] (52/56) three-dimensional-reps generation::cff_tests::cff_generation_builds_one_loop_high_power_with_repeated_spectators
  2298. 38.61 s > stdout ---
  2299. 38.61 s >
  2300. 38.61 s > running 1 test
  2301. 38.61 s > test generation::cff_tests::cff_generation_builds_one_loop_high_power_with_repeated_spectators ... FAILED
  2302. 38.61 s >
  2303. 38.61 s > failures:
  2304. 38.61 s >
  2305. 38.61 s > failures:
  2306. 38.61 s > generation::cff_tests::cff_generation_builds_one_loop_high_power_with_repeated_spectators
  2307. 38.61 s >
  2308. 38.61 s > test result: FAILED. 0 passed; 1 failed; 0 ignored; 0 measured; 55 filtered out; finished in 0.09s
  2309. 38.61 s >
  2310. 38.61 s > stderr ---
  2311. 38.61 s >
  2312. 38.61 s > thread 'generation::cff_tests::cff_generation_builds_one_loop_high_power_with_repeated_spectators' (3279) panicked at crates/three-dimensional-reps/src/generation.rs:6494:9:
  2313. 38.61 s > assertion failed: variants.iter().any(|variant|
  2314. 38.61 s > {
  2315. 38.61 s > variant.origin.as_deref().is_some_and(|origin|
  2316. 38.61 s > {
  2317. 38.61 s > origin.starts_with("bounded_degree_quadratic_recursive_remainder")
  2318. 38.61 s > })
  2319. 38.61 s > })
  2320. 38.61 s > stack backtrace:
  2321. 38.61 s > 0: __rustc::rust_begin_unwind
  2322. 38.61 s > 1: core::panicking::panic_fmt
  2323. 38.61 s > 2: core::panicking::panic
  2324. 38.61 s > 3: three_dimensional_reps::generation::cff_tests::cff_generation_builds_one_loop_high_power_with_repeated_spectators
  2325. 38.61 s > 4: <three_dimensional_reps::generation::cff_tests::cff_generation_builds_one_loop_high_power_with_repeated_spectators::{closure#0} as core::ops::function::FnOnce<()>>::call_once
  2326. 38.61 s > note: Some details are omitted, run with `RUST_BACKTRACE=full` for a verbose backtrace.
  2327. 38.61 s >
  2328. 38.61 s > error: test run failed
  2329. 38.61 s >
  2330. 38.61 s > ========== nextest test summary ==========
  2331. 38.61 s > report: target/nextest/ci_gammaloop/junit.xml
  2332. 38.61 s > tests: 56, failures: 4, errors: 0
  2333. 38.61 s >
  2334. 38.61 s > 1. three-dimensional-reps::generation::cff_tests::causal_repeated_generation_handles_energy_dependent_bubble_source
  2335. 38.61 s > failure: test failure with exit code 101
  2336. 38.61 s > thread 'generation::cff_tests::causal_repeated_generation_handles_energy_dependent_bubble_source' (3278) panicked at crates/three-dimensional-reps/src/generation.rs:5979:9:
  2337. 38.61 s > assertion `left == right` failed
  2338. 38.61 s > left: GlobalSourceProduct
  2339. 38.61 s > right: VariantLocal
  2340. 38.61 s > stack backtrace:
  2341. 38.61 s > 0: __rustc::rust_begin_unwind
  2342. 38.61 s > 1: core::panicking::panic_fmt
  2343. 38.61 s > 2: core::panicking::assert_failed_inner
  2344. 38.61 s > 3: core::panicking::assert_failed::<three_dimensional_reps::generation::CffEnergyFactorOwnership, three_dimensional_reps::generation::CffEnergyFactorOwnership>
  2345. 38.61 s > 4: three_dimensional_reps::generation::cff_tests::causal_repeated_generation_handles_energy_dependent_bubble_source
  2346. 38.61 s > 5: <three_dimensional_reps::generation::cff_tests::causal_repeated_generation_handles_energy_dependent_bubble_source::{closure#0} as core::ops::function::FnOnce<()>>::call_once
  2347. 38.61 s > note: Some details are omitted, run with `RUST_BACKTRACE=full` for a verbose backtrace.
  2348. 38.61 s > system-out
  2349. 38.61 s > running 1 test
  2350. 38.61 s > test generation::cff_tests::causal_repeated_generation_handles_energy_dependent_bubble_source ... FAILED
  2351. 38.61 s >
  2352. 38.61 s > failures:
  2353. 38.61 s >
  2354. 38.61 s > failures:
  2355. 38.61 s > generation::cff_tests::causal_repeated_generation_handles_energy_dependent_bubble_source
  2356. 38.61 s >
  2357. 38.61 s > test result: FAILED. 0 passed; 1 failed; 0 ignored; 0 measured; 55 filtered out; finished in 0.00s
  2358. 38.61 s > system-err
  2359. 38.61 s > thread 'generation::cff_tests::causal_repeated_generation_handles_energy_dependent_bubble_source' (3278) panicked at crates/three-dimensional-reps/src/generation.rs:5979:9:
  2360. 38.61 s > assertion `left == right` failed
  2361. 38.61 s > left: GlobalSourceProduct
  2362. 38.61 s > right: VariantLocal
  2363. 38.61 s > stack backtrace:
  2364. 38.61 s > 0: __rustc::rust_begin_unwind
  2365. 38.61 s > 1: core::panicking::panic_fmt
  2366. 38.61 s > 2: core::panicking::assert_failed_inner
  2367. 38.61 s > 3: core::panicking::assert_failed::<three_dimensional_reps::generation::CffEnergyFactorOwnership, three_dimensional_reps::generation::CffEnergyFactorOwnership>
  2368. 38.61 s > 4: three_dimensional_reps::generation::cff_tests::causal_repeated_generation_handles_energy_dependent_bubble_source
  2369. 38.61 s > 5: <three_dimensional_reps::generation::cff_tests::causal_repeated_generation_handles_energy_dependent_bubble_source::{closure#0} as core::ops::function::FnOnce<()>>::call_once
  2370. 38.61 s > note: Some details are omitted, run with `RUST_BACKTRACE=full` for a verbose backtrace.
  2371. 38.61 s >
  2372. 38.61 s > 2. three-dimensional-reps::generation::cff_tests::disconnected_mixed_energy_factor_ownership_keeps_both_component_factors
  2373. 38.61 s > failure: test failure with exit code 101
  2374. 38.61 s > thread 'generation::cff_tests::disconnected_mixed_energy_factor_ownership_keeps_both_component_factors' (3315) panicked at crates/three-dimensional-reps/src/generation.rs:5795:9:
  2375. 38.61 s > assertion `left == right` failed
  2376. 38.61 s > left: [GlobalSourceProduct, GlobalSourceProduct]
  2377. 38.61 s > right: [VariantLocal, GlobalSourceProduct]
  2378. 38.61 s > stack backtrace:
  2379. 38.61 s > 0: __rustc::rust_begin_unwind
  2380. 38.61 s > 1: core::panicking::panic_fmt
  2381. 38.61 s > 2: core::panicking::assert_failed_inner
  2382. 38.61 s > 3: core::panicking::assert_failed::<alloc::vec::Vec<three_dimensional_reps::generation::CffEnergyFactorOwnership>, alloc::vec::Vec<three_dimensional_reps::generation::CffEnergyFactorOwnership>>
  2383. 38.61 s > 4: three_dimensional_reps::generation::cff_tests::disconnected_mixed_energy_factor_ownership_keeps_both_component_factors
  2384. 38.61 s > 5: <three_dimensional_reps::generation::cff_tests::disconnected_mixed_energy_factor_ownership_keeps_both_component_factors::{closure#0} as core::ops::function::FnOnce<()>>::call_once
  2385. 38.61 s > note: Some details are omitted, run with `RUST_BACKTRACE=full` for a verbose backtrace.
  2386. 38.61 s > system-out
  2387. 38.61 s > running 1 test
  2388. 38.61 s > test generation::cff_tests::disconnected_mixed_energy_factor_ownership_keeps_both_component_factors ... FAILED
  2389. 38.61 s >
  2390. 38.61 s > failures:
  2391. 38.61 s >
  2392. 38.61 s > failures:
  2393. 38.61 s > generation::cff_tests::disconnected_mixed_energy_factor_ownership_keeps_both_component_factors
  2394. 38.61 s >
  2395. 38.61 s > test result: FAILED. 0 passed; 1 failed; 0 ignored; 0 measured; 55 filtered out; finished in 0.01s
  2396. 38.61 s > system-err
  2397. 38.61 s > thread 'generation::cff_tests::disconnected_mixed_energy_factor_ownership_keeps_both_component_factors' (3315) panicked at crates/three-dimensional-reps/src/generation.rs:5795:9:
  2398. 38.61 s > assertion `left == right` failed
  2399. 38.61 s > left: [GlobalSourceProduct, GlobalSourceProduct]
  2400. 38.61 s > right: [VariantLocal, GlobalSourceProduct]
  2401. 38.61 s > stack backtrace:
  2402. 38.61 s > 0: __rustc::rust_begin_unwind
  2403. 38.61 s > 1: core::panicking::panic_fmt
  2404. 38.61 s > 2: core::panicking::assert_failed_inner
  2405. 38.61 s > 3: core::panicking::assert_failed::<alloc::vec::Vec<three_dimensional_reps::generation::CffEnergyFactorOwnership>, alloc::vec::Vec<three_dimensional_reps::generation::CffEnergyFactorOwnership>>
  2406. 38.61 s > 4: three_dimensional_reps::generation::cff_tests::disconnected_mixed_energy_factor_ownership_keeps_both_component_factors
  2407. 38.61 s > 5: <three_dimensional_reps::generation::cff_tests::disconnected_mixed_energy_factor_ownership_keeps_both_component_factors::{closure#0} as core::ops::function::FnOnce<()>>::call_once
  2408. 38.61 s > note: Some details are omitted, run with `RUST_BACKTRACE=full` for a verbose backtrace.
  2409. 38.61 s >
  2410. 38.61 s > 3. three-dimensional-reps::generation::cff_tests::cff_generation_builds_multiloop_repeated_high_power_known_factor_completion
  2411. 38.61 s > failure: test failure with exit code 101
  2412. 38.61 s > thread 'generation::cff_tests::cff_generation_builds_multiloop_repeated_high_power_known_factor_completion' (3280) panicked at crates/three-dimensional-reps/src/generation.rs:6038:9:
  2413. 38.61 s > assertion failed: variants.iter().any(|variant|
  2414. 38.61 s > {
  2415. 38.61 s > variant.origin.as_deref().is_some_and(|origin|
  2416. 38.61 s > {
  2417. 38.61 s > origin.starts_with("bounded_degree_quadratic_recursive_remainder")
  2418. 38.61 s > })
  2419. 38.61 s > })
  2420. 38.61 s > stack backtrace:
  2421. 38.61 s > 0: __rustc::rust_begin_unwind
  2422. 38.61 s > 1: core::panicking::panic_fmt
  2423. 38.61 s > 2: core::panicking::panic
  2424. 38.61 s > 3: three_dimensional_reps::generation::cff_tests::cff_generation_builds_multiloop_repeated_high_power_known_factor_completion
  2425. 38.61 s > 4: <three_dimensional_reps::generation::cff_tests::cff_generation_builds_multiloop_repeated_high_power_known_factor_completion::{closure#0} as core::ops::function::FnOnce<()>>::call_once
  2426. 38.61 s > note: Some details are omitted, run with `RUST_BACKTRACE=full` for a verbose backtrace.
  2427. 38.61 s > system-out
  2428. 38.61 s > running 1 test
  2429. 38.61 s > test generation::cff_tests::cff_generation_builds_multiloop_repeated_high_power_known_factor_completion ... FAILED
  2430. 38.61 s >
  2431. 38.61 s > failures:
  2432. 38.61 s >
  2433. 38.61 s > failures:
  2434. 38.61 s > generation::cff_tests::cff_generation_builds_multiloop_repeated_high_power_known_factor_completion
  2435. 38.61 s >
  2436. 38.61 s > test result: FAILED. 0 passed; 1 failed; 0 ignored; 0 measured; 55 filtered out; finished in 0.05s
  2437. 38.61 s > system-err
  2438. 38.61 s > thread 'generation::cff_tests::cff_generation_builds_multiloop_repeated_high_power_known_factor_completion' (3280) panicked at crates/three-dimensional-reps/src/generation.rs:6038:9:
  2439. 38.61 s > assertion failed: variants.iter().any(|variant|
  2440. 38.61 s > {
  2441. 38.61 s > variant.origin.as_deref().is_some_and(|origin|
  2442. 38.61 s > {
  2443. 38.61 s > origin.starts_with("bounded_degree_quadratic_recursive_remainder")
  2444. 38.61 s > })
  2445. 38.61 s > })
  2446. 38.61 s > stack backtrace:
  2447. 38.61 s > 0: __rustc::rust_begin_unwind
  2448. 38.61 s > 1: core::panicking::panic_fmt
  2449. 38.61 s > 2: core::panicking::panic
  2450. 38.61 s > 3: three_dimensional_reps::generation::cff_tests::cff_generation_builds_multiloop_repeated_high_power_known_factor_completion
  2451. 38.61 s > 4: <three_dimensional_reps::generation::cff_tests::cff_generation_builds_multiloop_repeated_high_power_known_factor_completion::{closure#0} as core::ops::function::FnOnce<()>>::call_once
  2452. 38.61 s > note: Some details are omitted, run with `RUST_BACKTRACE=full` for a verbose backtrace.
  2453. 38.61 s >
  2454. 38.61 s > 4. three-dimensional-reps::generation::cff_tests::cff_generation_builds_one_loop_high_power_with_repeated_spectators
  2455. 38.61 s > failure: test failure with exit code 101
  2456. 38.61 s > thread 'generation::cff_tests::cff_generation_builds_one_loop_high_power_with_repeated_spectators' (3279) panicked at crates/three-dimensional-reps/src/generation.rs:6494:9:
  2457. 38.61 s > assertion failed: variants.iter().any(|variant|
  2458. 38.61 s > {
  2459. 38.61 s > variant.origin.as_deref().is_some_and(|origin|
  2460. 38.61 s > {
  2461. 38.61 s > origin.starts_with("bounded_degree_quadratic_recursive_remainder")
  2462. 38.61 s > })
  2463. 38.61 s > })
  2464. 38.61 s > stack backtrace:
  2465. 38.61 s > 0: __rustc::rust_begin_unwind
  2466. 38.61 s > 1: core::panicking::panic_fmt
  2467. 38.61 s > 2: core::panicking::panic
  2468. 38.61 s > 3: three_dimensional_reps::generation::cff_tests::cff_generation_builds_one_loop_high_power_with_repeated_spectators
  2469. 38.61 s > 4: <three_dimensional_reps::generation::cff_tests::cff_generation_builds_one_loop_high_power_with_repeated_spectators::{closure#0} as core::ops::function::FnOnce<()>>::call_once
  2470. 38.61 s > note: Some details are omitted, run with `RUST_BACKTRACE=full` for a verbose backtrace.
  2471. 38.61 s > system-out
  2472. 38.61 s > running 1 test
  2473. 38.61 s > test generation::cff_tests::cff_generation_builds_one_loop_high_power_with_repeated_spectators ... FAILED
  2474. 38.61 s >
  2475. 38.61 s > failures:
  2476. 38.61 s >
  2477. 38.61 s > failures:
  2478. 38.61 s > generation::cff_tests::cff_generation_builds_one_loop_high_power_with_repeated_spectators
  2479. 38.61 s >
  2480. 38.61 s > test result: FAILED. 0 passed; 1 failed; 0 ignored; 0 measured; 55 filtered out; finished in 0.09s
  2481. 38.61 s > system-err
  2482. 38.61 s > thread 'generation::cff_tests::cff_generation_builds_one_loop_high_power_with_repeated_spectators' (3279) panicked at crates/three-dimensional-reps/src/generation.rs:6494:9:
  2483. 38.61 s > assertion failed: variants.iter().any(|variant|
  2484. 38.61 s > {
  2485. 38.61 s > variant.origin.as_deref().is_some_and(|origin|
  2486. 38.61 s > {
  2487. 38.61 s > origin.starts_with("bounded_degree_quadratic_recursive_remainder")
  2488. 38.61 s > })
  2489. 38.61 s > })
  2490. 38.61 s > stack backtrace:
  2491. 38.61 s > 0: __rustc::rust_begin_unwind
  2492. 38.61 s > 1: core::panicking::panic_fmt
  2493. 38.61 s > 2: core::panicking::panic
  2494. 38.61 s > 3: three_dimensional_reps::generation::cff_tests::cff_generation_builds_one_loop_high_power_with_repeated_spectators
  2495. 38.61 s > 4: <three_dimensional_reps::generation::cff_tests::cff_generation_builds_one_loop_high_power_with_repeated_spectators::{closure#0} as core::ops::function::FnOnce<()>>::call_once
  2496. 38.61 s > note: Some details are omitted, run with `RUST_BACKTRACE=full` for a verbose backtrace.
  2497. 38.61 s > =========================================
  2498. 38.61 s For full logs, run:
  2499. 38.61 s nix log /nix/store/s66h2dc5d00kx7psx8nhg0r1sa3b96yv-gammaloop-nextest-core.drv
  2500. 38.70 s [0 built (1 failed), 1 cRun failed.