1. 0.55 s $ /nix/store/9ypz3flqsrl5xl495mm8h645gadjsxi1-coreutils-9.11/bin/timeout --kill-after=15s 7200s /nix/store/23zk8sgzamrbmj1fday15szf7f2279s8-nix-2.34.7/bin/nix --extra-experimental-features nix-command --extra-experimental-features flakes flake clone git+https://github.com/alphal00p/gammaloop --dest /tmp/nix-ci-worker/stable-pwd/repo/
  2. 0.87 s Cloning into '/tmp/nix-ci-worker/stable-pwd/repo'...
  3. 1.68 s remote: Enumerating objects: 62187, done.
  4. 1.92 s remote: Counting objects: 0% (1/7553) remote: Counting objects: 1% (76/7553) remote: Counting objects: 2% (152/7553) remote: Counting objects: 3% (227/7553) remote: Counting objects: 4% (303/7553) remote: Counting objects: 5% (378/7553) remote: Counting objects: 6% (454/7553) remote: Counting objects: 7% (529/7553) remote: Counting objects: 8% (605/7553) remote: Counting objects: 9% (680/7553) remote: Counting objects: 10% (756/7553) remote: Counting objects: 11% (831/7553) remote: Counting objects: 12% (907/7553) remote: Counting objects: 13% (982/7553) remote: Counting objects: 14% (1058/7553) remote: Counting objects: 15% (1133/7553) remote: Counting objects: 16% (1209/7553) remote: Counting objects: 17% (1285/7553) remote: Counting objects: 18% (1360/7553) remote: Counting objects: 19% (1436/7553) remote: Counting objects: 20% (1511/7553) remote: Counting objects: 21% (1587/7553) remote: Counting objects: 22% (1662/7553) remote: Counting objects: 23% (1738/7553) remote: Counting objects: 24% (1813/7553) remote: Counting objects: 25% (1889/7553) remote: Counting objects: 26% (1964/7553) remote: Counting objects: 27% (2040/7553) remote: Counting objects: 28% (2115/7553) remote: Counting objects: 29% (2191/7553) remote: Counting objects: 30% (2266/7553) remote: Counting objects: 31% (2342/7553) remote: Counting objects: 32% (2417/7553) remote: Counting objects: 33% (2493/7553) remote: Counting objects: 34% (2569/7553) remote: Counting objects: 35% (2644/7553) remote: Counting objects: 36% (2720/7553) remote: Counting objects: 37% (2795/7553) remote: Counting objects: 38% (2871/7553) remote: Counting objects: 39% (2946/7553) remote: Counting objects: 40% (3022/7553) remote: Counting objects: 41% (3097/7553) remote: Counting objects: 42% (3173/7553) remote: Counting objects: 43% (3248/7553) remote: Counting objects: 44% (3324/7553) remote: Counting objects: 45% (3399/7553) remote: Counting objects: 46% (3475/7553) remote: Counting objects: 47% (3550/7553) remote: Counting objects: 48% (3626/7553) remote: Counting objects: 49% (3701/7553) remote: Counting objects: 50% (3777/7553) remote: Counting objects: 51% (3853/7553) remote: Counting objects: 52% (3928/7553) remote: Counting objects: 53% (4004/7553) remote: Counting objects: 54% (4079/7553) remote: Counting objects: 55% (4155/7553) remote: Counting objects: 56% (4230/7553) remote: Counting objects: 57% (4306/7553) remote: Counting objects: 58% (4381/7553) remote: Counting objects: 59% (4457/7553) remote: Counting objects: 60% (4532/7553) remote: Counting objects: 61% (4608/7553) remote: Counting objects: 62% (4683/7553) remote: Counting objects: 63% (4759/7553) remote: Counting objects: 64% (4834/7553) remote: Counting objects: 65% (4910/7553) remote: Counting objects: 66% (4985/7553) remote: Counting objects: 67% (5061/7553) remote: Counting objects: 68% (5137/7553) remote: Counting objects: 69% (5212/7553) remote: Counting objects: 70% (5288/7553) remote: Counting objects: 71% (5363/7553) remote: Counting objects: 72% (5439/7553) remote: Counting objects: 73% (5514/7553) remote: Counting objects: 74% (5590/7553) remote: Counting objects: 75% (5665/7553) remote: Counting objects: 76% (5741/7553) remote: Counting objects: 77% (5816/7553) remote: Counting objects: 78% (5892/7553) remote: Counting objects: 79% (5967/7553) remote: Counting objects: 80% (6043/7553) remote: Counting objects: 81% (6118/7553) remote: Counting objects: 82% (6194/7553) remote: Counting objects: 83% (6269/7553) remote: Counting objects: 84% (6345/7553) remote: Counting objects: 85% (6421/7553) remote: Counting objects: 86% (6496/7553) remote: Counting objects: 87% (6572/7553) remote: Counting objects: 88% (6647/7553) remote: Counting objects: 89% (6723/7553) remote: Counting objects: 90% (6798/7553) remote: Counting objects: 91% (6874/7553) remote: Counting objects: 92% (6949/7553) remote: Counting objects: 93% (7025/7553) remote: Counting objects: 94% (7100/7553) remote: Counting objects: 95% (7176/7553) remote: Counting objects: 96% (7251/7553) remote: Counting objects: 97% (7327/7553) remote: Counting objects: 98% (7402/7553) remote: Counting objects: 99% (7478/7553) remote: Counting objects: 100% (7553/7553) remote: Counting objects: 100% (7553/7553), done.
  5. 3.38 s remote: Compressing objects: 0% (1/1562) remote: Compressing objects: 1% (16/1562) remote: Compressing objects: 2% (32/1562) remote: Compressing objects: 3% (47/1562) remote: Compressing objects: 4% (63/1562) remote: Compressing objects: 5% (79/1562) remote: Compressing objects: 6% (94/1562) remote: Compressing objects: 7% (110/1562) remote: Compressing objects: 8% (125/1562) remote: Compressing objects: 9% (141/1562) remote: Compressing objects: 10% (157/1562) remote: Compressing objects: 11% (172/1562) remote: Compressing objects: 12% (188/1562) remote: Compressing objects: 13% (204/1562) remote: Compressing objects: 14% (219/1562) remote: Compressing objects: 15% (235/1562) remote: Compressing objects: 15% (241/1562) remote: Compressing objects: 16% (250/1562) remote: Compressing objects: 17% (266/1562) remote: Compressing objects: 18% (282/1562) remote: Compressing objects: 19% (297/1562) remote: Compressing objects: 20% (313/1562) remote: Compressing objects: 21% (329/1562) remote: Compressing objects: 22% (344/1562) remote: Compressing objects: 23% (360/1562) remote: Compressing objects: 24% (375/1562) remote: Compressing objects: 25% (391/1562) remote: Compressing objects: 26% (407/1562) remote: Compressing objects: 27% (422/1562) remote: Compressing objects: 28% (438/1562) remote: Compressing objects: 29% (453/1562) remote: Compressing objects: 30% (469/1562) remote: Compressing objects: 31% (485/1562) remote: Compressing objects: 32% (500/1562) remote: Compressing objects: 33% (516/1562) remote: Compressing objects: 34% (532/1562) remote: Compressing objects: 35% (547/1562) remote: Compressing objects: 36% (563/1562) remote: Compressing objects: 37% (578/1562) remote: Compressing objects: 38% (594/1562) remote: Compressing objects: 39% (610/1562) remote: Compressing objects: 40% (625/1562) remote: Compressing objects: 41% (641/1562) remote: Compressing objects: 42% (657/1562) remote: Compressing objects: 43% (672/1562) remote: Compressing objects: 44% (688/1562) remote: Compressing objects: 45% (703/1562) remote: Compressing objects: 46% (719/1562) remote: Compressing objects: 47% (735/1562) remote: Compressing objects: 48% (750/1562) remote: Compressing objects: 49% (766/1562) remote: Compressing objects: 50% (781/1562) remote: Compressing objects: 51% (797/1562) remote: Compressing objects: 52% (813/1562) remote: Compressing objects: 53% (828/1562) remote: Compressing objects: 54% (844/1562) remote: Compressing objects: 55% (860/1562) remote: Compressing objects: 56% (875/1562) remote: Compressing objects: 57% (891/1562) remote: Compressing objects: 58% (906/1562) remote: Compressing objects: 59% (922/1562) remote: Compressing objects: 60% (938/1562) remote: Compressing objects: 61% (953/1562) remote: Compressing objects: 62% (969/1562) remote: Compressing objects: 63% (985/1562) remote: Compressing objects: 64% (1000/1562) remote: Compressing objects: 65% (1016/1562) remote: Compressing objects: 66% (1031/1562) remote: Compressing objects: 67% (1047/1562) remote: Compressing objects: 68% (1063/1562) remote: Compressing objects: 69% (1078/1562) remote: Compressing objects: 70% (1094/1562) remote: Compressing objects: 71% (1110/1562) remote: Compressing objects: 72% (1125/1562) remote: Compressing objects: 73% (1141/1562) remote: Compressing objects: 74% (1156/1562) remote: Compressing objects: 75% (1172/1562) remote: Compressing objects: 76% (1188/1562) remote: Compressing objects: 77% (1203/1562) remote: Compressing objects: 78% (1219/1562) remote: Compressing objects: 79% (1234/1562) remote: Compressing objects: 80% (1250/1562) remote: Compressing objects: 81% (1266/1562) remote: Compressing objects: 82% (1281/1562) remote: Compressing objects: 83% (1297/1562) remote: Compressing objects: 84% (1313/1562) remote: Compressing objects: 85% (1328/1562) remote: Compressing objects: 86% (1344/1562) remote: Compressing objects: 87% (1359/1562) remote: Compressing objects: 88% (1375/1562) remote: Compressing objects: 89% (1391/1562) remote: Compressing objects: 90% (1406/1562) remote: Compressing objects: 91% (1422/1562) remote: Compressing objects: 92% (1438/1562) remote: Compressing objects: 93% (1453/1562) remote: Compressing objects: 94% (1469/1562) remote: Compressing objects: 95% (1484/1562) remote: Compressing objects: 96% (1500/1562) remote: Compressing objects: 97% (1516/1562) remote: Compressing objects: 98% (1531/1562) remote: Compressing objects: 99% (1547/1562) remote: Compressing objects: 100% (1562/1562) remote: Compressing objects: 100% (1562/1562), done.
  6. 6.19 s Receiving objects: 0% (1/62187) Receiving objects: 1% (622/62187) Receiving objects: 2% (1244/62187) Receiving objects: 3% (1866/62187) Receiving objects: 4% (2488/62187) Receiving objects: 5% (3110/62187) Receiving objects: 6% (3732/62187) Receiving objects: 7% (4354/62187) Receiving objects: 8% (4975/62187) Receiving objects: 9% (5597/62187) Receiving objects: 10% (6219/62187) Receiving objects: 11% (6841/62187) Receiving objects: 12% (7463/62187) Receiving objects: 13% (8085/62187) Receiving objects: 14% (8707/62187) Receiving objects: 15% (9329/62187), 14.96 MiB | 29.91 MiB/s Receiving objects: 16% (9950/62187), 14.96 MiB | 29.91 MiB/s Receiving objects: 17% (10572/62187), 14.96 MiB | 29.91 MiB/s Receiving objects: 18% (11194/62187), 14.96 MiB | 29.91 MiB/s Receiving objects: 19% (11816/62187), 14.96 MiB | 29.91 MiB/s Receiving objects: 20% (12438/62187), 14.96 MiB | 29.91 MiB/s Receiving objects: 21% (13060/62187), 14.96 MiB | 29.91 MiB/s Receiving objects: 22% (13682/62187), 14.96 MiB | 29.91 MiB/s Receiving objects: 23% (14304/62187), 14.96 MiB | 29.91 MiB/s Receiving objects: 24% (14925/62187), 14.96 MiB | 29.91 MiB/s Receiving objects: 25% (15547/62187), 14.96 MiB | 29.91 MiB/s Receiving objects: 26% (16169/62187), 14.96 MiB | 29.91 MiB/s Receiving objects: 27% (16791/62187), 14.96 MiB | 29.91 MiB/s Receiving objects: 28% (17413/62187), 14.96 MiB | 29.91 MiB/s Receiving objects: 29% (18035/62187), 14.96 MiB | 29.91 MiB/s Receiving objects: 30% (18657/62187), 14.96 MiB | 29.91 MiB/s Receiving objects: 31% (19278/62187), 14.96 MiB | 29.91 MiB/s Receiving objects: 32% (19900/62187), 14.96 MiB | 29.91 MiB/s Receiving objects: 33% (20522/62187), 14.96 MiB | 29.91 MiB/s Receiving objects: 34% (21144/62187), 14.96 MiB | 29.91 MiB/s Receiving objects: 35% (21766/62187), 14.96 MiB | 29.91 MiB/s Receiving objects: 36% (22388/62187), 14.96 MiB | 29.91 MiB/s Receiving objects: 37% (23010/62187), 14.96 MiB | 29.91 MiB/s Receiving objects: 38% (23632/62187), 14.96 MiB | 29.91 MiB/s Receiving objects: 39% (24253/62187), 14.96 MiB | 29.91 MiB/s Receiving objects: 40% (24875/62187), 14.96 MiB | 29.91 MiB/s Receiving objects: 41% (25497/62187), 14.96 MiB | 29.91 MiB/s Receiving objects: 42% (26119/62187), 14.96 MiB | 29.91 MiB/s Receiving objects: 43% (26741/62187), 14.96 MiB | 29.91 MiB/s Receiving objects: 44% (27363/62187), 14.96 MiB | 29.91 MiB/s Receiving objects: 45% (27985/62187), 14.96 MiB | 29.91 MiB/s Receiving objects: 46% (28607/62187), 14.96 MiB | 29.91 MiB/s Receiving objects: 47% (29228/62187), 14.96 MiB | 29.91 MiB/s Receiving objects: 48% (29850/62187), 14.96 MiB | 29.91 MiB/s Receiving objects: 49% (30472/62187), 14.96 MiB | 29.91 MiB/s Receiving objects: 50% (31094/62187), 14.96 MiB | 29.91 MiB/s Receiving objects: 51% (31716/62187), 14.96 MiB | 29.91 MiB/s Receiving objects: 52% (32338/62187), 14.96 MiB | 29.91 MiB/s Receiving objects: 53% (32960/62187), 14.96 MiB | 29.91 MiB/s Receiving objects: 53% (33576/62187), 33.77 MiB | 33.40 MiB/s Receiving objects: 54% (33581/62187), 33.77 MiB | 33.40 MiB/s Receiving objects: 55% (34203/62187), 33.77 MiB | 33.40 MiB/s Receiving objects: 56% (34825/62187), 33.77 MiB | 33.40 MiB/s Receiving objects: 57% (35447/62187), 33.77 MiB | 33.40 MiB/s Receiving objects: 58% (36069/62187), 33.77 MiB | 33.40 MiB/s Receiving objects: 59% (36691/62187), 33.77 MiB | 33.40 MiB/s Receiving objects: 60% (37313/62187), 33.77 MiB | 33.40 MiB/s Receiving objects: 61% (37935/62187), 33.77 MiB | 33.40 MiB/s Receiving objects: 62% (38556/62187), 33.77 MiB | 33.40 MiB/s Receiving objects: 63% (39178/62187), 33.77 MiB | 33.40 MiB/s Receiving objects: 64% (39800/62187), 33.77 MiB | 33.40 MiB/s Receiving objects: 65% (40422/62187), 33.77 MiB | 33.40 MiB/s Receiving objects: 66% (41044/62187), 33.77 MiB | 33.40 MiB/s Receiving objects: 67% (41666/62187), 49.38 MiB | 32.68 MiB/s Receiving objects: 68% (42288/62187), 49.38 MiB | 32.68 MiB/s Receiving objects: 69% (42910/62187), 49.38 MiB | 32.68 MiB/s Receiving objects: 70% (43531/62187), 49.38 MiB | 32.68 MiB/s Receiving objects: 71% (44153/62187), 49.38 MiB | 32.68 MiB/s Receiving objects: 72% (44775/62187), 49.38 MiB | 32.68 MiB/s Receiving objects: 73% (45397/62187), 49.38 MiB | 32.68 MiB/s Receiving objects: 74% (46019/62187), 49.38 MiB | 32.68 MiB/s Receiving objects: 75% (46641/62187), 49.38 MiB | 32.68 MiB/s Receiving objects: 76% (47263/62187), 49.38 MiB | 32.68 MiB/s Receiving objects: 77% (47884/62187), 49.38 MiB | 32.68 MiB/s Receiving objects: 77% (48185/62187), 49.38 MiB | 32.68 MiB/s Receiving objects: 78% (48506/62187), 67.09 MiB | 33.36 MiB/s Receiving objects: 79% (49128/62187), 67.09 MiB | 33.36 MiB/s Receiving objects: 80% (49750/62187), 67.09 MiB | 33.36 MiB/s Receiving objects: 81% (50372/62187), 67.09 MiB | 33.36 MiB/s Receiving objects: 82% (50994/62187), 67.09 MiB | 33.36 MiB/s Receiving objects: 83% (51616/62187), 67.09 MiB | 33.36 MiB/s Receiving objects: 84% (52238/62187), 67.09 MiB | 33.36 MiB/s Receiving objects: 85% (52859/62187), 67.09 MiB | 33.36 MiB/s Receiving objects: 86% (53481/62187), 83.50 MiB | 33.05 MiB/s Receiving objects: 87% (54103/62187), 83.50 MiB | 33.05 MiB/s Receiving objects: 88% (54725/62187), 83.50 MiB | 33.05 MiB/s Receiving objects: 89% (55347/62187), 83.50 MiB | 33.05 MiB/s Receiving objects: 90% (55969/62187), 83.50 MiB | 33.05 MiB/s Receiving objects: 91% (56591/62187), 83.50 MiB | 33.05 MiB/s Receiving objects: 92% (57213/62187), 83.50 MiB | 33.05 MiB/s Receiving objects: 93% (57834/62187), 83.50 MiB | 33.05 MiB/s Receiving objects: 94% (58456/62187), 83.50 MiB | 33.05 MiB/s Receiving objects: 95% (59078/62187), 83.50 MiB | 33.05 MiB/s Receiving objects: 96% (59700/62187), 83.50 MiB | 33.05 MiB/s Receiving objects: 97% (60322/62187), 83.50 MiB | 33.05 MiB/s Receiving objects: 98% (60944/62187), 83.50 MiB | 33.05 MiB/s Receiving objects: 99% (61566/62187), 83.50 MiB | 33.05 MiB/s remote: Total 62187 (delta 6502), reused 6126 (delta 5986), pack-reused 54634 (from 3)
  7. 6.21 s Receiving objects: 100% (62187/62187), 83.50 MiB | 33.05 MiB/s Receiving objects: 100% (62187/62187), 92.55 MiB | 32.89 MiB/s, done.
  8. 6.84 s Resolving deltas: 0% (0/43421) Resolving deltas: 1% (435/43421) Resolving deltas: 2% (870/43421) Resolving deltas: 3% (1303/43421) Resolving deltas: 4% (1737/43421) Resolving deltas: 5% (2172/43421) Resolving deltas: 6% (2606/43421) Resolving deltas: 7% (3040/43421) Resolving deltas: 8% (3474/43421) Resolving deltas: 9% (3908/43421) Resolving deltas: 10% (4343/43421) Resolving deltas: 11% (4777/43421) Resolving deltas: 12% (5212/43421) Resolving deltas: 13% (5647/43421) Resolving deltas: 14% (6079/43421) Resolving deltas: 15% (6515/43421) Resolving deltas: 16% (6948/43421) Resolving deltas: 17% (7382/43421) Resolving deltas: 18% (7817/43421) Resolving deltas: 19% (8250/43421) Resolving deltas: 20% (8687/43421) Resolving deltas: 21% (9119/43421) Resolving deltas: 22% (9553/43421) Resolving deltas: 23% (9987/43421) Resolving deltas: 24% (10422/43421) Resolving deltas: 25% (10856/43421) Resolving deltas: 26% (11290/43421) Resolving deltas: 27% (11724/43421) Resolving deltas: 28% (12158/43421) Resolving deltas: 29% (12593/43421) Resolving deltas: 30% (13027/43421) Resolving deltas: 31% (13461/43421) Resolving deltas: 32% (13895/43421) Resolving deltas: 33% (14329/43421) Resolving deltas: 34% (14764/43421) Resolving deltas: 35% (15198/43421) Resolving deltas: 36% (15632/43421) Resolving deltas: 37% (16066/43421) Resolving deltas: 38% (16500/43421) Resolving deltas: 39% (16935/43421) Resolving deltas: 40% (17369/43421) Resolving deltas: 41% (17803/43421) Resolving deltas: 42% (18237/43421) Resolving deltas: 43% (18672/43421) Resolving deltas: 44% (19106/43421) Resolving deltas: 45% (19540/43421) Resolving deltas: 46% (19975/43421) Resolving deltas: 47% (20408/43421) Resolving deltas: 48% (20844/43421) Resolving deltas: 49% (21279/43421) Resolving deltas: 50% (21711/43421) Resolving deltas: 51% (22145/43421) Resolving deltas: 52% (22579/43421) Resolving deltas: 53% (23014/43421) Resolving deltas: 54% (23448/43421) Resolving deltas: 55% (23882/43421) Resolving deltas: 56% (24317/43421) Resolving deltas: 57% (24750/43421) Resolving deltas: 58% (25187/43421) Resolving deltas: 59% (25619/43421) Resolving deltas: 60% (26053/43421) Resolving deltas: 61% (26487/43421) Resolving deltas: 62% (26923/43421) Resolving deltas: 63% (27356/43421) Resolving deltas: 64% (27790/43421) Resolving deltas: 65% (28224/43421) Resolving deltas: 66% (28662/43421) Resolving deltas: 67% (29093/43421) Resolving deltas: 68% (29527/43421) Resolving deltas: 69% (29964/43421) Resolving deltas: 70% (30395/43421) Resolving deltas: 71% (30829/43421) Resolving deltas: 72% (31264/43421) Resolving deltas: 73% (31699/43421) Resolving deltas: 74% (32132/43421) Resolving deltas: 75% (32567/43421) Resolving deltas: 76% (33000/43421) Resolving deltas: 77% (33435/43421) Resolving deltas: 78% (33872/43421) Resolving deltas: 79% (34303/43421) Resolving deltas: 80% (34737/43421) Resolving deltas: 81% (35172/43421) Resolving deltas: 82% (35606/43421) Resolving deltas: 83% (36040/43421) Resolving deltas: 84% (36475/43421) Resolving deltas: 85% (36908/43421) Resolving deltas: 86% (37343/43421) Resolving deltas: 87% (37777/43421) Resolving deltas: 88% (38214/43421) Resolving deltas: 89% (38645/43421) Resolving deltas: 90% (39079/43421) Resolving deltas: 91% (39514/43421) Resolving deltas: 92% (39948/43421) Resolving deltas: 93% (40382/43421) Resolving deltas: 94% (40816/43421) Resolving deltas: 95% (41250/43421) Resolving deltas: 96% (41685/43421) Resolving deltas: 97% (42120/43421) Resolving deltas: 98% (42553/43421) Resolving deltas: 99% (42987/43421) Resolving deltas: 100% (43421/43421) Resolving deltas: 100% (43421/43421), done.
  9. 7.16 s Fetching commit bfedaacc152cfdfc2fece3c649d6bd3ee224b8cc for raised_energy_cff_wip ...
  10. 7.16 s $ /nix/store/bcnisk3ydfgv26v2gw3zlky24g00yww2-git-2.54.0/bin/git fetch origin bfedaacc152cfdfc2fece3c649d6bd3ee224b8cc
  11. 7.59 s From https://github.com/alphal00p/gammaloop
  12. 7.59 s * branch bfedaacc152cfdfc2fece3c649d6bd3ee224b8cc -> FETCH_HEAD
  13. 7.60 s $ /nix/store/9ypz3flqsrl5xl495mm8h645gadjsxi1-coreutils-9.11/bin/timeout --kill-after=15s 7200s /nix/store/bcnisk3ydfgv26v2gw3zlky24g00yww2-git-2.54.0/bin/git -c advice.detachedHead=false checkout bfedaacc152cfdfc2fece3c649d6bd3ee224b8cc
  14. 7.79 s HEAD is now at bfedaacc document raised-energy CFF handoff
  15. 7.79 s $ /nix/store/9ypz3flqsrl5xl495mm8h645gadjsxi1-coreutils-9.11/bin/timeout --kill-after=15s 7200s /nix/store/23zk8sgzamrbmj1fday15szf7f2279s8-nix-2.34.7/bin/nix --extra-experimental-features nix-command --extra-experimental-features flakes --log-format internal-json run .#packages.x86_64-linux.nix-ci-check-gammaloop-nextest-core --print-build-logs
  16. 7.93 s
  17. 13.04 s evaluating derivation 'g copying '/nix/store/b6fz evaluating derivation 'g copying '/nix/store/b6fz evaluating derivation 'g copying '/nix/store/b6fz evaluating derivation 'g copying '/nix/store/b6fz evaluating derivation 'g copying '/nix/store/b6fz evaluating derivation 'g copying '/nix/store/b6fz evaluating derivation 'g copying '/nix/store/b6fz evaluating derivation 'g copying '/nix/store/b6fz evaluating derivation 'g [0/1 built] [1/0/1 built] building ggammaloop-nextest-core> Extracting 3 binaries (including 1 non-test binary), 1 build script output directory, and 2 linked paths to /build/nextest-archive-8TZ4LJ
  18. 13.68 s gammaloop-nextest-core> Extracted 18 files to /build/nextest-archive-8TZ4LJ in 0.64s
  19. 13.70 s gammaloop-nextest-core> ------------
  20. 13.70 s gammaloop-nextest-core> Nextest run ID e19c85be-89bf-4c31-afa0-3977d6d1a2ce with nextest profile: ci_gammaloop
  21. 13.70 s gammaloop-nextest-core> Starting 367 tests across 2 binaries
  22. 14.46 s gammaloop-nextest-core> ------------
  23. 14.46 s gammaloop-nextest-core> Summary [ 0.758s] 367 tests run: 367 passed, 0 skipped
  24. 14.61 s gammaloop-nextest-core>
  25. 14.61 s gammaloop-nextest-core> ========== nextest test summary ==========
  26. 14.61 s gammaloop-nextest-core> report: target/nextest/ci_gammaloop/junit.xml
  27. 14.61 s gammaloop-nextest-core> tests: 367, failures: 0, errors: 0
  28. 14.61 s gammaloop-nextest-core> No failing testcases found.
  29. 14.61 s gammaloop-nextest-core> =========================================
  30. 14.63 s gammaloop-nextest-core> Extracting 1 binary and 1 linked path to /build/nextest-archive-CCtl1d
  31. 14.73 s gammaloop-nextest-core> Extracted 7 files to /build/nextest-archive-CCtl1d in 0.09s
  32. 14.74 s gammaloop-nextest-core> ------------
  33. 14.74 s gammaloop-nextest-core> Nextest run ID 9eab3b16-331d-4eac-8e83-42f1b27bd930 with nextest profile: ci_gammaloop
  34. 14.74 s gammaloop-nextest-core> Starting 19 tests across 1 binary
  35. 14.76 s gammaloop-nextest-core> ------------
  36. 14.76 s gammaloop-nextest-core> Summary [ 0.016s] 19 tests run: 19 passed, 0 skipped
  37. 14.83 s gammaloop-nextest-core>
  38. 14.83 s gammaloop-nextest-core> ========== nextest test summary ==========
  39. 14.83 s gammaloop-nextest-core> report: target/nextest/ci_gammaloop/junit.xml
  40. 14.83 s gammaloop-nextest-core> tests: 19, failures: 0, errors: 0
  41. 14.83 s gammaloop-nextest-core> No failing testcases found.
  42. 14.83 s gammaloop-nextest-core> =========================================
  43. 14.85 s gammaloop-nextest-core> Extracting 1 binary to /build/nextest-archive-gDWp0e
  44. 14.89 s gammaloop-nextest-core> Extracted 4 files to /build/nextest-archive-gDWp0e in 0.04s
  45. 14.90 s gammaloop-nextest-core> ------------
  46. 14.90 s gammaloop-nextest-core> Nextest run ID 3a492b90-4483-449d-b38c-f6d29c505d58 with nextest profile: ci_gammaloop
  47. 14.90 s gammaloop-nextest-core> Starting 0 tests across 1 binary
  48. 14.90 s gammaloop-nextest-core> ------------
  49. 14.90 s gammaloop-nextest-core> Summary [ 0.000s] 0 tests run: 0 passed, 0 skipped
  50. 14.94 s gammaloop-nextest-core>
  51. 14.94 s gammaloop-nextest-core> ========== nextest test summary ==========
  52. 14.94 s gammaloop-nextest-core> report: target/nextest/ci_gammaloop/junit.xml
  53. 14.94 s gammaloop-nextest-core> tests: 0, failures: 0, errors: 0
  54. 14.94 s gammaloop-nextest-core> No failing testcases found.
  55. 14.94 s gammaloop-nextest-core> =========================================
  56. 14.95 s gammaloop-nextest-core> Extracting 4 binaries, 1 build script output directory, and 2 linked paths to /build/nextest-archive-JqGIeB
  57. 15.61 s gammaloop-nextest-core> Extracted 18 files to /build/nextest-archive-JqGIeB in 0.66s
  58. 15.63 s gammaloop-nextest-core> ------------
  59. 15.63 s gammaloop-nextest-core> Nextest run ID 43ebe835-250e-46a3-8691-870ca9cd66f1 with nextest profile: ci_gammaloop
  60. 15.63 s gammaloop-nextest-core> Starting 501 tests across 4 binaries (59 tests skipped, including 58 tests via profile.ci_gammaloop.default-filter)
  61. 16.98 s gammaloop-nextest-core> FAIL [ 0.167s] (479/501) gammalooprs uv::hedge_poset::tests::union_terms_project_factorized_typed_4d_values
  62. 16.98 s gammaloop-nextest-core> stdout ---
  63. 16.98 s gammaloop-nextest-core>
  64. 16.98 s gammaloop-nextest-core> running 1 test
  65. 16.98 s gammaloop-nextest-core> test uv::hedge_poset::tests::union_terms_project_factorized_typed_4d_values ... FAILED
  66. 16.98 s gammaloop-nextest-core>
  67. 16.98 s gammaloop-nextest-core> failures:
  68. 16.98 s gammaloop-nextest-core>
  69. 16.98 s gammaloop-nextest-core> failures:
  70. 16.98 s gammaloop-nextest-core> uv::hedge_poset::tests::union_terms_project_factorized_typed_4d_values
  71. 16.98 s gammaloop-nextest-core>
  72. 16.98 s gammaloop-nextest-core> test result: FAILED. 0 passed; 1 failed; 0 ignored; 0 measured; 551 filtered out; finished in 0.14s
  73. 16.98 s gammaloop-nextest-core>
  74. 16.98 s gammaloop-nextest-core> stderr ---
  75. 16.98 s gammaloop-nextest-core> Error:
  76. 16.98 s gammaloop-nextest-core> 0: exact source occurrences for physical edge 1 disagree after on-shell-energy replacement: `-(mUVexp^2+Q(1,cind(1))^2+Q(1,cind(2))^2+Q(1,cind(3))^2)^(1/2)` versus `(mUVexp^2+Q(1,cind(1))^2+Q(1,cind(2))^2+Q(1,cind(3))^2)^(1/2)`; exact 4D term active denominators are [FourDDenominator { source_edge: EdgeIndex(1), momentum: gammalooprs::Q(1), mass_squared: gammalooprs::mUVexp^2, full_expr: -gammalooprs::mUV^2+spenso::dot(gammalooprs::Q(1,spenso::mink(gammalooprs::dim)),gammalooprs::Q(1,spenso::mink(gammalooprs::dim))) }, FourDDenominator { source_edge: EdgeIndex(1), momentum: gammalooprs::Q(1), mass_squared: gammalooprs::mUVexp^2, full_expr: -gammalooprs::mUV^2+spenso::dot(gammalooprs::Q(1,spenso::mink(gammalooprs::dim)),gammalooprs::Q(1,spenso::mink(gammalooprs::dim))) }, FourDDenominator { source_edge: EdgeIndex(3), momentum: gammalooprs::Q(3), mass_squared: gammalooprs::mUVexp^2, full_expr: -gammalooprs::mUV^2+spenso::dot(gammalooprs::Q(3,spenso::mink(gammalooprs::dim)),gammalooprs::Q(3,spenso::mink(gammalooprs::dim))) }, FourDDenominator { source_edge: EdgeIndex(3), momentum: gammalooprs::Q(3), mass_squared: gammalooprs::mUVexp^2, full_expr: -gammalooprs::mUV^2+spenso::dot(gammalooprs::Q(3,spenso::mink(gammalooprs::dim)),gammalooprs::Q(3,spenso::mink(gammalooprs::dim))) }, FourDDenominator { source_edge: EdgeIndex(0), momentum: gammalooprs::Q(0), mass_squared: UFO::mass_scalar_1^2, full_expr: -UFO::mass_scalar_1^2+spenso::dot(gammalooprs::Q(0,spenso::mink(gammalooprs::dim)),gammalooprs::Q(0,spenso::mink(gammalooprs::dim))) }]
  77. 16.98 s gammaloop-nextest-core>
  78. 16.98 s gammaloop-nextest-core> Location:
  79. 16.98 s gammaloop-nextest-core> crates/gammalooprs/src/uv/approx/local_3d.rs:641
  80. 16.98 s gammaloop-nextest-core>
  81. 16.98 s gammaloop-nextest-core> ━━━━━━━━━━━━━━━━━━━━━━━━━━━━━━━━━━ BACKTRACE ━━━━━━━━━━━━━━━━━━━━━━━━━━━━━━━━━━━
  82. 16.98 s gammaloop-nextest-core> 1: <color_eyre[51793ea62743adbd]::config::EyreHook>::into_eyre_hook::{closure#0}<unknown>
  83. 16.98 s gammaloop-nextest-core> at <unknown source file>:<unknown line>
  84. 16.98 s gammaloop-nextest-core> 2: eyre[cb2fd339c0c40fca]::capture_handler<unknown>
  85. 16.98 s gammaloop-nextest-core> at <unknown source file>:<unknown line>
  86. 16.98 s gammaloop-nextest-core> 3: <eyre[cb2fd339c0c40fca]::Report>::from_adhoc::<alloc[2ea6bcb46fca0c42]::string::String><unknown>
  87. 16.98 s gammaloop-nextest-core> at <unknown source file>:<unknown line>
  88. 16.98 s gammaloop-nextest-core> 4: <gammalooprs[6dc202c8af9e2ddf]::uv::approx::local_3d::Localizer>::project_4d<unknown>
  89. 16.98 s gammaloop-nextest-core> at <unknown source file>:<unknown line>
  90. 16.98 s gammaloop-nextest-core> 5: gammalooprs[6dc202c8af9e2ddf]::uv::hedge_poset::tests::union_terms_project_factorized_typed_4d_values<unknown>
  91. 16.98 s gammaloop-nextest-core> at <unknown source file>:<unknown line>
  92. 16.98 s gammaloop-nextest-core> 6: <gammalooprs[6dc202c8af9e2ddf]::uv::hedge_poset::tests::union_terms_project_factorized_typed_4d_values::{closure#0} as core[940e698046960fd5]::ops::function::FnOnce<()>>::call_once<unknown>
  93. 16.98 s gammaloop-nextest-core> at <unknown source file>:<unknown line>
  94. 16.98 s gammaloop-nextest-core> 7: test[75d6903177b1d7e9]::__rust_begin_short_backtrace::<core[940e698046960fd5]::result::Result<(), alloc[2ea6bcb46fca0c42]::string::String>, fn() -> core[940e698046960fd5]::result::Result<(), alloc[2ea6bcb46fca0c42]::string::String>><unknown>
  95. 16.98 s gammaloop-nextest-core> at <unknown source file>:<unknown line>
  96. 16.98 s gammaloop-nextest-core> 8: test[75d6903177b1d7e9]::run_test::{closure#0}<unknown>
  97. 16.98 s gammaloop-nextest-core> at <unknown source file>:<unknown line>
  98. 16.98 s gammaloop-nextest-core> 9: std[bcb96dfbba0ab899]::sys::backtrace::__rust_begin_short_backtrace::<test[75d6903177b1d7e9]::run_test::{closure#1}, ()><unknown>
  99. 16.98 s gammaloop-nextest-core> at <unknown source file>:<unknown line>
  100. 16.98 s gammaloop-nextest-core> 10: <std[bcb96dfbba0ab899]::thread::lifecycle::spawn_unchecked<test[75d6903177b1d7e9]::run_test::{closure#1}, ()>::{closure#1} as core[940e698046960fd5]::ops::function::FnOnce<()>>::call_once::{shim:vtable#0}<unknown>
  101. 16.98 s gammaloop-nextest-core> at <unknown source file>:<unknown line>
  102. 16.98 s gammaloop-nextest-core> 11: <std[bcb96dfbba0ab899]::sys::thread::unix::Thread>::new::thread_start<unknown>
  103. 16.98 s gammaloop-nextest-core> at <unknown source file>:<unknown line>
  104. 16.98 s gammaloop-nextest-core> 12: start_thread<unknown>
  105. 16.98 s gammaloop-nextest-core> at <unknown source file>:<unknown line>
  106. 16.98 s gammaloop-nextest-core> 13: __clone3<unknown>
  107. 16.98 s gammaloop-nextest-core> at <unknown source file>:<unknown line>
  108. 16.98 s gammaloop-nextest-core>
  109. 16.98 s gammaloop-nextest-core> Run with COLORBT_SHOW_HIDDEN=1 environment variable to disable frame filtering.
  110. 16.98 s gammaloop-nextest-core> Run with RUST_BACKTRACE=full to include source snippets.
  111. 16.98 s gammaloop-nextest-core>
  112. 22.26 s gammaloop-nextest-core> FAIL [ 5.275s] (497/501) gammalooprs::test_renormalization finite_part_ghost_2loop
  113. 22.27 s gammaloop-nextest-core> stdout ---
  114. 22.27 s gammaloop-nextest-core>
  115. 22.27 s gammaloop-nextest-core> running 1 test
  116. 22.27 s gammaloop-nextest-core> test finite_part_ghost_2loop ... FAILED
  117. 22.27 s gammaloop-nextest-core>
  118. 22.27 s gammaloop-nextest-core> failures:
  119. 22.27 s gammaloop-nextest-core>
  120. 22.27 s gammaloop-nextest-core> failures:
  121. 22.27 s gammaloop-nextest-core> finite_part_ghost_2loop
  122. 22.27 s gammaloop-nextest-core>
  123. 22.27 s gammaloop-nextest-core> test result: FAILED. 0 passed; 1 failed; 0 ignored; 0 measured; 5 filtered out; finished in 5.25s
  124. 22.27 s gammaloop-nextest-core>
  125. 22.27 s gammaloop-nextest-core> stderr ---
  126. 22.27 s gammaloop-nextest-core> [16:29:41.927] @gammalooprs::processes::amplitude ERROR :
  127. 22.27 s gammaloop-nextest-core> field value
  128. 22.28 s gammaloop-nextest-core> error generalized CFF expression generation failed for graph `d5` with source-edge numerator energy-degree bounds Some([(1, 1), (2, 1), (3, 1), (5, 2), (6, 2)]): energy-degree bounds do not certify vanishing residues at infinity under the conservative cap check: EnergyDivergenceReport { edge_degree_bounds: [1, 1, 1, 2, 2], loops: [EnergyDirectionReport { loop_id: Some(0), zero_edges: [], active_edges: [0, 1, 2, 4], nullity: None, numerator_degree_bound: 5, denominator_degree: 8, divergence_degree: -3, convergent: true }, EnergyDirectionReport { loop_id: Some(1), zero_edges: [], active_edges: [3, 4], nullity: None, numerator_degree_bound: 4, denominator_degree: 4, divergence_degree: 0, convergent: false }], directions: [EnergyDirectionReport { loop_id: None, zero_edges: [0, 1, 2], active_edges: [3, 4], nullity: Some(1), numerator_degree_bound: 4, denominator_degree: 4, divergence_degree: 0, convergent: false }, EnergyDirectionReport { loop_id: None, zero_edges: [], active_edges: [0, 1, 2, 3, 4], nullity: Some(2), numerator_degree_bound: 7, denominator_degree: 10, divergence_degree: -3, convergent: true }, EnergyDirectionReport { loop_id: None, zero_edges: [3], active_edges: [0, 1, 2, 4], nullity: Some(1), numerator_degree_bound: 5, denominator_degree: 8, divergence_degree: -3, convergent: true }, EnergyDirectionReport { loop_id: None, zero_edges: [4], active_edges: [0, 1, 2, 3], nullity: Some(1), numerator_degree_bound: 5, denominator_degree: 8, divergence_degree: -3, convergent: true }], coordinate_convergent: false, directional_convergent: false, convergent: false }
  129. 22.28 s gammaloop-nextest-core> 3D source has 2 loop names ["e1", "e5"], 5 internal edges [edge 0: 0 -> 1, loops=[1, 0], externals=[0, 0]; edge 1: 0 -> 2, loops=[-1, 0], externals=[1, 0]; edge 2: 1 -> 3, loops=[1, 0], externals=[-1, 0]; edge 3: 2 -> 3, loops=[0, 1], externals=[0, 0]; edge 4: 2 -> 3, loops=[-1, -1], externals=[1, 0]]
  130. 22.28 s gammaloop-nextest-core> at crates/gammalooprs/src/processes/amplitude.rs:825
  131. 22.28 s gammaloop-nextest-core> The application panicked (crashed).
  132. 22.28 s gammaloop-nextest-core> Message: called `Result::unwrap()` on an `Err` value:
  133. 22.28 s gammaloop-nextest-core> 0: generalized CFF expression generation failed for graph `d5` with source-edge numerator energy-degree bounds Some([(1, 1), (2, 1), (3, 1), (5, 2), (6, 2)]): energy-degree bounds do not certify vanishing residues at infinity under the conservative cap check: EnergyDivergenceReport { edge_degree_bounds: [1, 1, 1, 2, 2], loops: [EnergyDirectionReport { loop_id: Some(0), zero_edges: [], active_edges: [0, 1, 2, 4], nullity: None, numerator_degree_bound: 5, denominator_degree: 8, divergence_degree: -3, convergent: true }, EnergyDirectionReport { loop_id: Some(1), zero_edges: [], active_edges: [3, 4], nullity: None, numerator_degree_bound: 4, denominator_degree: 4, divergence_degree: 0, convergent: false }], directions: [EnergyDirectionReport { loop_id: None, zero_edges: [0, 1, 2], active_edges: [3, 4], nullity: Some(1), numerator_degree_bound: 4, denominator_degree: 4, divergence_degree: 0, convergent: false }, EnergyDirectionReport { loop_id: None, zero_edges: [], active_edges: [0, 1, 2, 3, 4], nullity: Some(2), numerator_degree_bound: 7, denominator_degree: 10, divergence_degree: -3, convergent: true }, EnergyDirectionReport { loop_id: None, zero_edges: [3], active_edges: [0, 1, 2, 4], nullity: Some(1), numerator_degree_bound: 5, denominator_degree: 8, divergence_degree: -3, convergent: true }, EnergyDirectionReport { loop_id: None, zero_edges: [4], active_edges: [0, 1, 2, 3], nullity: Some(1), numerator_degree_bound: 5, denominator_degree: 8, divergence_degree: -3, convergent: true }], coordinate_convergent: false, directional_convergent: false, convergent: false }
  134. 22.28 s gammaloop-nextest-core> 3D source has 2 loop names ["e1", "e5"], 5 internal edges [edge 0: 0 -> 1, loops=[1, 0], externals=[0, 0]; edge 1: 0 -> 2, loops=[-1, 0], externals=[1, 0]; edge 2: 1 -> 3, loops=[1, 0], externals=[-1, 0]; edge 3: 2 -> 3, loops=[0, 1], externals=[0, 0]; edge 4: 2 -> 3, loops=[-1, -1], externals=[1, 0]]
  135. 22.28 s gammaloop-nextest-core>
  136. 22.28 s gammaloop-nextest-core> Location:
  137. 22.28 s gammaloop-nextest-core> crates/gammalooprs/src/cff/generation.rs:226
  138. 22.28 s gammaloop-nextest-core>
  139. 22.28 s gammaloop-nextest-core> ━━━━━━━━━━━━━━━━━━━━━━━━━━━━━━━━━━ BACKTRACE ━━━━━━━━━━━━━━━━━━━━━━━━━━━━━━━━━━━
  140. 22.28 s gammaloop-nextest-core> 1: <color_eyre[51793ea62743adbd]::config::EyreHook>::into_eyre_hook::{closure#0}<unknown>
  141. 22.28 s gammaloop-nextest-core> at <unknown source file>:<unknown line>
  142. 22.28 s gammaloop-nextest-core> 2: eyre[cb2fd339c0c40fca]::capture_handler<unknown>
  143. 22.28 s gammaloop-nextest-core> at <unknown source file>:<unknown line>
  144. 22.28 s gammaloop-nextest-core> 3: <eyre[cb2fd339c0c40fca]::Report>::from_adhoc::<alloc[2ea6bcb46fca0c42]::string::String><unknown>
  145. 22.28 s gammaloop-nextest-core> at <unknown source file>:<unknown line>
  146. 22.28 s gammaloop-nextest-core> 4: <gammalooprs[1d0b14476f7eb2f8]::graph::Graph>::generate_3d_expression_for_integrand<unknown>
  147. 22.28 s gammaloop-nextest-core> at <unknown source file>:<unknown line>
  148. 22.28 s gammaloop-nextest-core> 5: <gammalooprs[1d0b14476f7eb2f8]::processes::amplitude::AmplitudeGraph>::generate_cff<unknown>
  149. 22.28 s gammaloop-nextest-core> at <unknown source file>:<unknown line>
  150. 22.28 s gammaloop-nextest-core> 6: <gammalooprs[1d0b14476f7eb2f8]::processes::amplitude::AmplitudeGraph>::renormalization_part<unknown>
  151. 22.28 s gammaloop-nextest-core> at <unknown source file>:<unknown line>
  152. 22.28 s gammaloop-nextest-core> 7: test_renormalization[879b57236d814a44]::finite_part_ghost_2loop<unknown>
  153. 22.28 s gammaloop-nextest-core> at <unknown source file>:<unknown line>
  154. 22.28 s gammaloop-nextest-core> 8: <test_renormalization[879b57236d814a44]::finite_part_ghost_2loop::{closure#0} as core[940e698046960fd5]::ops::function::FnOnce<()>>::call_once<unknown>
  155. 22.28 s gammaloop-nextest-core> at <unknown source file>:<unknown line>
  156. 22.28 s gammaloop-nextest-core> 9: test[75d6903177b1d7e9]::__rust_begin_short_backtrace::<core[940e698046960fd5]::result::Result<(), alloc[2ea6bcb46fca0c42]::string::String>, fn() -> core[940e698046960fd5]::result::Result<(), alloc[2ea6bcb46fca0c42]::string::String>><unknown>
  157. 22.28 s gammaloop-nextest-core> at <unknown source file>:<unknown line>
  158. 22.28 s gammaloop-nextest-core> 10: test[75d6903177b1d7e9]::run_test::{closure#0}<unknown>
  159. 22.28 s gammaloop-nextest-core> at <unknown source file>:<unknown line>
  160. 22.28 s gammaloop-nextest-core> 11: std[bcb96dfbba0ab899]::sys::backtrace::__rust_begin_short_backtrace::<test[75d6903177b1d7e9]::run_test::{closure#1}, ()><unknown>
  161. 22.28 s gammaloop-nextest-core> at <unknown source file>:<unknown line>
  162. 22.28 s gammaloop-nextest-core> 12: <std[bcb96dfbba0ab899]::thread::lifecycle::spawn_unchecked<test[75d6903177b1d7e9]::run_test::{closure#1}, ()>::{closure#1} as core[940e698046960fd5]::ops::function::FnOnce<()>>::call_once::{shim:vtable#0}<unknown>
  163. 22.28 s gammaloop-nextest-core> at <unknown source file>:<unknown line>
  164. 22.28 s gammaloop-nextest-core> 13: <std[bcb96dfbba0ab899]::sys::thread::unix::Thread>::new::thread_start<unknown>
  165. 22.28 s gammaloop-nextest-core> at <unknown source file>:<unknown line>
  166. 22.28 s gammaloop-nextest-core> 14: start_thread<unknown>
  167. 22.28 s gammaloop-nextest-core> at <unknown source file>:<unknown line>
  168. 22.28 s gammaloop-nextest-core> 15: __clone3<unknown>
  169. 22.28 s gammaloop-nextest-core> at <unknown source file>:<unknown line>
  170. 22.28 s gammaloop-nextest-core>
  171. 22.28 s gammaloop-nextest-core> Run with COLORBT_SHOW_HIDDEN=1 environment variable to disable frame filtering.
  172. 22.28 s gammaloop-nextest-core> Run with RUST_BACKTRACE=full to include source snippets.
  173. 22.28 s gammaloop-nextest-core> Warning: SpanTrace capture is Unsupported.
  174. 22.28 s gammaloop-nextest-core> Ensure that you've setup a tracing-error ErrorLayer and the semver versions are compatible
  175. 22.28 s gammaloop-nextest-core> Location: crates/gammalooprs/tests/test_renormalization.rs:495
  176. 22.28 s gammaloop-nextest-core>
  177. 22.28 s gammaloop-nextest-core> ━━━━━━━━━━━━━━━━━━━━━━━━━━━━━━━━━━ BACKTRACE ━━━━━━━━━━━━━━━━━━━━━━━━━━━━━━━━━━━
  178. 22.28 s gammaloop-nextest-core> 1: <color_eyre[51793ea62743adbd]::config::PanicHook>::panic_report<unknown>
  179. 22.28 s gammaloop-nextest-core> at <unknown source file>:<unknown line>
  180. 22.28 s gammaloop-nextest-core> 2: <color_eyre[51793ea62743adbd]::config::PanicHook>::into_panic_hook::{closure#0}<unknown>
  181. 22.28 s gammaloop-nextest-core> at <unknown source file>:<unknown line>
  182. 22.28 s gammaloop-nextest-core> 3: std[bcb96dfbba0ab899]::panicking::panic_with_hook<unknown>
  183. 22.28 s gammaloop-nextest-core> at <unknown source file>:<unknown line>
  184. 22.28 s gammaloop-nextest-core> 4: std[bcb96dfbba0ab899]::panicking::panic_handler::{closure#0}<unknown>
  185. 22.28 s gammaloop-nextest-core> at <unknown source file>:<unknown line>
  186. 22.28 s gammaloop-nextest-core> 5: std[bcb96dfbba0ab899]::sys::backtrace::__rust_end_short_backtrace::<std[bcb96dfbba0ab899]::panicking::panic_handler::{closure#0}, !><unknown>
  187. 22.28 s gammaloop-nextest-core> at <unknown source file>:<unknown line>
  188. 22.28 s gammaloop-nextest-core> 6: __rustc[6c289b9f9c454d21]::rust_begin_unwind<unknown>
  189. 22.28 s gammaloop-nextest-core> at <unknown source file>:<unknown line>
  190. 22.28 s gammaloop-nextest-core> 7: core[940e698046960fd5]::panicking::panic_fmt<unknown>
  191. 22.28 s gammaloop-nextest-core> at <unknown source file>:<unknown line>
  192. 22.28 s gammaloop-nextest-core> 8: core[940e698046960fd5]::result::unwrap_failed<unknown>
  193. 22.28 s gammaloop-nextest-core> at <unknown source file>:<unknown line>
  194. 22.28 s gammaloop-nextest-core> 9: test_renormalization[879b57236d814a44]::finite_part_ghost_2loop<unknown>
  195. 22.28 s gammaloop-nextest-core> at <unknown source file>:<unknown line>
  196. 22.28 s gammaloop-nextest-core> 10: <test_renormalization[879b57236d814a44]::finite_part_ghost_2loop::{closure#0} as core[940e698046960fd5]::ops::function::FnOnce<()>>::call_once<unknown>
  197. 22.28 s gammaloop-nextest-core> at <unknown source file>:<unknown line>
  198. 22.28 s gammaloop-nextest-core> 11: test[75d6903177b1d7e9]::__rust_begin_short_backtrace::<core[940e698046960fd5]::result::Result<(), alloc[2ea6bcb46fca0c42]::string::String>, fn() -> core[940e698046960fd5]::result::Result<(), alloc[2ea6bcb46fca0c42]::string::String>><unknown>
  199. 22.28 s gammaloop-nextest-core> at <unknown source file>:<unknown line>
  200. 22.28 s gammaloop-nextest-core> 12: test[75d6903177b1d7e9]::run_test::{closure#0}<unknown>
  201. 22.28 s gammaloop-nextest-core> at <unknown source file>:<unknown line>
  202. 22.28 s gammaloop-nextest-core> 13: std[bcb96dfbba0ab899]::sys::backtrace::__rust_begin_short_backtrace::<test[75d6903177b1d7e9]::run_test::{closure#1}, ()><unknown>
  203. 22.28 s gammaloop-nextest-core> at <unknown source file>:<unknown line>
  204. 22.28 s gammaloop-nextest-core> 14: <std[bcb96dfbba0ab899]::thread::lifecycle::spawn_unchecked<test[75d6903177b1d7e9]::run_test::{closure#1}, ()>::{closure#1} as core[940e698046960fd5]::ops::function::FnOnce<()>>::call_once::{shim:vtable#0}<unknown>
  205. 22.28 s gammaloop-nextest-core> at <unknown source file>:<unknown line>
  206. 22.28 s gammaloop-nextest-core> 15: <std[bcb96dfbba0ab899]::sys::thread::unix::Thread>::new::thread_start<unknown>
  207. 22.28 s gammaloop-nextest-core> at <unknown source file>:<unknown line>
  208. 22.28 s gammaloop-nextest-core> 16: start_thread<unknown>
  209. 22.28 s gammaloop-nextest-core> at <unknown source file>:<unknown line>
  210. 22.28 s gammaloop-nextest-core> 17: __clone3<unknown>
  211. 22.28 s gammaloop-nextest-core> at <unknown source file>:<unknown line>
  212. 22.28 s gammaloop-nextest-core>
  213. 22.28 s gammaloop-nextest-core> Run with COLORBT_SHOW_HIDDEN=1 environment variable to disable frame filtering.
  214. 22.28 s gammaloop-nextest-core> Run with RUST_BACKTRACE=full to include source snippets.
  215. 22.28 s gammaloop-nextest-core>
  216. 26.24 s gammaloop-nextest-core> ------------
  217. 26.24 s gammaloop-nextest-core> Summary [ 10.610s] 501 tests run: 499 passed, 2 failed, 59 skipped
  218. 26.24 s gammaloop-nextest-core> FAIL [ 0.167s] (479/501) gammalooprs uv::hedge_poset::tests::union_terms_project_factorized_typed_4d_values
  219. 26.24 s gammaloop-nextest-core> stdout ---
  220. 26.24 s gammaloop-nextest-core>
  221. 26.24 s gammaloop-nextest-core> running 1 test
  222. 26.24 s gammaloop-nextest-core> test uv::hedge_poset::tests::union_terms_project_factorized_typed_4d_values ... FAILED
  223. 26.24 s gammaloop-nextest-core>
  224. 26.24 s gammaloop-nextest-core> failures:
  225. 26.24 s gammaloop-nextest-core>
  226. 26.24 s gammaloop-nextest-core> failures:
  227. 26.24 s gammaloop-nextest-core> uv::hedge_poset::tests::union_terms_project_factorized_typed_4d_values
  228. 26.24 s gammaloop-nextest-core>
  229. 26.24 s gammaloop-nextest-core> test result: FAILED. 0 passed; 1 failed; 0 ignored; 0 measured; 551 filtered out; finished in 0.14s
  230. 26.24 s gammaloop-nextest-core>
  231. 26.24 s gammaloop-nextest-core> stderr ---
  232. 26.24 s gammaloop-nextest-core> Error:
  233. 26.24 s gammaloop-nextest-core> 0: exact source occurrences for physical edge 1 disagree after on-shell-energy replacement: `-(mUVexp^2+Q(1,cind(1))^2+Q(1,cind(2))^2+Q(1,cind(3))^2)^(1/2)` versus `(mUVexp^2+Q(1,cind(1))^2+Q(1,cind(2))^2+Q(1,cind(3))^2)^(1/2)`; exact 4D term active denominators are [FourDDenominator { source_edge: EdgeIndex(1), momentum: gammalooprs::Q(1), mass_squared: gammalooprs::mUVexp^2, full_expr: -gammalooprs::mUV^2+spenso::dot(gammalooprs::Q(1,spenso::mink(gammalooprs::dim)),gammalooprs::Q(1,spenso::mink(gammalooprs::dim))) }, FourDDenominator { source_edge: EdgeIndex(1), momentum: gammalooprs::Q(1), mass_squared: gammalooprs::mUVexp^2, full_expr: -gammalooprs::mUV^2+spenso::dot(gammalooprs::Q(1,spenso::mink(gammalooprs::dim)),gammalooprs::Q(1,spenso::mink(gammalooprs::dim))) }, FourDDenominator { source_edge: EdgeIndex(3), momentum: gammalooprs::Q(3), mass_squared: gammalooprs::mUVexp^2, full_expr: -gammalooprs::mUV^2+spenso::dot(gammalooprs::Q(3,spenso::mink(gammalooprs::dim)),gammalooprs::Q(3,spenso::mink(gammalooprs::dim))) }, FourDDenominator { source_edge: EdgeIndex(3), momentum: gammalooprs::Q(3), mass_squared: gammalooprs::mUVexp^2, full_expr: -gammalooprs::mUV^2+spenso::dot(gammalooprs::Q(3,spenso::mink(gammalooprs::dim)),gammalooprs::Q(3,spenso::mink(gammalooprs::dim))) }, FourDDenominator { source_edge: EdgeIndex(0), momentum: gammalooprs::Q(0), mass_squared: UFO::mass_scalar_1^2, full_expr: -UFO::mass_scalar_1^2+spenso::dot(gammalooprs::Q(0,spenso::mink(gammalooprs::dim)),gammalooprs::Q(0,spenso::mink(gammalooprs::dim))) }]
  234. 26.24 s gammaloop-nextest-core>
  235. 26.24 s gammaloop-nextest-core> Location:
  236. 26.24 s gammaloop-nextest-core> crates/gammalooprs/src/uv/approx/local_3d.rs:641
  237. 26.24 s gammaloop-nextest-core>
  238. 26.24 s gammaloop-nextest-core> ━━━━━━━━━━━━━━━━━━━━━━━━━━━━━━━━━━ BACKTRACE ━━━━━━━━━━━━━━━━━━━━━━━━━━━━━━━━━━━
  239. 26.24 s gammaloop-nextest-core> 1: <color_eyre[51793ea62743adbd]::config::EyreHook>::into_eyre_hook::{closure#0}<unknown>
  240. 26.24 s gammaloop-nextest-core> at <unknown source file>:<unknown line>
  241. 26.24 s gammaloop-nextest-core> 2: eyre[cb2fd339c0c40fca]::capture_handler<unknown>
  242. 26.24 s gammaloop-nextest-core> at <unknown source file>:<unknown line>
  243. 26.24 s gammaloop-nextest-core> 3: <eyre[cb2fd339c0c40fca]::Report>::from_adhoc::<alloc[2ea6bcb46fca0c42]::string::String><unknown>
  244. 26.24 s gammaloop-nextest-core> at <unknown source file>:<unknown line>
  245. 26.24 s gammaloop-nextest-core> 4: <gammalooprs[6dc202c8af9e2ddf]::uv::approx::local_3d::Localizer>::project_4d<unknown>
  246. 26.24 s gammaloop-nextest-core> at <unknown source file>:<unknown line>
  247. 26.24 s gammaloop-nextest-core> 5: gammalooprs[6dc202c8af9e2ddf]::uv::hedge_poset::tests::union_terms_project_factorized_typed_4d_values<unknown>
  248. 26.24 s gammaloop-nextest-core> at <unknown source file>:<unknown line>
  249. 26.24 s gammaloop-nextest-core> 6: <gammalooprs[6dc202c8af9e2ddf]::uv::hedge_poset::tests::union_terms_project_factorized_typed_4d_values::{closure#0} as core[940e698046960fd5]::ops::function::FnOnce<()>>::call_once<unknown>
  250. 26.24 s gammaloop-nextest-core> at <unknown source file>:<unknown line>
  251. 26.24 s gammaloop-nextest-core> 7: test[75d6903177b1d7e9]::__rust_begin_short_backtrace::<core[940e698046960fd5]::result::Result<(), alloc[2ea6bcb46fca0c42]::string::String>, fn() -> core[940e698046960fd5]::result::Result<(), alloc[2ea6bcb46fca0c42]::string::String>><unknown>
  252. 26.24 s gammaloop-nextest-core> at <unknown source file>:<unknown line>
  253. 26.24 s gammaloop-nextest-core> 8: test[75d6903177b1d7e9]::run_test::{closure#0}<unknown>
  254. 26.24 s gammaloop-nextest-core> at <unknown source file>:<unknown line>
  255. 26.24 s gammaloop-nextest-core> 9: std[bcb96dfbba0ab899]::sys::backtrace::__rust_begin_short_backtrace::<test[75d6903177b1d7e9]::run_test::{closure#1}, ()><unknown>
  256. 26.24 s gammaloop-nextest-core> at <unknown source file>:<unknown line>
  257. 26.24 s gammaloop-nextest-core> 10: <std[bcb96dfbba0ab899]::thread::lifecycle::spawn_unchecked<test[75d6903177b1d7e9]::run_test::{closure#1}, ()>::{closure#1} as core[940e698046960fd5]::ops::function::FnOnce<()>>::call_once::{shim:vtable#0}<unknown>
  258. 26.24 s gammaloop-nextest-core> at <unknown source file>:<unknown line>
  259. 26.24 s gammaloop-nextest-core> 11: <std[bcb96dfbba0ab899]::sys::thread::unix::Thread>::new::thread_start<unknown>
  260. 26.24 s gammaloop-nextest-core> at <unknown source file>:<unknown line>
  261. 26.24 s gammaloop-nextest-core> 12: start_thread<unknown>
  262. 26.24 s gammaloop-nextest-core> at <unknown source file>:<unknown line>
  263. 26.24 s gammaloop-nextest-core> 13: __clone3<unknown>
  264. 26.24 s gammaloop-nextest-core> at <unknown source file>:<unknown line>
  265. 26.24 s gammaloop-nextest-core>
  266. 26.24 s gammaloop-nextest-core> Run with COLORBT_SHOW_HIDDEN=1 environment variable to disable frame filtering.
  267. 26.24 s gammaloop-nextest-core> Run with RUST_BACKTRACE=full to include source snippets.
  268. 26.24 s gammaloop-nextest-core>
  269. 26.24 s gammaloop-nextest-core> FAIL [ 5.275s] (497/501) gammalooprs::test_renormalization finite_part_ghost_2loop
  270. 26.24 s gammaloop-nextest-core> stdout ---
  271. 26.24 s gammaloop-nextest-core>
  272. 26.24 s gammaloop-nextest-core> running 1 test
  273. 26.24 s gammaloop-nextest-core> test finite_part_ghost_2loop ... FAILED
  274. 26.24 s gammaloop-nextest-core>
  275. 26.24 s gammaloop-nextest-core> failures:
  276. 26.24 s gammaloop-nextest-core>
  277. 26.24 s gammaloop-nextest-core> failures:
  278. 26.24 s gammaloop-nextest-core> finite_part_ghost_2loop
  279. 26.24 s gammaloop-nextest-core>
  280. 26.24 s gammaloop-nextest-core> test result: FAILED. 0 passed; 1 failed; 0 ignored; 0 measured; 5 filtered out; finished in 5.25s
  281. 26.24 s gammaloop-nextest-core>
  282. 26.24 s gammaloop-nextest-core> stderr ---
  283. 26.24 s gammaloop-nextest-core> [16:29:41.927] @gammalooprs::processes::amplitude ERROR :
  284. 26.24 s gammaloop-nextest-core> field value
  285. 26.24 s gammaloop-nextest-core> error generalized CFF expression generation failed for graph `d5` with source-edge numerator energy-degree bounds Some([(1, 1), (2, 1), (3, 1), (5, 2), (6, 2)]): energy-degree bounds do not certify vanishing residues at infinity under the conservative cap check: EnergyDivergenceReport { edge_degree_bounds: [1, 1, 1, 2, 2], loops: [EnergyDirectionReport { loop_id: Some(0), zero_edges: [], active_edges: [0, 1, 2, 4], nullity: None, numerator_degree_bound: 5, denominator_degree: 8, divergence_degree: -3, convergent: true }, EnergyDirectionReport { loop_id: Some(1), zero_edges: [], active_edges: [3, 4], nullity: None, numerator_degree_bound: 4, denominator_degree: 4, divergence_degree: 0, convergent: false }], directions: [EnergyDirectionReport { loop_id: None, zero_edges: [0, 1, 2], active_edges: [3, 4], nullity: Some(1), numerator_degree_bound: 4, denominator_degree: 4, divergence_degree: 0, convergent: false }, EnergyDirectionReport { loop_id: None, zero_edges: [], active_edges: [0, 1, 2, 3, 4], nullity: Some(2), numerator_degree_bound: 7, denominator_degree: 10, divergence_degree: -3, convergent: true }, EnergyDirectionReport { loop_id: None, zero_edges: [3], active_edges: [0, 1, 2, 4], nullity: Some(1), numerator_degree_bound: 5, denominator_degree: 8, divergence_degree: -3, convergent: true }, EnergyDirectionReport { loop_id: None, zero_edges: [4], active_edges: [0, 1, 2, 3], nullity: Some(1), numerator_degree_bound: 5, denominator_degree: 8, divergence_degree: -3, convergent: true }], coordinate_convergent: false, directional_convergent: false, convergent: false }
  286. 26.24 s gammaloop-nextest-core> 3D source has 2 loop names ["e1", "e5"], 5 internal edges [edge 0: 0 -> 1, loops=[1, 0], externals=[0, 0]; edge 1: 0 -> 2, loops=[-1, 0], externals=[1, 0]; edge 2: 1 -> 3, loops=[1, 0], externals=[-1, 0]; edge 3: 2 -> 3, loops=[0, 1], externals=[0, 0]; edge 4: 2 -> 3, loops=[-1, -1], externals=[1, 0]]
  287. 26.24 s gammaloop-nextest-core> at crates/gammalooprs/src/processes/amplitude.rs:825
  288. 26.24 s gammaloop-nextest-core> The application panicked (crashed).
  289. 26.24 s gammaloop-nextest-core> Message: called `Result::unwrap()` on an `Err` value:
  290. 26.24 s gammaloop-nextest-core> 0: generalized CFF expression generation failed for graph `d5` with source-edge numerator energy-degree bounds Some([(1, 1), (2, 1), (3, 1), (5, 2), (6, 2)]): energy-degree bounds do not certify vanishing residues at infinity under the conservative cap check: EnergyDivergenceReport { edge_degree_bounds: [1, 1, 1, 2, 2], loops: [EnergyDirectionReport { loop_id: Some(0), zero_edges: [], active_edges: [0, 1, 2, 4], nullity: None, numerator_degree_bound: 5, denominator_degree: 8, divergence_degree: -3, convergent: true }, EnergyDirectionReport { loop_id: Some(1), zero_edges: [], active_edges: [3, 4], nullity: None, numerator_degree_bound: 4, denominator_degree: 4, divergence_degree: 0, convergent: false }], directions: [EnergyDirectionReport { loop_id: None, zero_edges: [0, 1, 2], active_edges: [3, 4], nullity: Some(1), numerator_degree_bound: 4, denominator_degree: 4, divergence_degree: 0, convergent: false }, EnergyDirectionReport { loop_id: None, zero_edges: [], active_edges: [0, 1, 2, 3, 4], nullity: Some(2), numerator_degree_bound: 7, denominator_degree: 10, divergence_degree: -3, convergent: true }, EnergyDirectionReport { loop_id: None, zero_edges: [3], active_edges: [0, 1, 2, 4], nullity: Some(1), numerator_degree_bound: 5, denominator_degree: 8, divergence_degree: -3, convergent: true }, EnergyDirectionReport { loop_id: None, zero_edges: [4], active_edges: [0, 1, 2, 3], nullity: Some(1), numerator_degree_bound: 5, denominator_degree: 8, divergence_degree: -3, convergent: true }], coordinate_convergent: false, directional_convergent: false, convergent: false }
  291. 26.24 s gammaloop-nextest-core> 3D source has 2 loop names ["e1", "e5"], 5 internal edges [edge 0: 0 -> 1, loops=[1, 0], externals=[0, 0]; edge 1: 0 -> 2, loops=[-1, 0], externals=[1, 0]; edge 2: 1 -> 3, loops=[1, 0], externals=[-1, 0]; edge 3: 2 -> 3, loops=[0, 1], externals=[0, 0]; edge 4: 2 -> 3, loops=[-1, -1], externals=[1, 0]]
  292. 26.24 s gammaloop-nextest-core>
  293. 26.24 s gammaloop-nextest-core> Location:
  294. 26.24 s gammaloop-nextest-core> crates/gammalooprs/src/cff/generation.rs:226
  295. 26.24 s gammaloop-nextest-core>
  296. 26.24 s gammaloop-nextest-core> ━━━━━━━━━━━━━━━━━━━━━━━━━━━━━━━━━━ BACKTRACE ━━━━━━━━━━━━━━━━━━━━━━━━━━━━━━━━━━━
  297. 26.24 s gammaloop-nextest-core> 1: <color_eyre[51793ea62743adbd]::config::EyreHook>::into_eyre_hook::{closure#0}<unknown>
  298. 26.24 s gammaloop-nextest-core> at <unknown source file>:<unknown line>
  299. 26.24 s gammaloop-nextest-core> 2: eyre[cb2fd339c0c40fca]::capture_handler<unknown>
  300. 26.24 s gammaloop-nextest-core> at <unknown source file>:<unknown line>
  301. 26.24 s gammaloop-nextest-core> 3: <eyre[cb2fd339c0c40fca]::Report>::from_adhoc::<alloc[2ea6bcb46fca0c42]::string::String><unknown>
  302. 26.24 s gammaloop-nextest-core> at <unknown source file>:<unknown line>
  303. 26.24 s gammaloop-nextest-core> 4: <gammalooprs[1d0b14476f7eb2f8]::graph::Graph>::generate_3d_expression_for_integrand<unknown>
  304. 26.24 s gammaloop-nextest-core> at <unknown source file>:<unknown line>
  305. 26.24 s gammaloop-nextest-core> 5: <gammalooprs[1d0b14476f7eb2f8]::processes::amplitude::AmplitudeGraph>::generate_cff<unknown>
  306. 26.24 s gammaloop-nextest-core> at <unknown source file>:<unknown line>
  307. 26.24 s gammaloop-nextest-core> 6: <gammalooprs[1d0b14476f7eb2f8]::processes::amplitude::AmplitudeGraph>::renormalization_part<unknown>
  308. 26.24 s gammaloop-nextest-core> at <unknown source file>:<unknown line>
  309. 26.24 s gammaloop-nextest-core> 7: test_renormalization[879b57236d814a44]::finite_part_ghost_2loop<unknown>
  310. 26.24 s gammaloop-nextest-core> at <unknown source file>:<unknown line>
  311. 26.24 s gammaloop-nextest-core> 8: <test_renormalization[879b57236d814a44]::finite_part_ghost_2loop::{closure#0} as core[940e698046960fd5]::ops::function::FnOnce<()>>::call_once<unknown>
  312. 26.24 s gammaloop-nextest-core> at <unknown source file>:<unknown line>
  313. 26.24 s gammaloop-nextest-core> 9: test[75d6903177b1d7e9]::__rust_begin_short_backtrace::<core[940e698046960fd5]::result::Result<(), alloc[2ea6bcb46fca0c42]::string::String>, fn() -> core[940e698046960fd5]::result::Result<(), alloc[2ea6bcb46fca0c42]::string::String>><unknown>
  314. 26.24 s gammaloop-nextest-core> at <unknown source file>:<unknown line>
  315. 26.24 s gammaloop-nextest-core> 10: test[75d6903177b1d7e9]::run_test::{closure#0}<unknown>
  316. 26.24 s gammaloop-nextest-core> at <unknown source file>:<unknown line>
  317. 26.24 s gammaloop-nextest-core> 11: std[bcb96dfbba0ab899]::sys::backtrace::__rust_begin_short_backtrace::<test[75d6903177b1d7e9]::run_test::{closure#1}, ()><unknown>
  318. 26.24 s gammaloop-nextest-core> at <unknown source file>:<unknown line>
  319. 26.24 s gammaloop-nextest-core> 12: <std[bcb96dfbba0ab899]::thread::lifecycle::spawn_unchecked<test[75d6903177b1d7e9]::run_test::{closure#1}, ()>::{closure#1} as core[940e698046960fd5]::ops::function::FnOnce<()>>::call_once::{shim:vtable#0}<unknown>
  320. 26.24 s gammaloop-nextest-core> at <unknown source file>:<unknown line>
  321. 26.24 s gammaloop-nextest-core> 13: <std[bcb96dfbba0ab899]::sys::thread::unix::Thread>::new::thread_start<unknown>
  322. 26.24 s gammaloop-nextest-core> at <unknown source file>:<unknown line>
  323. 26.24 s gammaloop-nextest-core> 14: start_thread<unknown>
  324. 26.24 s gammaloop-nextest-core> at <unknown source file>:<unknown line>
  325. 26.24 s gammaloop-nextest-core> 15: __clone3<unknown>
  326. 26.24 s gammaloop-nextest-core> at <unknown source file>:<unknown line>
  327. 26.24 s gammaloop-nextest-core>
  328. 26.24 s gammaloop-nextest-core> Run with COLORBT_SHOW_HIDDEN=1 environment variable to disable frame filtering.
  329. 26.24 s gammaloop-nextest-core> Run with RUST_BACKTRACE=full to include source snippets.
  330. 26.24 s gammaloop-nextest-core> Warning: SpanTrace capture is Unsupported.
  331. 26.24 s gammaloop-nextest-core> Ensure that you've setup a tracing-error ErrorLayer and the semver versions are compatible
  332. 26.24 s gammaloop-nextest-core> Location: crates/gammalooprs/tests/test_renormalization.rs:495
  333. 26.24 s gammaloop-nextest-core>
  334. 26.24 s gammaloop-nextest-core> ━━━━━━━━━━━━━━━━━━━━━━━━━━━━━━━━━━ BACKTRACE ━━━━━━━━━━━━━━━━━━━━━━━━━━━━━━━━━━━
  335. 26.24 s gammaloop-nextest-core> 1: <color_eyre[51793ea62743adbd]::config::PanicHook>::panic_report<unknown>
  336. 26.24 s gammaloop-nextest-core> at <unknown source file>:<unknown line>
  337. 26.24 s gammaloop-nextest-core> 2: <color_eyre[51793ea62743adbd]::config::PanicHook>::into_panic_hook::{closure#0}<unknown>
  338. 26.24 s gammaloop-nextest-core> at <unknown source file>:<unknown line>
  339. 26.24 s gammaloop-nextest-core> 3: std[bcb96dfbba0ab899]::panicking::panic_with_hook<unknown>
  340. 26.24 s gammaloop-nextest-core> at <unknown source file>:<unknown line>
  341. 26.24 s gammaloop-nextest-core> 4: std[bcb96dfbba0ab899]::panicking::panic_handler::{closure#0}<unknown>
  342. 26.24 s gammaloop-nextest-core> at <unknown source file>:<unknown line>
  343. 26.24 s gammaloop-nextest-core> 5: std[bcb96dfbba0ab899]::sys::backtrace::__rust_end_short_backtrace::<std[bcb96dfbba0ab899]::panicking::panic_handler::{closure#0}, !><unknown>
  344. 26.24 s gammaloop-nextest-core> at <unknown source file>:<unknown line>
  345. 26.24 s gammaloop-nextest-core> 6: __rustc[6c289b9f9c454d21]::rust_begin_unwind<unknown>
  346. 26.24 s gammaloop-nextest-core> at <unknown source file>:<unknown line>
  347. 26.24 s gammaloop-nextest-core> 7: core[940e698046960fd5]::panicking::panic_fmt<unknown>
  348. 26.24 s gammaloop-nextest-core> at <unknown source file>:<unknown line>
  349. 26.24 s gammaloop-nextest-core> 8: core[940e698046960fd5]::result::unwrap_failed<unknown>
  350. 26.24 s gammaloop-nextest-core> at <unknown source file>:<unknown line>
  351. 26.24 s gammaloop-nextest-core> 9: test_renormalization[879b57236d814a44]::finite_part_ghost_2loop<unknown>
  352. 26.24 s gammaloop-nextest-core> at <unknown source file>:<unknown line>
  353. 26.24 s gammaloop-nextest-core> 10: <test_renormalization[879b57236d814a44]::finite_part_ghost_2loop::{closure#0} as core[940e698046960fd5]::ops::function::FnOnce<()>>::call_once<unknown>
  354. 26.24 s gammaloop-nextest-core> at <unknown source file>:<unknown line>
  355. 26.24 s gammaloop-nextest-core> 11: test[75d6903177b1d7e9]::__rust_begin_short_backtrace::<core[940e698046960fd5]::result::Result<(), alloc[2ea6bcb46fca0c42]::string::String>, fn() -> core[940e698046960fd5]::result::Result<(), alloc[2ea6bcb46fca0c42]::string::String>><unknown>
  356. 26.24 s gammaloop-nextest-core> at <unknown source file>:<unknown line>
  357. 26.24 s gammaloop-nextest-core> 12: test[75d6903177b1d7e9]::run_test::{closure#0}<unknown>
  358. 26.24 s gammaloop-nextest-core> at <unknown source file>:<unknown line>
  359. 26.24 s gammaloop-nextest-core> 13: std[bcb96dfbba0ab899]::sys::backtrace::__rust_begin_short_backtrace::<test[75d6903177b1d7e9]::run_test::{closure#1}, ()><unknown>
  360. 26.24 s gammaloop-nextest-core> at <unknown source file>:<unknown line>
  361. 26.24 s gammaloop-nextest-core> 14: <std[bcb96dfbba0ab899]::thread::lifecycle::spawn_unchecked<test[75d6903177b1d7e9]::run_test::{closure#1}, ()>::{closure#1} as core[940e698046960fd5]::ops::function::FnOnce<()>>::call_once::{shim:vtable#0}<unknown>
  362. 26.24 s gammaloop-nextest-core> at <unknown source file>:<unknown line>
  363. 26.24 s gammaloop-nextest-core> 15: <std[bcb96dfbba0ab899]::sys::thread::unix::Thread>::new::thread_start<unknown>
  364. 26.24 s gammaloop-nextest-core> at <unknown source file>:<unknown line>
  365. 26.24 s gammaloop-nextest-core> 16: start_thread<unknown>
  366. 26.24 s gammaloop-nextest-core> at <unknown source file>:<unknown line>
  367. 26.24 s gammaloop-nextest-core> 17: __clone3<unknown>
  368. 26.24 s gammaloop-nextest-core> at <unknown source file>:<unknown line>
  369. 26.24 s gammaloop-nextest-core>
  370. 26.24 s gammaloop-nextest-core> Run with COLORBT_SHOW_HIDDEN=1 environment variable to disable frame filtering.
  371. 26.24 s gammaloop-nextest-core> Run with RUST_BACKTRACE=full to include source snippets.
  372. 26.24 s gammaloop-nextest-core>
  373. 26.32 s gammaloop-nextest-core> error: test run failed
  374. 26.35 s gammaloop-nextest-core>
  375. 26.35 s gammaloop-nextest-core> ========== nextest test summary ==========
  376. 26.35 s gammaloop-nextest-core> report: target/nextest/ci_gammaloop/junit.xml
  377. 26.35 s gammaloop-nextest-core> tests: 501, failures: 2, errors: 0
  378. 26.35 s gammaloop-nextest-core>
  379. 26.35 s gammaloop-nextest-core> 1. gammalooprs::uv::hedge_poset::tests::union_terms_project_factorized_typed_4d_values
  380. 26.35 s gammaloop-nextest-core> failure: test failure with exit code 101
  381. 26.35 s gammaloop-nextest-core> Error:
  382. 26.35 s gammaloop-nextest-core> 0: exact source occurrences for physical edge 1 disagree after on-shell-energy replacement: `-(mUVexp^2+Q(1,cind(1))^2+Q(1,cind(2))^2+Q(1,cind(3))^2)^(1/2)` versus `(mUVexp^2+Q(1,cind(1))^2+Q(1,cind(2))^2+Q(1,cind(3))^2)^(1/2)`; exact 4D term active denominators are [FourDDenominator { source_edge: EdgeIndex(1), momentum: gammalooprs::Q(1), mass_squared: gammalooprs::mUVexp^2, full_expr: -gammalooprs::mUV^2+spenso::dot(gammalooprs::Q(1,spenso::mink(gammalooprs::dim)),gammalooprs::Q(1,spenso::mink(gammalooprs::dim))) }, FourDDenominator { source_edge: EdgeIndex(1), momentum: gammalooprs::Q(1), mass_squared: gammalooprs::mUVexp^2, full_expr: -gammalooprs::mUV^2+spenso::dot(gammalooprs::Q(1,spenso::mink(gammalooprs::dim)),gammalooprs::Q(1,spenso::mink(gammalooprs::dim))) }, FourDDenominator { source_edge: EdgeIndex(3), momentum: gammalooprs::Q(3), mass_squared: gammalooprs::mUVexp^2, full_expr: -gammalooprs::mUV^2+spenso::dot(gammalooprs::Q(3,spenso::mink(gammalooprs::dim)),gammalooprs::Q(3,spenso::mink(gammalooprs::dim))) }, FourDDenominator { source_edge: EdgeIndex(3), momentum: gammalooprs::Q(3), mass_squared: gammalooprs::mUVexp^2, full_expr: -gammalooprs::mUV^2+spenso::dot(gammalooprs::Q(3,spenso::mink(gammalooprs::dim)),gammalooprs::Q(3,spenso::mink(gammalooprs::dim))) }, FourDDenominator { source_edge: EdgeIndex(0), momentum: gammalooprs::Q(0), mass_squared: UFO::mass_scalar_1^2, full_expr: -UFO::mass_scalar_1^2+spenso::dot(gammalooprs::Q(0,spenso::mink(gammalooprs::dim)),gammalooprs::Q(0,spenso::mink(gammalooprs::dim))) }]
  383. 26.35 s gammaloop-nextest-core>
  384. 26.35 s gammaloop-nextest-core> Location:
  385. 26.35 s gammaloop-nextest-core> crates/gammalooprs/src/uv/approx/local_3d.rs:641
  386. 26.35 s gammaloop-nextest-core>
  387. 26.35 s gammaloop-nextest-core> ━━━━━━━━━━━━━━━━━━━━━━━━━━━━━━━━━━ BACKTRACE ━━━━━━━━━━━━━━━━━━━━━━━━━━━━━━━━━━━
  388. 26.35 s gammaloop-nextest-core> 1: <color_eyre[51793ea62743adbd]::config::EyreHook>::into_eyre_hook::{closure#0}<unknown>
  389. 26.35 s gammaloop-nextest-core> at <unknown source file>:<unknown line>
  390. 26.35 s gammaloop-nextest-core> 2: eyre[cb2fd339c0c40fca]::capture_handler<unknown>
  391. 26.35 s gammaloop-nextest-core> at <unknown source file>:<unknown line>
  392. 26.35 s gammaloop-nextest-core> 3: <eyre[cb2fd339c0c40fca]::Report>::from_adhoc::<alloc[2ea6bcb46fca0c42]::string::String><unknown>
  393. 26.35 s gammaloop-nextest-core> at <unknown source file>:<unknown line>
  394. 26.35 s gammaloop-nextest-core> 4: <gammalooprs[6dc202c8af9e2ddf]::uv::approx::local_3d::Localizer>::project_4d<unknown>
  395. 26.35 s gammaloop-nextest-core> at <unknown source file>:<unknown line>
  396. 26.35 s gammaloop-nextest-core> 5: gammalooprs[6dc202c8af9e2ddf]::uv::hedge_poset::tests::union_terms_project_factorized_typed_4d_values<unknown>
  397. 26.35 s gammaloop-nextest-core> at <unknown source file>:<unknown line>
  398. 26.35 s gammaloop-nextest-core> 6: <gammalooprs[6dc202c8af9e2ddf]::uv::hedge_poset::tests::union_terms_project_factorized_typed_4d_values::{closure#0} as core[940e698046960fd5]::ops::function::FnOnce<()>>::call_once<unknown>
  399. 26.35 s gammaloop-nextest-core> at <unknown source file>:<unknown line>
  400. 26.35 s gammaloop-nextest-core> 7: test[75d6903177b1d7e9]::__rust_begin_short_backtrace::<core[940e698046960fd5]::result::Result<(), alloc[2ea6bcb46fca0c42]::string::String>, fn() -> core[940e698046960fd5]::result::Result<(), alloc[2ea6bcb46fca0c42]::string::String>><unknown>
  401. 26.35 s gammaloop-nextest-core> at <unknown source file>:<unknown line>
  402. 26.35 s gammaloop-nextest-core> 8: test[75d6903177b1d7e9]::run_test::{closure#0}<unknown>
  403. 26.35 s gammaloop-nextest-core> at <unknown source file>:<unknown line>
  404. 26.35 s gammaloop-nextest-core> 9: std[bcb96dfbba0ab899]::sys::backtrace::__rust_begin_short_backtrace::<test[75d6903177b1d7e9]::run_test::{closure#1}, ()><unknown>
  405. 26.35 s gammaloop-nextest-core> at <unknown source file>:<unknown line>
  406. 26.35 s gammaloop-nextest-core> 10: <std[bcb96dfbba0ab899]::thread::lifecycle::spawn_unchecked<test[75d6903177b1d7e9]::run_test::{closure#1}, ()>::{closure#1} as core[940e698046960fd5]::ops::function::FnOnce<()>>::call_once::{shim:vtable#0}<unknown>
  407. 26.35 s gammaloop-nextest-core> at <unknown source file>:<unknown line>
  408. 26.35 s gammaloop-nextest-core> 11: <std[bcb96dfbba0ab899]::sys::thread::unix::Thread>::new::thread_start<unknown>
  409. 26.35 s gammaloop-nextest-core> at <unknown source file>:<unknown line>
  410. 26.35 s gammaloop-nextest-core> 12: start_thread<unknown>
  411. 26.35 s gammaloop-nextest-core> at <unknown source file>:<unknown line>
  412. 26.35 s gammaloop-nextest-core> 13: __clone3<unknown>
  413. 26.35 s gammaloop-nextest-core> at <unknown source file>:<unknown line>
  414. 26.35 s gammaloop-nextest-core>
  415. 26.35 s gammaloop-nextest-core> Run with COLORBT_SHOW_HIDDEN=1 environment variable to disable frame filtering.
  416. 26.35 s gammaloop-nextest-core> Run with RUST_BACKTRACE=full to include source snippets.
  417. 26.35 s gammaloop-nextest-core> system-out
  418. 26.35 s gammaloop-nextest-core> running 1 test
  419. 26.35 s gammaloop-nextest-core> test uv::hedge_poset::tests::union_terms_project_factorized_typed_4d_values ... FAILED
  420. 26.35 s gammaloop-nextest-core>
  421. 26.35 s gammaloop-nextest-core> failures:
  422. 26.35 s gammaloop-nextest-core>
  423. 26.35 s gammaloop-nextest-core> failures:
  424. 26.35 s gammaloop-nextest-core> uv::hedge_poset::tests::union_terms_project_factorized_typed_4d_values
  425. 26.35 s gammaloop-nextest-core>
  426. 26.35 s gammaloop-nextest-core> test result: FAILED. 0 passed; 1 failed; 0 ignored; 0 measured; 551 filtered out; finished in 0.14s
  427. 26.35 s gammaloop-nextest-core> system-err
  428. 26.35 s gammaloop-nextest-core> Error:
  429. 26.35 s gammaloop-nextest-core> 0: exact source occurrences for physical edge 1 disagree after on-shell-energy replacement: `-(mUVexp^2+Q(1,cind(1))^2+Q(1,cind(2))^2+Q(1,cind(3))^2)^(1/2)` versus `(mUVexp^2+Q(1,cind(1))^2+Q(1,cind(2))^2+Q(1,cind(3))^2)^(1/2)`; exact 4D term active denominators are [FourDDenominator { source_edge: EdgeIndex(1), momentum: gammalooprs::Q(1), mass_squared: gammalooprs::mUVexp^2, full_expr: -gammalooprs::mUV^2+spenso::dot(gammalooprs::Q(1,spenso::mink(gammalooprs::dim)),gammalooprs::Q(1,spenso::mink(gammalooprs::dim))) }, FourDDenominator { source_edge: EdgeIndex(1), momentum: gammalooprs::Q(1), mass_squared: gammalooprs::mUVexp^2, full_expr: -gammalooprs::mUV^2+spenso::dot(gammalooprs::Q(1,spenso::mink(gammalooprs::dim)),gammalooprs::Q(1,spenso::mink(gammalooprs::dim))) }, FourDDenominator { source_edge: EdgeIndex(3), momentum: gammalooprs::Q(3), mass_squared: gammalooprs::mUVexp^2, full_expr: -gammalooprs::mUV^2+spenso::dot(gammalooprs::Q(3,spenso::mink(gammalooprs::dim)),gammalooprs::Q(3,spenso::mink(gammalooprs::dim))) }, FourDDenominator { source_edge: EdgeIndex(3), momentum: gammalooprs::Q(3), mass_squared: gammalooprs::mUVexp^2, full_expr: -gammalooprs::mUV^2+spenso::dot(gammalooprs::Q(3,spenso::mink(gammalooprs::dim)),gammalooprs::Q(3,spenso::mink(gammalooprs::dim))) }, FourDDenominator { source_edge: EdgeIndex(0), momentum: gammalooprs::Q(0), mass_squared: UFO::mass_scalar_1^2, full_expr: -UFO::mass_scalar_1^2+spenso::dot(gammalooprs::Q(0,spenso::mink(gammalooprs::dim)),gammalooprs::Q(0,spenso::mink(gammalooprs::dim))) }]
  430. 26.35 s gammaloop-nextest-core>
  431. 26.35 s gammaloop-nextest-core> Location:
  432. 26.35 s gammaloop-nextest-core> crates/gammalooprs/src/uv/approx/local_3d.rs:641
  433. 26.35 s gammaloop-nextest-core>
  434. 26.35 s gammaloop-nextest-core> ━━━━━━━━━━━━━━━━━━━━━━━━━━━━━━━━━━ BACKTRACE ━━━━━━━━━━━━━━━━━━━━━━━━━━━━━━━━━━━
  435. 26.35 s gammaloop-nextest-core> 1: <color_eyre[51793ea62743adbd]::config::EyreHook>::into_eyre_hook::{closure#0}<unknown>
  436. 26.35 s gammaloop-nextest-core> at <unknown source file>:<unknown line>
  437. 26.35 s gammaloop-nextest-core> 2: eyre[cb2fd339c0c40fca]::capture_handler<unknown>
  438. 26.35 s gammaloop-nextest-core> at <unknown source file>:<unknown line>
  439. 26.35 s gammaloop-nextest-core> 3: <eyre[cb2fd339c0c40fca]::Report>::from_adhoc::<alloc[2ea6bcb46fca0c42]::string::String><unknown>
  440. 26.35 s gammaloop-nextest-core> at <unknown source file>:<unknown line>
  441. 26.35 s gammaloop-nextest-core> 4: <gammalooprs[6dc202c8af9e2ddf]::uv::approx::local_3d::Localizer>::project_4d<unknown>
  442. 26.35 s gammaloop-nextest-core> at <unknown source file>:<unknown line>
  443. 26.35 s gammaloop-nextest-core> 5: gammalooprs[6dc202c8af9e2ddf]::uv::hedge_poset::tests::union_terms_project_factorized_typed_4d_values<unknown>
  444. 26.35 s gammaloop-nextest-core> at <unknown source file>:<unknown line>
  445. 26.35 s gammaloop-nextest-core> 6: <gammalooprs[6dc202c8af9e2ddf]::uv::hedge_poset::tests::union_terms_project_factorized_typed_4d_values::{closure#0} as core[940e698046960fd5]::ops::function::FnOnce<()>>::call_once<unknown>
  446. 26.35 s gammaloop-nextest-core> at <unknown source file>:<unknown line>
  447. 26.35 s gammaloop-nextest-core> 7: test[75d6903177b1d7e9]::__rust_begin_short_backtrace::<core[940e698046960fd5]::result::Result<(), alloc[2ea6bcb46fca0c42]::string::String>, fn() -> core[940e698046960fd5]::result::Result<(), alloc[2ea6bcb46fca0c42]::string::String>><unknown>
  448. 26.35 s gammaloop-nextest-core> at <unknown source file>:<unknown line>
  449. 26.35 s gammaloop-nextest-core> 8: test[75d6903177b1d7e9]::run_test::{closure#0}<unknown>
  450. 26.35 s gammaloop-nextest-core> at <unknown source file>:<unknown line>
  451. 26.35 s gammaloop-nextest-core> 9: std[bcb96dfbba0ab899]::sys::backtrace::__rust_begin_short_backtrace::<test[75d6903177b1d7e9]::run_test::{closure#1}, ()><unknown>
  452. 26.35 s gammaloop-nextest-core> at <unknown source file>:<unknown line>
  453. 26.35 s gammaloop-nextest-core> 10: <std[bcb96dfbba0ab899]::thread::lifecycle::spawn_unchecked<test[75d6903177b1d7e9]::run_test::{closure#1}, ()>::{closure#1} as core[940e698046960fd5]::ops::function::FnOnce<()>>::call_once::{shim:vtable#0}<unknown>
  454. 26.35 s gammaloop-nextest-core> at <unknown source file>:<unknown line>
  455. 26.35 s gammaloop-nextest-core> 11: <std[bcb96dfbba0ab899]::sys::thread::unix::Thread>::new::thread_start<unknown>
  456. 26.35 s gammaloop-nextest-core> at <unknown source file>:<unknown line>
  457. 26.35 s gammaloop-nextest-core> 12: start_thread<unknown>
  458. 26.35 s gammaloop-nextest-core> at <unknown source file>:<unknown line>
  459. 26.35 s gammaloop-nextest-core> 13: __clone3<unknown>
  460. 26.35 s gammaloop-nextest-core> at <unknown source file>:<unknown line>
  461. 26.35 s gammaloop-nextest-core>
  462. 26.35 s gammaloop-nextest-core> Run with COLORBT_SHOW_HIDDEN=1 environment variable to disable frame filtering.
  463. 26.35 s gammaloop-nextest-core> Run with RUST_BACKTRACE=full to include source snippets.
  464. 26.35 s gammaloop-nextest-core>
  465. 26.35 s gammaloop-nextest-core> 2. gammalooprs::test_renormalization::finite_part_ghost_2loop
  466. 26.35 s gammaloop-nextest-core> failure: test failure with exit code 101
  467. 26.35 s gammaloop-nextest-core> system-out
  468. 26.35 s gammaloop-nextest-core> running 1 test
  469. 26.35 s gammaloop-nextest-core> test finite_part_ghost_2loop ... FAILED
  470. 26.35 s gammaloop-nextest-core>
  471. 26.35 s gammaloop-nextest-core> failures:
  472. 26.35 s gammaloop-nextest-core>
  473. 26.35 s gammaloop-nextest-core> failures:
  474. 26.35 s gammaloop-nextest-core> finite_part_ghost_2loop
  475. 26.35 s gammaloop-nextest-core>
  476. 26.35 s gammaloop-nextest-core> test result: FAILED. 0 passed; 1 failed; 0 ignored; 0 measured; 5 filtered out; finished in 5.25s
  477. 26.35 s gammaloop-nextest-core> system-err
  478. 26.35 s gammaloop-nextest-core> [16:29:41.927] @gammalooprs::processes::amplitude ERROR :
  479. 26.35 s gammaloop-nextest-core> field value
  480. 26.35 s gammaloop-nextest-core> error generalized CFF expression generation failed for graph `d5` with source-edge numerator energy-degree bounds Some([(1, 1), (2, 1), (3, 1), (5, 2), (6, 2)]): energy-degree bounds do not certify vanishing residues at infinity under the conservative cap check: EnergyDivergenceReport { edge_degree_bounds: [1, 1, 1, 2, 2], loops: [EnergyDirectionReport { loop_id: Some(0), zero_edges: [], active_edges: [0, 1, 2, 4], nullity: None, numerator_degree_bound: 5, denominator_degree: 8, divergence_degree: -3, convergent: true }, EnergyDirectionReport { loop_id: Some(1), zero_edges: [], active_edges: [3, 4], nullity: None, numerator_degree_bound: 4, denominator_degree: 4, divergence_degree: 0, convergent: false }], directions: [EnergyDirectionReport { loop_id: None, zero_edges: [0, 1, 2], active_edges: [3, 4], nullity: Some(1), numerator_degree_bound: 4, denominator_degree: 4, divergence_degree: 0, convergent: false }, EnergyDirectionReport { loop_id: None, zero_edges: [], active_edges: [0, 1, 2, 3, 4], nullity: Some(2), numerator_degree_bound: 7, denominator_degree: 10, divergence_degree: -3, convergent: true }, EnergyDirectionReport { loop_id: None, zero_edges: [3], active_edges: [0, 1, 2, 4], nullity: Some(1), numerator_degree_bound: 5, denominator_degree: 8, divergence_degree: -3, convergent: true }, EnergyDirectionReport { loop_id: None, zero_edges: [4], active_edges: [0, 1, 2, 3], nullity: Some(1), numerator_degree_bound: 5, denominator_degree: 8, divergence_degree: -3, convergent: true }], coordinate_convergent: false, directional_convergent: false, convergent: false }
  481. 26.35 s gammaloop-nextest-core> 3D source has 2 loop names ["e1", "e5"], 5 internal edges [edge 0: 0 -> 1, loops=[1, 0], externals=[0, 0]; edge 1: 0 -> 2, loops=[-1, 0], externals=[1, 0]; edge 2: 1 -> 3, loops=[1, 0], externals=[-1, 0]; edge 3: 2 -> 3, loops=[0, 1], externals=[0, 0]; edge 4: 2 -> 3, loops=[-1, -1], externals=[1, 0]]
  482. 26.35 s gammaloop-nextest-core> at crates/gammalooprs/src/processes/amplitude.rs:825
  483. 26.35 s gammaloop-nextest-core> The application panicked (crashed).
  484. 26.35 s gammaloop-nextest-core> Message: called `Result::unwrap()` on an `Err` value:
  485. 26.35 s gammaloop-nextest-core> 0: generalized CFF expression generation failed for graph `d5` with source-edge numerator energy-degree bounds Some([(1, 1), (2, 1), (3, 1), (5, 2), (6, 2)]): energy-degree bounds do not certify vanishing residues at infinity under the conservative cap check: EnergyDivergenceReport { edge_degree_bounds: [1, 1, 1, 2, 2], loops: [EnergyDirectionReport { loop_id: Some(0), zero_edges: [], active_edges: [0, 1, 2, 4], nullity: None, numerator_degree_bound: 5, denominator_degree: 8, divergence_degree: -3, convergent: true }, EnergyDirectionReport { loop_id: Some(1), zero_edges: [], active_edges: [3, 4], nullity: None, numerator_degree_bound: 4, denominator_degree: 4, divergence_degree: 0, convergent: false }], directions: [EnergyDirectionReport { loop_id: None, zero_edges: [0, 1, 2], active_edges: [3, 4], nullity: Some(1), numerator_degree_bound: 4, denominator_degree: 4, divergence_degree: 0, convergent: false }, EnergyDirectionReport { loop_id: None, zero_edges: [], active_edges: [0, 1, 2, 3, 4], nullity: Some(2), numerator_degree_bound: 7, denominator_degree: 10, divergence_degree: -3, convergent: true }, EnergyDirectionReport { loop_id: None, zero_edges: [3], active_edges: [0, 1, 2, 4], nullity: Some(1), numerator_degree_bound: 5, denominator_degree: 8, divergence_degree: -3, convergent: true }, EnergyDirectionReport { loop_id: None, zero_edges: [4], active_edges: [0, 1, 2, 3], nullity: Some(1), numerator_degree_bound: 5, denominator_degree: 8, divergence_degree: -3, convergent: true }], coordinate_convergent: false, directional_convergent: false, convergent: false }
  486. 26.35 s gammaloop-nextest-core> 3D source has 2 loop names ["e1", "e5"], 5 internal edges [edge 0: 0 -> 1, loops=[1, 0], externals=[0, 0]; edge 1: 0 -> 2, loops=[-1, 0], externals=[1, 0]; edge 2: 1 -> 3, loops=[1, 0], externals=[-1, 0]; edge 3: 2 -> 3, loops=[0, 1], externals=[0, 0]; edge 4: 2 -> 3, loops=[-1, -1], externals=[1, 0]]
  487. 26.35 s gammaloop-nextest-core>
  488. 26.35 s gammaloop-nextest-core> Location:
  489. 26.35 s gammaloop-nextest-core> crates/gammalooprs/src/cff/generation.rs:226
  490. 26.35 s gammaloop-nextest-core>
  491. 26.35 s gammaloop-nextest-core> ━━━━━━━━━━━━━━━━━━━━━━━━━━━━━━━━━━ BACKTRACE ━━━━━━━━━━━━━━━━━━━━━━━━━━━━━━━━━━━
  492. 26.35 s gammaloop-nextest-core> 1: <color_eyre[51793ea62743adbd]::config::EyreHook>::into_eyre_hook::{closure#0}<unknown>
  493. 26.35 s gammaloop-nextest-core> at <unknown source file>:<unknown line>
  494. 26.35 s gammaloop-nextest-core> 2: eyre[cb2fd339c0c40fca]::capture_handler<unknown>
  495. 26.35 s gammaloop-nextest-core> at <unknown source file>:<unknown line>
  496. 26.35 s gammaloop-nextest-core> 3: <eyre[cb2fd339c0c40fca]::Report>::from_adhoc::<alloc[2ea6bcb46fca0c42]::string::String><unknown>
  497. 26.35 s gammaloop-nextest-core> at <unknown source file>:<unknown line>
  498. 26.35 s gammaloop-nextest-core> 4: <gammalooprs[1d0b14476f7eb2f8]::graph::Graph>::generate_3d_expression_for_integrand<unknown>
  499. 26.35 s gammaloop-nextest-core> at <unknown source file>:<unknown line>
  500. 26.35 s gammaloop-nextest-core> 5: <gammalooprs[1d0b14476f7eb2f8]::processes::amplitude::AmplitudeGraph>::generate_cff<unknown>
  501. 26.35 s gammaloop-nextest-core> at <unknown source file>:<unknown line>
  502. 26.35 s gammaloop-nextest-core> 6: <gammalooprs[1d0b14476f7eb2f8]::processes::amplitude::AmplitudeGraph>::renormalization_part<unknown>
  503. 26.35 s gammaloop-nextest-core> at <unknown source file>:<unknown line>
  504. 26.35 s gammaloop-nextest-core> 7: test_renormalization[879b57236d814a44]::finite_part_ghost_2loop<unknown>
  505. 26.35 s gammaloop-nextest-core> at <unknown source file>:<unknown line>
  506. 26.35 s gammaloop-nextest-core> 8: <test_renormalization[879b57236d814a44]::finite_part_ghost_2loop::{closure#0} as core[940e698046960fd5]::ops::function::FnOnce<()>>::call_once<unknown>
  507. 26.35 s gammaloop-nextest-core> at <unknown source file>:<unknown line>
  508. 26.35 s gammaloop-nextest-core> 9: test[75d6903177b1d7e9]::__rust_begin_short_backtrace::<core[940e698046960fd5]::result::Result<(), alloc[2ea6bcb46fca0c42]::string::String>, fn() -> core[940e698046960fd5]::result::Result<(), alloc[2ea6bcb46fca0c42]::string::String>><unknown>
  509. 26.35 s gammaloop-nextest-core> at <unknown source file>:<unknown line>
  510. 26.35 s gammaloop-nextest-core> 10: test[75d6903177b1d7e9]::run_test::{closure#0}<unknown>
  511. 26.35 s gammaloop-nextest-core> at <unknown source file>:<unknown line>
  512. 26.35 s gammaloop-nextest-core> 11: std[bcb96dfbba0ab899]::sys::backtrace::__rust_begin_short_backtrace::<test[75d6903177b1d7e9]::run_test::{closure#1}, ()><unknown>
  513. 26.35 s gammaloop-nextest-core> at <unknown source file>:<unknown line>
  514. 26.35 s gammaloop-nextest-core> 12: <std[bcb96dfbba0ab899]::thread::lifecycle::spawn_unchecked<test[75d6903177b1d7e9]::run_test::{closure#1}, ()>::{closure#1} as core[940e698046960fd5]::ops::function::FnOnce<()>>::call_once::{shim:vtable#0}<unknown>
  515. 26.35 s gammaloop-nextest-core> at <unknown source file>:<unknown line>
  516. 26.35 s gammaloop-nextest-core> 13: <std[bcb96dfbba0ab899]::sys::thread::unix::Thread>::new::thread_start<unknown>
  517. 26.35 s gammaloop-nextest-core> at <unknown source file>:<unknown line>
  518. 26.35 s gammaloop-nextest-core> 14: start_thread<unknown>
  519. 26.35 s gammaloop-nextest-core> at <unknown source file>:<unknown line>
  520. 26.35 s gammaloop-nextest-core> 15: __clone3<unknown>
  521. 26.35 s gammaloop-nextest-core> at <unknown source file>:<unknown line>
  522. 26.35 s gammaloop-nextest-core>
  523. 26.35 s gammaloop-nextest-core> Run with COLORBT_SHOW_HIDDEN=1 environment variable to disable frame filtering.
  524. 26.35 s gammaloop-nextest-core> Run with RUST_BACKTRACE=full to include source snippets.
  525. 26.35 s gammaloop-nextest-core> Warning: SpanTrace capture is Unsupported.
  526. 26.35 s gammaloop-nextest-core> Ensure that you've setup a tracing-error ErrorLayer and the semver versions are compatible
  527. 26.35 s gammaloop-nextest-core> Location: crates/gammalooprs/tests/test_renormalization.rs:495
  528. 26.35 s gammaloop-nextest-core>
  529. 26.35 s gammaloop-nextest-core> ━━━━━━━━━━━━━━━━━━━━━━━━━━━━━━━━━━ BACKTRACE ━━━━━━━━━━━━━━━━━━━━━━━━━━━━━━━━━━━
  530. 26.35 s gammaloop-nextest-core> 1: <color_eyre[51793ea62743adbd]::config::PanicHook>::panic_report<unknown>
  531. 26.35 s gammaloop-nextest-core> at <unknown source file>:<unknown line>
  532. 26.35 s gammaloop-nextest-core> 2: <color_eyre[51793ea62743adbd]::config::PanicHook>::into_panic_hook::{closure#0}<unknown>
  533. 26.35 s gammaloop-nextest-core> at <unknown source file>:<unknown line>
  534. 26.35 s gammaloop-nextest-core> 3: std[bcb96dfbba0ab899]::panicking::panic_with_hook<unknown>
  535. 26.35 s gammaloop-nextest-core> at <unknown source file>:<unknown line>
  536. 26.35 s gammaloop-nextest-core> 4: std[bcb96dfbba0ab899]::panicking::panic_handler::{closure#0}<unknown>
  537. 26.35 s gammaloop-nextest-core> at <unknown source file>:<unknown line>
  538. 26.35 s gammaloop-nextest-core> 5: std[bcb96dfbba0ab899]::sys::backtrace::__rust_end_short_backtrace::<std[bcb96dfbba0ab899]::panicking::panic_handler::{closure#0}, !><unknown>
  539. 26.35 s gammaloop-nextest-core> at <unknown source file>:<unknown line>
  540. 26.35 s gammaloop-nextest-core> 6: __rustc[6c289b9f9c454d21]::rust_begin_unwind<unknown>
  541. 26.35 s gammaloop-nextest-core> at <unknown source file>:<unknown line>
  542. 26.35 s gammaloop-nextest-core> 7: core[940e698046960fd5]::panicking::panic_fmt<unknown>
  543. 26.35 s gammaloop-nextest-core> at <unknown source file>:<unknown line>
  544. 26.35 s gammaloop-nextest-core> 8: core[940e698046960fd5]::result::unwrap_failed<unknown>
  545. 26.35 s gammaloop-nextest-core> at <unknown source file>:<unknown line>
  546. 26.35 s gammaloop-nextest-core> 9: test_renormalization[879b57236d814a44]::finite_part_ghost_2loop<unknown>
  547. 26.35 s gammaloop-nextest-core> at <unknown source file>:<unknown line>
  548. 26.35 s gammaloop-nextest-core> 10: <test_renormalization[879b57236d814a44]::finite_part_ghost_2loop::{closure#0} as core[940e698046960fd5]::ops::function::FnOnce<()>>::call_once<unknown>
  549. 26.35 s gammaloop-nextest-core> at <unknown source file>:<unknown line>
  550. 26.35 s gammaloop-nextest-core> 11: test[75d6903177b1d7e9]::__rust_begin_short_backtrace::<core[940e698046960fd5]::result::Result<(), alloc[2ea6bcb46fca0c42]::string::String>, fn() -> core[940e698046960fd5]::result::Result<(), alloc[2ea6bcb46fca0c42]::string::String>><unknown>
  551. 26.35 s gammaloop-nextest-core> at <unknown source file>:<unknown line>
  552. 26.35 s gammaloop-nextest-core> 12: test[75d6903177b1d7e9]::run_test::{closure#0}<unknown>
  553. 26.35 s gammaloop-nextest-core> at <unknown source file>:<unknown line>
  554. 26.35 s gammaloop-nextest-core> 13: std[bcb96dfbba0ab899]::sys::backtrace::__rust_begin_short_backtrace::<test[75d6903177b1d7e9]::run_test::{closure#1}, ()><unknown>
  555. 26.35 s gammaloop-nextest-core> at <unknown source file>:<unknown line>
  556. 26.35 s gammaloop-nextest-core> 14: <std[bcb96dfbba0ab899]::thread::lifecycle::spawn_unchecked<test[75d6903177b1d7e9]::run_test::{closure#1}, ()>::{closure#1} as core[940e698046960fd5]::ops::function::FnOnce<()>>::call_once::{shim:vtable#0}<unknown>
  557. 26.35 s gammaloop-nextest-core> at <unknown source file>:<unknown line>
  558. 26.35 s gammaloop-nextest-core> 15: <std[bcb96dfbba0ab899]::sys::thread::unix::Thread>::new::thread_start<unknown>
  559. 26.35 s gammaloop-nextest-core> at <unknown source file>:<unknown line>
  560. 26.35 s gammaloop-nextest-core> 16: start_thread<unknown>
  561. 26.35 s gammaloop-nextest-core> at <unknown source file>:<unknown line>
  562. 26.35 s gammaloop-nextest-core> 17: __clone3<unknown>
  563. 26.35 s gammaloop-nextest-core> at <unknown source file>:<unknown line>
  564. 26.35 s gammaloop-nextest-core>
  565. 26.35 s gammaloop-nextest-core> Run with COLORBT_SHOW_HIDDEN=1 environment variable to disable frame filtering.
  566. 26.35 s gammaloop-nextest-core> Run with RUST_BACKTRACE=full to include source snippets.
  567. 26.35 s gammaloop-nextest-core> =========================================
  568. 26.37 s gammaloop-nextest-core> Extracting 1 binary and 1 linked path to /build/nextest-archive-nOet3e
  569. 26.44 s gammaloop-nextest-core> Extracted 7 files to /build/nextest-archive-nOet3e in 0.07s
  570. 26.45 s gammaloop-nextest-core> ------------
  571. 26.45 s gammaloop-nextest-core> Nextest run ID 14fb3157-4f99-45e6-9b9b-da4b70766aea with nextest profile: ci_gammaloop
  572. 26.45 s gammaloop-nextest-core> Starting 53 tests across 1 binary
  573. 26.47 s gammaloop-nextest-core> FAIL [ 0.009s] (17/53) three-dimensional-reps generation::cff_tests::causal_repeated_generation_handles_energy_dependent_bubble_source
  574. 26.47 s gammaloop-nextest-core> stdout ---
  575. 26.47 s gammaloop-nextest-core>
  576. 26.47 s gammaloop-nextest-core> running 1 test
  577. 26.47 s gammaloop-nextest-core> test generation::cff_tests::causal_repeated_generation_handles_energy_dependent_bubble_source ... FAILED
  578. 26.47 s gammaloop-nextest-core>
  579. 26.47 s gammaloop-nextest-core> failures:
  580. 26.47 s gammaloop-nextest-core>
  581. 26.47 s gammaloop-nextest-core> failures:
  582. 26.47 s gammaloop-nextest-core> generation::cff_tests::causal_repeated_generation_handles_energy_dependent_bubble_source
  583. 26.47 s gammaloop-nextest-core>
  584. 26.47 s gammaloop-nextest-core> test result: FAILED. 0 passed; 1 failed; 0 ignored; 0 measured; 52 filtered out; finished in 0.00s
  585. 26.47 s gammaloop-nextest-core>
  586. 26.47 s gammaloop-nextest-core> stderr ---
  587. 26.47 s gammaloop-nextest-core>
  588. 26.47 s gammaloop-nextest-core> thread 'generation::cff_tests::causal_repeated_generation_handles_energy_dependent_bubble_source' (3117) panicked at crates/three-dimensional-reps/src/generation.rs:5806:9:
  589. 26.47 s gammaloop-nextest-core> assertion `left == right` failed
  590. 26.47 s gammaloop-nextest-core> left: GlobalSourceProduct
  591. 26.47 s gammaloop-nextest-core> right: VariantLocal
  592. 26.47 s gammaloop-nextest-core> stack backtrace:
  593. 26.47 s gammaloop-nextest-core> 0: __rustc::rust_begin_unwind
  594. 26.47 s gammaloop-nextest-core> 1: core::panicking::panic_fmt
  595. 26.47 s gammaloop-nextest-core> 2: core::panicking::assert_failed_inner
  596. 26.47 s gammaloop-nextest-core> 3: core::panicking::assert_failed::<three_dimensional_reps::generation::CffEnergyFactorOwnership, three_dimensional_reps::generation::CffEnergyFactorOwnership>
  597. 26.47 s gammaloop-nextest-core> 4: three_dimensional_reps::generation::cff_tests::causal_repeated_generation_handles_energy_dependent_bubble_source
  598. 26.47 s gammaloop-nextest-core> 5: <three_dimensional_reps::generation::cff_tests::causal_repeated_generation_handles_energy_dependent_bubble_source::{closure#0} as core::ops::function::FnOnce<()>>::call_once
  599. 26.47 s gammaloop-nextest-core> note: Some details are omitted, run with `RUST_BACKTRACE=full` for a verbose backtrace.
  600. 26.47 s gammaloop-nextest-core>
  601. 26.48 s gammaloop-nextest-core> FAIL [ 0.009s] (28/53) three-dimensional-reps generation::cff_tests::disconnected_mixed_energy_factor_ownership_keeps_both_component_factors
  602. 26.48 s gammaloop-nextest-core> stdout ---
  603. 26.48 s gammaloop-nextest-core>
  604. 26.48 s gammaloop-nextest-core> running 1 test
  605. 26.48 s gammaloop-nextest-core> test generation::cff_tests::disconnected_mixed_energy_factor_ownership_keeps_both_component_factors ... FAILED
  606. 26.48 s gammaloop-nextest-core>
  607. 26.48 s gammaloop-nextest-core> failures:
  608. 26.48 s gammaloop-nextest-core>
  609. 26.48 s gammaloop-nextest-core> failures:
  610. 26.48 s gammaloop-nextest-core> generation::cff_tests::disconnected_mixed_energy_factor_ownership_keeps_both_component_factors
  611. 26.48 s gammaloop-nextest-core>
  612. 26.48 s gammaloop-nextest-core> test result: FAILED. 0 passed; 1 failed; 0 ignored; 0 measured; 52 filtered out; finished in 0.00s
  613. 26.48 s gammaloop-nextest-core>
  614. 26.48 s gammaloop-nextest-core> stderr ---
  615. 26.48 s gammaloop-nextest-core>
  616. 26.48 s gammaloop-nextest-core> thread 'generation::cff_tests::disconnected_mixed_energy_factor_ownership_keeps_both_component_factors' (3152) panicked at crates/three-dimensional-reps/src/generation.rs:5726:9:
  617. 26.48 s gammaloop-nextest-core> assertion `left == right` failed
  618. 26.48 s gammaloop-nextest-core> left: [GlobalSourceProduct, GlobalSourceProduct]
  619. 26.48 s gammaloop-nextest-core> right: [VariantLocal, GlobalSourceProduct]
  620. 26.48 s gammaloop-nextest-core> stack backtrace:
  621. 26.48 s gammaloop-nextest-core> 0: __rustc::rust_begin_unwind
  622. 26.48 s gammaloop-nextest-core> 1: core::panicking::panic_fmt
  623. 26.48 s gammaloop-nextest-core> 2: core::panicking::assert_failed_inner
  624. 26.48 s gammaloop-nextest-core> 3: core::panicking::assert_failed::<alloc::vec::Vec<three_dimensional_reps::generation::CffEnergyFactorOwnership>, alloc::vec::Vec<three_dimensional_reps::generation::CffEnergyFactorOwnership>>
  625. 26.48 s gammaloop-nextest-core> 4: three_dimensional_reps::generation::cff_tests::disconnected_mixed_energy_factor_ownership_keeps_both_component_factors
  626. 26.48 s gammaloop-nextest-core> 5: <three_dimensional_reps::generation::cff_tests::disconnected_mixed_energy_factor_ownership_keeps_both_component_factors::{closure#0} as core::ops::function::FnOnce<()>>::call_once
  627. 26.48 s gammaloop-nextest-core> note: Some details are omitted, run with `RUST_BACKTRACE=full` for a verbose backtrace.
  628. 26.48 s gammaloop-nextest-core>
  629. 26.50 s gammaloop-nextest-core> FAIL [ 0.040s] (41/53) three-dimensional-reps generation::cff_tests::cff_generation_builds_multiloop_repeated_high_power_known_factor_completion
  630. 26.50 s gammaloop-nextest-core> stdout ---
  631. 26.50 s gammaloop-nextest-core>
  632. 26.50 s gammaloop-nextest-core> running 1 test
  633. 26.50 s gammaloop-nextest-core> test generation::cff_tests::cff_generation_builds_multiloop_repeated_high_power_known_factor_completion ... FAILED
  634. 26.50 s gammaloop-nextest-core>
  635. 26.50 s gammaloop-nextest-core> failures:
  636. 26.50 s gammaloop-nextest-core>
  637. 26.50 s gammaloop-nextest-core> failures:
  638. 26.50 s gammaloop-nextest-core> generation::cff_tests::cff_generation_builds_multiloop_repeated_high_power_known_factor_completion
  639. 26.50 s gammaloop-nextest-core>
  640. 26.50 s gammaloop-nextest-core> test result: FAILED. 0 passed; 1 failed; 0 ignored; 0 measured; 52 filtered out; finished in 0.03s
  641. 26.50 s gammaloop-nextest-core>
  642. 26.50 s gammaloop-nextest-core> stderr ---
  643. 26.50 s gammaloop-nextest-core>
  644. 26.50 s gammaloop-nextest-core> thread 'generation::cff_tests::cff_generation_builds_multiloop_repeated_high_power_known_factor_completion' (3119) panicked at crates/three-dimensional-reps/src/generation.rs:5865:9:
  645. 26.50 s gammaloop-nextest-core> assertion failed: variants.iter().any(|variant|
  646. 26.50 s gammaloop-nextest-core> {
  647. 26.50 s gammaloop-nextest-core> variant.origin.as_deref().is_some_and(|origin|
  648. 26.50 s gammaloop-nextest-core> {
  649. 26.50 s gammaloop-nextest-core> origin.starts_with("bounded_degree_quadratic_recursive_remainder")
  650. 26.50 s gammaloop-nextest-core> })
  651. 26.50 s gammaloop-nextest-core> })
  652. 26.50 s gammaloop-nextest-core> stack backtrace:
  653. 26.50 s gammaloop-nextest-core> 0: __rustc::rust_begin_unwind
  654. 26.50 s gammaloop-nextest-core> 1: core::panicking::panic_fmt
  655. 26.50 s gammaloop-nextest-core> 2: core::panicking::panic
  656. 26.50 s gammaloop-nextest-core> 3: three_dimensional_reps::generation::cff_tests::cff_generation_builds_multiloop_repeated_high_power_known_factor_completion
  657. 26.50 s gammaloop-nextest-core> 4: <three_dimensional_reps::generation::cff_tests::cff_generation_builds_multiloop_repeated_high_power_known_factor_completion::{closure#0} as core::ops::function::FnOnce<()>>::call_once
  658. 26.50 s gammaloop-nextest-core> note: Some details are omitted, run with `RUST_BACKTRACE=full` for a verbose backtrace.
  659. 26.50 s gammaloop-nextest-core>
  660. 26.56 s gammaloop-nextest-core> FAIL [ 0.097s] (48/53) three-dimensional-reps generation::cff_tests::cff_generation_builds_one_loop_high_power_with_repeated_spectators
  661. 26.56 s gammaloop-nextest-core> stdout ---
  662. 26.56 s gammaloop-nextest-core>
  663. 26.56 s gammaloop-nextest-core> running 1 test
  664. 26.56 s gammaloop-nextest-core> test generation::cff_tests::cff_generation_builds_one_loop_high_power_with_repeated_spectators ... FAILED
  665. 26.56 s gammaloop-nextest-core>
  666. 26.56 s gammaloop-nextest-core> failures:
  667. 26.56 s gammaloop-nextest-core>
  668. 26.56 s gammaloop-nextest-core> failures:
  669. 26.56 s gammaloop-nextest-core> generation::cff_tests::cff_generation_builds_one_loop_high_power_with_repeated_spectators
  670. 26.56 s gammaloop-nextest-core>
  671. 26.56 s gammaloop-nextest-core> test result: FAILED. 0 passed; 1 failed; 0 ignored; 0 measured; 52 filtered out; finished in 0.09s
  672. 26.56 s gammaloop-nextest-core>
  673. 26.56 s gammaloop-nextest-core> stderr ---
  674. 26.56 s gammaloop-nextest-core>
  675. 26.56 s gammaloop-nextest-core> thread 'generation::cff_tests::cff_generation_builds_one_loop_high_power_with_repeated_spectators' (3123) panicked at crates/three-dimensional-reps/src/generation.rs:6288:9:
  676. 26.56 s gammaloop-nextest-core> assertion failed: variants.iter().any(|variant|
  677. 26.56 s gammaloop-nextest-core> {
  678. 26.56 s gammaloop-nextest-core> variant.origin.as_deref().is_some_and(|origin|
  679. 26.56 s gammaloop-nextest-core> {
  680. 26.56 s gammaloop-nextest-core> origin.starts_with("bounded_degree_quadratic_recursive_remainder")
  681. 26.56 s gammaloop-nextest-core> })
  682. 26.56 s gammaloop-nextest-core> })
  683. 26.56 s gammaloop-nextest-core> stack backtrace:
  684. 26.56 s gammaloop-nextest-core> 0: __rustc::rust_begin_unwind
  685. 26.56 s gammaloop-nextest-core> 1: core::panicking::panic_fmt
  686. 26.56 s gammaloop-nextest-core> 2: core::panicking::panic
  687. 26.56 s gammaloop-nextest-core> 3: three_dimensional_reps::generation::cff_tests::cff_generation_builds_one_loop_high_power_with_repeated_spectators
  688. 26.56 s gammaloop-nextest-core> 4: <three_dimensional_reps::generation::cff_tests::cff_generation_builds_one_loop_high_power_with_repeated_spectators::{closure#0} as core::ops::function::FnOnce<()>>::call_once
  689. 26.56 s gammaloop-nextest-core> note: Some details are omitted, run with `RUST_BACKTRACE=full` for a verbose backtrace.
  690. 26.56 s gammaloop-nextest-core>
  691. 26.98 s gammaloop-nextest-core> ------------
  692. 26.98 s gammaloop-nextest-core> Summary [ 0.531s] 53 tests run: 49 passed, 4 failed, 0 skipped
  693. 26.98 s gammaloop-nextest-core> FAIL [ 0.009s] (17/53) three-dimensional-reps generation::cff_tests::causal_repeated_generation_handles_energy_dependent_bubble_source
  694. 26.98 s gammaloop-nextest-core> stdout ---
  695. 26.98 s gammaloop-nextest-core>
  696. 26.98 s gammaloop-nextest-core> running 1 test
  697. 26.98 s gammaloop-nextest-core> test generation::cff_tests::causal_repeated_generation_handles_energy_dependent_bubble_source ... FAILED
  698. 26.98 s gammaloop-nextest-core>
  699. 26.98 s gammaloop-nextest-core> failures:
  700. 26.98 s gammaloop-nextest-core>
  701. 26.98 s gammaloop-nextest-core> failures:
  702. 26.98 s gammaloop-nextest-core> generation::cff_tests::causal_repeated_generation_handles_energy_dependent_bubble_source
  703. 26.98 s gammaloop-nextest-core>
  704. 26.98 s gammaloop-nextest-core> test result: FAILED. 0 passed; 1 failed; 0 ignored; 0 measured; 52 filtered out; finished in 0.00s
  705. 26.98 s gammaloop-nextest-core>
  706. 26.98 s gammaloop-nextest-core> stderr ---
  707. 26.98 s gammaloop-nextest-core>
  708. 26.98 s gammaloop-nextest-core> thread 'generation::cff_tests::causal_repeated_generation_handles_energy_dependent_bubble_source' (3117) panicked at crates/three-dimensional-reps/src/generation.rs:5806:9:
  709. 26.98 s gammaloop-nextest-core> assertion `left == right` failed
  710. 26.98 s gammaloop-nextest-core> left: GlobalSourceProduct
  711. 26.98 s gammaloop-nextest-core> right: VariantLocal
  712. 26.98 s gammaloop-nextest-core> stack backtrace:
  713. 26.98 s gammaloop-nextest-core> 0: __rustc::rust_begin_unwind
  714. 26.98 s gammaloop-nextest-core> 1: core::panicking::panic_fmt
  715. 26.98 s gammaloop-nextest-core> 2: core::panicking::assert_failed_inner
  716. 26.98 s gammaloop-nextest-core> 3: core::panicking::assert_failed::<three_dimensional_reps::generation::CffEnergyFactorOwnership, three_dimensional_reps::generation::CffEnergyFactorOwnership>
  717. 26.98 s gammaloop-nextest-core> 4: three_dimensional_reps::generation::cff_tests::causal_repeated_generation_handles_energy_dependent_bubble_source
  718. 26.98 s gammaloop-nextest-core> 5: <three_dimensional_reps::generation::cff_tests::causal_repeated_generation_handles_energy_dependent_bubble_source::{closure#0} as core::ops::function::FnOnce<()>>::call_once
  719. 26.98 s gammaloop-nextest-core> note: Some details are omitted, run with `RUST_BACKTRACE=full` for a verbose backtrace.
  720. 26.98 s gammaloop-nextest-core>
  721. 26.98 s gammaloop-nextest-core> FAIL [ 0.009s] (28/53) three-dimensional-reps generation::cff_tests::disconnected_mixed_energy_factor_ownership_keeps_both_component_factors
  722. 26.98 s gammaloop-nextest-core> stdout ---
  723. 26.98 s gammaloop-nextest-core>
  724. 26.98 s gammaloop-nextest-core> running 1 test
  725. 26.98 s gammaloop-nextest-core> test generation::cff_tests::disconnected_mixed_energy_factor_ownership_keeps_both_component_factors ... FAILED
  726. 26.98 s gammaloop-nextest-core>
  727. 26.98 s gammaloop-nextest-core> failures:
  728. 26.98 s gammaloop-nextest-core>
  729. 26.98 s gammaloop-nextest-core> failures:
  730. 26.98 s gammaloop-nextest-core> generation::cff_tests::disconnected_mixed_energy_factor_ownership_keeps_both_component_factors
  731. 26.98 s gammaloop-nextest-core>
  732. 26.98 s gammaloop-nextest-core> test result: FAILED. 0 passed; 1 failed; 0 ignored; 0 measured; 52 filtered out; finished in 0.00s
  733. 26.98 s gammaloop-nextest-core>
  734. 26.98 s gammaloop-nextest-core> stderr ---
  735. 26.98 s gammaloop-nextest-core>
  736. 26.98 s gammaloop-nextest-core> thread 'generation::cff_tests::disconnected_mixed_energy_factor_ownership_keeps_both_component_factors' (3152) panicked at crates/three-dimensional-reps/src/generation.rs:5726:9:
  737. 26.98 s gammaloop-nextest-core> assertion `left == right` failed
  738. 26.98 s gammaloop-nextest-core> left: [GlobalSourceProduct, GlobalSourceProduct]
  739. 26.98 s gammaloop-nextest-core> right: [VariantLocal, GlobalSourceProduct]
  740. 26.98 s gammaloop-nextest-core> stack backtrace:
  741. 26.98 s gammaloop-nextest-core> 0: __rustc::rust_begin_unwind
  742. 26.98 s gammaloop-nextest-core> 1: core::panicking::panic_fmt
  743. 26.98 s gammaloop-nextest-core> 2: core::panicking::assert_failed_inner
  744. 26.98 s gammaloop-nextest-core> 3: core::panicking::assert_failed::<alloc::vec::Vec<three_dimensional_reps::generation::CffEnergyFactorOwnership>, alloc::vec::Vec<three_dimensional_reps::generation::CffEnergyFactorOwnership>>
  745. 26.98 s gammaloop-nextest-core> 4: three_dimensional_reps::generation::cff_tests::disconnected_mixed_energy_factor_ownership_keeps_both_component_factors
  746. 26.98 s gammaloop-nextest-core> 5: <three_dimensional_reps::generation::cff_tests::disconnected_mixed_energy_factor_ownership_keeps_both_component_factors::{closure#0} as core::ops::function::FnOnce<()>>::call_once
  747. 26.98 s gammaloop-nextest-core> note: Some details are omitted, run with `RUST_BACKTRACE=full` for a verbose backtrace.
  748. 26.98 s gammaloop-nextest-core>
  749. 26.98 s gammaloop-nextest-core> FAIL [ 0.040s] (41/53) three-dimensional-reps generation::cff_tests::cff_generation_builds_multiloop_repeated_high_power_known_factor_completion
  750. 26.98 s gammaloop-nextest-core> stdout ---
  751. 26.98 s gammaloop-nextest-core>
  752. 26.98 s gammaloop-nextest-core> running 1 test
  753. 26.98 s gammaloop-nextest-core> test generation::cff_tests::cff_generation_builds_multiloop_repeated_high_power_known_factor_completion ... FAILED
  754. 26.98 s gammaloop-nextest-core>
  755. 26.98 s gammaloop-nextest-core> failures:
  756. 26.98 s gammaloop-nextest-core>
  757. 26.98 s gammaloop-nextest-core> failures:
  758. 26.98 s gammaloop-nextest-core> generation::cff_tests::cff_generation_builds_multiloop_repeated_high_power_known_factor_completion
  759. 26.98 s gammaloop-nextest-core>
  760. 26.98 s gammaloop-nextest-core> test result: FAILED. 0 passed; 1 failed; 0 ignored; 0 measured; 52 filtered out; finished in 0.03s
  761. 26.98 s gammaloop-nextest-core>
  762. 26.98 s gammaloop-nextest-core> stderr ---
  763. 26.98 s gammaloop-nextest-core>
  764. 26.98 s gammaloop-nextest-core> thread 'generation::cff_tests::cff_generation_builds_multiloop_repeated_high_power_known_factor_completion' (3119) panicked at crates/three-dimensional-reps/src/generation.rs:5865:9:
  765. 26.98 s gammaloop-nextest-core> assertion failed: variants.iter().any(|variant|
  766. 26.98 s gammaloop-nextest-core> {
  767. 26.98 s gammaloop-nextest-core> variant.origin.as_deref().is_some_and(|origin|
  768. 26.98 s gammaloop-nextest-core> {
  769. 26.98 s gammaloop-nextest-core> origin.starts_with("bounded_degree_quadratic_recursive_remainder")
  770. 26.98 s gammaloop-nextest-core> })
  771. 26.98 s gammaloop-nextest-core> })
  772. 26.98 s gammaloop-nextest-core> stack backtrace:
  773. 26.98 s gammaloop-nextest-core> 0: __rustc::rust_begin_unwind
  774. 26.98 s gammaloop-nextest-core> 1: core::panicking::panic_fmt
  775. 26.98 s gammaloop-nextest-core> 2: core::panicking::panic
  776. 26.98 s gammaloop-nextest-core> 3: three_dimensional_reps::generation::cff_tests::cff_generation_builds_multiloop_repeated_high_power_known_factor_completion
  777. 26.98 s gammaloop-nextest-core> 4: <three_dimensional_reps::generation::cff_tests::cff_generation_builds_multiloop_repeated_high_power_known_factor_completion::{closure#0} as core::ops::function::FnOnce<()>>::call_once
  778. 26.98 s gammaloop-nextest-core> note: Some details are omitted, run with `RUST_BACKTRACE=full` for a verbose backtrace.
  779. 26.98 s gammaloop-nextest-core>
  780. 26.98 s gammaloop-nextest-core> FAIL [ 0.097s] (48/53) three-dimensional-reps generation::cff_tests::cff_generation_builds_one_loop_high_power_with_repeated_spectators
  781. 26.98 s gammaloop-nextest-core> stdout ---
  782. 26.98 s gammaloop-nextest-core>
  783. 26.98 s gammaloop-nextest-core> running 1 test
  784. 26.98 s gammaloop-nextest-core> test generation::cff_tests::cff_generation_builds_one_loop_high_power_with_repeated_spectators ... FAILED
  785. 26.98 s gammaloop-nextest-core>
  786. 26.98 s gammaloop-nextest-core> failures:
  787. 26.98 s gammaloop-nextest-core>
  788. 26.98 s gammaloop-nextest-core> failures:
  789. 26.98 s gammaloop-nextest-core> generation::cff_tests::cff_generation_builds_one_loop_high_power_with_repeated_spectators
  790. 26.98 s gammaloop-nextest-core>
  791. 26.98 s gammaloop-nextest-core> test result: FAILED. 0 passed; 1 failed; 0 ignored; 0 measured; 52 filtered out; finished in 0.09s
  792. 26.98 s gammaloop-nextest-core>
  793. 26.98 s gammaloop-nextest-core> stderr ---
  794. 26.98 s gammaloop-nextest-core>
  795. 26.98 s gammaloop-nextest-core> thread 'generation::cff_tests::cff_generation_builds_one_loop_high_power_with_repeated_spectators' (3123) panicked at crates/three-dimensional-reps/src/generation.rs:6288:9:
  796. 26.98 s gammaloop-nextest-core> assertion failed: variants.iter().any(|variant|
  797. 26.98 s gammaloop-nextest-core> {
  798. 26.98 s gammaloop-nextest-core> variant.origin.as_deref().is_some_and(|origin|
  799. 26.98 s gammaloop-nextest-core> {
  800. 26.98 s gammaloop-nextest-core> origin.starts_with("bounded_degree_quadratic_recursive_remainder")
  801. 26.98 s gammaloop-nextest-core> })
  802. 26.98 s gammaloop-nextest-core> })
  803. 26.98 s gammaloop-nextest-core> stack backtrace:
  804. 26.98 s gammaloop-nextest-core> 0: __rustc::rust_begin_unwind
  805. 26.98 s gammaloop-nextest-core> 1: core::panicking::panic_fmt
  806. 26.98 s gammaloop-nextest-core> 2: core::panicking::panic
  807. 26.98 s gammaloop-nextest-core> 3: three_dimensional_reps::generation::cff_tests::cff_generation_builds_one_loop_high_power_with_repeated_spectators
  808. 26.98 s gammaloop-nextest-core> 4: <three_dimensional_reps::generation::cff_tests::cff_generation_builds_one_loop_high_power_with_repeated_spectators::{closure#0} as core::ops::function::FnOnce<()>>::call_once
  809. 26.98 s gammaloop-nextest-core> note: Some details are omitted, run with `RUST_BACKTRACE=full` for a verbose backtrace.
  810. 26.98 s gammaloop-nextest-core>
  811. 27.00 s gammaloop-nextest-core> error: test run failed
  812. 27.03 s gammaloop-nextest-core>
  813. 27.03 s gammaloop-nextest-core> ========== nextest test summary ==========
  814. 27.03 s gammaloop-nextest-core> report: target/nextest/ci_gammaloop/junit.xml
  815. 27.03 s gammaloop-nextest-core> tests: 53, failures: 4, errors: 0
  816. 27.03 s gammaloop-nextest-core>
  817. 27.03 s gammaloop-nextest-core> 1. three-dimensional-reps::generation::cff_tests::causal_repeated_generation_handles_energy_dependent_bubble_source
  818. 27.03 s gammaloop-nextest-core> failure: test failure with exit code 101
  819. 27.03 s gammaloop-nextest-core> thread 'generation::cff_tests::causal_repeated_generation_handles_energy_dependent_bubble_source' (3117) panicked at crates/three-dimensional-reps/src/generation.rs:5806:9:
  820. 27.03 s gammaloop-nextest-core> assertion `left == right` failed
  821. 27.03 s gammaloop-nextest-core> left: GlobalSourceProduct
  822. 27.03 s gammaloop-nextest-core> right: VariantLocal
  823. 27.03 s gammaloop-nextest-core> stack backtrace:
  824. 27.03 s gammaloop-nextest-core> 0: __rustc::rust_begin_unwind
  825. 27.03 s gammaloop-nextest-core> 1: core::panicking::panic_fmt
  826. 27.03 s gammaloop-nextest-core> 2: core::panicking::assert_failed_inner
  827. 27.03 s gammaloop-nextest-core> 3: core::panicking::assert_failed::<three_dimensional_reps::generation::CffEnergyFactorOwnership, three_dimensional_reps::generation::CffEnergyFactorOwnership>
  828. 27.03 s gammaloop-nextest-core> 4: three_dimensional_reps::generation::cff_tests::causal_repeated_generation_handles_energy_dependent_bubble_source
  829. 27.03 s gammaloop-nextest-core> 5: <three_dimensional_reps::generation::cff_tests::causal_repeated_generation_handles_energy_dependent_bubble_source::{closure#0} as core::ops::function::FnOnce<()>>::call_once
  830. 27.03 s gammaloop-nextest-core> note: Some details are omitted, run with `RUST_BACKTRACE=full` for a verbose backtrace.
  831. 27.03 s gammaloop-nextest-core> system-out
  832. 27.03 s gammaloop-nextest-core> running 1 test
  833. 27.03 s gammaloop-nextest-core> test generation::cff_tests::causal_repeated_generation_handles_energy_dependent_bubble_source ... FAILED
  834. 27.03 s gammaloop-nextest-core>
  835. 27.03 s gammaloop-nextest-core> failures:
  836. 27.03 s gammaloop-nextest-core>
  837. 27.03 s gammaloop-nextest-core> failures:
  838. 27.03 s gammaloop-nextest-core> generation::cff_tests::causal_repeated_generation_handles_energy_dependent_bubble_source
  839. 27.03 s gammaloop-nextest-core>
  840. 27.03 s gammaloop-nextest-core> test result: FAILED. 0 passed; 1 failed; 0 ignored; 0 measured; 52 filtered out; finished in 0.00s
  841. 27.03 s gammaloop-nextest-core> system-err
  842. 27.03 s gammaloop-nextest-core> thread 'generation::cff_tests::causal_repeated_generation_handles_energy_dependent_bubble_source' (3117) panicked at crates/three-dimensional-reps/src/generation.rs:5806:9:
  843. 27.03 s gammaloop-nextest-core> assertion `left == right` failed
  844. 27.03 s gammaloop-nextest-core> left: GlobalSourceProduct
  845. 27.03 s gammaloop-nextest-core> right: VariantLocal
  846. 27.03 s gammaloop-nextest-core> stack backtrace:
  847. 27.03 s gammaloop-nextest-core> 0: __rustc::rust_begin_unwind
  848. 27.03 s gammaloop-nextest-core> 1: core::panicking::panic_fmt
  849. 27.03 s gammaloop-nextest-core> 2: core::panicking::assert_failed_inner
  850. 27.03 s gammaloop-nextest-core> 3: core::panicking::assert_failed::<three_dimensional_reps::generation::CffEnergyFactorOwnership, three_dimensional_reps::generation::CffEnergyFactorOwnership>
  851. 27.03 s gammaloop-nextest-core> 4: three_dimensional_reps::generation::cff_tests::causal_repeated_generation_handles_energy_dependent_bubble_source
  852. 27.03 s gammaloop-nextest-core> 5: <three_dimensional_reps::generation::cff_tests::causal_repeated_generation_handles_energy_dependent_bubble_source::{closure#0} as core::ops::function::FnOnce<()>>::call_once
  853. 27.03 s gammaloop-nextest-core> note: Some details are omitted, run with `RUST_BACKTRACE=full` for a verbose backtrace.
  854. 27.03 s gammaloop-nextest-core>
  855. 27.03 s gammaloop-nextest-core> 2. three-dimensional-reps::generation::cff_tests::disconnected_mixed_energy_factor_ownership_keeps_both_component_factors
  856. 27.03 s gammaloop-nextest-core> failure: test failure with exit code 101
  857. 27.03 s gammaloop-nextest-core> thread 'generation::cff_tests::disconnected_mixed_energy_factor_ownership_keeps_both_component_factors' (3152) panicked at crates/three-dimensional-reps/src/generation.rs:5726:9:
  858. 27.03 s gammaloop-nextest-core> assertion `left == right` failed
  859. 27.03 s gammaloop-nextest-core> left: [GlobalSourceProduct, GlobalSourceProduct]
  860. 27.03 s gammaloop-nextest-core> right: [VariantLocal, GlobalSourceProduct]
  861. 27.03 s gammaloop-nextest-core> stack backtrace:
  862. 27.03 s gammaloop-nextest-core> 0: __rustc::rust_begin_unwind
  863. 27.03 s gammaloop-nextest-core> 1: core::panicking::panic_fmt
  864. 27.03 s gammaloop-nextest-core> 2: core::panicking::assert_failed_inner
  865. 27.03 s gammaloop-nextest-core> 3: core::panicking::assert_failed::<alloc::vec::Vec<three_dimensional_reps::generation::CffEnergyFactorOwnership>, alloc::vec::Vec<three_dimensional_reps::generation::CffEnergyFactorOwnership>>
  866. 27.03 s gammaloop-nextest-core> 4: three_dimensional_reps::generation::cff_tests::disconnected_mixed_energy_factor_ownership_keeps_both_component_factors
  867. 27.03 s gammaloop-nextest-core> 5: <three_dimensional_reps::generation::cff_tests::disconnected_mixed_energy_factor_ownership_keeps_both_component_factors::{closure#0} as core::ops::function::FnOnce<()>>::call_once
  868. 27.03 s gammaloop-nextest-core> note: Some details are omitted, run with `RUST_BACKTRACE=full` for a verbose backtrace.
  869. 27.03 s gammaloop-nextest-core> system-out
  870. 27.03 s gammaloop-nextest-core> running 1 test
  871. 27.03 s gammaloop-nextest-core> test generation::cff_tests::disconnected_mixed_energy_factor_ownership_keeps_both_component_factors ... FAILED
  872. 27.03 s gammaloop-nextest-core>
  873. 27.03 s gammaloop-nextest-core> failures:
  874. 27.03 s gammaloop-nextest-core>
  875. 27.03 s gammaloop-nextest-core> failures:
  876. 27.03 s gammaloop-nextest-core> generation::cff_tests::disconnected_mixed_energy_factor_ownership_keeps_both_component_factors
  877. 27.03 s gammaloop-nextest-core>
  878. 27.03 s gammaloop-nextest-core> test result: FAILED. 0 passed; 1 failed; 0 ignored; 0 measured; 52 filtered out; finished in 0.00s
  879. 27.03 s gammaloop-nextest-core> system-err
  880. 27.03 s gammaloop-nextest-core> thread 'generation::cff_tests::disconnected_mixed_energy_factor_ownership_keeps_both_component_factors' (3152) panicked at crates/three-dimensional-reps/src/generation.rs:5726:9:
  881. 27.03 s gammaloop-nextest-core> assertion `left == right` failed
  882. 27.03 s gammaloop-nextest-core> left: [GlobalSourceProduct, GlobalSourceProduct]
  883. 27.03 s gammaloop-nextest-core> right: [VariantLocal, GlobalSourceProduct]
  884. 27.03 s gammaloop-nextest-core> stack backtrace:
  885. 27.03 s gammaloop-nextest-core> 0: __rustc::rust_begin_unwind
  886. 27.03 s gammaloop-nextest-core> 1: core::panicking::panic_fmt
  887. 27.03 s gammaloop-nextest-core> 2: core::panicking::assert_failed_inner
  888. 27.03 s gammaloop-nextest-core> 3: core::panicking::assert_failed::<alloc::vec::Vec<three_dimensional_reps::generation::CffEnergyFactorOwnership>, alloc::vec::Vec<three_dimensional_reps::generation::CffEnergyFactorOwnership>>
  889. 27.03 s gammaloop-nextest-core> 4: three_dimensional_reps::generation::cff_tests::disconnected_mixed_energy_factor_ownership_keeps_both_component_factors
  890. 27.03 s gammaloop-nextest-core> 5: <three_dimensional_reps::generation::cff_tests::disconnected_mixed_energy_factor_ownership_keeps_both_component_factors::{closure#0} as core::ops::function::FnOnce<()>>::call_once
  891. 27.03 s gammaloop-nextest-core> note: Some details are omitted, run with `RUST_BACKTRACE=full` for a verbose backtrace.
  892. 27.03 s gammaloop-nextest-core>
  893. 27.03 s gammaloop-nextest-core> 3. three-dimensional-reps::generation::cff_tests::cff_generation_builds_multiloop_repeated_high_power_known_factor_completion
  894. 27.03 s gammaloop-nextest-core> failure: test failure with exit code 101
  895. 27.03 s gammaloop-nextest-core> thread 'generation::cff_tests::cff_generation_builds_multiloop_repeated_high_power_known_factor_completion' (3119) panicked at crates/three-dimensional-reps/src/generation.rs:5865:9:
  896. 27.03 s gammaloop-nextest-core> assertion failed: variants.iter().any(|variant|
  897. 27.03 s gammaloop-nextest-core> {
  898. 27.03 s gammaloop-nextest-core> variant.origin.as_deref().is_some_and(|origin|
  899. 27.03 s gammaloop-nextest-core> {
  900. 27.03 s gammaloop-nextest-core> origin.starts_with("bounded_degree_quadratic_recursive_remainder")
  901. 27.03 s gammaloop-nextest-core> })
  902. 27.03 s gammaloop-nextest-core> })
  903. 27.03 s gammaloop-nextest-core> stack backtrace:
  904. 27.03 s gammaloop-nextest-core> 0: __rustc::rust_begin_unwind
  905. 27.03 s gammaloop-nextest-core> 1: core::panicking::panic_fmt
  906. 27.03 s gammaloop-nextest-core> 2: core::panicking::panic
  907. 27.03 s gammaloop-nextest-core> 3: three_dimensional_reps::generation::cff_tests::cff_generation_builds_multiloop_repeated_high_power_known_factor_completion
  908. 27.03 s gammaloop-nextest-core> 4: <three_dimensional_reps::generation::cff_tests::cff_generation_builds_multiloop_repeated_high_power_known_factor_completion::{closure#0} as core::ops::function::FnOnce<()>>::call_once
  909. 27.03 s gammaloop-nextest-core> note: Some details are omitted, run with `RUST_BACKTRACE=full` for a verbose backtrace.
  910. 27.03 s gammaloop-nextest-core> system-out
  911. 27.03 s gammaloop-nextest-core> running 1 test
  912. 27.03 s gammaloop-nextest-core> test generation::cff_tests::cff_generation_builds_multiloop_repeated_high_power_known_factor_completion ... FAILED
  913. 27.03 s gammaloop-nextest-core>
  914. 27.03 s gammaloop-nextest-core> failures:
  915. 27.03 s gammaloop-nextest-core>
  916. 27.03 s gammaloop-nextest-core> failures:
  917. 27.03 s gammaloop-nextest-core> generation::cff_tests::cff_generation_builds_multiloop_repeated_high_power_known_factor_completion
  918. 27.03 s gammaloop-nextest-core>
  919. 27.03 s gammaloop-nextest-core> test result: FAILED. 0 passed; 1 failed; 0 ignored; 0 measured; 52 filtered out; finished in 0.03s
  920. 27.03 s gammaloop-nextest-core> system-err
  921. 27.03 s gammaloop-nextest-core> thread 'generation::cff_tests::cff_generation_builds_multiloop_repeated_high_power_known_factor_completion' (3119) panicked at crates/three-dimensional-reps/src/generation.rs:5865:9:
  922. 27.03 s gammaloop-nextest-core> assertion failed: variants.iter().any(|variant|
  923. 27.03 s gammaloop-nextest-core> {
  924. 27.03 s gammaloop-nextest-core> variant.origin.as_deref().is_some_and(|origin|
  925. 27.03 s gammaloop-nextest-core> {
  926. 27.03 s gammaloop-nextest-core> origin.starts_with("bounded_degree_quadratic_recursive_remainder")
  927. 27.03 s gammaloop-nextest-core> })
  928. 27.03 s gammaloop-nextest-core> })
  929. 27.03 s gammaloop-nextest-core> stack backtrace:
  930. 27.03 s gammaloop-nextest-core> 0: __rustc::rust_begin_unwind
  931. 27.03 s gammaloop-nextest-core> 1: core::panicking::panic_fmt
  932. 27.03 s gammaloop-nextest-core> 2: core::panicking::panic
  933. 27.03 s gammaloop-nextest-core> 3: three_dimensional_reps::generation::cff_tests::cff_generation_builds_multiloop_repeated_high_power_known_factor_completion
  934. 27.03 s gammaloop-nextest-core> 4: <three_dimensional_reps::generation::cff_tests::cff_generation_builds_multiloop_repeated_high_power_known_factor_completion::{closure#0} as core::ops::function::FnOnce<()>>::call_once
  935. 27.03 s gammaloop-nextest-core> note: Some details are omitted, run with `RUST_BACKTRACE=full` for a verbose backtrace.
  936. 27.03 s gammaloop-nextest-core>
  937. 27.03 s gammaloop-nextest-core> 4. three-dimensional-reps::generation::cff_tests::cff_generation_builds_one_loop_high_power_with_repeated_spectators
  938. 27.03 s gammaloop-nextest-core> failure: test failure with exit code 101
  939. 27.03 s gammaloop-nextest-core> thread 'generation::cff_tests::cff_generation_builds_one_loop_high_power_with_repeated_spectators' (3123) panicked at crates/three-dimensional-reps/src/generation.rs:6288:9:
  940. 27.03 s gammaloop-nextest-core> assertion failed: variants.iter().any(|variant|
  941. 27.03 s gammaloop-nextest-core> {
  942. 27.03 s gammaloop-nextest-core> variant.origin.as_deref().is_some_and(|origin|
  943. 27.03 s gammaloop-nextest-core> {
  944. 27.03 s gammaloop-nextest-core> origin.starts_with("bounded_degree_quadratic_recursive_remainder")
  945. 27.03 s gammaloop-nextest-core> })
  946. 27.03 s gammaloop-nextest-core> })
  947. 27.03 s gammaloop-nextest-core> stack backtrace:
  948. 27.03 s gammaloop-nextest-core> 0: __rustc::rust_begin_unwind
  949. 27.03 s gammaloop-nextest-core> 1: core::panicking::panic_fmt
  950. 27.03 s gammaloop-nextest-core> 2: core::panicking::panic
  951. 27.03 s gammaloop-nextest-core> 3: three_dimensional_reps::generation::cff_tests::cff_generation_builds_one_loop_high_power_with_repeated_spectators
  952. 27.03 s gammaloop-nextest-core> 4: <three_dimensional_reps::generation::cff_tests::cff_generation_builds_one_loop_high_power_with_repeated_spectators::{closure#0} as core::ops::function::FnOnce<()>>::call_once
  953. 27.03 s gammaloop-nextest-core> note: Some details are omitted, run with `RUST_BACKTRACE=full` for a verbose backtrace.
  954. 27.03 s gammaloop-nextest-core> system-out
  955. 27.03 s gammaloop-nextest-core> running 1 test
  956. 27.03 s gammaloop-nextest-core> test generation::cff_tests::cff_generation_builds_one_loop_high_power_with_repeated_spectators ... FAILED
  957. 27.03 s gammaloop-nextest-core>
  958. 27.03 s gammaloop-nextest-core> failures:
  959. 27.03 s gammaloop-nextest-core>
  960. 27.03 s gammaloop-nextest-core> failures:
  961. 27.03 s gammaloop-nextest-core> generation::cff_tests::cff_generation_builds_one_loop_high_power_with_repeated_spectators
  962. 27.03 s gammaloop-nextest-core>
  963. 27.03 s gammaloop-nextest-core> test result: FAILED. 0 passed; 1 failed; 0 ignored; 0 measured; 52 filtered out; finished in 0.09s
  964. 27.03 s gammaloop-nextest-core> system-err
  965. 27.03 s gammaloop-nextest-core> thread 'generation::cff_tests::cff_generation_builds_one_loop_high_power_with_repeated_spectators' (3123) panicked at crates/three-dimensional-reps/src/generation.rs:6288:9:
  966. 27.03 s gammaloop-nextest-core> assertion failed: variants.iter().any(|variant|
  967. 27.03 s gammaloop-nextest-core> {
  968. 27.03 s gammaloop-nextest-core> variant.origin.as_deref().is_some_and(|origin|
  969. 27.03 s gammaloop-nextest-core> {
  970. 27.03 s gammaloop-nextest-core> origin.starts_with("bounded_degree_quadratic_recursive_remainder")
  971. 27.03 s gammaloop-nextest-core> })
  972. 27.03 s gammaloop-nextest-core> })
  973. 27.03 s gammaloop-nextest-core> stack backtrace:
  974. 27.03 s gammaloop-nextest-core> 0: __rustc::rust_begin_unwind
  975. 27.03 s gammaloop-nextest-core> 1: core::panicking::panic_fmt
  976. 27.03 s gammaloop-nextest-core> 2: core::panicking::panic
  977. 27.03 s gammaloop-nextest-core> 3: three_dimensional_reps::generation::cff_tests::cff_generation_builds_one_loop_high_power_with_repeated_spectators
  978. 27.03 s gammaloop-nextest-core> 4: <three_dimensional_reps::generation::cff_tests::cff_generation_builds_one_loop_high_power_with_repeated_spectators::{closure#0} as core::ops::function::FnOnce<()>>::call_once
  979. 27.03 s gammaloop-nextest-core> note: Some details are omitted, run with `RUST_BACKTRACE=full` for a verbose backtrace.
  980. 27.03 s gammaloop-nextest-core> =========================================
  981. 27.08 s error: Cannot build '/nix/store/i3sh6ivcl5js2i7xcdz1qf32z60j8rna-gammaloop-nextest-core.drv'.
  982. 27.08 s Reason: builder failed with exit code 100.
  983. 27.08 s Output paths:
  984. 27.08 s /nix/store/zw0sqrmrvf1b8g32rv52wgxnjn3i427b-gammaloop-nextest-core
  985. 27.08 s Last 964 log lines:
  986. 27.08 s > Extracting 3 binaries (including 1 non-test binary), 1 build script output directory, and 2 linked paths to /build/nextest-archive-8TZ4LJ
  987. 27.08 s > Extracted 18 files to /build/nextest-archive-8TZ4LJ in 0.64s
  988. 27.08 s > ------------
  989. 27.08 s > Nextest run ID e19c85be-89bf-4c31-afa0-3977d6d1a2ce with nextest profile: ci_gammaloop
  990. 27.08 s > Starting 367 tests across 2 binaries
  991. 27.08 s > ------------
  992. 27.08 s > Summary [ 0.758s] 367 tests run: 367 passed, 0 skipped
  993. 27.08 s >
  994. 27.08 s > ========== nextest test summary ==========
  995. 27.08 s > report: target/nextest/ci_gammaloop/junit.xml
  996. 27.08 s > tests: 367, failures: 0, errors: 0
  997. 27.08 s > No failing testcases found.
  998. 27.08 s > =========================================
  999. 27.08 s > Extracting 1 binary and 1 linked path to /build/nextest-archive-CCtl1d
  1000. 27.08 s > Extracted 7 files to /build/nextest-archive-CCtl1d in 0.09s
  1001. 27.08 s > ------------
  1002. 27.08 s > Nextest run ID 9eab3b16-331d-4eac-8e83-42f1b27bd930 with nextest profile: ci_gammaloop
  1003. 27.08 s > Starting 19 tests across 1 binary
  1004. 27.08 s > ------------
  1005. 27.08 s > Summary [ 0.016s] 19 tests run: 19 passed, 0 skipped
  1006. 27.08 s >
  1007. 27.08 s > ========== nextest test summary ==========
  1008. 27.08 s > report: target/nextest/ci_gammaloop/junit.xml
  1009. 27.08 s > tests: 19, failures: 0, errors: 0
  1010. 27.08 s > No failing testcases found.
  1011. 27.08 s > =========================================
  1012. 27.08 s > Extracting 1 binary to /build/nextest-archive-gDWp0e
  1013. 27.08 s > Extracted 4 files to /build/nextest-archive-gDWp0e in 0.04s
  1014. 27.08 s > ------------
  1015. 27.08 s > Nextest run ID 3a492b90-4483-449d-b38c-f6d29c505d58 with nextest profile: ci_gammaloop
  1016. 27.08 s > Starting 0 tests across 1 binary
  1017. 27.08 s > ------------
  1018. 27.08 s > Summary [ 0.000s] 0 tests run: 0 passed, 0 skipped
  1019. 27.08 s >
  1020. 27.08 s > ========== nextest test summary ==========
  1021. 27.08 s > report: target/nextest/ci_gammaloop/junit.xml
  1022. 27.08 s > tests: 0, failures: 0, errors: 0
  1023. 27.08 s > No failing testcases found.
  1024. 27.08 s > =========================================
  1025. 27.08 s > Extracting 4 binaries, 1 build script output directory, and 2 linked paths to /build/nextest-archive-JqGIeB
  1026. 27.08 s > Extracted 18 files to /build/nextest-archive-JqGIeB in 0.66s
  1027. 27.08 s > ------------
  1028. 27.08 s > Nextest run ID 43ebe835-250e-46a3-8691-870ca9cd66f1 with nextest profile: ci_gammaloop
  1029. 27.08 s > Starting 501 tests across 4 binaries (59 tests skipped, including 58 tests via profile.ci_gammaloop.default-filter)
  1030. 27.08 s > FAIL [ 0.167s] (479/501) gammalooprs uv::hedge_poset::tests::union_terms_project_factorized_typed_4d_values
  1031. 27.08 s > stdout ---
  1032. 27.08 s >
  1033. 27.08 s > running 1 test
  1034. 27.08 s > test uv::hedge_poset::tests::union_terms_project_factorized_typed_4d_values ... FAILED
  1035. 27.08 s >
  1036. 27.08 s > failures:
  1037. 27.08 s >
  1038. 27.08 s > failures:
  1039. 27.08 s > uv::hedge_poset::tests::union_terms_project_factorized_typed_4d_values
  1040. 27.08 s >
  1041. 27.08 s > test result: FAILED. 0 passed; 1 failed; 0 ignored; 0 measured; 551 filtered out; finished in 0.14s
  1042. 27.08 s >
  1043. 27.08 s > stderr ---
  1044. 27.08 s > Error:
  1045. 27.08 s > 0: exact source occurrences for physical edge 1 disagree after on-shell-energy replacement: `-(mUVexp^2+Q(1,cind(1))^2+Q(1,cind(2))^2+Q(1,cind(3))^2)^(1/2)` versus `(mUVexp^2+Q(1,cind(1))^2+Q(1,cind(2))^2+Q(1,cind(3))^2)^(1/2)`; exact 4D term active denominators are [FourDDenominator { source_edge: EdgeIndex(1), momentum: gammalooprs::Q(1), mass_squared: gammalooprs::mUVexp^2, full_expr: -gammalooprs::mUV^2+spenso::dot(gammalooprs::Q(1,spenso::mink(gammalooprs::dim)),gammalooprs::Q(1,spenso::mink(gammalooprs::dim))) }, FourDDenominator { source_edge: EdgeIndex(1), momentum: gammalooprs::Q(1), mass_squared: gammalooprs::mUVexp^2, full_expr: -gammalooprs::mUV^2+spenso::dot(gammalooprs::Q(1,spenso::mink(gammalooprs::dim)),gammalooprs::Q(1,spenso::mink(gammalooprs::dim))) }, FourDDenominator { source_edge: EdgeIndex(3), momentum: gammalooprs::Q(3), mass_squared: gammalooprs::mUVexp^2, full_expr: -gammalooprs::mUV^2+spenso::dot(gammalooprs::Q(3,spenso::mink(gammalooprs::dim)),gammalooprs::Q(3,spenso::mink(gammalooprs::dim))) }, FourDDenominator { source_edge: EdgeIndex(3), momentum: gammalooprs::Q(3), mass_squared: gammalooprs::mUVexp^2, full_expr: -gammalooprs::mUV^2+spenso::dot(gammalooprs::Q(3,spenso::mink(gammalooprs::dim)),gammalooprs::Q(3,spenso::mink(gammalooprs::dim))) }, FourDDenominator { source_edge: EdgeIndex(0), momentum: gammalooprs::Q(0), mass_squared: UFO::mass_scalar_1^2, full_expr: -UFO::mass_scalar_1^2+spenso::dot(gammalooprs::Q(0,spenso::mink(gammalooprs::dim)),gammalooprs::Q(0,spenso::mink(gammalooprs::dim))) }]
  1046. 27.08 s >
  1047. 27.08 s > Location:
  1048. 27.08 s > crates/gammalooprs/src/uv/approx/local_3d.rs:641
  1049. 27.08 s >
  1050. 27.08 s > ━━━━━━━━━━━━━━━━━━━━━━━━━━━━━━━━━━ BACKTRACE ━━━━━━━━━━━━━━━━━━━━━━━━━━━━━━━━━━━
  1051. 27.08 s > 1: <color_eyre[51793ea62743adbd]::config::EyreHook>::into_eyre_hook::{closure#0}<unknown>
  1052. 27.08 s > at <unknown source file>:<unknown line>
  1053. 27.08 s > 2: eyre[cb2fd339c0c40fca]::capture_handler<unknown>
  1054. 27.08 s > at <unknown source file>:<unknown line>
  1055. 27.08 s > 3: <eyre[cb2fd339c0c40fca]::Report>::from_adhoc::<alloc[2ea6bcb46fca0c42]::string::String><unknown>
  1056. 27.08 s > at <unknown source file>:<unknown line>
  1057. 27.08 s > 4: <gammalooprs[6dc202c8af9e2ddf]::uv::approx::local_3d::Localizer>::project_4d<unknown>
  1058. 27.08 s > at <unknown source file>:<unknown line>
  1059. 27.08 s > 5: gammalooprs[6dc202c8af9e2ddf]::uv::hedge_poset::tests::union_terms_project_factorized_typed_4d_values<unknown>
  1060. 27.08 s > at <unknown source file>:<unknown line>
  1061. 27.08 s > 6: <gammalooprs[6dc202c8af9e2ddf]::uv::hedge_poset::tests::union_terms_project_factorized_typed_4d_values::{closure#0} as core[940e698046960fd5]::ops::function::FnOnce<()>>::call_once<unknown>
  1062. 27.08 s > at <unknown source file>:<unknown line>
  1063. 27.08 s > 7: test[75d6903177b1d7e9]::__rust_begin_short_backtrace::<core[940e698046960fd5]::result::Result<(), alloc[2ea6bcb46fca0c42]::string::String>, fn() -> core[940e698046960fd5]::result::Result<(), alloc[2ea6bcb46fca0c42]::string::String>><unknown>
  1064. 27.08 s > at <unknown source file>:<unknown line>
  1065. 27.08 s > 8: test[75d6903177b1d7e9]::run_test::{closure#0}<unknown>
  1066. 27.08 s > at <unknown source file>:<unknown line>
  1067. 27.08 s > 9: std[bcb96dfbba0ab899]::sys::backtrace::__rust_begin_short_backtrace::<test[75d6903177b1d7e9]::run_test::{closure#1}, ()><unknown>
  1068. 27.08 s > at <unknown source file>:<unknown line>
  1069. 27.08 s > 10: <std[bcb96dfbba0ab899]::thread::lifecycle::spawn_unchecked<test[75d6903177b1d7e9]::run_test::{closure#1}, ()>::{closure#1} as core[940e698046960fd5]::ops::function::FnOnce<()>>::call_once::{shim:vtable#0}<unknown>
  1070. 27.08 s > at <unknown source file>:<unknown line>
  1071. 27.08 s > 11: <std[bcb96dfbba0ab899]::sys::thread::unix::Thread>::new::thread_start<unknown>
  1072. 27.08 s > at <unknown source file>:<unknown line>
  1073. 27.08 s > 12: start_thread<unknown>
  1074. 27.08 s > at <unknown source file>:<unknown line>
  1075. 27.08 s > 13: __clone3<unknown>
  1076. 27.08 s > at <unknown source file>:<unknown line>
  1077. 27.08 s >
  1078. 27.08 s > Run with COLORBT_SHOW_HIDDEN=1 environment variable to disable frame filtering.
  1079. 27.08 s > Run with RUST_BACKTRACE=full to include source snippets.
  1080. 27.08 s >
  1081. 27.08 s > FAIL [ 5.275s] (497/501) gammalooprs::test_renormalization finite_part_ghost_2loop
  1082. 27.08 s > stdout ---
  1083. 27.08 s >
  1084. 27.08 s > running 1 test
  1085. 27.08 s > test finite_part_ghost_2loop ... FAILED
  1086. 27.08 s >
  1087. 27.08 s > failures:
  1088. 27.08 s >
  1089. 27.08 s > failures:
  1090. 27.08 s > finite_part_ghost_2loop
  1091. 27.08 s >
  1092. 27.08 s > test result: FAILED. 0 passed; 1 failed; 0 ignored; 0 measured; 5 filtered out; finished in 5.25s
  1093. 27.08 s >
  1094. 27.08 s > stderr ---
  1095. 27.08 s > [16:29:41.927] @gammalooprs::processes::amplitude ERROR :
  1096. 27.08 s > field value
  1097. 27.08 s > error generalized CFF expression generation failed for graph `d5` with source-edge numerator energy-degree bounds Some([(1, 1), (2, 1), (3, 1), (5, 2), (6, 2)]): energy-degree bounds do not certify vanishing residues at infinity under the conservative cap check: EnergyDivergenceReport { edge_degree_bounds: [1, 1, 1, 2, 2], loops: [EnergyDirectionReport { loop_id: Some(0), zero_edges: [], active_edges: [0, 1, 2, 4], nullity: None, numerator_degree_bound: 5, denominator_degree: 8, divergence_degree: -3, convergent: true }, EnergyDirectionReport { loop_id: Some(1), zero_edges: [], active_edges: [3, 4], nullity: None, numerator_degree_bound: 4, denominator_degree: 4, divergence_degree: 0, convergent: false }], directions: [EnergyDirectionReport { loop_id: None, zero_edges: [0, 1, 2], active_edges: [3, 4], nullity: Some(1), numerator_degree_bound: 4, denominator_degree: 4, divergence_degree: 0, convergent: false }, EnergyDirectionReport { loop_id: None, zero_edges: [], active_edges: [0, 1, 2, 3, 4], nullity: Some(2), numerator_degree_bound: 7, denominator_degree: 10, divergence_degree: -3, convergent: true }, EnergyDirectionReport { loop_id: None, zero_edges: [3], active_edges: [0, 1, 2, 4], nullity: Some(1), numerator_degree_bound: 5, denominator_degree: 8, divergence_degree: -3, convergent: true }, EnergyDirectionReport { loop_id: None, zero_edges: [4], active_edges: [0, 1, 2, 3], nullity: Some(1), numerator_degree_bound: 5, denominator_degree: 8, divergence_degree: -3, convergent: true }], coordinate_convergent: false, directional_convergent: false, convergent: false }
  1098. 27.08 s > 3D source has 2 loop names ["e1", "e5"], 5 internal edges [edge 0: 0 -> 1, loops=[1, 0], externals=[0, 0]; edge 1: 0 -> 2, loops=[-1, 0], externals=[1, 0]; edge 2: 1 -> 3, loops=[1, 0], externals=[-1, 0]; edge 3: 2 -> 3, loops=[0, 1], externals=[0, 0]; edge 4: 2 -> 3, loops=[-1, -1], externals=[1, 0]]
  1099. 27.08 s > at crates/gammalooprs/src/processes/amplitude.rs:825
  1100. 27.08 s > The application panicked (crashed).
  1101. 27.08 s > Message: called `Result::unwrap()` on an `Err` value:
  1102. 27.08 s > 0: generalized CFF expression generation failed for graph `d5` with source-edge numerator energy-degree bounds Some([(1, 1), (2, 1), (3, 1), (5, 2), (6, 2)]): energy-degree bounds do not certify vanishing residues at infinity under the conservative cap check: EnergyDivergenceReport { edge_degree_bounds: [1, 1, 1, 2, 2], loops: [EnergyDirectionReport { loop_id: Some(0), zero_edges: [], active_edges: [0, 1, 2, 4], nullity: None, numerator_degree_bound: 5, denominator_degree: 8, divergence_degree: -3, convergent: true }, EnergyDirectionReport { loop_id: Some(1), zero_edges: [], active_edges: [3, 4], nullity: None, numerator_degree_bound: 4, denominator_degree: 4, divergence_degree: 0, convergent: false }], directions: [EnergyDirectionReport { loop_id: None, zero_edges: [0, 1, 2], active_edges: [3, 4], nullity: Some(1), numerator_degree_bound: 4, denominator_degree: 4, divergence_degree: 0, convergent: false }, EnergyDirectionReport { loop_id: None, zero_edges: [], active_edges: [0, 1, 2, 3, 4], nullity: Some(2), numerator_degree_bound: 7, denominator_degree: 10, divergence_degree: -3, convergent: true }, EnergyDirectionReport { loop_id: None, zero_edges: [3], active_edges: [0, 1, 2, 4], nullity: Some(1), numerator_degree_bound: 5, denominator_degree: 8, divergence_degree: -3, convergent: true }, EnergyDirectionReport { loop_id: None, zero_edges: [4], active_edges: [0, 1, 2, 3], nullity: Some(1), numerator_degree_bound: 5, denominator_degree: 8, divergence_degree: -3, convergent: true }], coordinate_convergent: false, directional_convergent: false, convergent: false }
  1103. 27.08 s > 3D source has 2 loop names ["e1", "e5"], 5 internal edges [edge 0: 0 -> 1, loops=[1, 0], externals=[0, 0]; edge 1: 0 -> 2, loops=[-1, 0], externals=[1, 0]; edge 2: 1 -> 3, loops=[1, 0], externals=[-1, 0]; edge 3: 2 -> 3, loops=[0, 1], externals=[0, 0]; edge 4: 2 -> 3, loops=[-1, -1], externals=[1, 0]]
  1104. 27.08 s >
  1105. 27.08 s > Location:
  1106. 27.08 s > crates/gammalooprs/src/cff/generation.rs:226
  1107. 27.08 s >
  1108. 27.08 s > ━━━━━━━━━━━━━━━━━━━━━━━━━━━━━━━━━━ BACKTRACE ━━━━━━━━━━━━━━━━━━━━━━━━━━━━━━━━━━━
  1109. 27.08 s > 1: <color_eyre[51793ea62743adbd]::config::EyreHook>::into_eyre_hook::{closure#0}<unknown>
  1110. 27.08 s > at <unknown source file>:<unknown line>
  1111. 27.08 s > 2: eyre[cb2fd339c0c40fca]::capture_handler<unknown>
  1112. 27.08 s > at <unknown source file>:<unknown line>
  1113. 27.08 s > 3: <eyre[cb2fd339c0c40fca]::Report>::from_adhoc::<alloc[2ea6bcb46fca0c42]::string::String><unknown>
  1114. 27.08 s > at <unknown source file>:<unknown line>
  1115. 27.08 s > 4: <gammalooprs[1d0b14476f7eb2f8]::graph::Graph>::generate_3d_expression_for_integrand<unknown>
  1116. 27.08 s > at <unknown source file>:<unknown line>
  1117. 27.08 s > 5: <gammalooprs[1d0b14476f7eb2f8]::processes::amplitude::AmplitudeGraph>::generate_cff<unknown>
  1118. 27.08 s > at <unknown source file>:<unknown line>
  1119. 27.08 s > 6: <gammalooprs[1d0b14476f7eb2f8]::processes::amplitude::AmplitudeGraph>::renormalization_part<unknown>
  1120. 27.08 s > at <unknown source file>:<unknown line>
  1121. 27.08 s > 7: test_renormalization[879b57236d814a44]::finite_part_ghost_2loop<unknown>
  1122. 27.08 s > at <unknown source file>:<unknown line>
  1123. 27.08 s > 8: <test_renormalization[879b57236d814a44]::finite_part_ghost_2loop::{closure#0} as core[940e698046960fd5]::ops::function::FnOnce<()>>::call_once<unknown>
  1124. 27.08 s > at <unknown source file>:<unknown line>
  1125. 27.08 s > 9: test[75d6903177b1d7e9]::__rust_begin_short_backtrace::<core[940e698046960fd5]::result::Result<(), alloc[2ea6bcb46fca0c42]::string::String>, fn() -> core[940e698046960fd5]::result::Result<(), alloc[2ea6bcb46fca0c42]::string::String>><unknown>
  1126. 27.08 s > at <unknown source file>:<unknown line>
  1127. 27.08 s > 10: test[75d6903177b1d7e9]::run_test::{closure#0}<unknown>
  1128. 27.08 s > at <unknown source file>:<unknown line>
  1129. 27.08 s > 11: std[bcb96dfbba0ab899]::sys::backtrace::__rust_begin_short_backtrace::<test[75d6903177b1d7e9]::run_test::{closure#1}, ()><unknown>
  1130. 27.08 s > at <unknown source file>:<unknown line>
  1131. 27.08 s > 12: <std[bcb96dfbba0ab899]::thread::lifecycle::spawn_unchecked<test[75d6903177b1d7e9]::run_test::{closure#1}, ()>::{closure#1} as core[940e698046960fd5]::ops::function::FnOnce<()>>::call_once::{shim:vtable#0}<unknown>
  1132. 27.08 s > at <unknown source file>:<unknown line>
  1133. 27.08 s > 13: <std[bcb96dfbba0ab899]::sys::thread::unix::Thread>::new::thread_start<unknown>
  1134. 27.08 s > at <unknown source file>:<unknown line>
  1135. 27.08 s > 14: start_thread<unknown>
  1136. 27.08 s > at <unknown source file>:<unknown line>
  1137. 27.08 s > 15: __clone3<unknown>
  1138. 27.08 s > at <unknown source file>:<unknown line>
  1139. 27.08 s >
  1140. 27.08 s > Run with COLORBT_SHOW_HIDDEN=1 environment variable to disable frame filtering.
  1141. 27.08 s > Run with RUST_BACKTRACE=full to include source snippets.
  1142. 27.08 s > Warning: SpanTrace capture is Unsupported.
  1143. 27.08 s > Ensure that you've setup a tracing-error ErrorLayer and the semver versions are compatible
  1144. 27.08 s > Location: crates/gammalooprs/tests/test_renormalization.rs:495
  1145. 27.08 s >
  1146. 27.08 s > ━━━━━━━━━━━━━━━━━━━━━━━━━━━━━━━━━━ BACKTRACE ━━━━━━━━━━━━━━━━━━━━━━━━━━━━━━━━━━━
  1147. 27.08 s > 1: <color_eyre[51793ea62743adbd]::config::PanicHook>::panic_report<unknown>
  1148. 27.08 s > at <unknown source file>:<unknown line>
  1149. 27.08 s > 2: <color_eyre[51793ea62743adbd]::config::PanicHook>::into_panic_hook::{closure#0}<unknown>
  1150. 27.08 s > at <unknown source file>:<unknown line>
  1151. 27.08 s > 3: std[bcb96dfbba0ab899]::panicking::panic_with_hook<unknown>
  1152. 27.08 s > at <unknown source file>:<unknown line>
  1153. 27.08 s > 4: std[bcb96dfbba0ab899]::panicking::panic_handler::{closure#0}<unknown>
  1154. 27.08 s > at <unknown source file>:<unknown line>
  1155. 27.08 s > 5: std[bcb96dfbba0ab899]::sys::backtrace::__rust_end_short_backtrace::<std[bcb96dfbba0ab899]::panicking::panic_handler::{closure#0}, !><unknown>
  1156. 27.08 s > at <unknown source file>:<unknown line>
  1157. 27.08 s > 6: __rustc[6c289b9f9c454d21]::rust_begin_unwind<unknown>
  1158. 27.08 s > at <unknown source file>:<unknown line>
  1159. 27.08 s > 7: core[940e698046960fd5]::panicking::panic_fmt<unknown>
  1160. 27.08 s > at <unknown source file>:<unknown line>
  1161. 27.08 s > 8: core[940e698046960fd5]::result::unwrap_failed<unknown>
  1162. 27.08 s > at <unknown source file>:<unknown line>
  1163. 27.08 s > 9: test_renormalization[879b57236d814a44]::finite_part_ghost_2loop<unknown>
  1164. 27.08 s > at <unknown source file>:<unknown line>
  1165. 27.08 s > 10: <test_renormalization[879b57236d814a44]::finite_part_ghost_2loop::{closure#0} as core[940e698046960fd5]::ops::function::FnOnce<()>>::call_once<unknown>
  1166. 27.08 s > at <unknown source file>:<unknown line>
  1167. 27.08 s > 11: test[75d6903177b1d7e9]::__rust_begin_short_backtrace::<core[940e698046960fd5]::result::Result<(), alloc[2ea6bcb46fca0c42]::string::String>, fn() -> core[940e698046960fd5]::result::Result<(), alloc[2ea6bcb46fca0c42]::string::String>><unknown>
  1168. 27.08 s > at <unknown source file>:<unknown line>
  1169. 27.08 s > 12: test[75d6903177b1d7e9]::run_test::{closure#0}<unknown>
  1170. 27.08 s > at <unknown source file>:<unknown line>
  1171. 27.08 s > 13: std[bcb96dfbba0ab899]::sys::backtrace::__rust_begin_short_backtrace::<test[75d6903177b1d7e9]::run_test::{closure#1}, ()><unknown>
  1172. 27.08 s > at <unknown source file>:<unknown line>
  1173. 27.08 s > 14: <std[bcb96dfbba0ab899]::thread::lifecycle::spawn_unchecked<test[75d6903177b1d7e9]::run_test::{closure#1}, ()>::{closure#1} as core[940e698046960fd5]::ops::function::FnOnce<()>>::call_once::{shim:vtable#0}<unknown>
  1174. 27.08 s > at <unknown source file>:<unknown line>
  1175. 27.08 s > 15: <std[bcb96dfbba0ab899]::sys::thread::unix::Thread>::new::thread_start<unknown>
  1176. 27.08 s > at <unknown source file>:<unknown line>
  1177. 27.08 s > 16: start_thread<unknown>
  1178. 27.08 s > at <unknown source file>:<unknown line>
  1179. 27.08 s > 17: __clone3<unknown>
  1180. 27.08 s > at <unknown source file>:<unknown line>
  1181. 27.08 s >
  1182. 27.08 s > Run with COLORBT_SHOW_HIDDEN=1 environment variable to disable frame filtering.
  1183. 27.08 s > Run with RUST_BACKTRACE=full to include source snippets.
  1184. 27.08 s >
  1185. 27.08 s > ------------
  1186. 27.08 s > Summary [ 10.610s] 501 tests run: 499 passed, 2 failed, 59 skipped
  1187. 27.08 s > FAIL [ 0.167s] (479/501) gammalooprs uv::hedge_poset::tests::union_terms_project_factorized_typed_4d_values
  1188. 27.08 s > stdout ---
  1189. 27.08 s >
  1190. 27.08 s > running 1 test
  1191. 27.08 s > test uv::hedge_poset::tests::union_terms_project_factorized_typed_4d_values ... FAILED
  1192. 27.08 s >
  1193. 27.08 s > failures:
  1194. 27.08 s >
  1195. 27.08 s > failures:
  1196. 27.08 s > uv::hedge_poset::tests::union_terms_project_factorized_typed_4d_values
  1197. 27.08 s >
  1198. 27.08 s > test result: FAILED. 0 passed; 1 failed; 0 ignored; 0 measured; 551 filtered out; finished in 0.14s
  1199. 27.08 s >
  1200. 27.08 s > stderr ---
  1201. 27.08 s > Error:
  1202. 27.08 s > 0: exact source occurrences for physical edge 1 disagree after on-shell-energy replacement: `-(mUVexp^2+Q(1,cind(1))^2+Q(1,cind(2))^2+Q(1,cind(3))^2)^(1/2)` versus `(mUVexp^2+Q(1,cind(1))^2+Q(1,cind(2))^2+Q(1,cind(3))^2)^(1/2)`; exact 4D term active denominators are [FourDDenominator { source_edge: EdgeIndex(1), momentum: gammalooprs::Q(1), mass_squared: gammalooprs::mUVexp^2, full_expr: -gammalooprs::mUV^2+spenso::dot(gammalooprs::Q(1,spenso::mink(gammalooprs::dim)),gammalooprs::Q(1,spenso::mink(gammalooprs::dim))) }, FourDDenominator { source_edge: EdgeIndex(1), momentum: gammalooprs::Q(1), mass_squared: gammalooprs::mUVexp^2, full_expr: -gammalooprs::mUV^2+spenso::dot(gammalooprs::Q(1,spenso::mink(gammalooprs::dim)),gammalooprs::Q(1,spenso::mink(gammalooprs::dim))) }, FourDDenominator { source_edge: EdgeIndex(3), momentum: gammalooprs::Q(3), mass_squared: gammalooprs::mUVexp^2, full_expr: -gammalooprs::mUV^2+spenso::dot(gammalooprs::Q(3,spenso::mink(gammalooprs::dim)),gammalooprs::Q(3,spenso::mink(gammalooprs::dim))) }, FourDDenominator { source_edge: EdgeIndex(3), momentum: gammalooprs::Q(3), mass_squared: gammalooprs::mUVexp^2, full_expr: -gammalooprs::mUV^2+spenso::dot(gammalooprs::Q(3,spenso::mink(gammalooprs::dim)),gammalooprs::Q(3,spenso::mink(gammalooprs::dim))) }, FourDDenominator { source_edge: EdgeIndex(0), momentum: gammalooprs::Q(0), mass_squared: UFO::mass_scalar_1^2, full_expr: -UFO::mass_scalar_1^2+spenso::dot(gammalooprs::Q(0,spenso::mink(gammalooprs::dim)),gammalooprs::Q(0,spenso::mink(gammalooprs::dim))) }]
  1203. 27.08 s >
  1204. 27.08 s > Location:
  1205. 27.08 s > crates/gammalooprs/src/uv/approx/local_3d.rs:641
  1206. 27.08 s >
  1207. 27.08 s > ━━━━━━━━━━━━━━━━━━━━━━━━━━━━━━━━━━ BACKTRACE ━━━━━━━━━━━━━━━━━━━━━━━━━━━━━━━━━━━
  1208. 27.08 s > 1: <color_eyre[51793ea62743adbd]::config::EyreHook>::into_eyre_hook::{closure#0}<unknown>
  1209. 27.08 s > at <unknown source file>:<unknown line>
  1210. 27.08 s > 2: eyre[cb2fd339c0c40fca]::capture_handler<unknown>
  1211. 27.08 s > at <unknown source file>:<unknown line>
  1212. 27.08 s > 3: <eyre[cb2fd339c0c40fca]::Report>::from_adhoc::<alloc[2ea6bcb46fca0c42]::string::String><unknown>
  1213. 27.08 s > at <unknown source file>:<unknown line>
  1214. 27.08 s > 4: <gammalooprs[6dc202c8af9e2ddf]::uv::approx::local_3d::Localizer>::project_4d<unknown>
  1215. 27.08 s > at <unknown source file>:<unknown line>
  1216. 27.08 s > 5: gammalooprs[6dc202c8af9e2ddf]::uv::hedge_poset::tests::union_terms_project_factorized_typed_4d_values<unknown>
  1217. 27.08 s > at <unknown source file>:<unknown line>
  1218. 27.08 s > 6: <gammalooprs[6dc202c8af9e2ddf]::uv::hedge_poset::tests::union_terms_project_factorized_typed_4d_values::{closure#0} as core[940e698046960fd5]::ops::function::FnOnce<()>>::call_once<unknown>
  1219. 27.08 s > at <unknown source file>:<unknown line>
  1220. 27.08 s > 7: test[75d6903177b1d7e9]::__rust_begin_short_backtrace::<core[940e698046960fd5]::result::Result<(), alloc[2ea6bcb46fca0c42]::string::String>, fn() -> core[940e698046960fd5]::result::Result<(), alloc[2ea6bcb46fca0c42]::string::String>><unknown>
  1221. 27.08 s > at <unknown source file>:<unknown line>
  1222. 27.08 s > 8: test[75d6903177b1d7e9]::run_test::{closure#0}<unknown>
  1223. 27.08 s > at <unknown source file>:<unknown line>
  1224. 27.08 s > 9: std[bcb96dfbba0ab899]::sys::backtrace::__rust_begin_short_backtrace::<test[75d6903177b1d7e9]::run_test::{closure#1}, ()><unknown>
  1225. 27.08 s > at <unknown source file>:<unknown line>
  1226. 27.08 s > 10: <std[bcb96dfbba0ab899]::thread::lifecycle::spawn_unchecked<test[75d6903177b1d7e9]::run_test::{closure#1}, ()>::{closure#1} as core[940e698046960fd5]::ops::function::FnOnce<()>>::call_once::{shim:vtable#0}<unknown>
  1227. 27.08 s > at <unknown source file>:<unknown line>
  1228. 27.08 s > 11: <std[bcb96dfbba0ab899]::sys::thread::unix::Thread>::new::thread_start<unknown>
  1229. 27.08 s > at <unknown source file>:<unknown line>
  1230. 27.08 s > 12: start_thread<unknown>
  1231. 27.08 s > at <unknown source file>:<unknown line>
  1232. 27.08 s > 13: __clone3<unknown>
  1233. 27.08 s > at <unknown source file>:<unknown line>
  1234. 27.08 s >
  1235. 27.08 s > Run with COLORBT_SHOW_HIDDEN=1 environment variable to disable frame filtering.
  1236. 27.08 s > Run with RUST_BACKTRACE=full to include source snippets.
  1237. 27.08 s >
  1238. 27.08 s > FAIL [ 5.275s] (497/501) gammalooprs::test_renormalization finite_part_ghost_2loop
  1239. 27.08 s > stdout ---
  1240. 27.08 s >
  1241. 27.08 s > running 1 test
  1242. 27.08 s > test finite_part_ghost_2loop ... FAILED
  1243. 27.08 s >
  1244. 27.08 s > failures:
  1245. 27.08 s >
  1246. 27.08 s > failures:
  1247. 27.08 s > finite_part_ghost_2loop
  1248. 27.08 s >
  1249. 27.08 s > test result: FAILED. 0 passed; 1 failed; 0 ignored; 0 measured; 5 filtered out; finished in 5.25s
  1250. 27.08 s >
  1251. 27.08 s > stderr ---
  1252. 27.08 s > [16:29:41.927] @gammalooprs::processes::amplitude ERROR :
  1253. 27.08 s > field value
  1254. 27.08 s > error generalized CFF expression generation failed for graph `d5` with source-edge numerator energy-degree bounds Some([(1, 1), (2, 1), (3, 1), (5, 2), (6, 2)]): energy-degree bounds do not certify vanishing residues at infinity under the conservative cap check: EnergyDivergenceReport { edge_degree_bounds: [1, 1, 1, 2, 2], loops: [EnergyDirectionReport { loop_id: Some(0), zero_edges: [], active_edges: [0, 1, 2, 4], nullity: None, numerator_degree_bound: 5, denominator_degree: 8, divergence_degree: -3, convergent: true }, EnergyDirectionReport { loop_id: Some(1), zero_edges: [], active_edges: [3, 4], nullity: None, numerator_degree_bound: 4, denominator_degree: 4, divergence_degree: 0, convergent: false }], directions: [EnergyDirectionReport { loop_id: None, zero_edges: [0, 1, 2], active_edges: [3, 4], nullity: Some(1), numerator_degree_bound: 4, denominator_degree: 4, divergence_degree: 0, convergent: false }, EnergyDirectionReport { loop_id: None, zero_edges: [], active_edges: [0, 1, 2, 3, 4], nullity: Some(2), numerator_degree_bound: 7, denominator_degree: 10, divergence_degree: -3, convergent: true }, EnergyDirectionReport { loop_id: None, zero_edges: [3], active_edges: [0, 1, 2, 4], nullity: Some(1), numerator_degree_bound: 5, denominator_degree: 8, divergence_degree: -3, convergent: true }, EnergyDirectionReport { loop_id: None, zero_edges: [4], active_edges: [0, 1, 2, 3], nullity: Some(1), numerator_degree_bound: 5, denominator_degree: 8, divergence_degree: -3, convergent: true }], coordinate_convergent: false, directional_convergent: false, convergent: false }
  1255. 27.08 s > 3D source has 2 loop names ["e1", "e5"], 5 internal edges [edge 0: 0 -> 1, loops=[1, 0], externals=[0, 0]; edge 1: 0 -> 2, loops=[-1, 0], externals=[1, 0]; edge 2: 1 -> 3, loops=[1, 0], externals=[-1, 0]; edge 3: 2 -> 3, loops=[0, 1], externals=[0, 0]; edge 4: 2 -> 3, loops=[-1, -1], externals=[1, 0]]
  1256. 27.08 s > at crates/gammalooprs/src/processes/amplitude.rs:825
  1257. 27.08 s > The application panicked (crashed).
  1258. 27.08 s > Message: called `Result::unwrap()` on an `Err` value:
  1259. 27.08 s > 0: generalized CFF expression generation failed for graph `d5` with source-edge numerator energy-degree bounds Some([(1, 1), (2, 1), (3, 1), (5, 2), (6, 2)]): energy-degree bounds do not certify vanishing residues at infinity under the conservative cap check: EnergyDivergenceReport { edge_degree_bounds: [1, 1, 1, 2, 2], loops: [EnergyDirectionReport { loop_id: Some(0), zero_edges: [], active_edges: [0, 1, 2, 4], nullity: None, numerator_degree_bound: 5, denominator_degree: 8, divergence_degree: -3, convergent: true }, EnergyDirectionReport { loop_id: Some(1), zero_edges: [], active_edges: [3, 4], nullity: None, numerator_degree_bound: 4, denominator_degree: 4, divergence_degree: 0, convergent: false }], directions: [EnergyDirectionReport { loop_id: None, zero_edges: [0, 1, 2], active_edges: [3, 4], nullity: Some(1), numerator_degree_bound: 4, denominator_degree: 4, divergence_degree: 0, convergent: false }, EnergyDirectionReport { loop_id: None, zero_edges: [], active_edges: [0, 1, 2, 3, 4], nullity: Some(2), numerator_degree_bound: 7, denominator_degree: 10, divergence_degree: -3, convergent: true }, EnergyDirectionReport { loop_id: None, zero_edges: [3], active_edges: [0, 1, 2, 4], nullity: Some(1), numerator_degree_bound: 5, denominator_degree: 8, divergence_degree: -3, convergent: true }, EnergyDirectionReport { loop_id: None, zero_edges: [4], active_edges: [0, 1, 2, 3], nullity: Some(1), numerator_degree_bound: 5, denominator_degree: 8, divergence_degree: -3, convergent: true }], coordinate_convergent: false, directional_convergent: false, convergent: false }
  1260. 27.08 s > 3D source has 2 loop names ["e1", "e5"], 5 internal edges [edge 0: 0 -> 1, loops=[1, 0], externals=[0, 0]; edge 1: 0 -> 2, loops=[-1, 0], externals=[1, 0]; edge 2: 1 -> 3, loops=[1, 0], externals=[-1, 0]; edge 3: 2 -> 3, loops=[0, 1], externals=[0, 0]; edge 4: 2 -> 3, loops=[-1, -1], externals=[1, 0]]
  1261. 27.08 s >
  1262. 27.08 s > Location:
  1263. 27.08 s > crates/gammalooprs/src/cff/generation.rs:226
  1264. 27.08 s >
  1265. 27.08 s > ━━━━━━━━━━━━━━━━━━━━━━━━━━━━━━━━━━ BACKTRACE ━━━━━━━━━━━━━━━━━━━━━━━━━━━━━━━━━━━
  1266. 27.08 s > 1: <color_eyre[51793ea62743adbd]::config::EyreHook>::into_eyre_hook::{closure#0}<unknown>
  1267. 27.08 s > at <unknown source file>:<unknown line>
  1268. 27.08 s > 2: eyre[cb2fd339c0c40fca]::capture_handler<unknown>
  1269. 27.08 s > at <unknown source file>:<unknown line>
  1270. 27.08 s > 3: <eyre[cb2fd339c0c40fca]::Report>::from_adhoc::<alloc[2ea6bcb46fca0c42]::string::String><unknown>
  1271. 27.08 s > at <unknown source file>:<unknown line>
  1272. 27.08 s > 4: <gammalooprs[1d0b14476f7eb2f8]::graph::Graph>::generate_3d_expression_for_integrand<unknown>
  1273. 27.08 s > at <unknown source file>:<unknown line>
  1274. 27.08 s > 5: <gammalooprs[1d0b14476f7eb2f8]::processes::amplitude::AmplitudeGraph>::generate_cff<unknown>
  1275. 27.08 s > at <unknown source file>:<unknown line>
  1276. 27.08 s > 6: <gammalooprs[1d0b14476f7eb2f8]::processes::amplitude::AmplitudeGraph>::renormalization_part<unknown>
  1277. 27.08 s > at <unknown source file>:<unknown line>
  1278. 27.08 s > 7: test_renormalization[879b57236d814a44]::finite_part_ghost_2loop<unknown>
  1279. 27.08 s > at <unknown source file>:<unknown line>
  1280. 27.08 s > 8: <test_renormalization[879b57236d814a44]::finite_part_ghost_2loop::{closure#0} as core[940e698046960fd5]::ops::function::FnOnce<()>>::call_once<unknown>
  1281. 27.08 s > at <unknown source file>:<unknown line>
  1282. 27.08 s > 9: test[75d6903177b1d7e9]::__rust_begin_short_backtrace::<core[940e698046960fd5]::result::Result<(), alloc[2ea6bcb46fca0c42]::string::String>, fn() -> core[940e698046960fd5]::result::Result<(), alloc[2ea6bcb46fca0c42]::string::String>><unknown>
  1283. 27.08 s > at <unknown source file>:<unknown line>
  1284. 27.08 s > 10: test[75d6903177b1d7e9]::run_test::{closure#0}<unknown>
  1285. 27.08 s > at <unknown source file>:<unknown line>
  1286. 27.08 s > 11: std[bcb96dfbba0ab899]::sys::backtrace::__rust_begin_short_backtrace::<test[75d6903177b1d7e9]::run_test::{closure#1}, ()><unknown>
  1287. 27.08 s > at <unknown source file>:<unknown line>
  1288. 27.08 s > 12: <std[bcb96dfbba0ab899]::thread::lifecycle::spawn_unchecked<test[75d6903177b1d7e9]::run_test::{closure#1}, ()>::{closure#1} as core[940e698046960fd5]::ops::function::FnOnce<()>>::call_once::{shim:vtable#0}<unknown>
  1289. 27.08 s > at <unknown source file>:<unknown line>
  1290. 27.08 s > 13: <std[bcb96dfbba0ab899]::sys::thread::unix::Thread>::new::thread_start<unknown>
  1291. 27.08 s > at <unknown source file>:<unknown line>
  1292. 27.08 s > 14: start_thread<unknown>
  1293. 27.08 s > at <unknown source file>:<unknown line>
  1294. 27.08 s > 15: __clone3<unknown>
  1295. 27.08 s > at <unknown source file>:<unknown line>
  1296. 27.08 s >
  1297. 27.08 s > Run with COLORBT_SHOW_HIDDEN=1 environment variable to disable frame filtering.
  1298. 27.08 s > Run with RUST_BACKTRACE=full to include source snippets.
  1299. 27.08 s > Warning: SpanTrace capture is Unsupported.
  1300. 27.08 s > Ensure that you've setup a tracing-error ErrorLayer and the semver versions are compatible
  1301. 27.08 s > Location: crates/gammalooprs/tests/test_renormalization.rs:495
  1302. 27.08 s >
  1303. 27.08 s > ━━━━━━━━━━━━━━━━━━━━━━━━━━━━━━━━━━ BACKTRACE ━━━━━━━━━━━━━━━━━━━━━━━━━━━━━━━━━━━
  1304. 27.08 s > 1: <color_eyre[51793ea62743adbd]::config::PanicHook>::panic_report<unknown>
  1305. 27.08 s > at <unknown source file>:<unknown line>
  1306. 27.08 s > 2: <color_eyre[51793ea62743adbd]::config::PanicHook>::into_panic_hook::{closure#0}<unknown>
  1307. 27.08 s > at <unknown source file>:<unknown line>
  1308. 27.08 s > 3: std[bcb96dfbba0ab899]::panicking::panic_with_hook<unknown>
  1309. 27.08 s > at <unknown source file>:<unknown line>
  1310. 27.08 s > 4: std[bcb96dfbba0ab899]::panicking::panic_handler::{closure#0}<unknown>
  1311. 27.08 s > at <unknown source file>:<unknown line>
  1312. 27.08 s > 5: std[bcb96dfbba0ab899]::sys::backtrace::__rust_end_short_backtrace::<std[bcb96dfbba0ab899]::panicking::panic_handler::{closure#0}, !><unknown>
  1313. 27.08 s > at <unknown source file>:<unknown line>
  1314. 27.08 s > 6: __rustc[6c289b9f9c454d21]::rust_begin_unwind<unknown>
  1315. 27.08 s > at <unknown source file>:<unknown line>
  1316. 27.08 s > 7: core[940e698046960fd5]::panicking::panic_fmt<unknown>
  1317. 27.08 s > at <unknown source file>:<unknown line>
  1318. 27.08 s > 8: core[940e698046960fd5]::result::unwrap_failed<unknown>
  1319. 27.08 s > at <unknown source file>:<unknown line>
  1320. 27.08 s > 9: test_renormalization[879b57236d814a44]::finite_part_ghost_2loop<unknown>
  1321. 27.08 s > at <unknown source file>:<unknown line>
  1322. 27.08 s > 10: <test_renormalization[879b57236d814a44]::finite_part_ghost_2loop::{closure#0} as core[940e698046960fd5]::ops::function::FnOnce<()>>::call_once<unknown>
  1323. 27.08 s > at <unknown source file>:<unknown line>
  1324. 27.08 s > 11: test[75d6903177b1d7e9]::__rust_begin_short_backtrace::<core[940e698046960fd5]::result::Result<(), alloc[2ea6bcb46fca0c42]::string::String>, fn() -> core[940e698046960fd5]::result::Result<(), alloc[2ea6bcb46fca0c42]::string::String>><unknown>
  1325. 27.08 s > at <unknown source file>:<unknown line>
  1326. 27.08 s > 12: test[75d6903177b1d7e9]::run_test::{closure#0}<unknown>
  1327. 27.08 s > at <unknown source file>:<unknown line>
  1328. 27.08 s > 13: std[bcb96dfbba0ab899]::sys::backtrace::__rust_begin_short_backtrace::<test[75d6903177b1d7e9]::run_test::{closure#1}, ()><unknown>
  1329. 27.08 s > at <unknown source file>:<unknown line>
  1330. 27.08 s > 14: <std[bcb96dfbba0ab899]::thread::lifecycle::spawn_unchecked<test[75d6903177b1d7e9]::run_test::{closure#1}, ()>::{closure#1} as core[940e698046960fd5]::ops::function::FnOnce<()>>::call_once::{shim:vtable#0}<unknown>
  1331. 27.08 s > at <unknown source file>:<unknown line>
  1332. 27.08 s > 15: <std[bcb96dfbba0ab899]::sys::thread::unix::Thread>::new::thread_start<unknown>
  1333. 27.08 s > at <unknown source file>:<unknown line>
  1334. 27.08 s > 16: start_thread<unknown>
  1335. 27.08 s > at <unknown source file>:<unknown line>
  1336. 27.08 s > 17: __clone3<unknown>
  1337. 27.08 s > at <unknown source file>:<unknown line>
  1338. 27.08 s >
  1339. 27.08 s > Run with COLORBT_SHOW_HIDDEN=1 environment variable to disable frame filtering.
  1340. 27.08 s > Run with RUST_BACKTRACE=full to include source snippets.
  1341. 27.08 s >
  1342. 27.08 s > error: test run failed
  1343. 27.08 s >
  1344. 27.08 s > ========== nextest test summary ==========
  1345. 27.08 s > report: target/nextest/ci_gammaloop/junit.xml
  1346. 27.08 s > tests: 501, failures: 2, errors: 0
  1347. 27.08 s >
  1348. 27.08 s > 1. gammalooprs::uv::hedge_poset::tests::union_terms_project_factorized_typed_4d_values
  1349. 27.08 s > failure: test failure with exit code 101
  1350. 27.08 s > Error:
  1351. 27.08 s > 0: exact source occurrences for physical edge 1 disagree after on-shell-energy replacement: `-(mUVexp^2+Q(1,cind(1))^2+Q(1,cind(2))^2+Q(1,cind(3))^2)^(1/2)` versus `(mUVexp^2+Q(1,cind(1))^2+Q(1,cind(2))^2+Q(1,cind(3))^2)^(1/2)`; exact 4D term active denominators are [FourDDenominator { source_edge: EdgeIndex(1), momentum: gammalooprs::Q(1), mass_squared: gammalooprs::mUVexp^2, full_expr: -gammalooprs::mUV^2+spenso::dot(gammalooprs::Q(1,spenso::mink(gammalooprs::dim)),gammalooprs::Q(1,spenso::mink(gammalooprs::dim))) }, FourDDenominator { source_edge: EdgeIndex(1), momentum: gammalooprs::Q(1), mass_squared: gammalooprs::mUVexp^2, full_expr: -gammalooprs::mUV^2+spenso::dot(gammalooprs::Q(1,spenso::mink(gammalooprs::dim)),gammalooprs::Q(1,spenso::mink(gammalooprs::dim))) }, FourDDenominator { source_edge: EdgeIndex(3), momentum: gammalooprs::Q(3), mass_squared: gammalooprs::mUVexp^2, full_expr: -gammalooprs::mUV^2+spenso::dot(gammalooprs::Q(3,spenso::mink(gammalooprs::dim)),gammalooprs::Q(3,spenso::mink(gammalooprs::dim))) }, FourDDenominator { source_edge: EdgeIndex(3), momentum: gammalooprs::Q(3), mass_squared: gammalooprs::mUVexp^2, full_expr: -gammalooprs::mUV^2+spenso::dot(gammalooprs::Q(3,spenso::mink(gammalooprs::dim)),gammalooprs::Q(3,spenso::mink(gammalooprs::dim))) }, FourDDenominator { source_edge: EdgeIndex(0), momentum: gammalooprs::Q(0), mass_squared: UFO::mass_scalar_1^2, full_expr: -UFO::mass_scalar_1^2+spenso::dot(gammalooprs::Q(0,spenso::mink(gammalooprs::dim)),gammalooprs::Q(0,spenso::mink(gammalooprs::dim))) }]
  1352. 27.08 s >
  1353. 27.08 s > Location:
  1354. 27.08 s > crates/gammalooprs/src/uv/approx/local_3d.rs:641
  1355. 27.08 s >
  1356. 27.08 s > ━━━━━━━━━━━━━━━━━━━━━━━━━━━━━━━━━━ BACKTRACE ━━━━━━━━━━━━━━━━━━━━━━━━━━━━━━━━━━━
  1357. 27.08 s > 1: <color_eyre[51793ea62743adbd]::config::EyreHook>::into_eyre_hook::{closure#0}<unknown>
  1358. 27.08 s > at <unknown source file>:<unknown line>
  1359. 27.08 s > 2: eyre[cb2fd339c0c40fca]::capture_handler<unknown>
  1360. 27.08 s > at <unknown source file>:<unknown line>
  1361. 27.08 s > 3: <eyre[cb2fd339c0c40fca]::Report>::from_adhoc::<alloc[2ea6bcb46fca0c42]::string::String><unknown>
  1362. 27.08 s > at <unknown source file>:<unknown line>
  1363. 27.08 s > 4: <gammalooprs[6dc202c8af9e2ddf]::uv::approx::local_3d::Localizer>::project_4d<unknown>
  1364. 27.08 s > at <unknown source file>:<unknown line>
  1365. 27.08 s > 5: gammalooprs[6dc202c8af9e2ddf]::uv::hedge_poset::tests::union_terms_project_factorized_typed_4d_values<unknown>
  1366. 27.08 s > at <unknown source file>:<unknown line>
  1367. 27.08 s > 6: <gammalooprs[6dc202c8af9e2ddf]::uv::hedge_poset::tests::union_terms_project_factorized_typed_4d_values::{closure#0} as core[940e698046960fd5]::ops::function::FnOnce<()>>::call_once<unknown>
  1368. 27.08 s > at <unknown source file>:<unknown line>
  1369. 27.08 s > 7: test[75d6903177b1d7e9]::__rust_begin_short_backtrace::<core[940e698046960fd5]::result::Result<(), alloc[2ea6bcb46fca0c42]::string::String>, fn() -> core[940e698046960fd5]::result::Result<(), alloc[2ea6bcb46fca0c42]::string::String>><unknown>
  1370. 27.08 s > at <unknown source file>:<unknown line>
  1371. 27.08 s > 8: test[75d6903177b1d7e9]::run_test::{closure#0}<unknown>
  1372. 27.08 s > at <unknown source file>:<unknown line>
  1373. 27.08 s > 9: std[bcb96dfbba0ab899]::sys::backtrace::__rust_begin_short_backtrace::<test[75d6903177b1d7e9]::run_test::{closure#1}, ()><unknown>
  1374. 27.08 s > at <unknown source file>:<unknown line>
  1375. 27.08 s > 10: <std[bcb96dfbba0ab899]::thread::lifecycle::spawn_unchecked<test[75d6903177b1d7e9]::run_test::{closure#1}, ()>::{closure#1} as core[940e698046960fd5]::ops::function::FnOnce<()>>::call_once::{shim:vtable#0}<unknown>
  1376. 27.08 s > at <unknown source file>:<unknown line>
  1377. 27.08 s > 11: <std[bcb96dfbba0ab899]::sys::thread::unix::Thread>::new::thread_start<unknown>
  1378. 27.08 s > at <unknown source file>:<unknown line>
  1379. 27.08 s > 12: start_thread<unknown>
  1380. 27.08 s > at <unknown source file>:<unknown line>
  1381. 27.08 s > 13: __clone3<unknown>
  1382. 27.08 s > at <unknown source file>:<unknown line>
  1383. 27.08 s >
  1384. 27.08 s > Run with COLORBT_SHOW_HIDDEN=1 environment variable to disable frame filtering.
  1385. 27.08 s > Run with RUST_BACKTRACE=full to include source snippets.
  1386. 27.08 s > system-out
  1387. 27.08 s > running 1 test
  1388. 27.08 s > test uv::hedge_poset::tests::union_terms_project_factorized_typed_4d_values ... FAILED
  1389. 27.08 s >
  1390. 27.08 s > failures:
  1391. 27.08 s >
  1392. 27.08 s > failures:
  1393. 27.08 s > uv::hedge_poset::tests::union_terms_project_factorized_typed_4d_values
  1394. 27.08 s >
  1395. 27.08 s > test result: FAILED. 0 passed; 1 failed; 0 ignored; 0 measured; 551 filtered out; finished in 0.14s
  1396. 27.08 s > system-err
  1397. 27.08 s > Error:
  1398. 27.08 s > 0: exact source occurrences for physical edge 1 disagree after on-shell-energy replacement: `-(mUVexp^2+Q(1,cind(1))^2+Q(1,cind(2))^2+Q(1,cind(3))^2)^(1/2)` versus `(mUVexp^2+Q(1,cind(1))^2+Q(1,cind(2))^2+Q(1,cind(3))^2)^(1/2)`; exact 4D term active denominators are [FourDDenominator { source_edge: EdgeIndex(1), momentum: gammalooprs::Q(1), mass_squared: gammalooprs::mUVexp^2, full_expr: -gammalooprs::mUV^2+spenso::dot(gammalooprs::Q(1,spenso::mink(gammalooprs::dim)),gammalooprs::Q(1,spenso::mink(gammalooprs::dim))) }, FourDDenominator { source_edge: EdgeIndex(1), momentum: gammalooprs::Q(1), mass_squared: gammalooprs::mUVexp^2, full_expr: -gammalooprs::mUV^2+spenso::dot(gammalooprs::Q(1,spenso::mink(gammalooprs::dim)),gammalooprs::Q(1,spenso::mink(gammalooprs::dim))) }, FourDDenominator { source_edge: EdgeIndex(3), momentum: gammalooprs::Q(3), mass_squared: gammalooprs::mUVexp^2, full_expr: -gammalooprs::mUV^2+spenso::dot(gammalooprs::Q(3,spenso::mink(gammalooprs::dim)),gammalooprs::Q(3,spenso::mink(gammalooprs::dim))) }, FourDDenominator { source_edge: EdgeIndex(3), momentum: gammalooprs::Q(3), mass_squared: gammalooprs::mUVexp^2, full_expr: -gammalooprs::mUV^2+spenso::dot(gammalooprs::Q(3,spenso::mink(gammalooprs::dim)),gammalooprs::Q(3,spenso::mink(gammalooprs::dim))) }, FourDDenominator { source_edge: EdgeIndex(0), momentum: gammalooprs::Q(0), mass_squared: UFO::mass_scalar_1^2, full_expr: -UFO::mass_scalar_1^2+spenso::dot(gammalooprs::Q(0,spenso::mink(gammalooprs::dim)),gammalooprs::Q(0,spenso::mink(gammalooprs::dim))) }]
  1399. 27.08 s >
  1400. 27.08 s > Location:
  1401. 27.08 s > crates/gammalooprs/src/uv/approx/local_3d.rs:641
  1402. 27.08 s >
  1403. 27.08 s > ━━━━━━━━━━━━━━━━━━━━━━━━━━━━━━━━━━ BACKTRACE ━━━━━━━━━━━━━━━━━━━━━━━━━━━━━━━━━━━
  1404. 27.08 s > 1: <color_eyre[51793ea62743adbd]::config::EyreHook>::into_eyre_hook::{closure#0}<unknown>
  1405. 27.08 s > at <unknown source file>:<unknown line>
  1406. 27.08 s > 2: eyre[cb2fd339c0c40fca]::capture_handler<unknown>
  1407. 27.08 s > at <unknown source file>:<unknown line>
  1408. 27.08 s > 3: <eyre[cb2fd339c0c40fca]::Report>::from_adhoc::<alloc[2ea6bcb46fca0c42]::string::String><unknown>
  1409. 27.08 s > at <unknown source file>:<unknown line>
  1410. 27.08 s > 4: <gammalooprs[6dc202c8af9e2ddf]::uv::approx::local_3d::Localizer>::project_4d<unknown>
  1411. 27.08 s > at <unknown source file>:<unknown line>
  1412. 27.08 s > 5: gammalooprs[6dc202c8af9e2ddf]::uv::hedge_poset::tests::union_terms_project_factorized_typed_4d_values<unknown>
  1413. 27.08 s > at <unknown source file>:<unknown line>
  1414. 27.08 s > 6: <gammalooprs[6dc202c8af9e2ddf]::uv::hedge_poset::tests::union_terms_project_factorized_typed_4d_values::{closure#0} as core[940e698046960fd5]::ops::function::FnOnce<()>>::call_once<unknown>
  1415. 27.08 s > at <unknown source file>:<unknown line>
  1416. 27.08 s > 7: test[75d6903177b1d7e9]::__rust_begin_short_backtrace::<core[940e698046960fd5]::result::Result<(), alloc[2ea6bcb46fca0c42]::string::String>, fn() -> core[940e698046960fd5]::result::Result<(), alloc[2ea6bcb46fca0c42]::string::String>><unknown>
  1417. 27.08 s > at <unknown source file>:<unknown line>
  1418. 27.08 s > 8: test[75d6903177b1d7e9]::run_test::{closure#0}<unknown>
  1419. 27.08 s > at <unknown source file>:<unknown line>
  1420. 27.08 s > 9: std[bcb96dfbba0ab899]::sys::backtrace::__rust_begin_short_backtrace::<test[75d6903177b1d7e9]::run_test::{closure#1}, ()><unknown>
  1421. 27.08 s > at <unknown source file>:<unknown line>
  1422. 27.08 s > 10: <std[bcb96dfbba0ab899]::thread::lifecycle::spawn_unchecked<test[75d6903177b1d7e9]::run_test::{closure#1}, ()>::{closure#1} as core[940e698046960fd5]::ops::function::FnOnce<()>>::call_once::{shim:vtable#0}<unknown>
  1423. 27.08 s > at <unknown source file>:<unknown line>
  1424. 27.08 s > 11: <std[bcb96dfbba0ab899]::sys::thread::unix::Thread>::new::thread_start<unknown>
  1425. 27.08 s > at <unknown source file>:<unknown line>
  1426. 27.08 s > 12: start_thread<unknown>
  1427. 27.08 s > at <unknown source file>:<unknown line>
  1428. 27.08 s > 13: __clone3<unknown>
  1429. 27.08 s > at <unknown source file>:<unknown line>
  1430. 27.08 s >
  1431. 27.08 s > Run with COLORBT_SHOW_HIDDEN=1 environment variable to disable frame filtering.
  1432. 27.08 s > Run with RUST_BACKTRACE=full to include source snippets.
  1433. 27.08 s >
  1434. 27.08 s > 2. gammalooprs::test_renormalization::finite_part_ghost_2loop
  1435. 27.08 s > failure: test failure with exit code 101
  1436. 27.08 s > system-out
  1437. 27.08 s > running 1 test
  1438. 27.08 s > test finite_part_ghost_2loop ... FAILED
  1439. 27.08 s >
  1440. 27.08 s > failures:
  1441. 27.08 s >
  1442. 27.08 s > failures:
  1443. 27.08 s > finite_part_ghost_2loop
  1444. 27.08 s >
  1445. 27.08 s > test result: FAILED. 0 passed; 1 failed; 0 ignored; 0 measured; 5 filtered out; finished in 5.25s
  1446. 27.08 s > system-err
  1447. 27.08 s > [16:29:41.927] @gammalooprs::processes::amplitude ERROR :
  1448. 27.08 s > field value
  1449. 27.08 s > error generalized CFF expression generation failed for graph `d5` with source-edge numerator energy-degree bounds Some([(1, 1), (2, 1), (3, 1), (5, 2), (6, 2)]): energy-degree bounds do not certify vanishing residues at infinity under the conservative cap check: EnergyDivergenceReport { edge_degree_bounds: [1, 1, 1, 2, 2], loops: [EnergyDirectionReport { loop_id: Some(0), zero_edges: [], active_edges: [0, 1, 2, 4], nullity: None, numerator_degree_bound: 5, denominator_degree: 8, divergence_degree: -3, convergent: true }, EnergyDirectionReport { loop_id: Some(1), zero_edges: [], active_edges: [3, 4], nullity: None, numerator_degree_bound: 4, denominator_degree: 4, divergence_degree: 0, convergent: false }], directions: [EnergyDirectionReport { loop_id: None, zero_edges: [0, 1, 2], active_edges: [3, 4], nullity: Some(1), numerator_degree_bound: 4, denominator_degree: 4, divergence_degree: 0, convergent: false }, EnergyDirectionReport { loop_id: None, zero_edges: [], active_edges: [0, 1, 2, 3, 4], nullity: Some(2), numerator_degree_bound: 7, denominator_degree: 10, divergence_degree: -3, convergent: true }, EnergyDirectionReport { loop_id: None, zero_edges: [3], active_edges: [0, 1, 2, 4], nullity: Some(1), numerator_degree_bound: 5, denominator_degree: 8, divergence_degree: -3, convergent: true }, EnergyDirectionReport { loop_id: None, zero_edges: [4], active_edges: [0, 1, 2, 3], nullity: Some(1), numerator_degree_bound: 5, denominator_degree: 8, divergence_degree: -3, convergent: true }], coordinate_convergent: false, directional_convergent: false, convergent: false }
  1450. 27.08 s > 3D source has 2 loop names ["e1", "e5"], 5 internal edges [edge 0: 0 -> 1, loops=[1, 0], externals=[0, 0]; edge 1: 0 -> 2, loops=[-1, 0], externals=[1, 0]; edge 2: 1 -> 3, loops=[1, 0], externals=[-1, 0]; edge 3: 2 -> 3, loops=[0, 1], externals=[0, 0]; edge 4: 2 -> 3, loops=[-1, -1], externals=[1, 0]]
  1451. 27.08 s > at crates/gammalooprs/src/processes/amplitude.rs:825
  1452. 27.08 s > The application panicked (crashed).
  1453. 27.08 s > Message: called `Result::unwrap()` on an `Err` value:
  1454. 27.08 s > 0: generalized CFF expression generation failed for graph `d5` with source-edge numerator energy-degree bounds Some([(1, 1), (2, 1), (3, 1), (5, 2), (6, 2)]): energy-degree bounds do not certify vanishing residues at infinity under the conservative cap check: EnergyDivergenceReport { edge_degree_bounds: [1, 1, 1, 2, 2], loops: [EnergyDirectionReport { loop_id: Some(0), zero_edges: [], active_edges: [0, 1, 2, 4], nullity: None, numerator_degree_bound: 5, denominator_degree: 8, divergence_degree: -3, convergent: true }, EnergyDirectionReport { loop_id: Some(1), zero_edges: [], active_edges: [3, 4], nullity: None, numerator_degree_bound: 4, denominator_degree: 4, divergence_degree: 0, convergent: false }], directions: [EnergyDirectionReport { loop_id: None, zero_edges: [0, 1, 2], active_edges: [3, 4], nullity: Some(1), numerator_degree_bound: 4, denominator_degree: 4, divergence_degree: 0, convergent: false }, EnergyDirectionReport { loop_id: None, zero_edges: [], active_edges: [0, 1, 2, 3, 4], nullity: Some(2), numerator_degree_bound: 7, denominator_degree: 10, divergence_degree: -3, convergent: true }, EnergyDirectionReport { loop_id: None, zero_edges: [3], active_edges: [0, 1, 2, 4], nullity: Some(1), numerator_degree_bound: 5, denominator_degree: 8, divergence_degree: -3, convergent: true }, EnergyDirectionReport { loop_id: None, zero_edges: [4], active_edges: [0, 1, 2, 3], nullity: Some(1), numerator_degree_bound: 5, denominator_degree: 8, divergence_degree: -3, convergent: true }], coordinate_convergent: false, directional_convergent: false, convergent: false }
  1455. 27.08 s > 3D source has 2 loop names ["e1", "e5"], 5 internal edges [edge 0: 0 -> 1, loops=[1, 0], externals=[0, 0]; edge 1: 0 -> 2, loops=[-1, 0], externals=[1, 0]; edge 2: 1 -> 3, loops=[1, 0], externals=[-1, 0]; edge 3: 2 -> 3, loops=[0, 1], externals=[0, 0]; edge 4: 2 -> 3, loops=[-1, -1], externals=[1, 0]]
  1456. 27.08 s >
  1457. 27.08 s > Location:
  1458. 27.08 s > crates/gammalooprs/src/cff/generation.rs:226
  1459. 27.08 s >
  1460. 27.08 s > ━━━━━━━━━━━━━━━━━━━━━━━━━━━━━━━━━━ BACKTRACE ━━━━━━━━━━━━━━━━━━━━━━━━━━━━━━━━━━━
  1461. 27.08 s > 1: <color_eyre[51793ea62743adbd]::config::EyreHook>::into_eyre_hook::{closure#0}<unknown>
  1462. 27.08 s > at <unknown source file>:<unknown line>
  1463. 27.08 s > 2: eyre[cb2fd339c0c40fca]::capture_handler<unknown>
  1464. 27.08 s > at <unknown source file>:<unknown line>
  1465. 27.08 s > 3: <eyre[cb2fd339c0c40fca]::Report>::from_adhoc::<alloc[2ea6bcb46fca0c42]::string::String><unknown>
  1466. 27.08 s > at <unknown source file>:<unknown line>
  1467. 27.08 s > 4: <gammalooprs[1d0b14476f7eb2f8]::graph::Graph>::generate_3d_expression_for_integrand<unknown>
  1468. 27.08 s > at <unknown source file>:<unknown line>
  1469. 27.08 s > 5: <gammalooprs[1d0b14476f7eb2f8]::processes::amplitude::AmplitudeGraph>::generate_cff<unknown>
  1470. 27.08 s > at <unknown source file>:<unknown line>
  1471. 27.08 s > 6: <gammalooprs[1d0b14476f7eb2f8]::processes::amplitude::AmplitudeGraph>::renormalization_part<unknown>
  1472. 27.08 s > at <unknown source file>:<unknown line>
  1473. 27.08 s > 7: test_renormalization[879b57236d814a44]::finite_part_ghost_2loop<unknown>
  1474. 27.08 s > at <unknown source file>:<unknown line>
  1475. 27.08 s > 8: <test_renormalization[879b57236d814a44]::finite_part_ghost_2loop::{closure#0} as core[940e698046960fd5]::ops::function::FnOnce<()>>::call_once<unknown>
  1476. 27.08 s > at <unknown source file>:<unknown line>
  1477. 27.08 s > 9: test[75d6903177b1d7e9]::__rust_begin_short_backtrace::<core[940e698046960fd5]::result::Result<(), alloc[2ea6bcb46fca0c42]::string::String>, fn() -> core[940e698046960fd5]::result::Result<(), alloc[2ea6bcb46fca0c42]::string::String>><unknown>
  1478. 27.08 s > at <unknown source file>:<unknown line>
  1479. 27.08 s > 10: test[75d6903177b1d7e9]::run_test::{closure#0}<unknown>
  1480. 27.08 s > at <unknown source file>:<unknown line>
  1481. 27.08 s > 11: std[bcb96dfbba0ab899]::sys::backtrace::__rust_begin_short_backtrace::<test[75d6903177b1d7e9]::run_test::{closure#1}, ()><unknown>
  1482. 27.08 s > at <unknown source file>:<unknown line>
  1483. 27.08 s > 12: <std[bcb96dfbba0ab899]::thread::lifecycle::spawn_unchecked<test[75d6903177b1d7e9]::run_test::{closure#1}, ()>::{closure#1} as core[940e698046960fd5]::ops::function::FnOnce<()>>::call_once::{shim:vtable#0}<unknown>
  1484. 27.08 s > at <unknown source file>:<unknown line>
  1485. 27.08 s > 13: <std[bcb96dfbba0ab899]::sys::thread::unix::Thread>::new::thread_start<unknown>
  1486. 27.08 s > at <unknown source file>:<unknown line>
  1487. 27.08 s > 14: start_thread<unknown>
  1488. 27.08 s > at <unknown source file>:<unknown line>
  1489. 27.08 s > 15: __clone3<unknown>
  1490. 27.08 s > at <unknown source file>:<unknown line>
  1491. 27.08 s >
  1492. 27.08 s > Run with COLORBT_SHOW_HIDDEN=1 environment variable to disable frame filtering.
  1493. 27.08 s > Run with RUST_BACKTRACE=full to include source snippets.
  1494. 27.08 s > Warning: SpanTrace capture is Unsupported.
  1495. 27.08 s > Ensure that you've setup a tracing-error ErrorLayer and the semver versions are compatible
  1496. 27.08 s > Location: crates/gammalooprs/tests/test_renormalization.rs:495
  1497. 27.08 s >
  1498. 27.08 s > ━━━━━━━━━━━━━━━━━━━━━━━━━━━━━━━━━━ BACKTRACE ━━━━━━━━━━━━━━━━━━━━━━━━━━━━━━━━━━━
  1499. 27.08 s > 1: <color_eyre[51793ea62743adbd]::config::PanicHook>::panic_report<unknown>
  1500. 27.08 s > at <unknown source file>:<unknown line>
  1501. 27.08 s > 2: <color_eyre[51793ea62743adbd]::config::PanicHook>::into_panic_hook::{closure#0}<unknown>
  1502. 27.08 s > at <unknown source file>:<unknown line>
  1503. 27.08 s > 3: std[bcb96dfbba0ab899]::panicking::panic_with_hook<unknown>
  1504. 27.08 s > at <unknown source file>:<unknown line>
  1505. 27.08 s > 4: std[bcb96dfbba0ab899]::panicking::panic_handler::{closure#0}<unknown>
  1506. 27.08 s > at <unknown source file>:<unknown line>
  1507. 27.08 s > 5: std[bcb96dfbba0ab899]::sys::backtrace::__rust_end_short_backtrace::<std[bcb96dfbba0ab899]::panicking::panic_handler::{closure#0}, !><unknown>
  1508. 27.08 s > at <unknown source file>:<unknown line>
  1509. 27.08 s > 6: __rustc[6c289b9f9c454d21]::rust_begin_unwind<unknown>
  1510. 27.08 s > at <unknown source file>:<unknown line>
  1511. 27.08 s > 7: core[940e698046960fd5]::panicking::panic_fmt<unknown>
  1512. 27.08 s > at <unknown source file>:<unknown line>
  1513. 27.08 s > 8: core[940e698046960fd5]::result::unwrap_failed<unknown>
  1514. 27.08 s > at <unknown source file>:<unknown line>
  1515. 27.08 s > 9: test_renormalization[879b57236d814a44]::finite_part_ghost_2loop<unknown>
  1516. 27.08 s > at <unknown source file>:<unknown line>
  1517. 27.08 s > 10: <test_renormalization[879b57236d814a44]::finite_part_ghost_2loop::{closure#0} as core[940e698046960fd5]::ops::function::FnOnce<()>>::call_once<unknown>
  1518. 27.08 s > at <unknown source file>:<unknown line>
  1519. 27.08 s > 11: test[75d6903177b1d7e9]::__rust_begin_short_backtrace::<core[940e698046960fd5]::result::Result<(), alloc[2ea6bcb46fca0c42]::string::String>, fn() -> core[940e698046960fd5]::result::Result<(), alloc[2ea6bcb46fca0c42]::string::String>><unknown>
  1520. 27.08 s > at <unknown source file>:<unknown line>
  1521. 27.08 s > 12: test[75d6903177b1d7e9]::run_test::{closure#0}<unknown>
  1522. 27.08 s > at <unknown source file>:<unknown line>
  1523. 27.08 s > 13: std[bcb96dfbba0ab899]::sys::backtrace::__rust_begin_short_backtrace::<test[75d6903177b1d7e9]::run_test::{closure#1}, ()><unknown>
  1524. 27.08 s > at <unknown source file>:<unknown line>
  1525. 27.08 s > 14: <std[bcb96dfbba0ab899]::thread::lifecycle::spawn_unchecked<test[75d6903177b1d7e9]::run_test::{closure#1}, ()>::{closure#1} as core[940e698046960fd5]::ops::function::FnOnce<()>>::call_once::{shim:vtable#0}<unknown>
  1526. 27.08 s > at <unknown source file>:<unknown line>
  1527. 27.08 s > 15: <std[bcb96dfbba0ab899]::sys::thread::unix::Thread>::new::thread_start<unknown>
  1528. 27.08 s > at <unknown source file>:<unknown line>
  1529. 27.08 s > 16: start_thread<unknown>
  1530. 27.08 s > at <unknown source file>:<unknown line>
  1531. 27.08 s > 17: __clone3<unknown>
  1532. 27.08 s > at <unknown source file>:<unknown line>
  1533. 27.08 s >
  1534. 27.08 s > Run with COLORBT_SHOW_HIDDEN=1 environment variable to disable frame filtering.
  1535. 27.08 s > Run with RUST_BACKTRACE=full to include source snippets.
  1536. 27.08 s > =========================================
  1537. 27.08 s > Extracting 1 binary and 1 linked path to /build/nextest-archive-nOet3e
  1538. 27.08 s > Extracted 7 files to /build/nextest-archive-nOet3e in 0.07s
  1539. 27.08 s > ------------
  1540. 27.08 s > Nextest run ID 14fb3157-4f99-45e6-9b9b-da4b70766aea with nextest profile: ci_gammaloop
  1541. 27.08 s > Starting 53 tests across 1 binary
  1542. 27.08 s > FAIL [ 0.009s] (17/53) three-dimensional-reps generation::cff_tests::causal_repeated_generation_handles_energy_dependent_bubble_source
  1543. 27.08 s > stdout ---
  1544. 27.08 s >
  1545. 27.08 s > running 1 test
  1546. 27.08 s > test generation::cff_tests::causal_repeated_generation_handles_energy_dependent_bubble_source ... FAILED
  1547. 27.08 s >
  1548. 27.08 s > failures:
  1549. 27.08 s >
  1550. 27.08 s > failures:
  1551. 27.08 s > generation::cff_tests::causal_repeated_generation_handles_energy_dependent_bubble_source
  1552. 27.08 s >
  1553. 27.08 s > test result: FAILED. 0 passed; 1 failed; 0 ignored; 0 measured; 52 filtered out; finished in 0.00s
  1554. 27.08 s >
  1555. 27.08 s > stderr ---
  1556. 27.08 s >
  1557. 27.08 s > thread 'generation::cff_tests::causal_repeated_generation_handles_energy_dependent_bubble_source' (3117) panicked at crates/three-dimensional-reps/src/generation.rs:5806:9:
  1558. 27.08 s > assertion `left == right` failed
  1559. 27.08 s > left: GlobalSourceProduct
  1560. 27.08 s > right: VariantLocal
  1561. 27.08 s > stack backtrace:
  1562. 27.08 s > 0: __rustc::rust_begin_unwind
  1563. 27.08 s > 1: core::panicking::panic_fmt
  1564. 27.08 s > 2: core::panicking::assert_failed_inner
  1565. 27.08 s > 3: core::panicking::assert_failed::<three_dimensional_reps::generation::CffEnergyFactorOwnership, three_dimensional_reps::generation::CffEnergyFactorOwnership>
  1566. 27.08 s > 4: three_dimensional_reps::generation::cff_tests::causal_repeated_generation_handles_energy_dependent_bubble_source
  1567. 27.08 s > 5: <three_dimensional_reps::generation::cff_tests::causal_repeated_generation_handles_energy_dependent_bubble_source::{closure#0} as core::ops::function::FnOnce<()>>::call_once
  1568. 27.08 s > note: Some details are omitted, run with `RUST_BACKTRACE=full` for a verbose backtrace.
  1569. 27.08 s >
  1570. 27.08 s > FAIL [ 0.009s] (28/53) three-dimensional-reps generation::cff_tests::disconnected_mixed_energy_factor_ownership_keeps_both_component_factors
  1571. 27.08 s > stdout ---
  1572. 27.08 s >
  1573. 27.08 s > running 1 test
  1574. 27.08 s > test generation::cff_tests::disconnected_mixed_energy_factor_ownership_keeps_both_component_factors ... FAILED
  1575. 27.08 s >
  1576. 27.08 s > failures:
  1577. 27.08 s >
  1578. 27.08 s > failures:
  1579. 27.08 s > generation::cff_tests::disconnected_mixed_energy_factor_ownership_keeps_both_component_factors
  1580. 27.08 s >
  1581. 27.08 s > test result: FAILED. 0 passed; 1 failed; 0 ignored; 0 measured; 52 filtered out; finished in 0.00s
  1582. 27.08 s >
  1583. 27.08 s > stderr ---
  1584. 27.08 s >
  1585. 27.08 s > thread 'generation::cff_tests::disconnected_mixed_energy_factor_ownership_keeps_both_component_factors' (3152) panicked at crates/three-dimensional-reps/src/generation.rs:5726:9:
  1586. 27.08 s > assertion `left == right` failed
  1587. 27.08 s > left: [GlobalSourceProduct, GlobalSourceProduct]
  1588. 27.08 s > right: [VariantLocal, GlobalSourceProduct]
  1589. 27.08 s > stack backtrace:
  1590. 27.08 s > 0: __rustc::rust_begin_unwind
  1591. 27.08 s > 1: core::panicking::panic_fmt
  1592. 27.08 s > 2: core::panicking::assert_failed_inner
  1593. 27.08 s > 3: core::panicking::assert_failed::<alloc::vec::Vec<three_dimensional_reps::generation::CffEnergyFactorOwnership>, alloc::vec::Vec<three_dimensional_reps::generation::CffEnergyFactorOwnership>>
  1594. 27.08 s > 4: three_dimensional_reps::generation::cff_tests::disconnected_mixed_energy_factor_ownership_keeps_both_component_factors
  1595. 27.08 s > 5: <three_dimensional_reps::generation::cff_tests::disconnected_mixed_energy_factor_ownership_keeps_both_component_factors::{closure#0} as core::ops::function::FnOnce<()>>::call_once
  1596. 27.08 s > note: Some details are omitted, run with `RUST_BACKTRACE=full` for a verbose backtrace.
  1597. 27.08 s >
  1598. 27.08 s > FAIL [ 0.040s] (41/53) three-dimensional-reps generation::cff_tests::cff_generation_builds_multiloop_repeated_high_power_known_factor_completion
  1599. 27.08 s > stdout ---
  1600. 27.08 s >
  1601. 27.08 s > running 1 test
  1602. 27.08 s > test generation::cff_tests::cff_generation_builds_multiloop_repeated_high_power_known_factor_completion ... FAILED
  1603. 27.08 s >
  1604. 27.08 s > failures:
  1605. 27.08 s >
  1606. 27.08 s > failures:
  1607. 27.08 s > generation::cff_tests::cff_generation_builds_multiloop_repeated_high_power_known_factor_completion
  1608. 27.08 s >
  1609. 27.08 s > test result: FAILED. 0 passed; 1 failed; 0 ignored; 0 measured; 52 filtered out; finished in 0.03s
  1610. 27.08 s >
  1611. 27.08 s > stderr ---
  1612. 27.08 s >
  1613. 27.08 s > thread 'generation::cff_tests::cff_generation_builds_multiloop_repeated_high_power_known_factor_completion' (3119) panicked at crates/three-dimensional-reps/src/generation.rs:5865:9:
  1614. 27.08 s > assertion failed: variants.iter().any(|variant|
  1615. 27.08 s > {
  1616. 27.08 s > variant.origin.as_deref().is_some_and(|origin|
  1617. 27.08 s > {
  1618. 27.08 s > origin.starts_with("bounded_degree_quadratic_recursive_remainder")
  1619. 27.08 s > })
  1620. 27.08 s > })
  1621. 27.08 s > stack backtrace:
  1622. 27.08 s > 0: __rustc::rust_begin_unwind
  1623. 27.08 s > 1: core::panicking::panic_fmt
  1624. 27.08 s > 2: core::panicking::panic
  1625. 27.08 s > 3: three_dimensional_reps::generation::cff_tests::cff_generation_builds_multiloop_repeated_high_power_known_factor_completion
  1626. 27.08 s > 4: <three_dimensional_reps::generation::cff_tests::cff_generation_builds_multiloop_repeated_high_power_known_factor_completion::{closure#0} as core::ops::function::FnOnce<()>>::call_once
  1627. 27.08 s > note: Some details are omitted, run with `RUST_BACKTRACE=full` for a verbose backtrace.
  1628. 27.08 s >
  1629. 27.08 s > FAIL [ 0.097s] (48/53) three-dimensional-reps generation::cff_tests::cff_generation_builds_one_loop_high_power_with_repeated_spectators
  1630. 27.08 s > stdout ---
  1631. 27.08 s >
  1632. 27.08 s > running 1 test
  1633. 27.08 s > test generation::cff_tests::cff_generation_builds_one_loop_high_power_with_repeated_spectators ... FAILED
  1634. 27.08 s >
  1635. 27.08 s > failures:
  1636. 27.08 s >
  1637. 27.08 s > failures:
  1638. 27.08 s > generation::cff_tests::cff_generation_builds_one_loop_high_power_with_repeated_spectators
  1639. 27.08 s >
  1640. 27.08 s > test result: FAILED. 0 passed; 1 failed; 0 ignored; 0 measured; 52 filtered out; finished in 0.09s
  1641. 27.08 s >
  1642. 27.08 s > stderr ---
  1643. 27.08 s >
  1644. 27.08 s > thread 'generation::cff_tests::cff_generation_builds_one_loop_high_power_with_repeated_spectators' (3123) panicked at crates/three-dimensional-reps/src/generation.rs:6288:9:
  1645. 27.08 s > assertion failed: variants.iter().any(|variant|
  1646. 27.08 s > {
  1647. 27.08 s > variant.origin.as_deref().is_some_and(|origin|
  1648. 27.08 s > {
  1649. 27.08 s > origin.starts_with("bounded_degree_quadratic_recursive_remainder")
  1650. 27.08 s > })
  1651. 27.08 s > })
  1652. 27.08 s > stack backtrace:
  1653. 27.08 s > 0: __rustc::rust_begin_unwind
  1654. 27.08 s > 1: core::panicking::panic_fmt
  1655. 27.08 s > 2: core::panicking::panic
  1656. 27.08 s > 3: three_dimensional_reps::generation::cff_tests::cff_generation_builds_one_loop_high_power_with_repeated_spectators
  1657. 27.08 s > 4: <three_dimensional_reps::generation::cff_tests::cff_generation_builds_one_loop_high_power_with_repeated_spectators::{closure#0} as core::ops::function::FnOnce<()>>::call_once
  1658. 27.08 s > note: Some details are omitted, run with `RUST_BACKTRACE=full` for a verbose backtrace.
  1659. 27.08 s >
  1660. 27.08 s > ------------
  1661. 27.08 s > Summary [ 0.531s] 53 tests run: 49 passed, 4 failed, 0 skipped
  1662. 27.08 s > FAIL [ 0.009s] (17/53) three-dimensional-reps generation::cff_tests::causal_repeated_generation_handles_energy_dependent_bubble_source
  1663. 27.08 s > stdout ---
  1664. 27.08 s >
  1665. 27.08 s > running 1 test
  1666. 27.08 s > test generation::cff_tests::causal_repeated_generation_handles_energy_dependent_bubble_source ... FAILED
  1667. 27.08 s >
  1668. 27.08 s > failures:
  1669. 27.08 s >
  1670. 27.08 s > failures:
  1671. 27.08 s > generation::cff_tests::causal_repeated_generation_handles_energy_dependent_bubble_source
  1672. 27.08 s >
  1673. 27.08 s > test result: FAILED. 0 passed; 1 failed; 0 ignored; 0 measured; 52 filtered out; finished in 0.00s
  1674. 27.08 s >
  1675. 27.08 s > stderr ---
  1676. 27.08 s >
  1677. 27.08 s > thread 'generation::cff_tests::causal_repeated_generation_handles_energy_dependent_bubble_source' (3117) panicked at crates/three-dimensional-reps/src/generation.rs:5806:9:
  1678. 27.08 s > assertion `left == right` failed
  1679. 27.08 s > left: GlobalSourceProduct
  1680. 27.08 s > right: VariantLocal
  1681. 27.08 s > stack backtrace:
  1682. 27.08 s > 0: __rustc::rust_begin_unwind
  1683. 27.08 s > 1: core::panicking::panic_fmt
  1684. 27.08 s > 2: core::panicking::assert_failed_inner
  1685. 27.08 s > 3: core::panicking::assert_failed::<three_dimensional_reps::generation::CffEnergyFactorOwnership, three_dimensional_reps::generation::CffEnergyFactorOwnership>
  1686. 27.08 s > 4: three_dimensional_reps::generation::cff_tests::causal_repeated_generation_handles_energy_dependent_bubble_source
  1687. 27.08 s > 5: <three_dimensional_reps::generation::cff_tests::causal_repeated_generation_handles_energy_dependent_bubble_source::{closure#0} as core::ops::function::FnOnce<()>>::call_once
  1688. 27.08 s > note: Some details are omitted, run with `RUST_BACKTRACE=full` for a verbose backtrace.
  1689. 27.08 s >
  1690. 27.08 s > FAIL [ 0.009s] (28/53) three-dimensional-reps generation::cff_tests::disconnected_mixed_energy_factor_ownership_keeps_both_component_factors
  1691. 27.08 s > stdout ---
  1692. 27.08 s >
  1693. 27.08 s > running 1 test
  1694. 27.08 s > test generation::cff_tests::disconnected_mixed_energy_factor_ownership_keeps_both_component_factors ... FAILED
  1695. 27.08 s >
  1696. 27.08 s > failures:
  1697. 27.08 s >
  1698. 27.08 s > failures:
  1699. 27.08 s > generation::cff_tests::disconnected_mixed_energy_factor_ownership_keeps_both_component_factors
  1700. 27.08 s >
  1701. 27.08 s > test result: FAILED. 0 passed; 1 failed; 0 ignored; 0 measured; 52 filtered out; finished in 0.00s
  1702. 27.08 s >
  1703. 27.08 s > stderr ---
  1704. 27.08 s >
  1705. 27.08 s > thread 'generation::cff_tests::disconnected_mixed_energy_factor_ownership_keeps_both_component_factors' (3152) panicked at crates/three-dimensional-reps/src/generation.rs:5726:9:
  1706. 27.08 s > assertion `left == right` failed
  1707. 27.08 s > left: [GlobalSourceProduct, GlobalSourceProduct]
  1708. 27.08 s > right: [VariantLocal, GlobalSourceProduct]
  1709. 27.08 s > stack backtrace:
  1710. 27.08 s > 0: __rustc::rust_begin_unwind
  1711. 27.08 s > 1: core::panicking::panic_fmt
  1712. 27.08 s > 2: core::panicking::assert_failed_inner
  1713. 27.08 s > 3: core::panicking::assert_failed::<alloc::vec::Vec<three_dimensional_reps::generation::CffEnergyFactorOwnership>, alloc::vec::Vec<three_dimensional_reps::generation::CffEnergyFactorOwnership>>
  1714. 27.08 s > 4: three_dimensional_reps::generation::cff_tests::disconnected_mixed_energy_factor_ownership_keeps_both_component_factors
  1715. 27.08 s > 5: <three_dimensional_reps::generation::cff_tests::disconnected_mixed_energy_factor_ownership_keeps_both_component_factors::{closure#0} as core::ops::function::FnOnce<()>>::call_once
  1716. 27.08 s > note: Some details are omitted, run with `RUST_BACKTRACE=full` for a verbose backtrace.
  1717. 27.08 s >
  1718. 27.08 s > FAIL [ 0.040s] (41/53) three-dimensional-reps generation::cff_tests::cff_generation_builds_multiloop_repeated_high_power_known_factor_completion
  1719. 27.08 s > stdout ---
  1720. 27.08 s >
  1721. 27.08 s > running 1 test
  1722. 27.08 s > test generation::cff_tests::cff_generation_builds_multiloop_repeated_high_power_known_factor_completion ... FAILED
  1723. 27.08 s >
  1724. 27.08 s > failures:
  1725. 27.08 s >
  1726. 27.08 s > failures:
  1727. 27.08 s > generation::cff_tests::cff_generation_builds_multiloop_repeated_high_power_known_factor_completion
  1728. 27.08 s >
  1729. 27.08 s > test result: FAILED. 0 passed; 1 failed; 0 ignored; 0 measured; 52 filtered out; finished in 0.03s
  1730. 27.08 s >
  1731. 27.08 s > stderr ---
  1732. 27.08 s >
  1733. 27.08 s > thread 'generation::cff_tests::cff_generation_builds_multiloop_repeated_high_power_known_factor_completion' (3119) panicked at crates/three-dimensional-reps/src/generation.rs:5865:9:
  1734. 27.08 s > assertion failed: variants.iter().any(|variant|
  1735. 27.08 s > {
  1736. 27.08 s > variant.origin.as_deref().is_some_and(|origin|
  1737. 27.08 s > {
  1738. 27.08 s > origin.starts_with("bounded_degree_quadratic_recursive_remainder")
  1739. 27.08 s > })
  1740. 27.08 s > })
  1741. 27.08 s > stack backtrace:
  1742. 27.08 s > 0: __rustc::rust_begin_unwind
  1743. 27.08 s > 1: core::panicking::panic_fmt
  1744. 27.08 s > 2: core::panicking::panic
  1745. 27.08 s > 3: three_dimensional_reps::generation::cff_tests::cff_generation_builds_multiloop_repeated_high_power_known_factor_completion
  1746. 27.08 s > 4: <three_dimensional_reps::generation::cff_tests::cff_generation_builds_multiloop_repeated_high_power_known_factor_completion::{closure#0} as core::ops::function::FnOnce<()>>::call_once
  1747. 27.08 s > note: Some details are omitted, run with `RUST_BACKTRACE=full` for a verbose backtrace.
  1748. 27.08 s >
  1749. 27.08 s > FAIL [ 0.097s] (48/53) three-dimensional-reps generation::cff_tests::cff_generation_builds_one_loop_high_power_with_repeated_spectators
  1750. 27.08 s > stdout ---
  1751. 27.08 s >
  1752. 27.08 s > running 1 test
  1753. 27.08 s > test generation::cff_tests::cff_generation_builds_one_loop_high_power_with_repeated_spectators ... FAILED
  1754. 27.08 s >
  1755. 27.08 s > failures:
  1756. 27.08 s >
  1757. 27.08 s > failures:
  1758. 27.08 s > generation::cff_tests::cff_generation_builds_one_loop_high_power_with_repeated_spectators
  1759. 27.08 s >
  1760. 27.08 s > test result: FAILED. 0 passed; 1 failed; 0 ignored; 0 measured; 52 filtered out; finished in 0.09s
  1761. 27.08 s >
  1762. 27.08 s > stderr ---
  1763. 27.08 s >
  1764. 27.08 s > thread 'generation::cff_tests::cff_generation_builds_one_loop_high_power_with_repeated_spectators' (3123) panicked at crates/three-dimensional-reps/src/generation.rs:6288:9:
  1765. 27.08 s > assertion failed: variants.iter().any(|variant|
  1766. 27.08 s > {
  1767. 27.08 s > variant.origin.as_deref().is_some_and(|origin|
  1768. 27.08 s > {
  1769. 27.08 s > origin.starts_with("bounded_degree_quadratic_recursive_remainder")
  1770. 27.08 s > })
  1771. 27.08 s > })
  1772. 27.08 s > stack backtrace:
  1773. 27.08 s > 0: __rustc::rust_begin_unwind
  1774. 27.08 s > 1: core::panicking::panic_fmt
  1775. 27.08 s > 2: core::panicking::panic
  1776. 27.08 s > 3: three_dimensional_reps::generation::cff_tests::cff_generation_builds_one_loop_high_power_with_repeated_spectators
  1777. 27.08 s > 4: <three_dimensional_reps::generation::cff_tests::cff_generation_builds_one_loop_high_power_with_repeated_spectators::{closure#0} as core::ops::function::FnOnce<()>>::call_once
  1778. 27.08 s > note: Some details are omitted, run with `RUST_BACKTRACE=full` for a verbose backtrace.
  1779. 27.08 s >
  1780. 27.08 s > error: test run failed
  1781. 27.08 s >
  1782. 27.08 s > ========== nextest test summary ==========
  1783. 27.08 s > report: target/nextest/ci_gammaloop/junit.xml
  1784. 27.08 s > tests: 53, failures: 4, errors: 0
  1785. 27.08 s >
  1786. 27.08 s > 1. three-dimensional-reps::generation::cff_tests::causal_repeated_generation_handles_energy_dependent_bubble_source
  1787. 27.08 s > failure: test failure with exit code 101
  1788. 27.08 s > thread 'generation::cff_tests::causal_repeated_generation_handles_energy_dependent_bubble_source' (3117) panicked at crates/three-dimensional-reps/src/generation.rs:5806:9:
  1789. 27.08 s > assertion `left == right` failed
  1790. 27.08 s > left: GlobalSourceProduct
  1791. 27.08 s > right: VariantLocal
  1792. 27.08 s > stack backtrace:
  1793. 27.08 s > 0: __rustc::rust_begin_unwind
  1794. 27.08 s > 1: core::panicking::panic_fmt
  1795. 27.08 s > 2: core::panicking::assert_failed_inner
  1796. 27.08 s > 3: core::panicking::assert_failed::<three_dimensional_reps::generation::CffEnergyFactorOwnership, three_dimensional_reps::generation::CffEnergyFactorOwnership>
  1797. 27.08 s > 4: three_dimensional_reps::generation::cff_tests::causal_repeated_generation_handles_energy_dependent_bubble_source
  1798. 27.08 s > 5: <three_dimensional_reps::generation::cff_tests::causal_repeated_generation_handles_energy_dependent_bubble_source::{closure#0} as core::ops::function::FnOnce<()>>::call_once
  1799. 27.08 s > note: Some details are omitted, run with `RUST_BACKTRACE=full` for a verbose backtrace.
  1800. 27.08 s > system-out
  1801. 27.08 s > running 1 test
  1802. 27.08 s > test generation::cff_tests::causal_repeated_generation_handles_energy_dependent_bubble_source ... FAILED
  1803. 27.08 s >
  1804. 27.08 s > failures:
  1805. 27.08 s >
  1806. 27.08 s > failures:
  1807. 27.08 s > generation::cff_tests::causal_repeated_generation_handles_energy_dependent_bubble_source
  1808. 27.08 s >
  1809. 27.08 s > test result: FAILED. 0 passed; 1 failed; 0 ignored; 0 measured; 52 filtered out; finished in 0.00s
  1810. 27.08 s > system-err
  1811. 27.08 s > thread 'generation::cff_tests::causal_repeated_generation_handles_energy_dependent_bubble_source' (3117) panicked at crates/three-dimensional-reps/src/generation.rs:5806:9:
  1812. 27.08 s > assertion `left == right` failed
  1813. 27.08 s > left: GlobalSourceProduct
  1814. 27.08 s > right: VariantLocal
  1815. 27.08 s > stack backtrace:
  1816. 27.08 s > 0: __rustc::rust_begin_unwind
  1817. 27.08 s > 1: core::panicking::panic_fmt
  1818. 27.08 s > 2: core::panicking::assert_failed_inner
  1819. 27.08 s > 3: core::panicking::assert_failed::<three_dimensional_reps::generation::CffEnergyFactorOwnership, three_dimensional_reps::generation::CffEnergyFactorOwnership>
  1820. 27.08 s > 4: three_dimensional_reps::generation::cff_tests::causal_repeated_generation_handles_energy_dependent_bubble_source
  1821. 27.08 s > 5: <three_dimensional_reps::generation::cff_tests::causal_repeated_generation_handles_energy_dependent_bubble_source::{closure#0} as core::ops::function::FnOnce<()>>::call_once
  1822. 27.08 s > note: Some details are omitted, run with `RUST_BACKTRACE=full` for a verbose backtrace.
  1823. 27.08 s >
  1824. 27.08 s > 2. three-dimensional-reps::generation::cff_tests::disconnected_mixed_energy_factor_ownership_keeps_both_component_factors
  1825. 27.08 s > failure: test failure with exit code 101
  1826. 27.08 s > thread 'generation::cff_tests::disconnected_mixed_energy_factor_ownership_keeps_both_component_factors' (3152) panicked at crates/three-dimensional-reps/src/generation.rs:5726:9:
  1827. 27.08 s > assertion `left == right` failed
  1828. 27.08 s > left: [GlobalSourceProduct, GlobalSourceProduct]
  1829. 27.08 s > right: [VariantLocal, GlobalSourceProduct]
  1830. 27.08 s > stack backtrace:
  1831. 27.08 s > 0: __rustc::rust_begin_unwind
  1832. 27.08 s > 1: core::panicking::panic_fmt
  1833. 27.08 s > 2: core::panicking::assert_failed_inner
  1834. 27.08 s > 3: core::panicking::assert_failed::<alloc::vec::Vec<three_dimensional_reps::generation::CffEnergyFactorOwnership>, alloc::vec::Vec<three_dimensional_reps::generation::CffEnergyFactorOwnership>>
  1835. 27.08 s > 4: three_dimensional_reps::generation::cff_tests::disconnected_mixed_energy_factor_ownership_keeps_both_component_factors
  1836. 27.08 s > 5: <three_dimensional_reps::generation::cff_tests::disconnected_mixed_energy_factor_ownership_keeps_both_component_factors::{closure#0} as core::ops::function::FnOnce<()>>::call_once
  1837. 27.08 s > note: Some details are omitted, run with `RUST_BACKTRACE=full` for a verbose backtrace.
  1838. 27.08 s > system-out
  1839. 27.08 s > running 1 test
  1840. 27.08 s > test generation::cff_tests::disconnected_mixed_energy_factor_ownership_keeps_both_component_factors ... FAILED
  1841. 27.08 s >
  1842. 27.08 s > failures:
  1843. 27.08 s >
  1844. 27.08 s > failures:
  1845. 27.08 s > generation::cff_tests::disconnected_mixed_energy_factor_ownership_keeps_both_component_factors
  1846. 27.08 s >
  1847. 27.08 s > test result: FAILED. 0 passed; 1 failed; 0 ignored; 0 measured; 52 filtered out; finished in 0.00s
  1848. 27.08 s > system-err
  1849. 27.08 s > thread 'generation::cff_tests::disconnected_mixed_energy_factor_ownership_keeps_both_component_factors' (3152) panicked at crates/three-dimensional-reps/src/generation.rs:5726:9:
  1850. 27.08 s > assertion `left == right` failed
  1851. 27.08 s > left: [GlobalSourceProduct, GlobalSourceProduct]
  1852. 27.08 s > right: [VariantLocal, GlobalSourceProduct]
  1853. 27.08 s > stack backtrace:
  1854. 27.08 s > 0: __rustc::rust_begin_unwind
  1855. 27.08 s > 1: core::panicking::panic_fmt
  1856. 27.08 s > 2: core::panicking::assert_failed_inner
  1857. 27.08 s > 3: core::panicking::assert_failed::<alloc::vec::Vec<three_dimensional_reps::generation::CffEnergyFactorOwnership>, alloc::vec::Vec<three_dimensional_reps::generation::CffEnergyFactorOwnership>>
  1858. 27.08 s > 4: three_dimensional_reps::generation::cff_tests::disconnected_mixed_energy_factor_ownership_keeps_both_component_factors
  1859. 27.08 s > 5: <three_dimensional_reps::generation::cff_tests::disconnected_mixed_energy_factor_ownership_keeps_both_component_factors::{closure#0} as core::ops::function::FnOnce<()>>::call_once
  1860. 27.08 s > note: Some details are omitted, run with `RUST_BACKTRACE=full` for a verbose backtrace.
  1861. 27.08 s >
  1862. 27.08 s > 3. three-dimensional-reps::generation::cff_tests::cff_generation_builds_multiloop_repeated_high_power_known_factor_completion
  1863. 27.08 s > failure: test failure with exit code 101
  1864. 27.08 s > thread 'generation::cff_tests::cff_generation_builds_multiloop_repeated_high_power_known_factor_completion' (3119) panicked at crates/three-dimensional-reps/src/generation.rs:5865:9:
  1865. 27.08 s > assertion failed: variants.iter().any(|variant|
  1866. 27.08 s > {
  1867. 27.08 s > variant.origin.as_deref().is_some_and(|origin|
  1868. 27.08 s > {
  1869. 27.08 s > origin.starts_with("bounded_degree_quadratic_recursive_remainder")
  1870. 27.08 s > })
  1871. 27.08 s > })
  1872. 27.08 s > stack backtrace:
  1873. 27.08 s > 0: __rustc::rust_begin_unwind
  1874. 27.08 s > 1: core::panicking::panic_fmt
  1875. 27.08 s > 2: core::panicking::panic
  1876. 27.08 s > 3: three_dimensional_reps::generation::cff_tests::cff_generation_builds_multiloop_repeated_high_power_known_factor_completion
  1877. 27.08 s > 4: <three_dimensional_reps::generation::cff_tests::cff_generation_builds_multiloop_repeated_high_power_known_factor_completion::{closure#0} as core::ops::function::FnOnce<()>>::call_once
  1878. 27.08 s > note: Some details are omitted, run with `RUST_BACKTRACE=full` for a verbose backtrace.
  1879. 27.08 s > system-out
  1880. 27.08 s > running 1 test
  1881. 27.08 s > test generation::cff_tests::cff_generation_builds_multiloop_repeated_high_power_known_factor_completion ... FAILED
  1882. 27.08 s >
  1883. 27.08 s > failures:
  1884. 27.08 s >
  1885. 27.08 s > failures:
  1886. 27.08 s > generation::cff_tests::cff_generation_builds_multiloop_repeated_high_power_known_factor_completion
  1887. 27.08 s >
  1888. 27.08 s > test result: FAILED. 0 passed; 1 failed; 0 ignored; 0 measured; 52 filtered out; finished in 0.03s
  1889. 27.08 s > system-err
  1890. 27.08 s > thread 'generation::cff_tests::cff_generation_builds_multiloop_repeated_high_power_known_factor_completion' (3119) panicked at crates/three-dimensional-reps/src/generation.rs:5865:9:
  1891. 27.08 s > assertion failed: variants.iter().any(|variant|
  1892. 27.08 s > {
  1893. 27.08 s > variant.origin.as_deref().is_some_and(|origin|
  1894. 27.08 s > {
  1895. 27.08 s > origin.starts_with("bounded_degree_quadratic_recursive_remainder")
  1896. 27.08 s > })
  1897. 27.08 s > })
  1898. 27.08 s > stack backtrace:
  1899. 27.08 s > 0: __rustc::rust_begin_unwind
  1900. 27.08 s > 1: core::panicking::panic_fmt
  1901. 27.08 s > 2: core::panicking::panic
  1902. 27.08 s > 3: three_dimensional_reps::generation::cff_tests::cff_generation_builds_multiloop_repeated_high_power_known_factor_completion
  1903. 27.08 s > 4: <three_dimensional_reps::generation::cff_tests::cff_generation_builds_multiloop_repeated_high_power_known_factor_completion::{closure#0} as core::ops::function::FnOnce<()>>::call_once
  1904. 27.08 s > note: Some details are omitted, run with `RUST_BACKTRACE=full` for a verbose backtrace.
  1905. 27.08 s >
  1906. 27.08 s > 4. three-dimensional-reps::generation::cff_tests::cff_generation_builds_one_loop_high_power_with_repeated_spectators
  1907. 27.08 s > failure: test failure with exit code 101
  1908. 27.08 s > thread 'generation::cff_tests::cff_generation_builds_one_loop_high_power_with_repeated_spectators' (3123) panicked at crates/three-dimensional-reps/src/generation.rs:6288:9:
  1909. 27.08 s > assertion failed: variants.iter().any(|variant|
  1910. 27.08 s > {
  1911. 27.08 s > variant.origin.as_deref().is_some_and(|origin|
  1912. 27.08 s > {
  1913. 27.08 s > origin.starts_with("bounded_degree_quadratic_recursive_remainder")
  1914. 27.08 s > })
  1915. 27.08 s > })
  1916. 27.08 s > stack backtrace:
  1917. 27.08 s > 0: __rustc::rust_begin_unwind
  1918. 27.08 s > 1: core::panicking::panic_fmt
  1919. 27.08 s > 2: core::panicking::panic
  1920. 27.08 s > 3: three_dimensional_reps::generation::cff_tests::cff_generation_builds_one_loop_high_power_with_repeated_spectators
  1921. 27.08 s > 4: <three_dimensional_reps::generation::cff_tests::cff_generation_builds_one_loop_high_power_with_repeated_spectators::{closure#0} as core::ops::function::FnOnce<()>>::call_once
  1922. 27.08 s > note: Some details are omitted, run with `RUST_BACKTRACE=full` for a verbose backtrace.
  1923. 27.08 s > system-out
  1924. 27.08 s > running 1 test
  1925. 27.08 s > test generation::cff_tests::cff_generation_builds_one_loop_high_power_with_repeated_spectators ... FAILED
  1926. 27.08 s >
  1927. 27.08 s > failures:
  1928. 27.08 s >
  1929. 27.08 s > failures:
  1930. 27.08 s > generation::cff_tests::cff_generation_builds_one_loop_high_power_with_repeated_spectators
  1931. 27.08 s >
  1932. 27.08 s > test result: FAILED. 0 passed; 1 failed; 0 ignored; 0 measured; 52 filtered out; finished in 0.09s
  1933. 27.08 s > system-err
  1934. 27.08 s > thread 'generation::cff_tests::cff_generation_builds_one_loop_high_power_with_repeated_spectators' (3123) panicked at crates/three-dimensional-reps/src/generation.rs:6288:9:
  1935. 27.08 s > assertion failed: variants.iter().any(|variant|
  1936. 27.08 s > {
  1937. 27.08 s > variant.origin.as_deref().is_some_and(|origin|
  1938. 27.08 s > {
  1939. 27.08 s > origin.starts_with("bounded_degree_quadratic_recursive_remainder")
  1940. 27.08 s > })
  1941. 27.08 s > })
  1942. 27.08 s > stack backtrace:
  1943. 27.08 s > 0: __rustc::rust_begin_unwind
  1944. 27.08 s > 1: core::panicking::panic_fmt
  1945. 27.08 s > 2: core::panicking::panic
  1946. 27.08 s > 3: three_dimensional_reps::generation::cff_tests::cff_generation_builds_one_loop_high_power_with_repeated_spectators
  1947. 27.08 s > 4: <three_dimensional_reps::generation::cff_tests::cff_generation_builds_one_loop_high_power_with_repeated_spectators::{closure#0} as core::ops::function::FnOnce<()>>::call_once
  1948. 27.08 s > note: Some details are omitted, run with `RUST_BACKTRACE=full` for a verbose backtrace.
  1949. 27.08 s > =========================================
  1950. 27.08 s For full logs, run:
  1951. 27.08 s nix log /nix/store/i3sh6ivcl5js2i7xcdz1qf32z60j8rna-gammaloop-nextest-core.drv
  1952. 27.21 s [0 built (1 failed)]Run failed.