test packages.x86_64-linux.nix-ci-check-gammaloop-nextest-core

Reproduce this run
Retry Run
  1. 0.09 s $ /nix/store/9ypz3flqsrl5xl495mm8h645gadjsxi1-coreutils-9.11/bin/timeout --kill-after=15s 7200s /nix/store/23zk8sgzamrbmj1fday15szf7f2279s8-nix-2.34.7/bin/nix --extra-experimental-features nix-command --extra-experimental-features flakes flake clone git+https://github.com/alphal00p/gammaloop --dest /tmp/nix-ci-worker/stable-pwd/repo/
  2. 0.10 s Cloning into '/tmp/nix-ci-worker/stable-pwd/repo'...
  3. 1.47 s remote: Enumerating objects: 62187, done.
  4. 1.69 s remote: Counting objects: 0% (1/7541) remote: Counting objects: 1% (76/7541) remote: Counting objects: 2% (151/7541) remote: Counting objects: 3% (227/7541) remote: Counting objects: 4% (302/7541) remote: Counting objects: 5% (378/7541) remote: Counting objects: 6% (453/7541) remote: Counting objects: 7% (528/7541) remote: Counting objects: 8% (604/7541) remote: Counting objects: 9% (679/7541) remote: Counting objects: 10% (755/7541) remote: Counting objects: 11% (830/7541) remote: Counting objects: 12% (905/7541) remote: Counting objects: 13% (981/7541) remote: Counting objects: 14% (1056/7541) remote: Counting objects: 15% (1132/7541) remote: Counting objects: 16% (1207/7541) remote: Counting objects: 17% (1282/7541) remote: Counting objects: 18% (1358/7541) remote: Counting objects: 19% (1433/7541) remote: Counting objects: 20% (1509/7541) remote: Counting objects: 21% (1584/7541) remote: Counting objects: 22% (1660/7541) remote: Counting objects: 23% (1735/7541) remote: Counting objects: 24% (1810/7541) remote: Counting objects: 25% (1886/7541) remote: Counting objects: 26% (1961/7541) remote: Counting objects: 27% (2037/7541) remote: Counting objects: 28% (2112/7541) remote: Counting objects: 29% (2187/7541) remote: Counting objects: 30% (2263/7541) remote: Counting objects: 31% (2338/7541) remote: Counting objects: 32% (2414/7541) remote: Counting objects: 33% (2489/7541) remote: Counting objects: 34% (2564/7541) remote: Counting objects: 35% (2640/7541) remote: Counting objects: 36% (2715/7541) remote: Counting objects: 37% (2791/7541) remote: Counting objects: 38% (2866/7541) remote: Counting objects: 39% (2941/7541) remote: Counting objects: 40% (3017/7541) remote: Counting objects: 41% (3092/7541) remote: Counting objects: 42% (3168/7541) remote: Counting objects: 43% (3243/7541) remote: Counting objects: 44% (3319/7541) remote: Counting objects: 45% (3394/7541) remote: Counting objects: 46% (3469/7541) remote: Counting objects: 47% (3545/7541) remote: Counting objects: 48% (3620/7541) remote: Counting objects: 49% (3696/7541) remote: Counting objects: 50% (3771/7541) remote: Counting objects: 51% (3846/7541) remote: Counting objects: 52% (3922/7541) remote: Counting objects: 53% (3997/7541) remote: Counting objects: 54% (4073/7541) remote: Counting objects: 55% (4148/7541) remote: Counting objects: 56% (4223/7541) remote: Counting objects: 57% (4299/7541) remote: Counting objects: 58% (4374/7541) remote: Counting objects: 59% (4450/7541) remote: Counting objects: 60% (4525/7541) remote: Counting objects: 61% (4601/7541) remote: Counting objects: 62% (4676/7541) remote: Counting objects: 63% (4751/7541) remote: Counting objects: 64% (4827/7541) remote: Counting objects: 65% (4902/7541) remote: Counting objects: 66% (4978/7541) remote: Counting objects: 67% (5053/7541) remote: Counting objects: 68% (5128/7541) remote: Counting objects: 69% (5204/7541) remote: Counting objects: 70% (5279/7541) remote: Counting objects: 71% (5355/7541) remote: Counting objects: 72% (5430/7541) remote: Counting objects: 73% (5505/7541) remote: Counting objects: 74% (5581/7541) remote: Counting objects: 75% (5656/7541) remote: Counting objects: 76% (5732/7541) remote: Counting objects: 77% (5807/7541) remote: Counting objects: 78% (5882/7541) remote: Counting objects: 79% (5958/7541) remote: Counting objects: 80% (6033/7541) remote: Counting objects: 81% (6109/7541) remote: Counting objects: 82% (6184/7541) remote: Counting objects: 83% (6260/7541) remote: Counting objects: 84% (6335/7541) remote: Counting objects: 85% (6410/7541) remote: Counting objects: 86% (6486/7541) remote: Counting objects: 87% (6561/7541) remote: Counting objects: 88% (6637/7541) remote: Counting objects: 89% (6712/7541) remote: Counting objects: 90% (6787/7541) remote: Counting objects: 91% (6863/7541) remote: Counting objects: 92% (6938/7541) remote: Counting objects: 93% (7014/7541) remote: Counting objects: 94% (7089/7541) remote: Counting objects: 95% (7164/7541) remote: Counting objects: 96% (7240/7541) remote: Counting objects: 97% (7315/7541) remote: Counting objects: 98% (7391/7541) remote: Counting objects: 99% (7466/7541) remote: Counting objects: 100% (7541/7541) remote: Counting objects: 100% (7541/7541), done.
  5. 3.23 s remote: Compressing objects: 0% (1/1561) remote: Compressing objects: 1% (16/1561) remote: Compressing objects: 2% (32/1561) remote: Compressing objects: 3% (47/1561) remote: Compressing objects: 4% (63/1561) remote: Compressing objects: 5% (79/1561) remote: Compressing objects: 6% (94/1561) remote: Compressing objects: 7% (110/1561) remote: Compressing objects: 8% (125/1561) remote: Compressing objects: 9% (141/1561) remote: Compressing objects: 10% (157/1561) remote: Compressing objects: 11% (172/1561) remote: Compressing objects: 12% (188/1561) remote: Compressing objects: 13% (203/1561) remote: Compressing objects: 13% (217/1561) remote: Compressing objects: 14% (219/1561) remote: Compressing objects: 15% (235/1561) remote: Compressing objects: 16% (250/1561) remote: Compressing objects: 17% (266/1561) remote: Compressing objects: 18% (281/1561) remote: Compressing objects: 19% (297/1561) remote: Compressing objects: 20% (313/1561) remote: Compressing objects: 21% (328/1561) remote: Compressing objects: 22% (344/1561) remote: Compressing objects: 23% (360/1561) remote: Compressing objects: 24% (375/1561) remote: Compressing objects: 25% (391/1561) remote: Compressing objects: 26% (406/1561) remote: Compressing objects: 27% (422/1561) remote: Compressing objects: 28% (438/1561) remote: Compressing objects: 29% (453/1561) remote: Compressing objects: 30% (469/1561) remote: Compressing objects: 31% (484/1561) remote: Compressing objects: 32% (500/1561) remote: Compressing objects: 33% (516/1561) remote: Compressing objects: 34% (531/1561) remote: Compressing objects: 35% (547/1561) remote: Compressing objects: 36% (562/1561) remote: Compressing objects: 37% (578/1561) remote: Compressing objects: 38% (594/1561) remote: Compressing objects: 39% (609/1561) remote: Compressing objects: 40% (625/1561) remote: Compressing objects: 41% (641/1561) remote: Compressing objects: 42% (656/1561) remote: Compressing objects: 43% (672/1561) remote: Compressing objects: 44% (687/1561) remote: Compressing objects: 45% (703/1561) remote: Compressing objects: 46% (719/1561) remote: Compressing objects: 47% (734/1561) remote: Compressing objects: 48% (750/1561) remote: Compressing objects: 49% (765/1561) remote: Compressing objects: 50% (781/1561) remote: Compressing objects: 51% (797/1561) remote: Compressing objects: 52% (812/1561) remote: Compressing objects: 53% (828/1561) remote: Compressing objects: 54% (843/1561) remote: Compressing objects: 55% (859/1561) remote: Compressing objects: 56% (875/1561) remote: Compressing objects: 57% (890/1561) remote: Compressing objects: 58% (906/1561) remote: Compressing objects: 59% (921/1561) remote: Compressing objects: 60% (937/1561) remote: Compressing objects: 61% (953/1561) remote: Compressing objects: 62% (968/1561) remote: Compressing objects: 63% (984/1561) remote: Compressing objects: 64% (1000/1561) remote: Compressing objects: 65% (1015/1561) remote: Compressing objects: 66% (1031/1561) remote: Compressing objects: 67% (1046/1561) remote: Compressing objects: 68% (1062/1561) remote: Compressing objects: 69% (1078/1561) remote: Compressing objects: 70% (1093/1561) remote: Compressing objects: 71% (1109/1561) remote: Compressing objects: 72% (1124/1561) remote: Compressing objects: 73% (1140/1561) remote: Compressing objects: 74% (1156/1561) remote: Compressing objects: 75% (1171/1561) remote: Compressing objects: 76% (1187/1561) remote: Compressing objects: 77% (1202/1561) remote: Compressing objects: 78% (1218/1561) remote: Compressing objects: 79% (1234/1561) remote: Compressing objects: 80% (1249/1561) remote: Compressing objects: 81% (1265/1561) remote: Compressing objects: 82% (1281/1561) remote: Compressing objects: 83% (1296/1561) remote: Compressing objects: 84% (1312/1561) remote: Compressing objects: 85% (1327/1561) remote: Compressing objects: 86% (1343/1561) remote: Compressing objects: 87% (1359/1561) remote: Compressing objects: 88% (1374/1561) remote: Compressing objects: 89% (1390/1561) remote: Compressing objects: 90% (1405/1561) remote: Compressing objects: 91% (1421/1561) remote: Compressing objects: 92% (1437/1561) remote: Compressing objects: 93% (1452/1561) remote: Compressing objects: 94% (1468/1561) remote: Compressing objects: 95% (1483/1561) remote: Compressing objects: 96% (1499/1561) remote: Compressing objects: 97% (1515/1561) remote: Compressing objects: 98% (1530/1561) remote: Compressing objects: 99% (1546/1561) remote: Compressing objects: 100% (1561/1561) remote: Compressing objects: 100% (1561/1561), done.
  6. 6.02 s Receiving objects: 0% (1/62187) Receiving objects: 1% (622/62187) Receiving objects: 2% (1244/62187) Receiving objects: 3% (1866/62187) Receiving objects: 4% (2488/62187) Receiving objects: 5% (3110/62187) Receiving objects: 6% (3732/62187) Receiving objects: 7% (4354/62187) Receiving objects: 8% (4975/62187) Receiving objects: 9% (5597/62187) Receiving objects: 10% (6219/62187) Receiving objects: 11% (6841/62187) Receiving objects: 12% (7463/62187), 13.92 MiB | 27.83 MiB/s Receiving objects: 13% (8085/62187), 13.92 MiB | 27.83 MiB/s Receiving objects: 14% (8707/62187), 13.92 MiB | 27.83 MiB/s Receiving objects: 15% (9329/62187), 13.92 MiB | 27.83 MiB/s Receiving objects: 16% (9950/62187), 13.92 MiB | 27.83 MiB/s Receiving objects: 17% (10572/62187), 13.92 MiB | 27.83 MiB/s Receiving objects: 18% (11194/62187), 13.92 MiB | 27.83 MiB/s Receiving objects: 19% (11816/62187), 13.92 MiB | 27.83 MiB/s Receiving objects: 20% (12438/62187), 13.92 MiB | 27.83 MiB/s Receiving objects: 21% (13060/62187), 13.92 MiB | 27.83 MiB/s Receiving objects: 22% (13682/62187), 13.92 MiB | 27.83 MiB/s Receiving objects: 23% (14304/62187), 13.92 MiB | 27.83 MiB/s Receiving objects: 24% (14925/62187), 13.92 MiB | 27.83 MiB/s Receiving objects: 25% (15547/62187), 13.92 MiB | 27.83 MiB/s Receiving objects: 26% (16169/62187), 13.92 MiB | 27.83 MiB/s Receiving objects: 27% (16791/62187), 13.92 MiB | 27.83 MiB/s Receiving objects: 28% (17413/62187), 13.92 MiB | 27.83 MiB/s Receiving objects: 29% (18035/62187), 13.92 MiB | 27.83 MiB/s Receiving objects: 30% (18657/62187), 13.92 MiB | 27.83 MiB/s Receiving objects: 31% (19278/62187), 13.92 MiB | 27.83 MiB/s Receiving objects: 32% (19900/62187), 13.92 MiB | 27.83 MiB/s Receiving objects: 33% (20522/62187), 13.92 MiB | 27.83 MiB/s Receiving objects: 34% (21144/62187), 13.92 MiB | 27.83 MiB/s Receiving objects: 35% (21766/62187), 13.92 MiB | 27.83 MiB/s Receiving objects: 36% (22388/62187), 13.92 MiB | 27.83 MiB/s Receiving objects: 37% (23010/62187), 13.92 MiB | 27.83 MiB/s Receiving objects: 38% (23632/62187), 13.92 MiB | 27.83 MiB/s Receiving objects: 39% (24253/62187), 13.92 MiB | 27.83 MiB/s Receiving objects: 40% (24875/62187), 13.92 MiB | 27.83 MiB/s Receiving objects: 41% (25497/62187), 13.92 MiB | 27.83 MiB/s Receiving objects: 42% (26119/62187), 13.92 MiB | 27.83 MiB/s Receiving objects: 43% (26741/62187), 13.92 MiB | 27.83 MiB/s Receiving objects: 44% (27363/62187), 13.92 MiB | 27.83 MiB/s Receiving objects: 45% (27985/62187), 13.92 MiB | 27.83 MiB/s Receiving objects: 46% (28607/62187), 13.92 MiB | 27.83 MiB/s Receiving objects: 47% (29228/62187), 13.92 MiB | 27.83 MiB/s Receiving objects: 48% (29850/62187), 13.92 MiB | 27.83 MiB/s Receiving objects: 49% (30472/62187), 13.92 MiB | 27.83 MiB/s Receiving objects: 50% (31094/62187), 13.92 MiB | 27.83 MiB/s Receiving objects: 51% (31716/62187), 13.92 MiB | 27.83 MiB/s Receiving objects: 52% (32338/62187), 13.92 MiB | 27.83 MiB/s Receiving objects: 53% (32960/62187), 13.92 MiB | 27.83 MiB/s Receiving objects: 54% (33581/62187), 13.92 MiB | 27.83 MiB/s Receiving objects: 54% (33857/62187), 33.14 MiB | 32.94 MiB/s Receiving objects: 55% (34203/62187), 33.14 MiB | 32.94 MiB/s Receiving objects: 56% (34825/62187), 33.14 MiB | 32.94 MiB/s Receiving objects: 57% (35447/62187), 33.14 MiB | 32.94 MiB/s Receiving objects: 58% (36069/62187), 33.14 MiB | 32.94 MiB/s Receiving objects: 59% (36691/62187), 33.14 MiB | 32.94 MiB/s Receiving objects: 60% (37313/62187), 33.14 MiB | 32.94 MiB/s Receiving objects: 61% (37935/62187), 33.14 MiB | 32.94 MiB/s Receiving objects: 62% (38556/62187), 33.14 MiB | 32.94 MiB/s Receiving objects: 63% (39178/62187), 33.14 MiB | 32.94 MiB/s Receiving objects: 64% (39800/62187), 50.32 MiB | 33.43 MiB/s Receiving objects: 65% (40422/62187), 50.32 MiB | 33.43 MiB/s Receiving objects: 66% (41044/62187), 50.32 MiB | 33.43 MiB/s Receiving objects: 67% (41666/62187), 50.32 MiB | 33.43 MiB/s Receiving objects: 68% (42288/62187), 50.32 MiB | 33.43 MiB/s Receiving objects: 69% (42910/62187), 50.32 MiB | 33.43 MiB/s Receiving objects: 70% (43531/62187), 50.32 MiB | 33.43 MiB/s Receiving objects: 71% (44153/62187), 50.32 MiB | 33.43 MiB/s Receiving objects: 72% (44775/62187), 50.32 MiB | 33.43 MiB/s Receiving objects: 73% (45397/62187), 50.32 MiB | 33.43 MiB/s Receiving objects: 73% (45701/62187), 50.32 MiB | 33.43 MiB/s Receiving objects: 74% (46019/62187), 66.79 MiB | 33.08 MiB/s Receiving objects: 75% (46641/62187), 66.79 MiB | 33.08 MiB/s Receiving objects: 76% (47263/62187), 66.79 MiB | 33.08 MiB/s Receiving objects: 77% (47884/62187), 66.79 MiB | 33.08 MiB/s Receiving objects: 78% (48506/62187), 66.79 MiB | 33.08 MiB/s Receiving objects: 79% (49128/62187), 66.79 MiB | 33.08 MiB/s Receiving objects: 80% (49750/62187), 66.79 MiB | 33.08 MiB/s Receiving objects: 81% (50372/62187), 66.79 MiB | 33.08 MiB/s Receiving objects: 82% (50994/62187), 66.79 MiB | 33.08 MiB/s Receiving objects: 83% (51616/62187), 66.79 MiB | 33.08 MiB/s Receiving objects: 84% (52238/62187), 66.79 MiB | 33.08 MiB/s Receiving objects: 85% (52859/62187), 66.79 MiB | 33.08 MiB/s Receiving objects: 86% (53481/62187), 66.79 MiB | 33.08 MiB/s Receiving objects: 87% (54103/62187), 84.82 MiB | 33.67 MiB/s Receiving objects: 88% (54725/62187), 84.82 MiB | 33.67 MiB/s Receiving objects: 89% (55347/62187), 84.82 MiB | 33.67 MiB/s Receiving objects: 90% (55969/62187), 84.82 MiB | 33.67 MiB/s Receiving objects: 91% (56591/62187), 84.82 MiB | 33.67 MiB/s Receiving objects: 92% (57213/62187), 84.82 MiB | 33.67 MiB/s Receiving objects: 93% (57834/62187), 84.82 MiB | 33.67 MiB/s Receiving objects: 94% (58456/62187), 84.82 MiB | 33.67 MiB/s Receiving objects: 95% (59078/62187), 84.82 MiB | 33.67 MiB/s Receiving objects: 96% (59700/62187), 84.82 MiB | 33.67 MiB/s Receiving objects: 97% (60322/62187), 84.82 MiB | 33.67 MiB/s Receiving objects: 98% (60944/62187), 84.82 MiB | 33.67 MiB/s Receiving objects: 99% (61566/62187), 84.82 MiB | 33.67 MiB/s remote: Total 62187 (delta 6491), reused 6115 (delta 5975), pack-reused 54646 (from 3)
  7. 6.22 s Receiving objects: 100% (62187/62187), 84.82 MiB | 33.67 MiB/s Receiving objects: 100% (62187/62187), 92.54 MiB | 33.23 MiB/s, done.
  8. 6.70 s Resolving deltas: 0% (0/43421) Resolving deltas: 1% (435/43421) Resolving deltas: 2% (869/43421) Resolving deltas: 3% (1303/43421) Resolving deltas: 4% (1738/43421) Resolving deltas: 5% (2172/43421) Resolving deltas: 6% (2608/43421) Resolving deltas: 7% (3040/43421) Resolving deltas: 8% (3474/43421) Resolving deltas: 9% (3908/43421) Resolving deltas: 10% (4343/43421) Resolving deltas: 11% (4777/43421) Resolving deltas: 12% (5211/43421) Resolving deltas: 13% (5646/43421) Resolving deltas: 14% (6081/43421) Resolving deltas: 15% (6515/43421) Resolving deltas: 16% (6949/43421) Resolving deltas: 17% (7382/43421) Resolving deltas: 18% (7816/43421) Resolving deltas: 19% (8250/43421) Resolving deltas: 20% (8686/43421) Resolving deltas: 21% (9120/43421) Resolving deltas: 22% (9554/43421) Resolving deltas: 23% (9987/43421) Resolving deltas: 24% (10422/43421) Resolving deltas: 25% (10856/43421) Resolving deltas: 26% (11290/43421) Resolving deltas: 27% (11725/43421) Resolving deltas: 28% (12160/43421) Resolving deltas: 29% (12593/43421) Resolving deltas: 30% (13027/43421) Resolving deltas: 31% (13461/43421) Resolving deltas: 32% (13895/43421) Resolving deltas: 33% (14329/43421) Resolving deltas: 34% (14764/43421) Resolving deltas: 35% (15198/43421) Resolving deltas: 36% (15632/43421) Resolving deltas: 37% (16066/43421) Resolving deltas: 38% (16500/43421) Resolving deltas: 39% (16935/43421) Resolving deltas: 40% (17369/43421) Resolving deltas: 41% (17803/43421) Resolving deltas: 42% (18237/43421) Resolving deltas: 43% (18672/43421) Resolving deltas: 44% (19107/43421) Resolving deltas: 45% (19540/43421) Resolving deltas: 46% (19974/43421) Resolving deltas: 47% (20409/43421) Resolving deltas: 48% (20844/43421) Resolving deltas: 49% (21277/43421) Resolving deltas: 50% (21711/43421) Resolving deltas: 51% (22145/43421) Resolving deltas: 52% (22579/43421) Resolving deltas: 53% (23018/43421) Resolving deltas: 54% (23449/43421) Resolving deltas: 55% (23886/43421) Resolving deltas: 56% (24316/43421) Resolving deltas: 57% (24750/43421) Resolving deltas: 58% (25185/43421) Resolving deltas: 59% (25619/43421) Resolving deltas: 60% (26053/43421) Resolving deltas: 61% (26487/43421) Resolving deltas: 62% (26923/43421) Resolving deltas: 63% (27356/43421) Resolving deltas: 64% (27790/43421) Resolving deltas: 65% (28224/43421) Resolving deltas: 66% (28659/43421) Resolving deltas: 67% (29096/43421) Resolving deltas: 68% (29527/43421) Resolving deltas: 69% (29961/43421) Resolving deltas: 70% (30395/43421) Resolving deltas: 71% (30830/43421) Resolving deltas: 72% (31264/43421) Resolving deltas: 73% (31698/43421) Resolving deltas: 74% (32132/43421) Resolving deltas: 75% (32566/43421) Resolving deltas: 76% (33000/43421) Resolving deltas: 77% (33436/43421) Resolving deltas: 78% (33869/43421) Resolving deltas: 79% (34303/43421) Resolving deltas: 80% (34737/43421) Resolving deltas: 81% (35173/43421) Resolving deltas: 82% (35606/43421) Resolving deltas: 83% (36040/43421) Resolving deltas: 84% (36474/43421) Resolving deltas: 85% (36908/43421) Resolving deltas: 86% (37343/43421) Resolving deltas: 87% (37778/43421) Resolving deltas: 88% (38211/43421) Resolving deltas: 89% (38645/43421) Resolving deltas: 90% (39079/43421) Resolving deltas: 91% (39514/43421) Resolving deltas: 92% (39948/43421) Resolving deltas: 93% (40383/43421) Resolving deltas: 94% (40816/43421) Resolving deltas: 95% (41250/43421) Resolving deltas: 96% (41685/43421) Resolving deltas: 97% (42119/43421) Resolving deltas: 98% (42553/43421) Resolving deltas: 99% (42987/43421) Resolving deltas: 100% (43421/43421) Resolving deltas: 100% (43421/43421), done.
  9. 7.07 s Fetching commit bfedaacc152cfdfc2fece3c649d6bd3ee224b8cc for raised_energy_cff_wip ...
  10. 7.07 s $ /nix/store/bcnisk3ydfgv26v2gw3zlky24g00yww2-git-2.54.0/bin/git fetch origin bfedaacc152cfdfc2fece3c649d6bd3ee224b8cc
  11. 7.62 s From https://github.com/alphal00p/gammaloop
  12. 7.62 s * branch bfedaacc152cfdfc2fece3c649d6bd3ee224b8cc -> FETCH_HEAD
  13. 7.63 s $ /nix/store/9ypz3flqsrl5xl495mm8h645gadjsxi1-coreutils-9.11/bin/timeout --kill-after=15s 7200s /nix/store/bcnisk3ydfgv26v2gw3zlky24g00yww2-git-2.54.0/bin/git -c advice.detachedHead=false checkout bfedaacc152cfdfc2fece3c649d6bd3ee224b8cc
  14. 7.83 s HEAD is now at bfedaacc document raised-energy CFF handoff
  15. 7.84 s $ /nix/store/9ypz3flqsrl5xl495mm8h645gadjsxi1-coreutils-9.11/bin/timeout --kill-after=15s 7200s /nix/store/23zk8sgzamrbmj1fday15szf7f2279s8-nix-2.34.7/bin/nix --extra-experimental-features nix-command --extra-experimental-features flakes --log-format internal-json run .#packages.x86_64-linux.nix-ci-check-gammaloop-nextest-core --print-build-logs
  16. 12.35 s
  17. 12.82 s Downloading cached gammaloop-nextest-binaries-core-gammaloop-api from https://cache.nix-ci.com
  18. 12.84 s Downloading cached gammaloop-nextest-binaries-core-gammalooprs from https://cache.nix-ci.com
  19. 13.74 s Downloaded cached gammaloop-nextest-binaries-core-gammaloop-api (70.3 MiB) in 913ms
  20. 13.74 s Progress: 0 of 1 built, 1 of 4 downloaded from cache (1 downloading)
  21. 13.80 s Downloaded cached gammaloop-nextest-binaries-core-gammalooprs (82.1 MiB) in 962ms
  22. 13.80 s Progress: 0 of 1 built, 2 of 4 downloaded from cache
  23. 13.81 s Downloading cached gammaloop-ci-test-binary-dependencies-1b17e1ec025c6580-Cargo.toml from https://cache.nix-ci.com
  24. 13.82 s Downloaded cached gammaloop-ci-test-binary-dependencies-1b17e1ec025c6580-Cargo.toml (280 B) in 9ms
  25. 13.86 s Downloading cached gammaloop-crate-test-binaries-gammaloop-tracing-filter-macros-1b17e1ec025c6580-inputs from https://cache.nix-ci.com
  26. 13.86 s Downloading cached gammaloop-crate-test-binaries-three-dimensional-reps-50150770f831b638-inputs from https://cache.nix-ci.com
  27. 13.98 s Building /nix/store/7llwjkf9ws3lch6p18f0cfrpm3nhsfrk-gammaloop-nextest-binaries-core-gammaloop-tracing-filter-0.1.0.drv
  28. 14.01 s Building /nix/store/hb7vrvwgsdv3zmb4nk4r2bwgj32kasrf-gammaloop-ci-test-binary-dependencies-1b17e1ec025c6580-gammaloop-tracing-filter-macros-dev-dependency.toml.drv
  29. 14.03 s Building /nix/store/620cg4lxjsln105525v3nij0sy75ni31-gammaloop-ci-test-binary-dependencies-50150770f831b638-three-dimensional-reps-dev-dependency.toml.drv
  30. 14.03 s Progress: 0 of 10 built (3 building), 3 of 7 downloaded from cache (2 downloading)
  31. 14.08 s [gammaloop-ci-test-binary-dependencies-1b17e1ec025c6580-gammaloop-tracing-filter-macros-dev-dependency.toml:post-build] Uploading to the NixCI cache: /nix/store/gczxq1jnxb2f6nwcbl5zwmigdpgim7v7-gammaloop-ci-test-binary-dependencies-1b17e1ec025c6580-gammaloop-tracing-filter-macros-dev-dependency.toml
  32. 14.13 s [gammaloop-ci-test-binary-dependencies-1b17e1ec025c6580-gammaloop-tracing-filter-macros-dev-dependency.toml:post-build] warning: 'warn-short-path-literals' is deprecated, use 'lint-short-path-literals = ignore' instead
  33. 14.18 s [gammaloop-ci-test-binary-dependencies-1b17e1ec025c6580-gammaloop-tracing-filter-macros-dev-dependency.toml:post-build] copying 0 paths...
  34. 14.25 s [gammaloop-ci-test-binary-dependencies-1b17e1ec025c6580-gammaloop-tracing-filter-macros-dev-dependency.toml:post-build] warning: 'warn-short-path-literals' is deprecated, use 'lint-short-path-literals = ignore' instead
  35. 14.31 s [gammaloop-ci-test-binary-dependencies-1b17e1ec025c6580-gammaloop-tracing-filter-macros-dev-dependency.toml:post-build] copying 0 paths...
  36. 14.34 s Uploaded gammaloop-ci-test-binary-dependencies-1b17e1ec025c6580-gammaloop-tracing-filter-macros-dev-dependency.toml in 274ms
  37. 14.34 s Progress: 1 of 10 built (2 building), 3 of 7 downloaded from cache (2 downloading)
  38. 14.34 s Built gammaloop-ci-test-binary-dependencies-1b17e1ec025c6580-gammaloop-tracing-filter-macros-dev-dependency.toml in 324ms
  39. 14.37 s [gammaloop-ci-test-binary-dependencies-50150770f831b638-three-dimensional-reps-dev-dependency.toml:post-build] Uploading to the NixCI cache: /nix/store/nkd9p6h639pp1ya2nb2yngjw7qb80nfg-gammaloop-ci-test-binary-dependencies-50150770f831b638-three-dimensional-reps-dev-dependency.toml
  40. 14.44 s [gammaloop-ci-test-binary-dependencies-50150770f831b638-three-dimensional-reps-dev-dependency.toml:post-build] warning: 'warn-short-path-literals' is deprecated, use 'lint-short-path-literals = ignore' instead
  41. 14.49 s [gammaloop-ci-test-binary-dependencies-50150770f831b638-three-dimensional-reps-dev-dependency.toml:post-build] copying 0 paths...
  42. 14.55 s [gammaloop-ci-test-binary-dependencies-50150770f831b638-three-dimensional-reps-dev-dependency.toml:post-build] warning: 'warn-short-path-literals' is deprecated, use 'lint-short-path-literals = ignore' instead
  43. 14.61 s [gammaloop-ci-test-binary-dependencies-50150770f831b638-three-dimensional-reps-dev-dependency.toml:post-build] copying 0 paths...
  44. 14.63 s Uploaded gammaloop-ci-test-binary-dependencies-50150770f831b638-three-dimensional-reps-dev-dependency.toml in 285ms
  45. 14.63 s Progress: 2 of 10 built (1 building), 3 of 7 downloaded from cache (2 downloading)
  46. 14.63 s Built gammaloop-ci-test-binary-dependencies-50150770f831b638-three-dimensional-reps-dev-dependency.toml in 596ms
  47. 14.63 s [gammaloop-nextest-binaries-core-gammaloop-tracing-filter] Phase: unpackPhase
  48. 14.63 s [gammaloop-nextest-binaries-core-gammaloop-tracing-filter] unpacking source archive /nix/store/6qq0igzsgzj3gj74k3dak3jwywp7n1mz-source
  49. 14.63 s [gammaloop-nextest-binaries-core-gammaloop-tracing-filter] source root is source
  50. 14.63 s [gammaloop-nextest-binaries-core-gammaloop-tracing-filter] Phase: patchPhase
  51. 14.63 s [gammaloop-nextest-binaries-core-gammaloop-tracing-filter] copying cargo artifacts from /nix/store/6ijfii5wcxl3wag89nscdj4jbmprcmqq-gammaloop-crate-test-binaries-gammaloop-tracing-filter-31e37aec92971227-inputs/target to target
  52. 16.61 s [gammaloop-nextest-binaries-core-gammaloop-tracing-filter] Executing configureCargoCommonVars
  53. 16.61 s [gammaloop-nextest-binaries-core-gammaloop-tracing-filter] decompressing cargo artifacts from /nix/store/gbck5vvd7gd016wrk6fsqh26kx0wi5ac-gammaloop-crate-test-binaries-gammaloop-tracing-filter-31e37aec92971227-deps-0.1.0/target.tar.zst to target
  54. 16.64 s [gammaloop-nextest-binaries-core-gammaloop-tracing-filter] Phase: updateAutotoolsGnuConfigScriptsPhase
  55. 16.68 s [gammaloop-nextest-binaries-core-gammaloop-tracing-filter] Phase: configurePhase
  56. 16.68 s [gammaloop-nextest-binaries-core-gammaloop-tracing-filter] will append /build/source/.cargo-home/config.toml with contents of /nix/store/1sigmg52bb61pfngmk9k8wq5fz9r7bf1-vendor-cargo-deps/config.toml
  57. 16.68 s [gammaloop-nextest-binaries-core-gammaloop-tracing-filter] default configurePhase, nothing to do
  58. 16.69 s [gammaloop-nextest-binaries-core-gammaloop-tracing-filter] Phase: buildPhase
  59. 16.69 s [gammaloop-nextest-binaries-core-gammaloop-tracing-filter] +++ command cargo --version
  60. 16.69 s [gammaloop-nextest-binaries-core-gammaloop-tracing-filter] cargo 1.97.0 (c980f4866 2026-06-30)
  61. 16.74 s [gammaloop-nextest-binaries-core-gammaloop-tracing-filter] +++ command cargo nextest --version
  62. 16.74 s [gammaloop-nextest-binaries-core-gammaloop-tracing-filter] cargo-nextest 0.9.140
  63. 16.75 s [gammaloop-nextest-binaries-core-gammaloop-tracing-filter] release: 0.9.140
  64. 16.75 s [gammaloop-nextest-binaries-core-gammaloop-tracing-filter] host: x86_64-unknown-linux-gnu
  65. 16.75 s [gammaloop-nextest-binaries-core-gammaloop-tracing-filter] +++ command cargo nextest archive --cargo-profile ci-optim --offline -p gammaloop-tracing-filter --features gammaloop-tracing-filter/clap,gammaloop-tracing-filter/symbolica -E 'package(gammaloop-tracing-filter)' --profile ci_gammaloop --archive-file /nix/store/ll6zv4c0ms7j5bsyjsxryjf0jw7997yp-gammaloop-nextest-binaries-core-gammaloop-tracing-filter-0.1.0/gammaloop-nextest-core-gammaloop-tracing-filter.tar.zst
  66. 17.59 s [gammaloop-nextest-binaries-core-gammaloop-tracing-filter] Finished `ci-optim` profile [optimized] target(s) in 0.25s
  67. 17.73 s [gammaloop-nextest-binaries-core-gammaloop-tracing-filter] warning: the following packages contain code that will be rejected by a future version of Rust: proc-macro-error2 v2.0.1
  68. 17.73 s [gammaloop-nextest-binaries-core-gammaloop-tracing-filter] note: to see what the problems were, use the option `--future-incompat-report`, or run `cargo report future-incompatibilities --id 1`
  69. 17.77 s [gammaloop-nextest-binaries-core-gammaloop-tracing-filter] Archiving 1 binary, 1 linked path, and 1 standard library to /nix/store/ll6zv4c0ms7j5bsyjsxryjf0jw7997yp-gammaloop-nextest-binaries-core-gammaloop-tracing-filter-0.1.0/gammaloop-nextest-core-gammaloop-tracing-filter.tar.zst
  70. 17.85 s [gammaloop-nextest-binaries-core-gammaloop-tracing-filter] Archived 7 files to /nix/store/ll6zv4c0ms7j5bsyjsxryjf0jw7997yp-gammaloop-nextest-binaries-core-gammaloop-tracing-filter-0.1.0/gammaloop-nextest-core-gammaloop-tracing-filter.tar.zst in 0.08s
  71. 17.88 s [gammaloop-nextest-binaries-core-gammaloop-tracing-filter] Phase: installPhase
  72. 17.88 s [gammaloop-nextest-binaries-core-gammaloop-tracing-filter] Phase: fixupPhase
  73. 17.88 s [gammaloop-nextest-binaries-core-gammaloop-tracing-filter] shrinking RPATHs of ELF executables and libraries in /nix/store/ll6zv4c0ms7j5bsyjsxryjf0jw7997yp-gammaloop-nextest-binaries-core-gammaloop-tracing-filter-0.1.0
  74. 17.89 s [gammaloop-nextest-binaries-core-gammaloop-tracing-filter] checking for references to /build/ in /nix/store/ll6zv4c0ms7j5bsyjsxryjf0jw7997yp-gammaloop-nextest-binaries-core-gammaloop-tracing-filter-0.1.0...
  75. 17.89 s [gammaloop-nextest-binaries-core-gammaloop-tracing-filter] patching script interpreter paths in /nix/store/ll6zv4c0ms7j5bsyjsxryjf0jw7997yp-gammaloop-nextest-binaries-core-gammaloop-tracing-filter-0.1.0
  76. 18.11 s [gammaloop-nextest-binaries-core-gammaloop-tracing-filter:post-build] Uploading to the NixCI cache: /nix/store/ll6zv4c0ms7j5bsyjsxryjf0jw7997yp-gammaloop-nextest-binaries-core-gammaloop-tracing-filter-0.1.0
  77. 18.16 s [gammaloop-nextest-binaries-core-gammaloop-tracing-filter:post-build] warning: 'warn-short-path-literals' is deprecated, use 'lint-short-path-literals = ignore' instead
  78. 18.17 s [gammaloop-nextest-binaries-core-gammaloop-tracing-filter:post-build] copying 1 paths...
  79. 18.17 s [gammaloop-nextest-binaries-core-gammaloop-tracing-filter:post-build] copying path '/nix/store/ll6zv4c0ms7j5bsyjsxryjf0jw7997yp-gammaloop-nextest-binaries-core-gammaloop-tracing-filter-0.1.0' to 'https://cache.nix-ci.com'...
  80. 21.81 s Downloaded cached gammaloop-crate-test-binaries-gammaloop-tracing-filter-macros-1b17e1ec025c6580-inputs (1.1 GiB) in 7.9s
  81. 22.44 s [gammaloop-nextest-binaries-core-gammaloop-tracing-filter:post-build] warning: 'warn-short-path-literals' is deprecated, use 'lint-short-path-literals = ignore' instead
  82. 22.65 s [gammaloop-nextest-binaries-core-gammaloop-tracing-filter:post-build] copying 1 paths...
  83. 22.65 s [gammaloop-nextest-binaries-core-gammaloop-tracing-filter:post-build] copying path '/nix/store/7llwjkf9ws3lch6p18f0cfrpm3nhsfrk-gammaloop-nextest-binaries-core-gammaloop-tracing-filter-0.1.0.drv' to 'https://cache.nix-ci.com'...
  84. 22.82 s Uploaded gammaloop-nextest-binaries-core-gammaloop-tracing-filter in 4.7s
  85. 22.82 s Progress: 3 of 10 built, 3 of 7 downloaded from cache (2 downloading)
  86. 22.82 s Built gammaloop-nextest-binaries-core-gammaloop-tracing-filter in 8.8s
  87. 22.82 s Progress: 3 of 9 built, 4 of 7 downloaded from cache (1 downloading)
  88. 22.82 s Downloading cached gammaloop-crate-test-binaries-gammaloop-tracing-filter-macros-1b17e1ec025c6580-deps from https://cache.nix-ci.com
  89. 22.83 s Downloaded cached gammaloop-crate-test-binaries-gammaloop-tracing-filter-macros-1b17e1ec025c6580-deps (183 KiB) in 7ms
  90. 22.83 s Progress: 3 of 9 built, 5 of 7 downloaded from cache (1 downloading)
  91. 22.93 s Building /nix/store/yj1h5qlhzw1dcmr3kiwcnxm6insfqx6c-gammaloop-nextest-binaries-core-gammaloop-tracing-filter-macros-0.1.0.drv
  92. 23.01 s [gammaloop-nextest-binaries-core-gammaloop-tracing-filter-macros] Phase: unpackPhase
  93. 23.21 s [gammaloop-nextest-binaries-core-gammaloop-tracing-filter-macros] unpacking source archive /nix/store/mwnbxpzkmp412b5ybxbzrsr2hjmkknha-source
  94. 23.22 s [gammaloop-nextest-binaries-core-gammaloop-tracing-filter-macros] source root is source
  95. 23.23 s [gammaloop-nextest-binaries-core-gammaloop-tracing-filter-macros] Phase: patchPhase
  96. 23.34 s [gammaloop-nextest-binaries-core-gammaloop-tracing-filter-macros] copying cargo artifacts from /nix/store/hirpzqw66djigh51sh9nmc1bp88ic2pr-gammaloop-crate-test-binaries-gammaloop-tracing-filter-macros-1b17e1ec025c6580-inputs/target to target
  97. 24.46 s Downloaded cached gammaloop-crate-test-binaries-three-dimensional-reps-50150770f831b638-inputs (1.5 GiB) in 10.6s
  98. 24.46 s Progress: 3 of 8 built (1 building), 6 of 7 downloaded from cache
  99. 24.46 s Downloading cached gammaloop-crate-test-binaries-three-dimensional-reps-50150770f831b638-deps from https://cache.nix-ci.com
  100. 24.51 s Downloaded cached gammaloop-crate-test-binaries-three-dimensional-reps-50150770f831b638-deps (6.1 MiB) in 54ms
  101. 24.51 s Progress: 3 of 8 built (1 building), 7 of 7 downloaded from cache
  102. 24.59 s Building /nix/store/8b80v1pv4pc3zv4wz89xyq4qy6qi8gqg-gammaloop-nextest-binaries-core-three-dimensional-reps-0.1.0.drv
  103. 24.66 s [gammaloop-nextest-binaries-core-three-dimensional-reps] Phase: unpackPhase
  104. 24.66 s [gammaloop-nextest-binaries-core-three-dimensional-reps] unpacking source archive /nix/store/604b5f1jxx1cxvz4a5zf3hp8pbwjjkgn-source
  105. 24.69 s [gammaloop-nextest-binaries-core-three-dimensional-reps] source root is source
  106. 24.70 s [gammaloop-nextest-binaries-core-three-dimensional-reps] Phase: patchPhase
  107. 24.80 s [gammaloop-nextest-binaries-core-three-dimensional-reps] copying cargo artifacts from /nix/store/ghkj2zjrxybch02818ycvb2bvdjvw2vs-gammaloop-crate-test-binaries-three-dimensional-reps-50150770f831b638-inputs/target to target
  108. 24.85 s [gammaloop-nextest-binaries-core-gammaloop-tracing-filter-macros] Executing configureCargoCommonVars
  109. 24.85 s [gammaloop-nextest-binaries-core-gammaloop-tracing-filter-macros] decompressing cargo artifacts from /nix/store/j1bsycr378zppwn15ccq5i9pk7nn35ps-gammaloop-crate-test-binaries-gammaloop-tracing-filter-macros-1b17e1ec025c6580-deps-0.1.0/target.tar.zst to target
  110. 24.86 s [gammaloop-nextest-binaries-core-gammaloop-tracing-filter-macros] Phase: updateAutotoolsGnuConfigScriptsPhase
  111. 24.89 s [gammaloop-nextest-binaries-core-gammaloop-tracing-filter-macros] Phase: configurePhase
  112. 24.89 s [gammaloop-nextest-binaries-core-gammaloop-tracing-filter-macros] will append /build/source/.cargo-home/config.toml with contents of /nix/store/1sigmg52bb61pfngmk9k8wq5fz9r7bf1-vendor-cargo-deps/config.toml
  113. 24.90 s [gammaloop-nextest-binaries-core-gammaloop-tracing-filter-macros] default configurePhase, nothing to do
  114. 24.90 s [gammaloop-nextest-binaries-core-gammaloop-tracing-filter-macros] Phase: buildPhase
  115. 24.90 s [gammaloop-nextest-binaries-core-gammaloop-tracing-filter-macros] +++ command cargo --version
  116. 24.91 s [gammaloop-nextest-binaries-core-gammaloop-tracing-filter-macros] cargo 1.97.0 (c980f4866 2026-06-30)
  117. 24.94 s [gammaloop-nextest-binaries-core-gammaloop-tracing-filter-macros] +++ command cargo nextest --version
  118. 24.95 s [gammaloop-nextest-binaries-core-gammaloop-tracing-filter-macros] cargo-nextest 0.9.140
  119. 24.95 s [gammaloop-nextest-binaries-core-gammaloop-tracing-filter-macros] release: 0.9.140
  120. 24.95 s [gammaloop-nextest-binaries-core-gammaloop-tracing-filter-macros] host: x86_64-unknown-linux-gnu
  121. 24.95 s [gammaloop-nextest-binaries-core-gammaloop-tracing-filter-macros] +++ command cargo nextest archive --cargo-profile ci-optim --offline -p gammaloop-tracing-filter-macros -E 'package(gammaloop-tracing-filter-macros)' --profile ci_gammaloop --archive-file /nix/store/345c70y0l05zr6b4c2my5x5fyln4v8r5-gammaloop-nextest-binaries-core-gammaloop-tracing-filter-macros-0.1.0/gammaloop-nextest-core-gammaloop-tracing-filter-macros.tar.zst
  122. 25.47 s [gammaloop-nextest-binaries-core-gammaloop-tracing-filter-macros] Finished `ci-optim` profile [optimized] target(s) in 0.17s
  123. 25.50 s [gammaloop-nextest-binaries-core-gammaloop-tracing-filter-macros] Archiving 1 binary and 1 standard library to /nix/store/345c70y0l05zr6b4c2my5x5fyln4v8r5-gammaloop-nextest-binaries-core-gammaloop-tracing-filter-macros-0.1.0/gammaloop-nextest-core-gammaloop-tracing-filter-macros.tar.zst
  124. 25.54 s [gammaloop-nextest-binaries-core-gammaloop-tracing-filter-macros] Archived 4 files to /nix/store/345c70y0l05zr6b4c2my5x5fyln4v8r5-gammaloop-nextest-binaries-core-gammaloop-tracing-filter-macros-0.1.0/gammaloop-nextest-core-gammaloop-tracing-filter-macros.tar.zst in 0.04s
  125. 25.54 s [gammaloop-nextest-binaries-core-gammaloop-tracing-filter-macros] Phase: installPhase
  126. 25.55 s [gammaloop-nextest-binaries-core-gammaloop-tracing-filter-macros] Phase: fixupPhase
  127. 25.56 s [gammaloop-nextest-binaries-core-gammaloop-tracing-filter-macros] shrinking RPATHs of ELF executables and libraries in /nix/store/345c70y0l05zr6b4c2my5x5fyln4v8r5-gammaloop-nextest-binaries-core-gammaloop-tracing-filter-macros-0.1.0
  128. 25.56 s [gammaloop-nextest-binaries-core-gammaloop-tracing-filter-macros] checking for references to /build/ in /nix/store/345c70y0l05zr6b4c2my5x5fyln4v8r5-gammaloop-nextest-binaries-core-gammaloop-tracing-filter-macros-0.1.0...
  129. 25.57 s [gammaloop-nextest-binaries-core-gammaloop-tracing-filter-macros] patching script interpreter paths in /nix/store/345c70y0l05zr6b4c2my5x5fyln4v8r5-gammaloop-nextest-binaries-core-gammaloop-tracing-filter-macros-0.1.0
  130. 25.72 s [gammaloop-nextest-binaries-core-gammaloop-tracing-filter-macros:post-build] Uploading to the NixCI cache: /nix/store/345c70y0l05zr6b4c2my5x5fyln4v8r5-gammaloop-nextest-binaries-core-gammaloop-tracing-filter-macros-0.1.0
  131. 25.76 s [gammaloop-nextest-binaries-core-gammaloop-tracing-filter-macros:post-build] warning: 'warn-short-path-literals' is deprecated, use 'lint-short-path-literals = ignore' instead
  132. 25.76 s [gammaloop-nextest-binaries-core-gammaloop-tracing-filter-macros:post-build] copying 1 paths...
  133. 25.76 s [gammaloop-nextest-binaries-core-gammaloop-tracing-filter-macros:post-build] copying path '/nix/store/345c70y0l05zr6b4c2my5x5fyln4v8r5-gammaloop-nextest-binaries-core-gammaloop-tracing-filter-macros-0.1.0' to 'https://cache.nix-ci.com'...
  134. 26.45 s [gammaloop-nextest-binaries-core-gammaloop-tracing-filter-macros:post-build] warning: 'warn-short-path-literals' is deprecated, use 'lint-short-path-literals = ignore' instead
  135. 26.69 s [gammaloop-nextest-binaries-core-gammaloop-tracing-filter-macros:post-build] copying 1 paths...
  136. 26.69 s [gammaloop-nextest-binaries-core-gammaloop-tracing-filter-macros:post-build] copying path '/nix/store/yj1h5qlhzw1dcmr3kiwcnxm6insfqx6c-gammaloop-nextest-binaries-core-gammaloop-tracing-filter-macros-0.1.0.drv' to 'https://cache.nix-ci.com'...
  137. 26.84 s Uploaded gammaloop-nextest-binaries-core-gammaloop-tracing-filter-macros in 1.1s
  138. 26.84 s Progress: 4 of 8 built (1 building), 7 of 7 downloaded from cache
  139. 26.84 s Built gammaloop-nextest-binaries-core-gammaloop-tracing-filter-macros in 3.9s
  140. 26.84 s [gammaloop-nextest-binaries-core-three-dimensional-reps] Executing configureCargoCommonVars
  141. 26.84 s [gammaloop-nextest-binaries-core-three-dimensional-reps] decompressing cargo artifacts from /nix/store/wyhs6nk5r2g05ghhy4pz6s7bmgvx12rp-gammaloop-crate-test-binaries-three-dimensional-reps-50150770f831b638-deps-0.1.0/target.tar.zst to target
  142. 26.84 s [gammaloop-nextest-binaries-core-three-dimensional-reps] Phase: updateAutotoolsGnuConfigScriptsPhase
  143. 26.84 s [gammaloop-nextest-binaries-core-three-dimensional-reps] Phase: configurePhase
  144. 26.84 s [gammaloop-nextest-binaries-core-three-dimensional-reps] will append /build/source/.cargo-home/config.toml with contents of /nix/store/1sigmg52bb61pfngmk9k8wq5fz9r7bf1-vendor-cargo-deps/config.toml
  145. 26.84 s [gammaloop-nextest-binaries-core-three-dimensional-reps] default configurePhase, nothing to do
  146. 26.84 s [gammaloop-nextest-binaries-core-three-dimensional-reps] Phase: buildPhase
  147. 26.84 s [gammaloop-nextest-binaries-core-three-dimensional-reps] +++ command cargo --version
  148. 26.84 s [gammaloop-nextest-binaries-core-three-dimensional-reps] cargo 1.97.0 (c980f4866 2026-06-30)
  149. 26.84 s [gammaloop-nextest-binaries-core-three-dimensional-reps] +++ command cargo nextest --version
  150. 26.84 s [gammaloop-nextest-binaries-core-three-dimensional-reps] cargo-nextest 0.9.140
  151. 26.84 s [gammaloop-nextest-binaries-core-three-dimensional-reps] release: 0.9.140
  152. 26.84 s [gammaloop-nextest-binaries-core-three-dimensional-reps] host: x86_64-unknown-linux-gnu
  153. 26.84 s [gammaloop-nextest-binaries-core-three-dimensional-reps] +++ command cargo nextest archive --cargo-profile ci-optim --offline -p three-dimensional-reps --features three-dimensional-reps/serde -E 'package(three-dimensional-reps)' --profile ci_gammaloop --archive-file /nix/store/21lsyav8skyfsixh0b491cz6dc0vkdfn-gammaloop-nextest-binaries-core-three-dimensional-reps-0.1.0/gammaloop-nextest-core-three-dimensional-reps.tar.zst
  154. 27.24 s [gammaloop-nextest-binaries-core-three-dimensional-reps] Finished `ci-optim` profile [optimized] target(s) in 0.23s
  155. 27.36 s [gammaloop-nextest-binaries-core-three-dimensional-reps] warning: the following packages contain code that will be rejected by a future version of Rust: proc-macro-error2 v2.0.1
  156. 27.36 s [gammaloop-nextest-binaries-core-three-dimensional-reps] note: to see what the problems were, use the option `--future-incompat-report`, or run `cargo report future-incompatibilities --id 1`
  157. 27.39 s [gammaloop-nextest-binaries-core-three-dimensional-reps] Archiving 1 binary, 1 linked path, and 1 standard library to /nix/store/21lsyav8skyfsixh0b491cz6dc0vkdfn-gammaloop-nextest-binaries-core-three-dimensional-reps-0.1.0/gammaloop-nextest-core-three-dimensional-reps.tar.zst
  158. 27.46 s [gammaloop-nextest-binaries-core-three-dimensional-reps] Archived 7 files to /nix/store/21lsyav8skyfsixh0b491cz6dc0vkdfn-gammaloop-nextest-binaries-core-three-dimensional-reps-0.1.0/gammaloop-nextest-core-three-dimensional-reps.tar.zst in 0.06s
  159. 27.46 s [gammaloop-nextest-binaries-core-three-dimensional-reps] Phase: installPhase
  160. 27.47 s [gammaloop-nextest-binaries-core-three-dimensional-reps] Phase: fixupPhase
  161. 27.48 s [gammaloop-nextest-binaries-core-three-dimensional-reps] shrinking RPATHs of ELF executables and libraries in /nix/store/21lsyav8skyfsixh0b491cz6dc0vkdfn-gammaloop-nextest-binaries-core-three-dimensional-reps-0.1.0
  162. 27.48 s [gammaloop-nextest-binaries-core-three-dimensional-reps] checking for references to /build/ in /nix/store/21lsyav8skyfsixh0b491cz6dc0vkdfn-gammaloop-nextest-binaries-core-three-dimensional-reps-0.1.0...
  163. 27.49 s [gammaloop-nextest-binaries-core-three-dimensional-reps] patching script interpreter paths in /nix/store/21lsyav8skyfsixh0b491cz6dc0vkdfn-gammaloop-nextest-binaries-core-three-dimensional-reps-0.1.0
  164. 27.65 s [gammaloop-nextest-binaries-core-three-dimensional-reps:post-build] Uploading to the NixCI cache: /nix/store/21lsyav8skyfsixh0b491cz6dc0vkdfn-gammaloop-nextest-binaries-core-three-dimensional-reps-0.1.0
  165. 27.69 s [gammaloop-nextest-binaries-core-three-dimensional-reps:post-build] warning: 'warn-short-path-literals' is deprecated, use 'lint-short-path-literals = ignore' instead
  166. 27.69 s [gammaloop-nextest-binaries-core-three-dimensional-reps:post-build] copying 1 paths...
  167. 27.69 s [gammaloop-nextest-binaries-core-three-dimensional-reps:post-build] copying path '/nix/store/21lsyav8skyfsixh0b491cz6dc0vkdfn-gammaloop-nextest-binaries-core-three-dimensional-reps-0.1.0' to 'https://cache.nix-ci.com'...
  168. 31.08 s [gammaloop-nextest-binaries-core-three-dimensional-reps:post-build] warning: 'warn-short-path-literals' is deprecated, use 'lint-short-path-literals = ignore' instead
  169. 31.28 s [gammaloop-nextest-binaries-core-three-dimensional-reps:post-build] copying 1 paths...
  170. 31.28 s [gammaloop-nextest-binaries-core-three-dimensional-reps:post-build] copying path '/nix/store/8b80v1pv4pc3zv4wz89xyq4qy6qi8gqg-gammaloop-nextest-binaries-core-three-dimensional-reps-0.1.0.drv' to 'https://cache.nix-ci.com'...
  171. 31.43 s Uploaded gammaloop-nextest-binaries-core-three-dimensional-reps in 3.8s
  172. 31.43 s Progress: 5 of 8 built, 7 of 7 downloaded from cache
  173. 31.43 s Built gammaloop-nextest-binaries-core-three-dimensional-reps in 6.8s
  174. 31.46 s Building /nix/store/q4ds3wgap85x4l7jjdww1qdgn58v5dix-gammaloop-nextest-binaries-core.drv
  175. 31.53 s [gammaloop-nextest-binaries-core:post-build] Uploading to the NixCI cache: /nix/store/01285wfzxyq4sqp4kbp8l3sfq3ak8p8y-gammaloop-nextest-binaries-core
  176. 31.57 s [gammaloop-nextest-binaries-core:post-build] warning: 'warn-short-path-literals' is deprecated, use 'lint-short-path-literals = ignore' instead
  177. 31.58 s [gammaloop-nextest-binaries-core:post-build] copying 0 paths...
  178. 31.62 s [gammaloop-nextest-binaries-core:post-build] warning: 'warn-short-path-literals' is deprecated, use 'lint-short-path-literals = ignore' instead
  179. 31.75 s [gammaloop-nextest-binaries-core:post-build] copying 0 paths...
  180. 31.77 s Uploaded gammaloop-nextest-binaries-core in 247ms
  181. 31.77 s Progress: 6 of 8 built, 7 of 7 downloaded from cache
  182. 31.77 s Built gammaloop-nextest-binaries-core in 305ms
  183. 31.80 s Building /nix/store/6wfncf5wqc5s2b0x5vaywljvlx2zd8b3-nix-ci-check-gammaloop-nextest-core.drv
  184. 31.87 s [nix-ci-check-gammaloop-nextest-core:post-build] Uploading to the NixCI cache: /nix/store/hmcybrwdkyw2v9bsqyj8dfk0b2bhzamd-nix-ci-check-gammaloop-nextest-core
  185. 31.91 s [nix-ci-check-gammaloop-nextest-core:post-build] warning: 'warn-short-path-literals' is deprecated, use 'lint-short-path-literals = ignore' instead
  186. 31.93 s [nix-ci-check-gammaloop-nextest-core:post-build] copying 0 paths...
  187. 31.97 s [nix-ci-check-gammaloop-nextest-core:post-build] warning: 'warn-short-path-literals' is deprecated, use 'lint-short-path-literals = ignore' instead
  188. 32.17 s [nix-ci-check-gammaloop-nextest-core:post-build] copying 0 paths...
  189. 32.20 s Uploaded nix-ci-check-gammaloop-nextest-core in 335ms
  190. 32.20 s Progress: 7 of 8 built, 7 of 7 downloaded from cache
  191. 32.20 s Built nix-ci-check-gammaloop-nextest-core in 395ms
  192. 32.20 s Progress: 8 of 8 built, 7 of 7 downloaded from cache
  193. 37.25 s evaluating derivation 'g copying '/nix/store/b6fz evaluating derivation 'g copying '/nix/store/b6fz evaluating derivation 'g copying '/nix/store/b6fz evaluating derivation 'g copying '/nix/store/b6fz evaluating derivation 'g copying '/nix/store/b6fz evaluating derivation 'g copying '/nix/store/b6fz evaluating derivation 'g copying '/nix/store/b6fz evaluating derivation 'g copying '/nix/store/b6fz evaluating derivation 'g copying '/nix/store/b6fz evaluating derivation 'g querying gammaloop-nexte [0/11 built, 0.0 KiB DL] [0/1 built, 0.0 KiB DL] [1/0/1 built, 0.0 KiB DLgammaloop-nextest-core> Extracting 3 binaries (including 1 non-test binary), 1 build script output directory, and 2 linked paths to /build/nextest-archive-2ydUp3
  194. 37.73 s gammaloop-nextest-core> Extracted 18 files to /build/nextest-archive-2ydUp3 in 0.49s
  195. 37.74 s gammaloop-nextest-core> ------------
  196. 37.74 s gammaloop-nextest-core> Nextest run ID a856d9f2-686d-40b2-86f7-4598c93484ce with nextest profile: ci_gammaloop
  197. 37.74 s gammaloop-nextest-core> Starting 367 tests across 2 binaries
  198. 38.49 s gammaloop-nextest-core> ------------
  199. 38.49 s gammaloop-nextest-core> Summary [ 0.745s] 367 tests run: 367 passed, 0 skipped
  200. 38.64 s gammaloop-nextest-core>
  201. 38.64 s gammaloop-nextest-core> ========== nextest test summary ==========
  202. 38.64 s gammaloop-nextest-core> report: target/nextest/ci_gammaloop/junit.xml
  203. 38.64 s gammaloop-nextest-core> tests: 367, failures: 0, errors: 0
  204. 38.64 s gammaloop-nextest-core> No failing testcases found.
  205. 38.64 s gammaloop-nextest-core> =========================================
  206. 38.66 s gammaloop-nextest-core> Extracting 1 binary and 1 linked path to /build/nextest-archive-DkaeiJ
  207. 38.77 s gammaloop-nextest-core> Extracted 7 files to /build/nextest-archive-DkaeiJ in 0.10s
  208. 38.78 s gammaloop-nextest-core> ------------
  209. 38.78 s gammaloop-nextest-core> Nextest run ID c41efd5b-b2bc-4170-acef-1bd18cf6bd37 with nextest profile: ci_gammaloop
  210. 38.78 s gammaloop-nextest-core> Starting 19 tests across 1 binary
  211. 38.80 s gammaloop-nextest-core> ------------
  212. 38.80 s gammaloop-nextest-core> Summary [ 0.020s] 19 tests run: 19 passed, 0 skipped
  213. 38.86 s gammaloop-nextest-core>
  214. 38.86 s gammaloop-nextest-core> ========== nextest test summary ==========
  215. 38.86 s gammaloop-nextest-core> report: target/nextest/ci_gammaloop/junit.xml
  216. 38.86 s gammaloop-nextest-core> tests: 19, failures: 0, errors: 0
  217. 38.86 s gammaloop-nextest-core> No failing testcases found.
  218. 38.86 s gammaloop-nextest-core> =========================================
  219. 38.88 s gammaloop-nextest-core> Extracting 1 binary to /build/nextest-archive-dfVR97
  220. 38.92 s gammaloop-nextest-core> Extracted 4 files to /build/nextest-archive-dfVR97 in 0.05s
  221. 38.93 s gammaloop-nextest-core> ------------
  222. 38.93 s gammaloop-nextest-core> Nextest run ID 38d99550-314d-416b-b229-5197891cf99f with nextest profile: ci_gammaloop
  223. 38.93 s gammaloop-nextest-core> Starting 0 tests across 1 binary
  224. 38.93 s gammaloop-nextest-core> ------------
  225. 38.93 s gammaloop-nextest-core> Summary [ 0.000s] 0 tests run: 0 passed, 0 skipped
  226. 38.99 s gammaloop-nextest-core>
  227. 38.99 s gammaloop-nextest-core> ========== nextest test summary ==========
  228. 38.99 s gammaloop-nextest-core> report: target/nextest/ci_gammaloop/junit.xml
  229. 38.99 s gammaloop-nextest-core> tests: 0, failures: 0, errors: 0
  230. 38.99 s gammaloop-nextest-core> No failing testcases found.
  231. 38.99 s gammaloop-nextest-core> =========================================
  232. 39.01 s gammaloop-nextest-core> Extracting 4 binaries, 1 build script output directory, and 2 linked paths to /build/nextest-archive-2r6Y3e
  233. 39.69 s gammaloop-nextest-core> Extracted 18 files to /build/nextest-archive-2r6Y3e in 0.69s
  234. 39.71 s gammaloop-nextest-core> ------------
  235. 39.71 s gammaloop-nextest-core> Nextest run ID 73669b91-3f0e-409c-a693-5d29f5a66b04 with nextest profile: ci_gammaloop
  236. 39.71 s gammaloop-nextest-core> Starting 501 tests across 4 binaries (59 tests skipped, including 58 tests via profile.ci_gammaloop.default-filter)
  237. 41.40 s gammaloop-nextest-core> FAIL [ 0.237s] (483/501) gammalooprs uv::hedge_poset::tests::union_terms_project_factorized_typed_4d_values
  238. 41.40 s gammaloop-nextest-core> stdout ---
  239. 41.40 s gammaloop-nextest-core>
  240. 41.40 s gammaloop-nextest-core> running 1 test
  241. 41.40 s gammaloop-nextest-core> test uv::hedge_poset::tests::union_terms_project_factorized_typed_4d_values ... FAILED
  242. 41.40 s gammaloop-nextest-core>
  243. 41.40 s gammaloop-nextest-core> failures:
  244. 41.40 s gammaloop-nextest-core>
  245. 41.40 s gammaloop-nextest-core> failures:
  246. 41.40 s gammaloop-nextest-core> uv::hedge_poset::tests::union_terms_project_factorized_typed_4d_values
  247. 41.40 s gammaloop-nextest-core>
  248. 41.40 s gammaloop-nextest-core> test result: FAILED. 0 passed; 1 failed; 0 ignored; 0 measured; 551 filtered out; finished in 0.22s
  249. 41.40 s gammaloop-nextest-core>
  250. 41.40 s gammaloop-nextest-core> stderr ---
  251. 41.40 s gammaloop-nextest-core> Error:
  252. 41.40 s gammaloop-nextest-core> 0: exact source occurrences for physical edge 1 disagree after on-shell-energy replacement: `-(mUVexp^2+Q(1,cind(1))^2+Q(1,cind(2))^2+Q(1,cind(3))^2)^(1/2)` versus `(mUVexp^2+Q(1,cind(1))^2+Q(1,cind(2))^2+Q(1,cind(3))^2)^(1/2)`; exact 4D term active denominators are [FourDDenominator { source_edge: EdgeIndex(1), momentum: gammalooprs::Q(1), mass_squared: gammalooprs::mUVexp^2, full_expr: -gammalooprs::mUV^2+spenso::dot(gammalooprs::Q(1,spenso::mink(gammalooprs::dim)),gammalooprs::Q(1,spenso::mink(gammalooprs::dim))) }, FourDDenominator { source_edge: EdgeIndex(1), momentum: gammalooprs::Q(1), mass_squared: gammalooprs::mUVexp^2, full_expr: -gammalooprs::mUV^2+spenso::dot(gammalooprs::Q(1,spenso::mink(gammalooprs::dim)),gammalooprs::Q(1,spenso::mink(gammalooprs::dim))) }, FourDDenominator { source_edge: EdgeIndex(3), momentum: gammalooprs::Q(3), mass_squared: gammalooprs::mUVexp^2, full_expr: -gammalooprs::mUV^2+spenso::dot(gammalooprs::Q(3,spenso::mink(gammalooprs::dim)),gammalooprs::Q(3,spenso::mink(gammalooprs::dim))) }, FourDDenominator { source_edge: EdgeIndex(3), momentum: gammalooprs::Q(3), mass_squared: gammalooprs::mUVexp^2, full_expr: -gammalooprs::mUV^2+spenso::dot(gammalooprs::Q(3,spenso::mink(gammalooprs::dim)),gammalooprs::Q(3,spenso::mink(gammalooprs::dim))) }, FourDDenominator { source_edge: EdgeIndex(0), momentum: gammalooprs::Q(0), mass_squared: UFO::mass_scalar_1^2, full_expr: -UFO::mass_scalar_1^2+spenso::dot(gammalooprs::Q(0,spenso::mink(gammalooprs::dim)),gammalooprs::Q(0,spenso::mink(gammalooprs::dim))) }]
  253. 41.40 s gammaloop-nextest-core>
  254. 41.40 s gammaloop-nextest-core> Location:
  255. 41.40 s gammaloop-nextest-core> crates/gammalooprs/src/uv/approx/local_3d.rs:641
  256. 41.40 s gammaloop-nextest-core>
  257. 41.40 s gammaloop-nextest-core> ━━━━━━━━━━━━━━━━━━━━━━━━━━━━━━━━━━ BACKTRACE ━━━━━━━━━━━━━━━━━━━━━━━━━━━━━━━━━━━
  258. 41.40 s gammaloop-nextest-core> 1: <color_eyre[51793ea62743adbd]::config::EyreHook>::into_eyre_hook::{closure#0}<unknown>
  259. 41.40 s gammaloop-nextest-core> at <unknown source file>:<unknown line>
  260. 41.40 s gammaloop-nextest-core> 2: eyre[cb2fd339c0c40fca]::capture_handler<unknown>
  261. 41.40 s gammaloop-nextest-core> at <unknown source file>:<unknown line>
  262. 41.40 s gammaloop-nextest-core> 3: <eyre[cb2fd339c0c40fca]::Report>::from_adhoc::<alloc[2ea6bcb46fca0c42]::string::String><unknown>
  263. 41.40 s gammaloop-nextest-core> at <unknown source file>:<unknown line>
  264. 41.40 s gammaloop-nextest-core> 4: <gammalooprs[6dc202c8af9e2ddf]::uv::approx::local_3d::Localizer>::project_4d<unknown>
  265. 41.40 s gammaloop-nextest-core> at <unknown source file>:<unknown line>
  266. 41.40 s gammaloop-nextest-core> 5: gammalooprs[6dc202c8af9e2ddf]::uv::hedge_poset::tests::union_terms_project_factorized_typed_4d_values<unknown>
  267. 41.40 s gammaloop-nextest-core> at <unknown source file>:<unknown line>
  268. 41.40 s gammaloop-nextest-core> 6: <gammalooprs[6dc202c8af9e2ddf]::uv::hedge_poset::tests::union_terms_project_factorized_typed_4d_values::{closure#0} as core[940e698046960fd5]::ops::function::FnOnce<()>>::call_once<unknown>
  269. 41.40 s gammaloop-nextest-core> at <unknown source file>:<unknown line>
  270. 41.40 s gammaloop-nextest-core> 7: test[75d6903177b1d7e9]::__rust_begin_short_backtrace::<core[940e698046960fd5]::result::Result<(), alloc[2ea6bcb46fca0c42]::string::String>, fn() -> core[940e698046960fd5]::result::Result<(), alloc[2ea6bcb46fca0c42]::string::String>><unknown>
  271. 41.40 s gammaloop-nextest-core> at <unknown source file>:<unknown line>
  272. 41.40 s gammaloop-nextest-core> 8: test[75d6903177b1d7e9]::run_test::{closure#0}<unknown>
  273. 41.40 s gammaloop-nextest-core> at <unknown source file>:<unknown line>
  274. 41.40 s gammaloop-nextest-core> 9: std[bcb96dfbba0ab899]::sys::backtrace::__rust_begin_short_backtrace::<test[75d6903177b1d7e9]::run_test::{closure#1}, ()><unknown>
  275. 41.40 s gammaloop-nextest-core> at <unknown source file>:<unknown line>
  276. 41.40 s gammaloop-nextest-core> 10: <std[bcb96dfbba0ab899]::thread::lifecycle::spawn_unchecked<test[75d6903177b1d7e9]::run_test::{closure#1}, ()>::{closure#1} as core[940e698046960fd5]::ops::function::FnOnce<()>>::call_once::{shim:vtable#0}<unknown>
  277. 41.40 s gammaloop-nextest-core> at <unknown source file>:<unknown line>
  278. 41.40 s gammaloop-nextest-core> 11: <std[bcb96dfbba0ab899]::sys::thread::unix::Thread>::new::thread_start<unknown>
  279. 41.40 s gammaloop-nextest-core> at <unknown source file>:<unknown line>
  280. 41.40 s gammaloop-nextest-core> 12: start_thread<unknown>
  281. 41.40 s gammaloop-nextest-core> at <unknown source file>:<unknown line>
  282. 41.40 s gammaloop-nextest-core> 13: __clone3<unknown>
  283. 41.40 s gammaloop-nextest-core> at <unknown source file>:<unknown line>
  284. 41.40 s gammaloop-nextest-core>
  285. 41.40 s gammaloop-nextest-core> Run with COLORBT_SHOW_HIDDEN=1 environment variable to disable frame filtering.
  286. 41.40 s gammaloop-nextest-core> Run with RUST_BACKTRACE=full to include source snippets.
  287. 41.41 s gammaloop-nextest-core>
  288. 47.05 s gammaloop-nextest-core> FAIL [ 5.655s] (497/501) gammalooprs::test_renormalization finite_part_ghost_2loop
  289. 47.06 s gammaloop-nextest-core> stdout ---
  290. 47.06 s gammaloop-nextest-core>
  291. 47.06 s gammaloop-nextest-core> running 1 test
  292. 47.06 s gammaloop-nextest-core> test finite_part_ghost_2loop ... FAILED
  293. 47.06 s gammaloop-nextest-core>
  294. 47.06 s gammaloop-nextest-core> failures:
  295. 47.06 s gammaloop-nextest-core>
  296. 47.06 s gammaloop-nextest-core> failures:
  297. 47.06 s gammaloop-nextest-core> finite_part_ghost_2loop
  298. 47.06 s gammaloop-nextest-core>
  299. 47.06 s gammaloop-nextest-core> test result: FAILED. 0 passed; 1 failed; 0 ignored; 0 measured; 5 filtered out; finished in 5.64s
  300. 47.06 s gammaloop-nextest-core>
  301. 47.06 s gammaloop-nextest-core> stderr ---
  302. 47.06 s gammaloop-nextest-core> [16:29:12.294] @gammalooprs::processes::amplitude ERROR :
  303. 47.06 s gammaloop-nextest-core> field value
  304. 47.06 s gammaloop-nextest-core> error generalized CFF expression generation failed for graph `d5` with source-edge numerator energy-degree bounds Some([(1, 1), (2, 1), (3, 1), (5, 2), (6, 2)]): energy-degree bounds do not certify vanishing residues at infinity under the conservative cap check: EnergyDivergenceReport { edge_degree_bounds: [1, 1, 1, 2, 2], loops: [EnergyDirectionReport { loop_id: Some(0), zero_edges: [], active_edges: [0, 1, 2, 4], nullity: None, numerator_degree_bound: 5, denominator_degree: 8, divergence_degree: -3, convergent: true }, EnergyDirectionReport { loop_id: Some(1), zero_edges: [], active_edges: [3, 4], nullity: None, numerator_degree_bound: 4, denominator_degree: 4, divergence_degree: 0, convergent: false }], directions: [EnergyDirectionReport { loop_id: None, zero_edges: [0, 1, 2], active_edges: [3, 4], nullity: Some(1), numerator_degree_bound: 4, denominator_degree: 4, divergence_degree: 0, convergent: false }, EnergyDirectionReport { loop_id: None, zero_edges: [], active_edges: [0, 1, 2, 3, 4], nullity: Some(2), numerator_degree_bound: 7, denominator_degree: 10, divergence_degree: -3, convergent: true }, EnergyDirectionReport { loop_id: None, zero_edges: [3], active_edges: [0, 1, 2, 4], nullity: Some(1), numerator_degree_bound: 5, denominator_degree: 8, divergence_degree: -3, convergent: true }, EnergyDirectionReport { loop_id: None, zero_edges: [4], active_edges: [0, 1, 2, 3], nullity: Some(1), numerator_degree_bound: 5, denominator_degree: 8, divergence_degree: -3, convergent: true }], coordinate_convergent: false, directional_convergent: false, convergent: false }
  305. 47.06 s gammaloop-nextest-core> 3D source has 2 loop names ["e1", "e5"], 5 internal edges [edge 0: 0 -> 1, loops=[1, 0], externals=[0, 0]; edge 1: 0 -> 2, loops=[-1, 0], externals=[1, 0]; edge 2: 1 -> 3, loops=[1, 0], externals=[-1, 0]; edge 3: 2 -> 3, loops=[0, 1], externals=[0, 0]; edge 4: 2 -> 3, loops=[-1, -1], externals=[1, 0]]
  306. 47.06 s gammaloop-nextest-core> at crates/gammalooprs/src/processes/amplitude.rs:825
  307. 47.06 s gammaloop-nextest-core> The application panicked (crashed).
  308. 47.06 s gammaloop-nextest-core> Message: called `Result::unwrap()` on an `Err` value:
  309. 47.06 s gammaloop-nextest-core> 0: generalized CFF expression generation failed for graph `d5` with source-edge numerator energy-degree bounds Some([(1, 1), (2, 1), (3, 1), (5, 2), (6, 2)]): energy-degree bounds do not certify vanishing residues at infinity under the conservative cap check: EnergyDivergenceReport { edge_degree_bounds: [1, 1, 1, 2, 2], loops: [EnergyDirectionReport { loop_id: Some(0), zero_edges: [], active_edges: [0, 1, 2, 4], nullity: None, numerator_degree_bound: 5, denominator_degree: 8, divergence_degree: -3, convergent: true }, EnergyDirectionReport { loop_id: Some(1), zero_edges: [], active_edges: [3, 4], nullity: None, numerator_degree_bound: 4, denominator_degree: 4, divergence_degree: 0, convergent: false }], directions: [EnergyDirectionReport { loop_id: None, zero_edges: [0, 1, 2], active_edges: [3, 4], nullity: Some(1), numerator_degree_bound: 4, denominator_degree: 4, divergence_degree: 0, convergent: false }, EnergyDirectionReport { loop_id: None, zero_edges: [], active_edges: [0, 1, 2, 3, 4], nullity: Some(2), numerator_degree_bound: 7, denominator_degree: 10, divergence_degree: -3, convergent: true }, EnergyDirectionReport { loop_id: None, zero_edges: [3], active_edges: [0, 1, 2, 4], nullity: Some(1), numerator_degree_bound: 5, denominator_degree: 8, divergence_degree: -3, convergent: true }, EnergyDirectionReport { loop_id: None, zero_edges: [4], active_edges: [0, 1, 2, 3], nullity: Some(1), numerator_degree_bound: 5, denominator_degree: 8, divergence_degree: -3, convergent: true }], coordinate_convergent: false, directional_convergent: false, convergent: false }
  310. 47.06 s gammaloop-nextest-core> 3D source has 2 loop names ["e1", "e5"], 5 internal edges [edge 0: 0 -> 1, loops=[1, 0], externals=[0, 0]; edge 1: 0 -> 2, loops=[-1, 0], externals=[1, 0]; edge 2: 1 -> 3, loops=[1, 0], externals=[-1, 0]; edge 3: 2 -> 3, loops=[0, 1], externals=[0, 0]; edge 4: 2 -> 3, loops=[-1, -1], externals=[1, 0]]
  311. 47.06 s gammaloop-nextest-core>
  312. 47.06 s gammaloop-nextest-core> Location:
  313. 47.06 s gammaloop-nextest-core> crates/gammalooprs/src/cff/generation.rs:226
  314. 47.06 s gammaloop-nextest-core>
  315. 47.06 s gammaloop-nextest-core> ━━━━━━━━━━━━━━━━━━━━━━━━━━━━━━━━━━ BACKTRACE ━━━━━━━━━━━━━━━━━━━━━━━━━━━━━━━━━━━
  316. 47.06 s gammaloop-nextest-core> 1: <color_eyre[51793ea62743adbd]::config::EyreHook>::into_eyre_hook::{closure#0}<unknown>
  317. 47.06 s gammaloop-nextest-core> at <unknown source file>:<unknown line>
  318. 47.06 s gammaloop-nextest-core> 2: eyre[cb2fd339c0c40fca]::capture_handler<unknown>
  319. 47.06 s gammaloop-nextest-core> at <unknown source file>:<unknown line>
  320. 47.06 s gammaloop-nextest-core> 3: <eyre[cb2fd339c0c40fca]::Report>::from_adhoc::<alloc[2ea6bcb46fca0c42]::string::String><unknown>
  321. 47.06 s gammaloop-nextest-core> at <unknown source file>:<unknown line>
  322. 47.06 s gammaloop-nextest-core> 4: <gammalooprs[1d0b14476f7eb2f8]::graph::Graph>::generate_3d_expression_for_integrand<unknown>
  323. 47.06 s gammaloop-nextest-core> at <unknown source file>:<unknown line>
  324. 47.06 s gammaloop-nextest-core> 5: <gammalooprs[1d0b14476f7eb2f8]::processes::amplitude::AmplitudeGraph>::generate_cff<unknown>
  325. 47.06 s gammaloop-nextest-core> at <unknown source file>:<unknown line>
  326. 47.06 s gammaloop-nextest-core> 6: <gammalooprs[1d0b14476f7eb2f8]::processes::amplitude::AmplitudeGraph>::renormalization_part<unknown>
  327. 47.06 s gammaloop-nextest-core> at <unknown source file>:<unknown line>
  328. 47.06 s gammaloop-nextest-core> 7: test_renormalization[879b57236d814a44]::finite_part_ghost_2loop<unknown>
  329. 47.06 s gammaloop-nextest-core> at <unknown source file>:<unknown line>
  330. 47.06 s gammaloop-nextest-core> 8: <test_renormalization[879b57236d814a44]::finite_part_ghost_2loop::{closure#0} as core[940e698046960fd5]::ops::function::FnOnce<()>>::call_once<unknown>
  331. 47.06 s gammaloop-nextest-core> at <unknown source file>:<unknown line>
  332. 47.06 s gammaloop-nextest-core> 9: test[75d6903177b1d7e9]::__rust_begin_short_backtrace::<core[940e698046960fd5]::result::Result<(), alloc[2ea6bcb46fca0c42]::string::String>, fn() -> core[940e698046960fd5]::result::Result<(), alloc[2ea6bcb46fca0c42]::string::String>><unknown>
  333. 47.06 s gammaloop-nextest-core> at <unknown source file>:<unknown line>
  334. 47.06 s gammaloop-nextest-core> 10: test[75d6903177b1d7e9]::run_test::{closure#0}<unknown>
  335. 47.06 s gammaloop-nextest-core> at <unknown source file>:<unknown line>
  336. 47.06 s gammaloop-nextest-core> 11: std[bcb96dfbba0ab899]::sys::backtrace::__rust_begin_short_backtrace::<test[75d6903177b1d7e9]::run_test::{closure#1}, ()><unknown>
  337. 47.06 s gammaloop-nextest-core> at <unknown source file>:<unknown line>
  338. 47.06 s gammaloop-nextest-core> 12: <std[bcb96dfbba0ab899]::thread::lifecycle::spawn_unchecked<test[75d6903177b1d7e9]::run_test::{closure#1}, ()>::{closure#1} as core[940e698046960fd5]::ops::function::FnOnce<()>>::call_once::{shim:vtable#0}<unknown>
  339. 47.06 s gammaloop-nextest-core> at <unknown source file>:<unknown line>
  340. 47.06 s gammaloop-nextest-core> 13: <std[bcb96dfbba0ab899]::sys::thread::unix::Thread>::new::thread_start<unknown>
  341. 47.06 s gammaloop-nextest-core> at <unknown source file>:<unknown line>
  342. 47.06 s gammaloop-nextest-core> 14: start_thread<unknown>
  343. 47.06 s gammaloop-nextest-core> at <unknown source file>:<unknown line>
  344. 47.06 s gammaloop-nextest-core> 15: __clone3<unknown>
  345. 47.06 s gammaloop-nextest-core> at <unknown source file>:<unknown line>
  346. 47.06 s gammaloop-nextest-core>
  347. 47.06 s gammaloop-nextest-core> Run with COLORBT_SHOW_HIDDEN=1 environment variable to disable frame filtering.
  348. 47.06 s gammaloop-nextest-core> Run with RUST_BACKTRACE=full to include source snippets.
  349. 47.06 s gammaloop-nextest-core> Warning: SpanTrace capture is Unsupported.
  350. 47.06 s gammaloop-nextest-core> Ensure that you've setup a tracing-error ErrorLayer and the semver versions are compatible
  351. 47.06 s gammaloop-nextest-core> Location: crates/gammalooprs/tests/test_renormalization.rs:495
  352. 47.06 s gammaloop-nextest-core>
  353. 47.06 s gammaloop-nextest-core> ━━━━━━━━━━━━━━━━━━━━━━━━━━━━━━━━━━ BACKTRACE ━━━━━━━━━━━━━━━━━━━━━━━━━━━━━━━━━━━
  354. 47.06 s gammaloop-nextest-core> 1: <color_eyre[51793ea62743adbd]::config::PanicHook>::panic_report<unknown>
  355. 47.06 s gammaloop-nextest-core> at <unknown source file>:<unknown line>
  356. 47.06 s gammaloop-nextest-core> 2: <color_eyre[51793ea62743adbd]::config::PanicHook>::into_panic_hook::{closure#0}<unknown>
  357. 47.06 s gammaloop-nextest-core> at <unknown source file>:<unknown line>
  358. 47.06 s gammaloop-nextest-core> 3: std[bcb96dfbba0ab899]::panicking::panic_with_hook<unknown>
  359. 47.06 s gammaloop-nextest-core> at <unknown source file>:<unknown line>
  360. 47.06 s gammaloop-nextest-core> 4: std[bcb96dfbba0ab899]::panicking::panic_handler::{closure#0}<unknown>
  361. 47.06 s gammaloop-nextest-core> at <unknown source file>:<unknown line>
  362. 47.06 s gammaloop-nextest-core> 5: std[bcb96dfbba0ab899]::sys::backtrace::__rust_end_short_backtrace::<std[bcb96dfbba0ab899]::panicking::panic_handler::{closure#0}, !><unknown>
  363. 47.06 s gammaloop-nextest-core> at <unknown source file>:<unknown line>
  364. 47.06 s gammaloop-nextest-core> 6: __rustc[6c289b9f9c454d21]::rust_begin_unwind<unknown>
  365. 47.06 s gammaloop-nextest-core> at <unknown source file>:<unknown line>
  366. 47.06 s gammaloop-nextest-core> 7: core[940e698046960fd5]::panicking::panic_fmt<unknown>
  367. 47.06 s gammaloop-nextest-core> at <unknown source file>:<unknown line>
  368. 47.06 s gammaloop-nextest-core> 8: core[940e698046960fd5]::result::unwrap_failed<unknown>
  369. 47.06 s gammaloop-nextest-core> at <unknown source file>:<unknown line>
  370. 47.06 s gammaloop-nextest-core> 9: test_renormalization[879b57236d814a44]::finite_part_ghost_2loop<unknown>
  371. 47.06 s gammaloop-nextest-core> at <unknown source file>:<unknown line>
  372. 47.06 s gammaloop-nextest-core> 10: <test_renormalization[879b57236d814a44]::finite_part_ghost_2loop::{closure#0} as core[940e698046960fd5]::ops::function::FnOnce<()>>::call_once<unknown>
  373. 47.06 s gammaloop-nextest-core> at <unknown source file>:<unknown line>
  374. 47.06 s gammaloop-nextest-core> 11: test[75d6903177b1d7e9]::__rust_begin_short_backtrace::<core[940e698046960fd5]::result::Result<(), alloc[2ea6bcb46fca0c42]::string::String>, fn() -> core[940e698046960fd5]::result::Result<(), alloc[2ea6bcb46fca0c42]::string::String>><unknown>
  375. 47.06 s gammaloop-nextest-core> at <unknown source file>:<unknown line>
  376. 47.06 s gammaloop-nextest-core> 12: test[75d6903177b1d7e9]::run_test::{closure#0}<unknown>
  377. 47.06 s gammaloop-nextest-core> at <unknown source file>:<unknown line>
  378. 47.06 s gammaloop-nextest-core> 13: std[bcb96dfbba0ab899]::sys::backtrace::__rust_begin_short_backtrace::<test[75d6903177b1d7e9]::run_test::{closure#1}, ()><unknown>
  379. 47.06 s gammaloop-nextest-core> at <unknown source file>:<unknown line>
  380. 47.06 s gammaloop-nextest-core> 14: <std[bcb96dfbba0ab899]::thread::lifecycle::spawn_unchecked<test[75d6903177b1d7e9]::run_test::{closure#1}, ()>::{closure#1} as core[940e698046960fd5]::ops::function::FnOnce<()>>::call_once::{shim:vtable#0}<unknown>
  381. 47.06 s gammaloop-nextest-core> at <unknown source file>:<unknown line>
  382. 47.06 s gammaloop-nextest-core> 15: <std[bcb96dfbba0ab899]::sys::thread::unix::Thread>::new::thread_start<unknown>
  383. 47.06 s gammaloop-nextest-core> at <unknown source file>:<unknown line>
  384. 47.06 s gammaloop-nextest-core> 16: start_thread<unknown>
  385. 47.06 s gammaloop-nextest-core> at <unknown source file>:<unknown line>
  386. 47.06 s gammaloop-nextest-core> 17: __clone3<unknown>
  387. 47.06 s gammaloop-nextest-core> at <unknown source file>:<unknown line>
  388. 47.06 s gammaloop-nextest-core>
  389. 47.06 s gammaloop-nextest-core> Run with COLORBT_SHOW_HIDDEN=1 environment variable to disable frame filtering.
  390. 47.06 s gammaloop-nextest-core> Run with RUST_BACKTRACE=full to include source snippets.
  391. 47.06 s gammaloop-nextest-core>
  392. 51.19 s gammaloop-nextest-core> ------------
  393. 51.19 s gammaloop-nextest-core> Summary [ 11.484s] 501 tests run: 499 passed, 2 failed, 59 skipped
  394. 51.19 s gammaloop-nextest-core> FAIL [ 0.237s] (483/501) gammalooprs uv::hedge_poset::tests::union_terms_project_factorized_typed_4d_values
  395. 51.19 s gammaloop-nextest-core> stdout ---
  396. 51.19 s gammaloop-nextest-core>
  397. 51.19 s gammaloop-nextest-core> running 1 test
  398. 51.19 s gammaloop-nextest-core> test uv::hedge_poset::tests::union_terms_project_factorized_typed_4d_values ... FAILED
  399. 51.19 s gammaloop-nextest-core>
  400. 51.19 s gammaloop-nextest-core> failures:
  401. 51.19 s gammaloop-nextest-core>
  402. 51.19 s gammaloop-nextest-core> failures:
  403. 51.19 s gammaloop-nextest-core> uv::hedge_poset::tests::union_terms_project_factorized_typed_4d_values
  404. 51.19 s gammaloop-nextest-core>
  405. 51.19 s gammaloop-nextest-core> test result: FAILED. 0 passed; 1 failed; 0 ignored; 0 measured; 551 filtered out; finished in 0.22s
  406. 51.19 s gammaloop-nextest-core>
  407. 51.19 s gammaloop-nextest-core> stderr ---
  408. 51.19 s gammaloop-nextest-core> Error:
  409. 51.19 s gammaloop-nextest-core> 0: exact source occurrences for physical edge 1 disagree after on-shell-energy replacement: `-(mUVexp^2+Q(1,cind(1))^2+Q(1,cind(2))^2+Q(1,cind(3))^2)^(1/2)` versus `(mUVexp^2+Q(1,cind(1))^2+Q(1,cind(2))^2+Q(1,cind(3))^2)^(1/2)`; exact 4D term active denominators are [FourDDenominator { source_edge: EdgeIndex(1), momentum: gammalooprs::Q(1), mass_squared: gammalooprs::mUVexp^2, full_expr: -gammalooprs::mUV^2+spenso::dot(gammalooprs::Q(1,spenso::mink(gammalooprs::dim)),gammalooprs::Q(1,spenso::mink(gammalooprs::dim))) }, FourDDenominator { source_edge: EdgeIndex(1), momentum: gammalooprs::Q(1), mass_squared: gammalooprs::mUVexp^2, full_expr: -gammalooprs::mUV^2+spenso::dot(gammalooprs::Q(1,spenso::mink(gammalooprs::dim)),gammalooprs::Q(1,spenso::mink(gammalooprs::dim))) }, FourDDenominator { source_edge: EdgeIndex(3), momentum: gammalooprs::Q(3), mass_squared: gammalooprs::mUVexp^2, full_expr: -gammalooprs::mUV^2+spenso::dot(gammalooprs::Q(3,spenso::mink(gammalooprs::dim)),gammalooprs::Q(3,spenso::mink(gammalooprs::dim))) }, FourDDenominator { source_edge: EdgeIndex(3), momentum: gammalooprs::Q(3), mass_squared: gammalooprs::mUVexp^2, full_expr: -gammalooprs::mUV^2+spenso::dot(gammalooprs::Q(3,spenso::mink(gammalooprs::dim)),gammalooprs::Q(3,spenso::mink(gammalooprs::dim))) }, FourDDenominator { source_edge: EdgeIndex(0), momentum: gammalooprs::Q(0), mass_squared: UFO::mass_scalar_1^2, full_expr: -UFO::mass_scalar_1^2+spenso::dot(gammalooprs::Q(0,spenso::mink(gammalooprs::dim)),gammalooprs::Q(0,spenso::mink(gammalooprs::dim))) }]
  410. 51.19 s gammaloop-nextest-core>
  411. 51.19 s gammaloop-nextest-core> Location:
  412. 51.19 s gammaloop-nextest-core> crates/gammalooprs/src/uv/approx/local_3d.rs:641
  413. 51.19 s gammaloop-nextest-core>
  414. 51.19 s gammaloop-nextest-core> ━━━━━━━━━━━━━━━━━━━━━━━━━━━━━━━━━━ BACKTRACE ━━━━━━━━━━━━━━━━━━━━━━━━━━━━━━━━━━━
  415. 51.19 s gammaloop-nextest-core> 1: <color_eyre[51793ea62743adbd]::config::EyreHook>::into_eyre_hook::{closure#0}<unknown>
  416. 51.19 s gammaloop-nextest-core> at <unknown source file>:<unknown line>
  417. 51.19 s gammaloop-nextest-core> 2: eyre[cb2fd339c0c40fca]::capture_handler<unknown>
  418. 51.19 s gammaloop-nextest-core> at <unknown source file>:<unknown line>
  419. 51.19 s gammaloop-nextest-core> 3: <eyre[cb2fd339c0c40fca]::Report>::from_adhoc::<alloc[2ea6bcb46fca0c42]::string::String><unknown>
  420. 51.19 s gammaloop-nextest-core> at <unknown source file>:<unknown line>
  421. 51.19 s gammaloop-nextest-core> 4: <gammalooprs[6dc202c8af9e2ddf]::uv::approx::local_3d::Localizer>::project_4d<unknown>
  422. 51.19 s gammaloop-nextest-core> at <unknown source file>:<unknown line>
  423. 51.19 s gammaloop-nextest-core> 5: gammalooprs[6dc202c8af9e2ddf]::uv::hedge_poset::tests::union_terms_project_factorized_typed_4d_values<unknown>
  424. 51.19 s gammaloop-nextest-core> at <unknown source file>:<unknown line>
  425. 51.19 s gammaloop-nextest-core> 6: <gammalooprs[6dc202c8af9e2ddf]::uv::hedge_poset::tests::union_terms_project_factorized_typed_4d_values::{closure#0} as core[940e698046960fd5]::ops::function::FnOnce<()>>::call_once<unknown>
  426. 51.19 s gammaloop-nextest-core> at <unknown source file>:<unknown line>
  427. 51.19 s gammaloop-nextest-core> 7: test[75d6903177b1d7e9]::__rust_begin_short_backtrace::<core[940e698046960fd5]::result::Result<(), alloc[2ea6bcb46fca0c42]::string::String>, fn() -> core[940e698046960fd5]::result::Result<(), alloc[2ea6bcb46fca0c42]::string::String>><unknown>
  428. 51.19 s gammaloop-nextest-core> at <unknown source file>:<unknown line>
  429. 51.19 s gammaloop-nextest-core> 8: test[75d6903177b1d7e9]::run_test::{closure#0}<unknown>
  430. 51.19 s gammaloop-nextest-core> at <unknown source file>:<unknown line>
  431. 51.19 s gammaloop-nextest-core> 9: std[bcb96dfbba0ab899]::sys::backtrace::__rust_begin_short_backtrace::<test[75d6903177b1d7e9]::run_test::{closure#1}, ()><unknown>
  432. 51.19 s gammaloop-nextest-core> at <unknown source file>:<unknown line>
  433. 51.19 s gammaloop-nextest-core> 10: <std[bcb96dfbba0ab899]::thread::lifecycle::spawn_unchecked<test[75d6903177b1d7e9]::run_test::{closure#1}, ()>::{closure#1} as core[940e698046960fd5]::ops::function::FnOnce<()>>::call_once::{shim:vtable#0}<unknown>
  434. 51.19 s gammaloop-nextest-core> at <unknown source file>:<unknown line>
  435. 51.19 s gammaloop-nextest-core> 11: <std[bcb96dfbba0ab899]::sys::thread::unix::Thread>::new::thread_start<unknown>
  436. 51.19 s gammaloop-nextest-core> at <unknown source file>:<unknown line>
  437. 51.19 s gammaloop-nextest-core> 12: start_thread<unknown>
  438. 51.19 s gammaloop-nextest-core> at <unknown source file>:<unknown line>
  439. 51.19 s gammaloop-nextest-core> 13: __clone3<unknown>
  440. 51.19 s gammaloop-nextest-core> at <unknown source file>:<unknown line>
  441. 51.19 s gammaloop-nextest-core>
  442. 51.19 s gammaloop-nextest-core> Run with COLORBT_SHOW_HIDDEN=1 environment variable to disable frame filtering.
  443. 51.19 s gammaloop-nextest-core> Run with RUST_BACKTRACE=full to include source snippets.
  444. 51.19 s gammaloop-nextest-core>
  445. 51.19 s gammaloop-nextest-core> FAIL [ 5.655s] (497/501) gammalooprs::test_renormalization finite_part_ghost_2loop
  446. 51.19 s gammaloop-nextest-core> stdout ---
  447. 51.19 s gammaloop-nextest-core>
  448. 51.19 s gammaloop-nextest-core> running 1 test
  449. 51.19 s gammaloop-nextest-core> test finite_part_ghost_2loop ... FAILED
  450. 51.19 s gammaloop-nextest-core>
  451. 51.19 s gammaloop-nextest-core> failures:
  452. 51.19 s gammaloop-nextest-core>
  453. 51.19 s gammaloop-nextest-core> failures:
  454. 51.19 s gammaloop-nextest-core> finite_part_ghost_2loop
  455. 51.19 s gammaloop-nextest-core>
  456. 51.19 s gammaloop-nextest-core> test result: FAILED. 0 passed; 1 failed; 0 ignored; 0 measured; 5 filtered out; finished in 5.64s
  457. 51.19 s gammaloop-nextest-core>
  458. 51.19 s gammaloop-nextest-core> stderr ---
  459. 51.19 s gammaloop-nextest-core> [16:29:12.294] @gammalooprs::processes::amplitude ERROR :
  460. 51.19 s gammaloop-nextest-core> field value
  461. 51.19 s gammaloop-nextest-core> error generalized CFF expression generation failed for graph `d5` with source-edge numerator energy-degree bounds Some([(1, 1), (2, 1), (3, 1), (5, 2), (6, 2)]): energy-degree bounds do not certify vanishing residues at infinity under the conservative cap check: EnergyDivergenceReport { edge_degree_bounds: [1, 1, 1, 2, 2], loops: [EnergyDirectionReport { loop_id: Some(0), zero_edges: [], active_edges: [0, 1, 2, 4], nullity: None, numerator_degree_bound: 5, denominator_degree: 8, divergence_degree: -3, convergent: true }, EnergyDirectionReport { loop_id: Some(1), zero_edges: [], active_edges: [3, 4], nullity: None, numerator_degree_bound: 4, denominator_degree: 4, divergence_degree: 0, convergent: false }], directions: [EnergyDirectionReport { loop_id: None, zero_edges: [0, 1, 2], active_edges: [3, 4], nullity: Some(1), numerator_degree_bound: 4, denominator_degree: 4, divergence_degree: 0, convergent: false }, EnergyDirectionReport { loop_id: None, zero_edges: [], active_edges: [0, 1, 2, 3, 4], nullity: Some(2), numerator_degree_bound: 7, denominator_degree: 10, divergence_degree: -3, convergent: true }, EnergyDirectionReport { loop_id: None, zero_edges: [3], active_edges: [0, 1, 2, 4], nullity: Some(1), numerator_degree_bound: 5, denominator_degree: 8, divergence_degree: -3, convergent: true }, EnergyDirectionReport { loop_id: None, zero_edges: [4], active_edges: [0, 1, 2, 3], nullity: Some(1), numerator_degree_bound: 5, denominator_degree: 8, divergence_degree: -3, convergent: true }], coordinate_convergent: false, directional_convergent: false, convergent: false }
  462. 51.19 s gammaloop-nextest-core> 3D source has 2 loop names ["e1", "e5"], 5 internal edges [edge 0: 0 -> 1, loops=[1, 0], externals=[0, 0]; edge 1: 0 -> 2, loops=[-1, 0], externals=[1, 0]; edge 2: 1 -> 3, loops=[1, 0], externals=[-1, 0]; edge 3: 2 -> 3, loops=[0, 1], externals=[0, 0]; edge 4: 2 -> 3, loops=[-1, -1], externals=[1, 0]]
  463. 51.19 s gammaloop-nextest-core> at crates/gammalooprs/src/processes/amplitude.rs:825
  464. 51.19 s gammaloop-nextest-core> The application panicked (crashed).
  465. 51.19 s gammaloop-nextest-core> Message: called `Result::unwrap()` on an `Err` value:
  466. 51.19 s gammaloop-nextest-core> 0: generalized CFF expression generation failed for graph `d5` with source-edge numerator energy-degree bounds Some([(1, 1), (2, 1), (3, 1), (5, 2), (6, 2)]): energy-degree bounds do not certify vanishing residues at infinity under the conservative cap check: EnergyDivergenceReport { edge_degree_bounds: [1, 1, 1, 2, 2], loops: [EnergyDirectionReport { loop_id: Some(0), zero_edges: [], active_edges: [0, 1, 2, 4], nullity: None, numerator_degree_bound: 5, denominator_degree: 8, divergence_degree: -3, convergent: true }, EnergyDirectionReport { loop_id: Some(1), zero_edges: [], active_edges: [3, 4], nullity: None, numerator_degree_bound: 4, denominator_degree: 4, divergence_degree: 0, convergent: false }], directions: [EnergyDirectionReport { loop_id: None, zero_edges: [0, 1, 2], active_edges: [3, 4], nullity: Some(1), numerator_degree_bound: 4, denominator_degree: 4, divergence_degree: 0, convergent: false }, EnergyDirectionReport { loop_id: None, zero_edges: [], active_edges: [0, 1, 2, 3, 4], nullity: Some(2), numerator_degree_bound: 7, denominator_degree: 10, divergence_degree: -3, convergent: true }, EnergyDirectionReport { loop_id: None, zero_edges: [3], active_edges: [0, 1, 2, 4], nullity: Some(1), numerator_degree_bound: 5, denominator_degree: 8, divergence_degree: -3, convergent: true }, EnergyDirectionReport { loop_id: None, zero_edges: [4], active_edges: [0, 1, 2, 3], nullity: Some(1), numerator_degree_bound: 5, denominator_degree: 8, divergence_degree: -3, convergent: true }], coordinate_convergent: false, directional_convergent: false, convergent: false }
  467. 51.19 s gammaloop-nextest-core> 3D source has 2 loop names ["e1", "e5"], 5 internal edges [edge 0: 0 -> 1, loops=[1, 0], externals=[0, 0]; edge 1: 0 -> 2, loops=[-1, 0], externals=[1, 0]; edge 2: 1 -> 3, loops=[1, 0], externals=[-1, 0]; edge 3: 2 -> 3, loops=[0, 1], externals=[0, 0]; edge 4: 2 -> 3, loops=[-1, -1], externals=[1, 0]]
  468. 51.19 s gammaloop-nextest-core>
  469. 51.19 s gammaloop-nextest-core> Location:
  470. 51.19 s gammaloop-nextest-core> crates/gammalooprs/src/cff/generation.rs:226
  471. 51.19 s gammaloop-nextest-core>
  472. 51.19 s gammaloop-nextest-core> ━━━━━━━━━━━━━━━━━━━━━━━━━━━━━━━━━━ BACKTRACE ━━━━━━━━━━━━━━━━━━━━━━━━━━━━━━━━━━━
  473. 51.19 s gammaloop-nextest-core> 1: <color_eyre[51793ea62743adbd]::config::EyreHook>::into_eyre_hook::{closure#0}<unknown>
  474. 51.19 s gammaloop-nextest-core> at <unknown source file>:<unknown line>
  475. 51.19 s gammaloop-nextest-core> 2: eyre[cb2fd339c0c40fca]::capture_handler<unknown>
  476. 51.19 s gammaloop-nextest-core> at <unknown source file>:<unknown line>
  477. 51.19 s gammaloop-nextest-core> 3: <eyre[cb2fd339c0c40fca]::Report>::from_adhoc::<alloc[2ea6bcb46fca0c42]::string::String><unknown>
  478. 51.19 s gammaloop-nextest-core> at <unknown source file>:<unknown line>
  479. 51.19 s gammaloop-nextest-core> 4: <gammalooprs[1d0b14476f7eb2f8]::graph::Graph>::generate_3d_expression_for_integrand<unknown>
  480. 51.19 s gammaloop-nextest-core> at <unknown source file>:<unknown line>
  481. 51.19 s gammaloop-nextest-core> 5: <gammalooprs[1d0b14476f7eb2f8]::processes::amplitude::AmplitudeGraph>::generate_cff<unknown>
  482. 51.19 s gammaloop-nextest-core> at <unknown source file>:<unknown line>
  483. 51.19 s gammaloop-nextest-core> 6: <gammalooprs[1d0b14476f7eb2f8]::processes::amplitude::AmplitudeGraph>::renormalization_part<unknown>
  484. 51.19 s gammaloop-nextest-core> at <unknown source file>:<unknown line>
  485. 51.19 s gammaloop-nextest-core> 7: test_renormalization[879b57236d814a44]::finite_part_ghost_2loop<unknown>
  486. 51.19 s gammaloop-nextest-core> at <unknown source file>:<unknown line>
  487. 51.19 s gammaloop-nextest-core> 8: <test_renormalization[879b57236d814a44]::finite_part_ghost_2loop::{closure#0} as core[940e698046960fd5]::ops::function::FnOnce<()>>::call_once<unknown>
  488. 51.19 s gammaloop-nextest-core> at <unknown source file>:<unknown line>
  489. 51.19 s gammaloop-nextest-core> 9: test[75d6903177b1d7e9]::__rust_begin_short_backtrace::<core[940e698046960fd5]::result::Result<(), alloc[2ea6bcb46fca0c42]::string::String>, fn() -> core[940e698046960fd5]::result::Result<(), alloc[2ea6bcb46fca0c42]::string::String>><unknown>
  490. 51.19 s gammaloop-nextest-core> at <unknown source file>:<unknown line>
  491. 51.19 s gammaloop-nextest-core> 10: test[75d6903177b1d7e9]::run_test::{closure#0}<unknown>
  492. 51.19 s gammaloop-nextest-core> at <unknown source file>:<unknown line>
  493. 51.19 s gammaloop-nextest-core> 11: std[bcb96dfbba0ab899]::sys::backtrace::__rust_begin_short_backtrace::<test[75d6903177b1d7e9]::run_test::{closure#1}, ()><unknown>
  494. 51.19 s gammaloop-nextest-core> at <unknown source file>:<unknown line>
  495. 51.19 s gammaloop-nextest-core> 12: <std[bcb96dfbba0ab899]::thread::lifecycle::spawn_unchecked<test[75d6903177b1d7e9]::run_test::{closure#1}, ()>::{closure#1} as core[940e698046960fd5]::ops::function::FnOnce<()>>::call_once::{shim:vtable#0}<unknown>
  496. 51.19 s gammaloop-nextest-core> at <unknown source file>:<unknown line>
  497. 51.19 s gammaloop-nextest-core> 13: <std[bcb96dfbba0ab899]::sys::thread::unix::Thread>::new::thread_start<unknown>
  498. 51.19 s gammaloop-nextest-core> at <unknown source file>:<unknown line>
  499. 51.19 s gammaloop-nextest-core> 14: start_thread<unknown>
  500. 51.19 s gammaloop-nextest-core> at <unknown source file>:<unknown line>
  501. 51.19 s gammaloop-nextest-core> 15: __clone3<unknown>
  502. 51.19 s gammaloop-nextest-core> at <unknown source file>:<unknown line>
  503. 51.19 s gammaloop-nextest-core>
  504. 51.19 s gammaloop-nextest-core> Run with COLORBT_SHOW_HIDDEN=1 environment variable to disable frame filtering.
  505. 51.19 s gammaloop-nextest-core> Run with RUST_BACKTRACE=full to include source snippets.
  506. 51.19 s gammaloop-nextest-core> Warning: SpanTrace capture is Unsupported.
  507. 51.19 s gammaloop-nextest-core> Ensure that you've setup a tracing-error ErrorLayer and the semver versions are compatible
  508. 51.19 s gammaloop-nextest-core> Location: crates/gammalooprs/tests/test_renormalization.rs:495
  509. 51.19 s gammaloop-nextest-core>
  510. 51.19 s gammaloop-nextest-core> ━━━━━━━━━━━━━━━━━━━━━━━━━━━━━━━━━━ BACKTRACE ━━━━━━━━━━━━━━━━━━━━━━━━━━━━━━━━━━━
  511. 51.19 s gammaloop-nextest-core> 1: <color_eyre[51793ea62743adbd]::config::PanicHook>::panic_report<unknown>
  512. 51.19 s gammaloop-nextest-core> at <unknown source file>:<unknown line>
  513. 51.19 s gammaloop-nextest-core> 2: <color_eyre[51793ea62743adbd]::config::PanicHook>::into_panic_hook::{closure#0}<unknown>
  514. 51.19 s gammaloop-nextest-core> at <unknown source file>:<unknown line>
  515. 51.19 s gammaloop-nextest-core> 3: std[bcb96dfbba0ab899]::panicking::panic_with_hook<unknown>
  516. 51.19 s gammaloop-nextest-core> at <unknown source file>:<unknown line>
  517. 51.19 s gammaloop-nextest-core> 4: std[bcb96dfbba0ab899]::panicking::panic_handler::{closure#0}<unknown>
  518. 51.19 s gammaloop-nextest-core> at <unknown source file>:<unknown line>
  519. 51.19 s gammaloop-nextest-core> 5: std[bcb96dfbba0ab899]::sys::backtrace::__rust_end_short_backtrace::<std[bcb96dfbba0ab899]::panicking::panic_handler::{closure#0}, !><unknown>
  520. 51.19 s gammaloop-nextest-core> at <unknown source file>:<unknown line>
  521. 51.19 s gammaloop-nextest-core> 6: __rustc[6c289b9f9c454d21]::rust_begin_unwind<unknown>
  522. 51.19 s gammaloop-nextest-core> at <unknown source file>:<unknown line>
  523. 51.19 s gammaloop-nextest-core> 7: core[940e698046960fd5]::panicking::panic_fmt<unknown>
  524. 51.19 s gammaloop-nextest-core> at <unknown source file>:<unknown line>
  525. 51.19 s gammaloop-nextest-core> 8: core[940e698046960fd5]::result::unwrap_failed<unknown>
  526. 51.19 s gammaloop-nextest-core> at <unknown source file>:<unknown line>
  527. 51.19 s gammaloop-nextest-core> 9: test_renormalization[879b57236d814a44]::finite_part_ghost_2loop<unknown>
  528. 51.19 s gammaloop-nextest-core> at <unknown source file>:<unknown line>
  529. 51.19 s gammaloop-nextest-core> 10: <test_renormalization[879b57236d814a44]::finite_part_ghost_2loop::{closure#0} as core[940e698046960fd5]::ops::function::FnOnce<()>>::call_once<unknown>
  530. 51.19 s gammaloop-nextest-core> at <unknown source file>:<unknown line>
  531. 51.19 s gammaloop-nextest-core> 11: test[75d6903177b1d7e9]::__rust_begin_short_backtrace::<core[940e698046960fd5]::result::Result<(), alloc[2ea6bcb46fca0c42]::string::String>, fn() -> core[940e698046960fd5]::result::Result<(), alloc[2ea6bcb46fca0c42]::string::String>><unknown>
  532. 51.19 s gammaloop-nextest-core> at <unknown source file>:<unknown line>
  533. 51.19 s gammaloop-nextest-core> 12: test[75d6903177b1d7e9]::run_test::{closure#0}<unknown>
  534. 51.19 s gammaloop-nextest-core> at <unknown source file>:<unknown line>
  535. 51.19 s gammaloop-nextest-core> 13: std[bcb96dfbba0ab899]::sys::backtrace::__rust_begin_short_backtrace::<test[75d6903177b1d7e9]::run_test::{closure#1}, ()><unknown>
  536. 51.19 s gammaloop-nextest-core> at <unknown source file>:<unknown line>
  537. 51.19 s gammaloop-nextest-core> 14: <std[bcb96dfbba0ab899]::thread::lifecycle::spawn_unchecked<test[75d6903177b1d7e9]::run_test::{closure#1}, ()>::{closure#1} as core[940e698046960fd5]::ops::function::FnOnce<()>>::call_once::{shim:vtable#0}<unknown>
  538. 51.19 s gammaloop-nextest-core> at <unknown source file>:<unknown line>
  539. 51.19 s gammaloop-nextest-core> 15: <std[bcb96dfbba0ab899]::sys::thread::unix::Thread>::new::thread_start<unknown>
  540. 51.19 s gammaloop-nextest-core> at <unknown source file>:<unknown line>
  541. 51.19 s gammaloop-nextest-core> 16: start_thread<unknown>
  542. 51.19 s gammaloop-nextest-core> at <unknown source file>:<unknown line>
  543. 51.19 s gammaloop-nextest-core> 17: __clone3<unknown>
  544. 51.19 s gammaloop-nextest-core> at <unknown source file>:<unknown line>
  545. 51.19 s gammaloop-nextest-core>
  546. 51.19 s gammaloop-nextest-core> Run with COLORBT_SHOW_HIDDEN=1 environment variable to disable frame filtering.
  547. 51.19 s gammaloop-nextest-core> Run with RUST_BACKTRACE=full to include source snippets.
  548. 51.19 s gammaloop-nextest-core>
  549. 51.26 s gammaloop-nextest-core> error: test run failed
  550. 51.29 s gammaloop-nextest-core>
  551. 51.29 s gammaloop-nextest-core> ========== nextest test summary ==========
  552. 51.29 s gammaloop-nextest-core> report: target/nextest/ci_gammaloop/junit.xml
  553. 51.29 s gammaloop-nextest-core> tests: 501, failures: 2, errors: 0
  554. 51.29 s gammaloop-nextest-core>
  555. 51.29 s gammaloop-nextest-core> 1. gammalooprs::uv::hedge_poset::tests::union_terms_project_factorized_typed_4d_values
  556. 51.29 s gammaloop-nextest-core> failure: test failure with exit code 101
  557. 51.29 s gammaloop-nextest-core> Error:
  558. 51.29 s gammaloop-nextest-core> 0: exact source occurrences for physical edge 1 disagree after on-shell-energy replacement: `-(mUVexp^2+Q(1,cind(1))^2+Q(1,cind(2))^2+Q(1,cind(3))^2)^(1/2)` versus `(mUVexp^2+Q(1,cind(1))^2+Q(1,cind(2))^2+Q(1,cind(3))^2)^(1/2)`; exact 4D term active denominators are [FourDDenominator { source_edge: EdgeIndex(1), momentum: gammalooprs::Q(1), mass_squared: gammalooprs::mUVexp^2, full_expr: -gammalooprs::mUV^2+spenso::dot(gammalooprs::Q(1,spenso::mink(gammalooprs::dim)),gammalooprs::Q(1,spenso::mink(gammalooprs::dim))) }, FourDDenominator { source_edge: EdgeIndex(1), momentum: gammalooprs::Q(1), mass_squared: gammalooprs::mUVexp^2, full_expr: -gammalooprs::mUV^2+spenso::dot(gammalooprs::Q(1,spenso::mink(gammalooprs::dim)),gammalooprs::Q(1,spenso::mink(gammalooprs::dim))) }, FourDDenominator { source_edge: EdgeIndex(3), momentum: gammalooprs::Q(3), mass_squared: gammalooprs::mUVexp^2, full_expr: -gammalooprs::mUV^2+spenso::dot(gammalooprs::Q(3,spenso::mink(gammalooprs::dim)),gammalooprs::Q(3,spenso::mink(gammalooprs::dim))) }, FourDDenominator { source_edge: EdgeIndex(3), momentum: gammalooprs::Q(3), mass_squared: gammalooprs::mUVexp^2, full_expr: -gammalooprs::mUV^2+spenso::dot(gammalooprs::Q(3,spenso::mink(gammalooprs::dim)),gammalooprs::Q(3,spenso::mink(gammalooprs::dim))) }, FourDDenominator { source_edge: EdgeIndex(0), momentum: gammalooprs::Q(0), mass_squared: UFO::mass_scalar_1^2, full_expr: -UFO::mass_scalar_1^2+spenso::dot(gammalooprs::Q(0,spenso::mink(gammalooprs::dim)),gammalooprs::Q(0,spenso::mink(gammalooprs::dim))) }]
  559. 51.29 s gammaloop-nextest-core>
  560. 51.29 s gammaloop-nextest-core> Location:
  561. 51.29 s gammaloop-nextest-core> crates/gammalooprs/src/uv/approx/local_3d.rs:641
  562. 51.29 s gammaloop-nextest-core>
  563. 51.29 s gammaloop-nextest-core> ━━━━━━━━━━━━━━━━━━━━━━━━━━━━━━━━━━ BACKTRACE ━━━━━━━━━━━━━━━━━━━━━━━━━━━━━━━━━━━
  564. 51.29 s gammaloop-nextest-core> 1: <color_eyre[51793ea62743adbd]::config::EyreHook>::into_eyre_hook::{closure#0}<unknown>
  565. 51.29 s gammaloop-nextest-core> at <unknown source file>:<unknown line>
  566. 51.29 s gammaloop-nextest-core> 2: eyre[cb2fd339c0c40fca]::capture_handler<unknown>
  567. 51.29 s gammaloop-nextest-core> at <unknown source file>:<unknown line>
  568. 51.29 s gammaloop-nextest-core> 3: <eyre[cb2fd339c0c40fca]::Report>::from_adhoc::<alloc[2ea6bcb46fca0c42]::string::String><unknown>
  569. 51.29 s gammaloop-nextest-core> at <unknown source file>:<unknown line>
  570. 51.29 s gammaloop-nextest-core> 4: <gammalooprs[6dc202c8af9e2ddf]::uv::approx::local_3d::Localizer>::project_4d<unknown>
  571. 51.29 s gammaloop-nextest-core> at <unknown source file>:<unknown line>
  572. 51.29 s gammaloop-nextest-core> 5: gammalooprs[6dc202c8af9e2ddf]::uv::hedge_poset::tests::union_terms_project_factorized_typed_4d_values<unknown>
  573. 51.29 s gammaloop-nextest-core> at <unknown source file>:<unknown line>
  574. 51.29 s gammaloop-nextest-core> 6: <gammalooprs[6dc202c8af9e2ddf]::uv::hedge_poset::tests::union_terms_project_factorized_typed_4d_values::{closure#0} as core[940e698046960fd5]::ops::function::FnOnce<()>>::call_once<unknown>
  575. 51.29 s gammaloop-nextest-core> at <unknown source file>:<unknown line>
  576. 51.29 s gammaloop-nextest-core> 7: test[75d6903177b1d7e9]::__rust_begin_short_backtrace::<core[940e698046960fd5]::result::Result<(), alloc[2ea6bcb46fca0c42]::string::String>, fn() -> core[940e698046960fd5]::result::Result<(), alloc[2ea6bcb46fca0c42]::string::String>><unknown>
  577. 51.29 s gammaloop-nextest-core> at <unknown source file>:<unknown line>
  578. 51.29 s gammaloop-nextest-core> 8: test[75d6903177b1d7e9]::run_test::{closure#0}<unknown>
  579. 51.29 s gammaloop-nextest-core> at <unknown source file>:<unknown line>
  580. 51.29 s gammaloop-nextest-core> 9: std[bcb96dfbba0ab899]::sys::backtrace::__rust_begin_short_backtrace::<test[75d6903177b1d7e9]::run_test::{closure#1}, ()><unknown>
  581. 51.29 s gammaloop-nextest-core> at <unknown source file>:<unknown line>
  582. 51.29 s gammaloop-nextest-core> 10: <std[bcb96dfbba0ab899]::thread::lifecycle::spawn_unchecked<test[75d6903177b1d7e9]::run_test::{closure#1}, ()>::{closure#1} as core[940e698046960fd5]::ops::function::FnOnce<()>>::call_once::{shim:vtable#0}<unknown>
  583. 51.29 s gammaloop-nextest-core> at <unknown source file>:<unknown line>
  584. 51.29 s gammaloop-nextest-core> 11: <std[bcb96dfbba0ab899]::sys::thread::unix::Thread>::new::thread_start<unknown>
  585. 51.29 s gammaloop-nextest-core> at <unknown source file>:<unknown line>
  586. 51.29 s gammaloop-nextest-core> 12: start_thread<unknown>
  587. 51.29 s gammaloop-nextest-core> at <unknown source file>:<unknown line>
  588. 51.29 s gammaloop-nextest-core> 13: __clone3<unknown>
  589. 51.29 s gammaloop-nextest-core> at <unknown source file>:<unknown line>
  590. 51.29 s gammaloop-nextest-core>
  591. 51.29 s gammaloop-nextest-core> Run with COLORBT_SHOW_HIDDEN=1 environment variable to disable frame filtering.
  592. 51.29 s gammaloop-nextest-core> Run with RUST_BACKTRACE=full to include source snippets.
  593. 51.29 s gammaloop-nextest-core> system-out
  594. 51.29 s gammaloop-nextest-core> running 1 test
  595. 51.29 s gammaloop-nextest-core> test uv::hedge_poset::tests::union_terms_project_factorized_typed_4d_values ... FAILED
  596. 51.29 s gammaloop-nextest-core>
  597. 51.29 s gammaloop-nextest-core> failures:
  598. 51.29 s gammaloop-nextest-core>
  599. 51.29 s gammaloop-nextest-core> failures:
  600. 51.29 s gammaloop-nextest-core> uv::hedge_poset::tests::union_terms_project_factorized_typed_4d_values
  601. 51.29 s gammaloop-nextest-core>
  602. 51.29 s gammaloop-nextest-core> test result: FAILED. 0 passed; 1 failed; 0 ignored; 0 measured; 551 filtered out; finished in 0.22s
  603. 51.29 s gammaloop-nextest-core> system-err
  604. 51.29 s gammaloop-nextest-core> Error:
  605. 51.29 s gammaloop-nextest-core> 0: exact source occurrences for physical edge 1 disagree after on-shell-energy replacement: `-(mUVexp^2+Q(1,cind(1))^2+Q(1,cind(2))^2+Q(1,cind(3))^2)^(1/2)` versus `(mUVexp^2+Q(1,cind(1))^2+Q(1,cind(2))^2+Q(1,cind(3))^2)^(1/2)`; exact 4D term active denominators are [FourDDenominator { source_edge: EdgeIndex(1), momentum: gammalooprs::Q(1), mass_squared: gammalooprs::mUVexp^2, full_expr: -gammalooprs::mUV^2+spenso::dot(gammalooprs::Q(1,spenso::mink(gammalooprs::dim)),gammalooprs::Q(1,spenso::mink(gammalooprs::dim))) }, FourDDenominator { source_edge: EdgeIndex(1), momentum: gammalooprs::Q(1), mass_squared: gammalooprs::mUVexp^2, full_expr: -gammalooprs::mUV^2+spenso::dot(gammalooprs::Q(1,spenso::mink(gammalooprs::dim)),gammalooprs::Q(1,spenso::mink(gammalooprs::dim))) }, FourDDenominator { source_edge: EdgeIndex(3), momentum: gammalooprs::Q(3), mass_squared: gammalooprs::mUVexp^2, full_expr: -gammalooprs::mUV^2+spenso::dot(gammalooprs::Q(3,spenso::mink(gammalooprs::dim)),gammalooprs::Q(3,spenso::mink(gammalooprs::dim))) }, FourDDenominator { source_edge: EdgeIndex(3), momentum: gammalooprs::Q(3), mass_squared: gammalooprs::mUVexp^2, full_expr: -gammalooprs::mUV^2+spenso::dot(gammalooprs::Q(3,spenso::mink(gammalooprs::dim)),gammalooprs::Q(3,spenso::mink(gammalooprs::dim))) }, FourDDenominator { source_edge: EdgeIndex(0), momentum: gammalooprs::Q(0), mass_squared: UFO::mass_scalar_1^2, full_expr: -UFO::mass_scalar_1^2+spenso::dot(gammalooprs::Q(0,spenso::mink(gammalooprs::dim)),gammalooprs::Q(0,spenso::mink(gammalooprs::dim))) }]
  606. 51.29 s gammaloop-nextest-core>
  607. 51.29 s gammaloop-nextest-core> Location:
  608. 51.29 s gammaloop-nextest-core> crates/gammalooprs/src/uv/approx/local_3d.rs:641
  609. 51.29 s gammaloop-nextest-core>
  610. 51.29 s gammaloop-nextest-core> ━━━━━━━━━━━━━━━━━━━━━━━━━━━━━━━━━━ BACKTRACE ━━━━━━━━━━━━━━━━━━━━━━━━━━━━━━━━━━━
  611. 51.29 s gammaloop-nextest-core> 1: <color_eyre[51793ea62743adbd]::config::EyreHook>::into_eyre_hook::{closure#0}<unknown>
  612. 51.29 s gammaloop-nextest-core> at <unknown source file>:<unknown line>
  613. 51.29 s gammaloop-nextest-core> 2: eyre[cb2fd339c0c40fca]::capture_handler<unknown>
  614. 51.29 s gammaloop-nextest-core> at <unknown source file>:<unknown line>
  615. 51.29 s gammaloop-nextest-core> 3: <eyre[cb2fd339c0c40fca]::Report>::from_adhoc::<alloc[2ea6bcb46fca0c42]::string::String><unknown>
  616. 51.29 s gammaloop-nextest-core> at <unknown source file>:<unknown line>
  617. 51.29 s gammaloop-nextest-core> 4: <gammalooprs[6dc202c8af9e2ddf]::uv::approx::local_3d::Localizer>::project_4d<unknown>
  618. 51.29 s gammaloop-nextest-core> at <unknown source file>:<unknown line>
  619. 51.29 s gammaloop-nextest-core> 5: gammalooprs[6dc202c8af9e2ddf]::uv::hedge_poset::tests::union_terms_project_factorized_typed_4d_values<unknown>
  620. 51.29 s gammaloop-nextest-core> at <unknown source file>:<unknown line>
  621. 51.29 s gammaloop-nextest-core> 6: <gammalooprs[6dc202c8af9e2ddf]::uv::hedge_poset::tests::union_terms_project_factorized_typed_4d_values::{closure#0} as core[940e698046960fd5]::ops::function::FnOnce<()>>::call_once<unknown>
  622. 51.29 s gammaloop-nextest-core> at <unknown source file>:<unknown line>
  623. 51.29 s gammaloop-nextest-core> 7: test[75d6903177b1d7e9]::__rust_begin_short_backtrace::<core[940e698046960fd5]::result::Result<(), alloc[2ea6bcb46fca0c42]::string::String>, fn() -> core[940e698046960fd5]::result::Result<(), alloc[2ea6bcb46fca0c42]::string::String>><unknown>
  624. 51.29 s gammaloop-nextest-core> at <unknown source file>:<unknown line>
  625. 51.29 s gammaloop-nextest-core> 8: test[75d6903177b1d7e9]::run_test::{closure#0}<unknown>
  626. 51.29 s gammaloop-nextest-core> at <unknown source file>:<unknown line>
  627. 51.29 s gammaloop-nextest-core> 9: std[bcb96dfbba0ab899]::sys::backtrace::__rust_begin_short_backtrace::<test[75d6903177b1d7e9]::run_test::{closure#1}, ()><unknown>
  628. 51.29 s gammaloop-nextest-core> at <unknown source file>:<unknown line>
  629. 51.29 s gammaloop-nextest-core> 10: <std[bcb96dfbba0ab899]::thread::lifecycle::spawn_unchecked<test[75d6903177b1d7e9]::run_test::{closure#1}, ()>::{closure#1} as core[940e698046960fd5]::ops::function::FnOnce<()>>::call_once::{shim:vtable#0}<unknown>
  630. 51.29 s gammaloop-nextest-core> at <unknown source file>:<unknown line>
  631. 51.29 s gammaloop-nextest-core> 11: <std[bcb96dfbba0ab899]::sys::thread::unix::Thread>::new::thread_start<unknown>
  632. 51.29 s gammaloop-nextest-core> at <unknown source file>:<unknown line>
  633. 51.29 s gammaloop-nextest-core> 12: start_thread<unknown>
  634. 51.29 s gammaloop-nextest-core> at <unknown source file>:<unknown line>
  635. 51.29 s gammaloop-nextest-core> 13: __clone3<unknown>
  636. 51.29 s gammaloop-nextest-core> at <unknown source file>:<unknown line>
  637. 51.29 s gammaloop-nextest-core>
  638. 51.29 s gammaloop-nextest-core> Run with COLORBT_SHOW_HIDDEN=1 environment variable to disable frame filtering.
  639. 51.29 s gammaloop-nextest-core> Run with RUST_BACKTRACE=full to include source snippets.
  640. 51.29 s gammaloop-nextest-core>
  641. 51.29 s gammaloop-nextest-core> 2. gammalooprs::test_renormalization::finite_part_ghost_2loop
  642. 51.29 s gammaloop-nextest-core> failure: test failure with exit code 101
  643. 51.29 s gammaloop-nextest-core> system-out
  644. 51.29 s gammaloop-nextest-core> running 1 test
  645. 51.29 s gammaloop-nextest-core> test finite_part_ghost_2loop ... FAILED
  646. 51.29 s gammaloop-nextest-core>
  647. 51.29 s gammaloop-nextest-core> failures:
  648. 51.29 s gammaloop-nextest-core>
  649. 51.29 s gammaloop-nextest-core> failures:
  650. 51.29 s gammaloop-nextest-core> finite_part_ghost_2loop
  651. 51.29 s gammaloop-nextest-core>
  652. 51.29 s gammaloop-nextest-core> test result: FAILED. 0 passed; 1 failed; 0 ignored; 0 measured; 5 filtered out; finished in 5.64s
  653. 51.29 s gammaloop-nextest-core> system-err
  654. 51.29 s gammaloop-nextest-core> [16:29:12.294] @gammalooprs::processes::amplitude ERROR :
  655. 51.29 s gammaloop-nextest-core> field value
  656. 51.29 s gammaloop-nextest-core> error generalized CFF expression generation failed for graph `d5` with source-edge numerator energy-degree bounds Some([(1, 1), (2, 1), (3, 1), (5, 2), (6, 2)]): energy-degree bounds do not certify vanishing residues at infinity under the conservative cap check: EnergyDivergenceReport { edge_degree_bounds: [1, 1, 1, 2, 2], loops: [EnergyDirectionReport { loop_id: Some(0), zero_edges: [], active_edges: [0, 1, 2, 4], nullity: None, numerator_degree_bound: 5, denominator_degree: 8, divergence_degree: -3, convergent: true }, EnergyDirectionReport { loop_id: Some(1), zero_edges: [], active_edges: [3, 4], nullity: None, numerator_degree_bound: 4, denominator_degree: 4, divergence_degree: 0, convergent: false }], directions: [EnergyDirectionReport { loop_id: None, zero_edges: [0, 1, 2], active_edges: [3, 4], nullity: Some(1), numerator_degree_bound: 4, denominator_degree: 4, divergence_degree: 0, convergent: false }, EnergyDirectionReport { loop_id: None, zero_edges: [], active_edges: [0, 1, 2, 3, 4], nullity: Some(2), numerator_degree_bound: 7, denominator_degree: 10, divergence_degree: -3, convergent: true }, EnergyDirectionReport { loop_id: None, zero_edges: [3], active_edges: [0, 1, 2, 4], nullity: Some(1), numerator_degree_bound: 5, denominator_degree: 8, divergence_degree: -3, convergent: true }, EnergyDirectionReport { loop_id: None, zero_edges: [4], active_edges: [0, 1, 2, 3], nullity: Some(1), numerator_degree_bound: 5, denominator_degree: 8, divergence_degree: -3, convergent: true }], coordinate_convergent: false, directional_convergent: false, convergent: false }
  657. 51.29 s gammaloop-nextest-core> 3D source has 2 loop names ["e1", "e5"], 5 internal edges [edge 0: 0 -> 1, loops=[1, 0], externals=[0, 0]; edge 1: 0 -> 2, loops=[-1, 0], externals=[1, 0]; edge 2: 1 -> 3, loops=[1, 0], externals=[-1, 0]; edge 3: 2 -> 3, loops=[0, 1], externals=[0, 0]; edge 4: 2 -> 3, loops=[-1, -1], externals=[1, 0]]
  658. 51.29 s gammaloop-nextest-core> at crates/gammalooprs/src/processes/amplitude.rs:825
  659. 51.29 s gammaloop-nextest-core> The application panicked (crashed).
  660. 51.29 s gammaloop-nextest-core> Message: called `Result::unwrap()` on an `Err` value:
  661. 51.29 s gammaloop-nextest-core> 0: generalized CFF expression generation failed for graph `d5` with source-edge numerator energy-degree bounds Some([(1, 1), (2, 1), (3, 1), (5, 2), (6, 2)]): energy-degree bounds do not certify vanishing residues at infinity under the conservative cap check: EnergyDivergenceReport { edge_degree_bounds: [1, 1, 1, 2, 2], loops: [EnergyDirectionReport { loop_id: Some(0), zero_edges: [], active_edges: [0, 1, 2, 4], nullity: None, numerator_degree_bound: 5, denominator_degree: 8, divergence_degree: -3, convergent: true }, EnergyDirectionReport { loop_id: Some(1), zero_edges: [], active_edges: [3, 4], nullity: None, numerator_degree_bound: 4, denominator_degree: 4, divergence_degree: 0, convergent: false }], directions: [EnergyDirectionReport { loop_id: None, zero_edges: [0, 1, 2], active_edges: [3, 4], nullity: Some(1), numerator_degree_bound: 4, denominator_degree: 4, divergence_degree: 0, convergent: false }, EnergyDirectionReport { loop_id: None, zero_edges: [], active_edges: [0, 1, 2, 3, 4], nullity: Some(2), numerator_degree_bound: 7, denominator_degree: 10, divergence_degree: -3, convergent: true }, EnergyDirectionReport { loop_id: None, zero_edges: [3], active_edges: [0, 1, 2, 4], nullity: Some(1), numerator_degree_bound: 5, denominator_degree: 8, divergence_degree: -3, convergent: true }, EnergyDirectionReport { loop_id: None, zero_edges: [4], active_edges: [0, 1, 2, 3], nullity: Some(1), numerator_degree_bound: 5, denominator_degree: 8, divergence_degree: -3, convergent: true }], coordinate_convergent: false, directional_convergent: false, convergent: false }
  662. 51.29 s gammaloop-nextest-core> 3D source has 2 loop names ["e1", "e5"], 5 internal edges [edge 0: 0 -> 1, loops=[1, 0], externals=[0, 0]; edge 1: 0 -> 2, loops=[-1, 0], externals=[1, 0]; edge 2: 1 -> 3, loops=[1, 0], externals=[-1, 0]; edge 3: 2 -> 3, loops=[0, 1], externals=[0, 0]; edge 4: 2 -> 3, loops=[-1, -1], externals=[1, 0]]
  663. 51.29 s gammaloop-nextest-core>
  664. 51.29 s gammaloop-nextest-core> Location:
  665. 51.29 s gammaloop-nextest-core> crates/gammalooprs/src/cff/generation.rs:226
  666. 51.29 s gammaloop-nextest-core>
  667. 51.29 s gammaloop-nextest-core> ━━━━━━━━━━━━━━━━━━━━━━━━━━━━━━━━━━ BACKTRACE ━━━━━━━━━━━━━━━━━━━━━━━━━━━━━━━━━━━
  668. 51.29 s gammaloop-nextest-core> 1: <color_eyre[51793ea62743adbd]::config::EyreHook>::into_eyre_hook::{closure#0}<unknown>
  669. 51.29 s gammaloop-nextest-core> at <unknown source file>:<unknown line>
  670. 51.29 s gammaloop-nextest-core> 2: eyre[cb2fd339c0c40fca]::capture_handler<unknown>
  671. 51.29 s gammaloop-nextest-core> at <unknown source file>:<unknown line>
  672. 51.29 s gammaloop-nextest-core> 3: <eyre[cb2fd339c0c40fca]::Report>::from_adhoc::<alloc[2ea6bcb46fca0c42]::string::String><unknown>
  673. 51.29 s gammaloop-nextest-core> at <unknown source file>:<unknown line>
  674. 51.29 s gammaloop-nextest-core> 4: <gammalooprs[1d0b14476f7eb2f8]::graph::Graph>::generate_3d_expression_for_integrand<unknown>
  675. 51.29 s gammaloop-nextest-core> at <unknown source file>:<unknown line>
  676. 51.29 s gammaloop-nextest-core> 5: <gammalooprs[1d0b14476f7eb2f8]::processes::amplitude::AmplitudeGraph>::generate_cff<unknown>
  677. 51.29 s gammaloop-nextest-core> at <unknown source file>:<unknown line>
  678. 51.29 s gammaloop-nextest-core> 6: <gammalooprs[1d0b14476f7eb2f8]::processes::amplitude::AmplitudeGraph>::renormalization_part<unknown>
  679. 51.29 s gammaloop-nextest-core> at <unknown source file>:<unknown line>
  680. 51.29 s gammaloop-nextest-core> 7: test_renormalization[879b57236d814a44]::finite_part_ghost_2loop<unknown>
  681. 51.29 s gammaloop-nextest-core> at <unknown source file>:<unknown line>
  682. 51.29 s gammaloop-nextest-core> 8: <test_renormalization[879b57236d814a44]::finite_part_ghost_2loop::{closure#0} as core[940e698046960fd5]::ops::function::FnOnce<()>>::call_once<unknown>
  683. 51.29 s gammaloop-nextest-core> at <unknown source file>:<unknown line>
  684. 51.29 s gammaloop-nextest-core> 9: test[75d6903177b1d7e9]::__rust_begin_short_backtrace::<core[940e698046960fd5]::result::Result<(), alloc[2ea6bcb46fca0c42]::string::String>, fn() -> core[940e698046960fd5]::result::Result<(), alloc[2ea6bcb46fca0c42]::string::String>><unknown>
  685. 51.29 s gammaloop-nextest-core> at <unknown source file>:<unknown line>
  686. 51.29 s gammaloop-nextest-core> 10: test[75d6903177b1d7e9]::run_test::{closure#0}<unknown>
  687. 51.29 s gammaloop-nextest-core> at <unknown source file>:<unknown line>
  688. 51.29 s gammaloop-nextest-core> 11: std[bcb96dfbba0ab899]::sys::backtrace::__rust_begin_short_backtrace::<test[75d6903177b1d7e9]::run_test::{closure#1}, ()><unknown>
  689. 51.29 s gammaloop-nextest-core> at <unknown source file>:<unknown line>
  690. 51.29 s gammaloop-nextest-core> 12: <std[bcb96dfbba0ab899]::thread::lifecycle::spawn_unchecked<test[75d6903177b1d7e9]::run_test::{closure#1}, ()>::{closure#1} as core[940e698046960fd5]::ops::function::FnOnce<()>>::call_once::{shim:vtable#0}<unknown>
  691. 51.29 s gammaloop-nextest-core> at <unknown source file>:<unknown line>
  692. 51.29 s gammaloop-nextest-core> 13: <std[bcb96dfbba0ab899]::sys::thread::unix::Thread>::new::thread_start<unknown>
  693. 51.29 s gammaloop-nextest-core> at <unknown source file>:<unknown line>
  694. 51.29 s gammaloop-nextest-core> 14: start_thread<unknown>
  695. 51.29 s gammaloop-nextest-core> at <unknown source file>:<unknown line>
  696. 51.29 s gammaloop-nextest-core> 15: __clone3<unknown>
  697. 51.29 s gammaloop-nextest-core> at <unknown source file>:<unknown line>
  698. 51.29 s gammaloop-nextest-core>
  699. 51.29 s gammaloop-nextest-core> Run with COLORBT_SHOW_HIDDEN=1 environment variable to disable frame filtering.
  700. 51.29 s gammaloop-nextest-core> Run with RUST_BACKTRACE=full to include source snippets.
  701. 51.29 s gammaloop-nextest-core> Warning: SpanTrace capture is Unsupported.
  702. 51.29 s gammaloop-nextest-core> Ensure that you've setup a tracing-error ErrorLayer and the semver versions are compatible
  703. 51.29 s gammaloop-nextest-core> Location: crates/gammalooprs/tests/test_renormalization.rs:495
  704. 51.29 s gammaloop-nextest-core>
  705. 51.29 s gammaloop-nextest-core> ━━━━━━━━━━━━━━━━━━━━━━━━━━━━━━━━━━ BACKTRACE ━━━━━━━━━━━━━━━━━━━━━━━━━━━━━━━━━━━
  706. 51.29 s gammaloop-nextest-core> 1: <color_eyre[51793ea62743adbd]::config::PanicHook>::panic_report<unknown>
  707. 51.29 s gammaloop-nextest-core> at <unknown source file>:<unknown line>
  708. 51.29 s gammaloop-nextest-core> 2: <color_eyre[51793ea62743adbd]::config::PanicHook>::into_panic_hook::{closure#0}<unknown>
  709. 51.29 s gammaloop-nextest-core> at <unknown source file>:<unknown line>
  710. 51.29 s gammaloop-nextest-core> 3: std[bcb96dfbba0ab899]::panicking::panic_with_hook<unknown>
  711. 51.29 s gammaloop-nextest-core> at <unknown source file>:<unknown line>
  712. 51.29 s gammaloop-nextest-core> 4: std[bcb96dfbba0ab899]::panicking::panic_handler::{closure#0}<unknown>
  713. 51.29 s gammaloop-nextest-core> at <unknown source file>:<unknown line>
  714. 51.29 s gammaloop-nextest-core> 5: std[bcb96dfbba0ab899]::sys::backtrace::__rust_end_short_backtrace::<std[bcb96dfbba0ab899]::panicking::panic_handler::{closure#0}, !><unknown>
  715. 51.29 s gammaloop-nextest-core> at <unknown source file>:<unknown line>
  716. 51.29 s gammaloop-nextest-core> 6: __rustc[6c289b9f9c454d21]::rust_begin_unwind<unknown>
  717. 51.29 s gammaloop-nextest-core> at <unknown source file>:<unknown line>
  718. 51.29 s gammaloop-nextest-core> 7: core[940e698046960fd5]::panicking::panic_fmt<unknown>
  719. 51.29 s gammaloop-nextest-core> at <unknown source file>:<unknown line>
  720. 51.29 s gammaloop-nextest-core> 8: core[940e698046960fd5]::result::unwrap_failed<unknown>
  721. 51.29 s gammaloop-nextest-core> at <unknown source file>:<unknown line>
  722. 51.29 s gammaloop-nextest-core> 9: test_renormalization[879b57236d814a44]::finite_part_ghost_2loop<unknown>
  723. 51.29 s gammaloop-nextest-core> at <unknown source file>:<unknown line>
  724. 51.29 s gammaloop-nextest-core> 10: <test_renormalization[879b57236d814a44]::finite_part_ghost_2loop::{closure#0} as core[940e698046960fd5]::ops::function::FnOnce<()>>::call_once<unknown>
  725. 51.29 s gammaloop-nextest-core> at <unknown source file>:<unknown line>
  726. 51.29 s gammaloop-nextest-core> 11: test[75d6903177b1d7e9]::__rust_begin_short_backtrace::<core[940e698046960fd5]::result::Result<(), alloc[2ea6bcb46fca0c42]::string::String>, fn() -> core[940e698046960fd5]::result::Result<(), alloc[2ea6bcb46fca0c42]::string::String>><unknown>
  727. 51.29 s gammaloop-nextest-core> at <unknown source file>:<unknown line>
  728. 51.29 s gammaloop-nextest-core> 12: test[75d6903177b1d7e9]::run_test::{closure#0}<unknown>
  729. 51.29 s gammaloop-nextest-core> at <unknown source file>:<unknown line>
  730. 51.29 s gammaloop-nextest-core> 13: std[bcb96dfbba0ab899]::sys::backtrace::__rust_begin_short_backtrace::<test[75d6903177b1d7e9]::run_test::{closure#1}, ()><unknown>
  731. 51.29 s gammaloop-nextest-core> at <unknown source file>:<unknown line>
  732. 51.29 s gammaloop-nextest-core> 14: <std[bcb96dfbba0ab899]::thread::lifecycle::spawn_unchecked<test[75d6903177b1d7e9]::run_test::{closure#1}, ()>::{closure#1} as core[940e698046960fd5]::ops::function::FnOnce<()>>::call_once::{shim:vtable#0}<unknown>
  733. 51.29 s gammaloop-nextest-core> at <unknown source file>:<unknown line>
  734. 51.29 s gammaloop-nextest-core> 15: <std[bcb96dfbba0ab899]::sys::thread::unix::Thread>::new::thread_start<unknown>
  735. 51.29 s gammaloop-nextest-core> at <unknown source file>:<unknown line>
  736. 51.29 s gammaloop-nextest-core> 16: start_thread<unknown>
  737. 51.29 s gammaloop-nextest-core> at <unknown source file>:<unknown line>
  738. 51.29 s gammaloop-nextest-core> 17: __clone3<unknown>
  739. 51.29 s gammaloop-nextest-core> at <unknown source file>:<unknown line>
  740. 51.29 s gammaloop-nextest-core>
  741. 51.29 s gammaloop-nextest-core> Run with COLORBT_SHOW_HIDDEN=1 environment variable to disable frame filtering.
  742. 51.29 s gammaloop-nextest-core> Run with RUST_BACKTRACE=full to include source snippets.
  743. 51.29 s gammaloop-nextest-core> =========================================
  744. 51.31 s gammaloop-nextest-core> Extracting 1 binary and 1 linked path to /build/nextest-archive-nJbJJM
  745. 51.37 s gammaloop-nextest-core> Extracted 7 files to /build/nextest-archive-nJbJJM in 0.07s
  746. 51.38 s gammaloop-nextest-core> ------------
  747. 51.38 s gammaloop-nextest-core> Nextest run ID 5ee752d7-c83e-4808-bd96-7329b548f774 with nextest profile: ci_gammaloop
  748. 51.38 s gammaloop-nextest-core> Starting 53 tests across 1 binary
  749. 51.40 s gammaloop-nextest-core> FAIL [ 0.009s] (17/53) three-dimensional-reps generation::cff_tests::causal_repeated_generation_handles_energy_dependent_bubble_source
  750. 51.40 s gammaloop-nextest-core> stdout ---
  751. 51.40 s gammaloop-nextest-core>
  752. 51.40 s gammaloop-nextest-core> running 1 test
  753. 51.40 s gammaloop-nextest-core> test generation::cff_tests::causal_repeated_generation_handles_energy_dependent_bubble_source ... FAILED
  754. 51.40 s gammaloop-nextest-core>
  755. 51.40 s gammaloop-nextest-core> failures:
  756. 51.40 s gammaloop-nextest-core>
  757. 51.40 s gammaloop-nextest-core> failures:
  758. 51.40 s gammaloop-nextest-core> generation::cff_tests::causal_repeated_generation_handles_energy_dependent_bubble_source
  759. 51.40 s gammaloop-nextest-core>
  760. 51.40 s gammaloop-nextest-core> test result: FAILED. 0 passed; 1 failed; 0 ignored; 0 measured; 52 filtered out; finished in 0.00s
  761. 51.40 s gammaloop-nextest-core>
  762. 51.40 s gammaloop-nextest-core> stderr ---
  763. 51.40 s gammaloop-nextest-core>
  764. 51.40 s gammaloop-nextest-core> thread 'generation::cff_tests::causal_repeated_generation_handles_energy_dependent_bubble_source' (3121) panicked at crates/three-dimensional-reps/src/generation.rs:5806:9:
  765. 51.40 s gammaloop-nextest-core> assertion `left == right` failed
  766. 51.40 s gammaloop-nextest-core> left: GlobalSourceProduct
  767. 51.40 s gammaloop-nextest-core> right: VariantLocal
  768. 51.40 s gammaloop-nextest-core> stack backtrace:
  769. 51.40 s gammaloop-nextest-core> 0: __rustc::rust_begin_unwind
  770. 51.40 s gammaloop-nextest-core> 1: core::panicking::panic_fmt
  771. 51.40 s gammaloop-nextest-core> 2: core::panicking::assert_failed_inner
  772. 51.40 s gammaloop-nextest-core> 3: core::panicking::assert_failed::<three_dimensional_reps::generation::CffEnergyFactorOwnership, three_dimensional_reps::generation::CffEnergyFactorOwnership>
  773. 51.40 s gammaloop-nextest-core> 4: three_dimensional_reps::generation::cff_tests::causal_repeated_generation_handles_energy_dependent_bubble_source
  774. 51.40 s gammaloop-nextest-core> 5: <three_dimensional_reps::generation::cff_tests::causal_repeated_generation_handles_energy_dependent_bubble_source::{closure#0} as core::ops::function::FnOnce<()>>::call_once
  775. 51.40 s gammaloop-nextest-core> note: Some details are omitted, run with `RUST_BACKTRACE=full` for a verbose backtrace.
  776. 51.40 s gammaloop-nextest-core>
  777. 51.42 s gammaloop-nextest-core> FAIL [ 0.015s] (30/53) three-dimensional-reps generation::cff_tests::disconnected_mixed_energy_factor_ownership_keeps_both_component_factors
  778. 51.42 s gammaloop-nextest-core> stdout ---
  779. 51.42 s gammaloop-nextest-core>
  780. 51.42 s gammaloop-nextest-core> running 1 test
  781. 51.42 s gammaloop-nextest-core> test generation::cff_tests::disconnected_mixed_energy_factor_ownership_keeps_both_component_factors ... FAILED
  782. 51.42 s gammaloop-nextest-core>
  783. 51.42 s gammaloop-nextest-core> failures:
  784. 51.42 s gammaloop-nextest-core>
  785. 51.42 s gammaloop-nextest-core> failures:
  786. 51.42 s gammaloop-nextest-core> generation::cff_tests::disconnected_mixed_energy_factor_ownership_keeps_both_component_factors
  787. 51.42 s gammaloop-nextest-core>
  788. 51.42 s gammaloop-nextest-core> test result: FAILED. 0 passed; 1 failed; 0 ignored; 0 measured; 52 filtered out; finished in 0.00s
  789. 51.42 s gammaloop-nextest-core>
  790. 51.42 s gammaloop-nextest-core> stderr ---
  791. 51.42 s gammaloop-nextest-core>
  792. 51.42 s gammaloop-nextest-core> thread 'generation::cff_tests::disconnected_mixed_energy_factor_ownership_keeps_both_component_factors' (3161) panicked at crates/three-dimensional-reps/src/generation.rs:5726:9:
  793. 51.42 s gammaloop-nextest-core> assertion `left == right` failed
  794. 51.42 s gammaloop-nextest-core> left: [GlobalSourceProduct, GlobalSourceProduct]
  795. 51.42 s gammaloop-nextest-core> right: [VariantLocal, GlobalSourceProduct]
  796. 51.42 s gammaloop-nextest-core> stack backtrace:
  797. 51.42 s gammaloop-nextest-core> 0: __rustc::rust_begin_unwind
  798. 51.42 s gammaloop-nextest-core> 1: core::panicking::panic_fmt
  799. 51.42 s gammaloop-nextest-core> 2: core::panicking::assert_failed_inner
  800. 51.42 s gammaloop-nextest-core> 3: core::panicking::assert_failed::<alloc::vec::Vec<three_dimensional_reps::generation::CffEnergyFactorOwnership>, alloc::vec::Vec<three_dimensional_reps::generation::CffEnergyFactorOwnership>>
  801. 51.42 s gammaloop-nextest-core> 4: three_dimensional_reps::generation::cff_tests::disconnected_mixed_energy_factor_ownership_keeps_both_component_factors
  802. 51.42 s gammaloop-nextest-core> 5: <three_dimensional_reps::generation::cff_tests::disconnected_mixed_energy_factor_ownership_keeps_both_component_factors::{closure#0} as core::ops::function::FnOnce<()>>::call_once
  803. 51.42 s gammaloop-nextest-core> note: Some details are omitted, run with `RUST_BACKTRACE=full` for a verbose backtrace.
  804. 51.42 s gammaloop-nextest-core>
  805. 51.43 s gammaloop-nextest-core> FAIL [ 0.040s] (42/53) three-dimensional-reps generation::cff_tests::cff_generation_builds_multiloop_repeated_high_power_known_factor_completion
  806. 51.43 s gammaloop-nextest-core> stdout ---
  807. 51.43 s gammaloop-nextest-core>
  808. 51.43 s gammaloop-nextest-core> running 1 test
  809. 51.43 s gammaloop-nextest-core> test generation::cff_tests::cff_generation_builds_multiloop_repeated_high_power_known_factor_completion ... FAILED
  810. 51.43 s gammaloop-nextest-core>
  811. 51.43 s gammaloop-nextest-core> failures:
  812. 51.43 s gammaloop-nextest-core>
  813. 51.43 s gammaloop-nextest-core> failures:
  814. 51.43 s gammaloop-nextest-core> generation::cff_tests::cff_generation_builds_multiloop_repeated_high_power_known_factor_completion
  815. 51.43 s gammaloop-nextest-core>
  816. 51.43 s gammaloop-nextest-core> test result: FAILED. 0 passed; 1 failed; 0 ignored; 0 measured; 52 filtered out; finished in 0.03s
  817. 51.43 s gammaloop-nextest-core>
  818. 51.43 s gammaloop-nextest-core> stderr ---
  819. 51.43 s gammaloop-nextest-core>
  820. 51.43 s gammaloop-nextest-core> thread 'generation::cff_tests::cff_generation_builds_multiloop_repeated_high_power_known_factor_completion' (3123) panicked at crates/three-dimensional-reps/src/generation.rs:5865:9:
  821. 51.43 s gammaloop-nextest-core> assertion failed: variants.iter().any(|variant|
  822. 51.43 s gammaloop-nextest-core> {
  823. 51.43 s gammaloop-nextest-core> variant.origin.as_deref().is_some_and(|origin|
  824. 51.43 s gammaloop-nextest-core> {
  825. 51.43 s gammaloop-nextest-core> origin.starts_with("bounded_degree_quadratic_recursive_remainder")
  826. 51.43 s gammaloop-nextest-core> })
  827. 51.43 s gammaloop-nextest-core> })
  828. 51.43 s gammaloop-nextest-core> stack backtrace:
  829. 51.43 s gammaloop-nextest-core> 0: __rustc::rust_begin_unwind
  830. 51.43 s gammaloop-nextest-core> 1: core::panicking::panic_fmt
  831. 51.43 s gammaloop-nextest-core> 2: core::panicking::panic
  832. 51.43 s gammaloop-nextest-core> 3: three_dimensional_reps::generation::cff_tests::cff_generation_builds_multiloop_repeated_high_power_known_factor_completion
  833. 51.43 s gammaloop-nextest-core> 4: <three_dimensional_reps::generation::cff_tests::cff_generation_builds_multiloop_repeated_high_power_known_factor_completion::{closure#0} as core::ops::function::FnOnce<()>>::call_once
  834. 51.43 s gammaloop-nextest-core> note: Some details are omitted, run with `RUST_BACKTRACE=full` for a verbose backtrace.
  835. 51.43 s gammaloop-nextest-core>
  836. 51.50 s gammaloop-nextest-core> FAIL [ 0.108s] (49/53) three-dimensional-reps generation::cff_tests::cff_generation_builds_one_loop_high_power_with_repeated_spectators
  837. 51.50 s gammaloop-nextest-core> stdout ---
  838. 51.50 s gammaloop-nextest-core>
  839. 51.50 s gammaloop-nextest-core> running 1 test
  840. 51.50 s gammaloop-nextest-core> test generation::cff_tests::cff_generation_builds_one_loop_high_power_with_repeated_spectators ... FAILED
  841. 51.50 s gammaloop-nextest-core>
  842. 51.50 s gammaloop-nextest-core> failures:
  843. 51.50 s gammaloop-nextest-core>
  844. 51.50 s gammaloop-nextest-core> failures:
  845. 51.50 s gammaloop-nextest-core> generation::cff_tests::cff_generation_builds_one_loop_high_power_with_repeated_spectators
  846. 51.50 s gammaloop-nextest-core>
  847. 51.50 s gammaloop-nextest-core> test result: FAILED. 0 passed; 1 failed; 0 ignored; 0 measured; 52 filtered out; finished in 0.10s
  848. 51.50 s gammaloop-nextest-core>
  849. 51.50 s gammaloop-nextest-core> stderr ---
  850. 51.50 s gammaloop-nextest-core>
  851. 51.50 s gammaloop-nextest-core> thread 'generation::cff_tests::cff_generation_builds_one_loop_high_power_with_repeated_spectators' (3124) panicked at crates/three-dimensional-reps/src/generation.rs:6288:9:
  852. 51.50 s gammaloop-nextest-core> assertion failed: variants.iter().any(|variant|
  853. 51.50 s gammaloop-nextest-core> {
  854. 51.50 s gammaloop-nextest-core> variant.origin.as_deref().is_some_and(|origin|
  855. 51.50 s gammaloop-nextest-core> {
  856. 51.50 s gammaloop-nextest-core> origin.starts_with("bounded_degree_quadratic_recursive_remainder")
  857. 51.50 s gammaloop-nextest-core> })
  858. 51.50 s gammaloop-nextest-core> })
  859. 51.50 s gammaloop-nextest-core> stack backtrace:
  860. 51.50 s gammaloop-nextest-core> 0: __rustc::rust_begin_unwind
  861. 51.50 s gammaloop-nextest-core> 1: core::panicking::panic_fmt
  862. 51.50 s gammaloop-nextest-core> 2: core::panicking::panic
  863. 51.50 s gammaloop-nextest-core> 3: three_dimensional_reps::generation::cff_tests::cff_generation_builds_one_loop_high_power_with_repeated_spectators
  864. 51.50 s gammaloop-nextest-core> 4: <three_dimensional_reps::generation::cff_tests::cff_generation_builds_one_loop_high_power_with_repeated_spectators::{closure#0} as core::ops::function::FnOnce<()>>::call_once
  865. 51.50 s gammaloop-nextest-core> note: Some details are omitted, run with `RUST_BACKTRACE=full` for a verbose backtrace.
  866. 51.50 s gammaloop-nextest-core>
  867. 51.93 s gammaloop-nextest-core> ------------
  868. 51.93 s gammaloop-nextest-core> Summary [ 0.547s] 53 tests run: 49 passed, 4 failed, 0 skipped
  869. 51.93 s gammaloop-nextest-core> FAIL [ 0.009s] (17/53) three-dimensional-reps generation::cff_tests::causal_repeated_generation_handles_energy_dependent_bubble_source
  870. 51.93 s gammaloop-nextest-core> stdout ---
  871. 51.93 s gammaloop-nextest-core>
  872. 51.93 s gammaloop-nextest-core> running 1 test
  873. 51.93 s gammaloop-nextest-core> test generation::cff_tests::causal_repeated_generation_handles_energy_dependent_bubble_source ... FAILED
  874. 51.93 s gammaloop-nextest-core>
  875. 51.93 s gammaloop-nextest-core> failures:
  876. 51.93 s gammaloop-nextest-core>
  877. 51.93 s gammaloop-nextest-core> failures:
  878. 51.93 s gammaloop-nextest-core> generation::cff_tests::causal_repeated_generation_handles_energy_dependent_bubble_source
  879. 51.93 s gammaloop-nextest-core>
  880. 51.93 s gammaloop-nextest-core> test result: FAILED. 0 passed; 1 failed; 0 ignored; 0 measured; 52 filtered out; finished in 0.00s
  881. 51.93 s gammaloop-nextest-core>
  882. 51.93 s gammaloop-nextest-core> stderr ---
  883. 51.93 s gammaloop-nextest-core>
  884. 51.93 s gammaloop-nextest-core> thread 'generation::cff_tests::causal_repeated_generation_handles_energy_dependent_bubble_source' (3121) panicked at crates/three-dimensional-reps/src/generation.rs:5806:9:
  885. 51.93 s gammaloop-nextest-core> assertion `left == right` failed
  886. 51.93 s gammaloop-nextest-core> left: GlobalSourceProduct
  887. 51.93 s gammaloop-nextest-core> right: VariantLocal
  888. 51.93 s gammaloop-nextest-core> stack backtrace:
  889. 51.93 s gammaloop-nextest-core> 0: __rustc::rust_begin_unwind
  890. 51.93 s gammaloop-nextest-core> 1: core::panicking::panic_fmt
  891. 51.93 s gammaloop-nextest-core> 2: core::panicking::assert_failed_inner
  892. 51.93 s gammaloop-nextest-core> 3: core::panicking::assert_failed::<three_dimensional_reps::generation::CffEnergyFactorOwnership, three_dimensional_reps::generation::CffEnergyFactorOwnership>
  893. 51.93 s gammaloop-nextest-core> 4: three_dimensional_reps::generation::cff_tests::causal_repeated_generation_handles_energy_dependent_bubble_source
  894. 51.93 s gammaloop-nextest-core> 5: <three_dimensional_reps::generation::cff_tests::causal_repeated_generation_handles_energy_dependent_bubble_source::{closure#0} as core::ops::function::FnOnce<()>>::call_once
  895. 51.93 s gammaloop-nextest-core> note: Some details are omitted, run with `RUST_BACKTRACE=full` for a verbose backtrace.
  896. 51.93 s gammaloop-nextest-core>
  897. 51.93 s gammaloop-nextest-core> FAIL [ 0.015s] (30/53) three-dimensional-reps generation::cff_tests::disconnected_mixed_energy_factor_ownership_keeps_both_component_factors
  898. 51.93 s gammaloop-nextest-core> stdout ---
  899. 51.93 s gammaloop-nextest-core>
  900. 51.93 s gammaloop-nextest-core> running 1 test
  901. 51.93 s gammaloop-nextest-core> test generation::cff_tests::disconnected_mixed_energy_factor_ownership_keeps_both_component_factors ... FAILED
  902. 51.93 s gammaloop-nextest-core>
  903. 51.93 s gammaloop-nextest-core> failures:
  904. 51.93 s gammaloop-nextest-core>
  905. 51.93 s gammaloop-nextest-core> failures:
  906. 51.93 s gammaloop-nextest-core> generation::cff_tests::disconnected_mixed_energy_factor_ownership_keeps_both_component_factors
  907. 51.93 s gammaloop-nextest-core>
  908. 51.93 s gammaloop-nextest-core> test result: FAILED. 0 passed; 1 failed; 0 ignored; 0 measured; 52 filtered out; finished in 0.00s
  909. 51.93 s gammaloop-nextest-core>
  910. 51.93 s gammaloop-nextest-core> stderr ---
  911. 51.93 s gammaloop-nextest-core>
  912. 51.93 s gammaloop-nextest-core> thread 'generation::cff_tests::disconnected_mixed_energy_factor_ownership_keeps_both_component_factors' (3161) panicked at crates/three-dimensional-reps/src/generation.rs:5726:9:
  913. 51.93 s gammaloop-nextest-core> assertion `left == right` failed
  914. 51.93 s gammaloop-nextest-core> left: [GlobalSourceProduct, GlobalSourceProduct]
  915. 51.93 s gammaloop-nextest-core> right: [VariantLocal, GlobalSourceProduct]
  916. 51.93 s gammaloop-nextest-core> stack backtrace:
  917. 51.93 s gammaloop-nextest-core> 0: __rustc::rust_begin_unwind
  918. 51.93 s gammaloop-nextest-core> 1: core::panicking::panic_fmt
  919. 51.93 s gammaloop-nextest-core> 2: core::panicking::assert_failed_inner
  920. 51.93 s gammaloop-nextest-core> 3: core::panicking::assert_failed::<alloc::vec::Vec<three_dimensional_reps::generation::CffEnergyFactorOwnership>, alloc::vec::Vec<three_dimensional_reps::generation::CffEnergyFactorOwnership>>
  921. 51.93 s gammaloop-nextest-core> 4: three_dimensional_reps::generation::cff_tests::disconnected_mixed_energy_factor_ownership_keeps_both_component_factors
  922. 51.93 s gammaloop-nextest-core> 5: <three_dimensional_reps::generation::cff_tests::disconnected_mixed_energy_factor_ownership_keeps_both_component_factors::{closure#0} as core::ops::function::FnOnce<()>>::call_once
  923. 51.93 s gammaloop-nextest-core> note: Some details are omitted, run with `RUST_BACKTRACE=full` for a verbose backtrace.
  924. 51.93 s gammaloop-nextest-core>
  925. 51.93 s gammaloop-nextest-core> FAIL [ 0.040s] (42/53) three-dimensional-reps generation::cff_tests::cff_generation_builds_multiloop_repeated_high_power_known_factor_completion
  926. 51.93 s gammaloop-nextest-core> stdout ---
  927. 51.93 s gammaloop-nextest-core>
  928. 51.93 s gammaloop-nextest-core> running 1 test
  929. 51.93 s gammaloop-nextest-core> test generation::cff_tests::cff_generation_builds_multiloop_repeated_high_power_known_factor_completion ... FAILED
  930. 51.93 s gammaloop-nextest-core>
  931. 51.93 s gammaloop-nextest-core> failures:
  932. 51.93 s gammaloop-nextest-core>
  933. 51.93 s gammaloop-nextest-core> failures:
  934. 51.93 s gammaloop-nextest-core> generation::cff_tests::cff_generation_builds_multiloop_repeated_high_power_known_factor_completion
  935. 51.93 s gammaloop-nextest-core>
  936. 51.93 s gammaloop-nextest-core> test result: FAILED. 0 passed; 1 failed; 0 ignored; 0 measured; 52 filtered out; finished in 0.03s
  937. 51.93 s gammaloop-nextest-core>
  938. 51.93 s gammaloop-nextest-core> stderr ---
  939. 51.93 s gammaloop-nextest-core>
  940. 51.93 s gammaloop-nextest-core> thread 'generation::cff_tests::cff_generation_builds_multiloop_repeated_high_power_known_factor_completion' (3123) panicked at crates/three-dimensional-reps/src/generation.rs:5865:9:
  941. 51.93 s gammaloop-nextest-core> assertion failed: variants.iter().any(|variant|
  942. 51.93 s gammaloop-nextest-core> {
  943. 51.93 s gammaloop-nextest-core> variant.origin.as_deref().is_some_and(|origin|
  944. 51.93 s gammaloop-nextest-core> {
  945. 51.93 s gammaloop-nextest-core> origin.starts_with("bounded_degree_quadratic_recursive_remainder")
  946. 51.93 s gammaloop-nextest-core> })
  947. 51.93 s gammaloop-nextest-core> })
  948. 51.93 s gammaloop-nextest-core> stack backtrace:
  949. 51.93 s gammaloop-nextest-core> 0: __rustc::rust_begin_unwind
  950. 51.93 s gammaloop-nextest-core> 1: core::panicking::panic_fmt
  951. 51.93 s gammaloop-nextest-core> 2: core::panicking::panic
  952. 51.93 s gammaloop-nextest-core> 3: three_dimensional_reps::generation::cff_tests::cff_generation_builds_multiloop_repeated_high_power_known_factor_completion
  953. 51.93 s gammaloop-nextest-core> 4: <three_dimensional_reps::generation::cff_tests::cff_generation_builds_multiloop_repeated_high_power_known_factor_completion::{closure#0} as core::ops::function::FnOnce<()>>::call_once
  954. 51.93 s gammaloop-nextest-core> note: Some details are omitted, run with `RUST_BACKTRACE=full` for a verbose backtrace.
  955. 51.93 s gammaloop-nextest-core>
  956. 51.93 s gammaloop-nextest-core> FAIL [ 0.108s] (49/53) three-dimensional-reps generation::cff_tests::cff_generation_builds_one_loop_high_power_with_repeated_spectators
  957. 51.93 s gammaloop-nextest-core> stdout ---
  958. 51.93 s gammaloop-nextest-core>
  959. 51.93 s gammaloop-nextest-core> running 1 test
  960. 51.93 s gammaloop-nextest-core> test generation::cff_tests::cff_generation_builds_one_loop_high_power_with_repeated_spectators ... FAILED
  961. 51.93 s gammaloop-nextest-core>
  962. 51.93 s gammaloop-nextest-core> failures:
  963. 51.93 s gammaloop-nextest-core>
  964. 51.93 s gammaloop-nextest-core> failures:
  965. 51.93 s gammaloop-nextest-core> generation::cff_tests::cff_generation_builds_one_loop_high_power_with_repeated_spectators
  966. 51.93 s gammaloop-nextest-core>
  967. 51.93 s gammaloop-nextest-core> test result: FAILED. 0 passed; 1 failed; 0 ignored; 0 measured; 52 filtered out; finished in 0.10s
  968. 51.93 s gammaloop-nextest-core>
  969. 51.93 s gammaloop-nextest-core> stderr ---
  970. 51.93 s gammaloop-nextest-core>
  971. 51.93 s gammaloop-nextest-core> thread 'generation::cff_tests::cff_generation_builds_one_loop_high_power_with_repeated_spectators' (3124) panicked at crates/three-dimensional-reps/src/generation.rs:6288:9:
  972. 51.93 s gammaloop-nextest-core> assertion failed: variants.iter().any(|variant|
  973. 51.93 s gammaloop-nextest-core> {
  974. 51.93 s gammaloop-nextest-core> variant.origin.as_deref().is_some_and(|origin|
  975. 51.93 s gammaloop-nextest-core> {
  976. 51.93 s gammaloop-nextest-core> origin.starts_with("bounded_degree_quadratic_recursive_remainder")
  977. 51.93 s gammaloop-nextest-core> })
  978. 51.93 s gammaloop-nextest-core> })
  979. 51.93 s gammaloop-nextest-core> stack backtrace:
  980. 51.93 s gammaloop-nextest-core> 0: __rustc::rust_begin_unwind
  981. 51.93 s gammaloop-nextest-core> 1: core::panicking::panic_fmt
  982. 51.93 s gammaloop-nextest-core> 2: core::panicking::panic
  983. 51.93 s gammaloop-nextest-core> 3: three_dimensional_reps::generation::cff_tests::cff_generation_builds_one_loop_high_power_with_repeated_spectators
  984. 51.93 s gammaloop-nextest-core> 4: <three_dimensional_reps::generation::cff_tests::cff_generation_builds_one_loop_high_power_with_repeated_spectators::{closure#0} as core::ops::function::FnOnce<()>>::call_once
  985. 51.93 s gammaloop-nextest-core> note: Some details are omitted, run with `RUST_BACKTRACE=full` for a verbose backtrace.
  986. 51.93 s gammaloop-nextest-core>
  987. 51.94 s gammaloop-nextest-core> error: test run failed
  988. 51.97 s gammaloop-nextest-core>
  989. 51.97 s gammaloop-nextest-core> ========== nextest test summary ==========
  990. 51.97 s gammaloop-nextest-core> report: target/nextest/ci_gammaloop/junit.xml
  991. 51.97 s gammaloop-nextest-core> tests: 53, failures: 4, errors: 0
  992. 51.97 s gammaloop-nextest-core>
  993. 51.97 s gammaloop-nextest-core> 1. three-dimensional-reps::generation::cff_tests::causal_repeated_generation_handles_energy_dependent_bubble_source
  994. 51.97 s gammaloop-nextest-core> failure: test failure with exit code 101
  995. 51.97 s gammaloop-nextest-core> thread 'generation::cff_tests::causal_repeated_generation_handles_energy_dependent_bubble_source' (3121) panicked at crates/three-dimensional-reps/src/generation.rs:5806:9:
  996. 51.97 s gammaloop-nextest-core> assertion `left == right` failed
  997. 51.97 s gammaloop-nextest-core> left: GlobalSourceProduct
  998. 51.97 s gammaloop-nextest-core> right: VariantLocal
  999. 51.97 s gammaloop-nextest-core> stack backtrace:
  1000. 51.97 s gammaloop-nextest-core> 0: __rustc::rust_begin_unwind
  1001. 51.97 s gammaloop-nextest-core> 1: core::panicking::panic_fmt
  1002. 51.97 s gammaloop-nextest-core> 2: core::panicking::assert_failed_inner
  1003. 51.97 s gammaloop-nextest-core> 3: core::panicking::assert_failed::<three_dimensional_reps::generation::CffEnergyFactorOwnership, three_dimensional_reps::generation::CffEnergyFactorOwnership>
  1004. 51.97 s gammaloop-nextest-core> 4: three_dimensional_reps::generation::cff_tests::causal_repeated_generation_handles_energy_dependent_bubble_source
  1005. 51.97 s gammaloop-nextest-core> 5: <three_dimensional_reps::generation::cff_tests::causal_repeated_generation_handles_energy_dependent_bubble_source::{closure#0} as core::ops::function::FnOnce<()>>::call_once
  1006. 51.97 s gammaloop-nextest-core> note: Some details are omitted, run with `RUST_BACKTRACE=full` for a verbose backtrace.
  1007. 51.97 s gammaloop-nextest-core> system-out
  1008. 51.97 s gammaloop-nextest-core> running 1 test
  1009. 51.97 s gammaloop-nextest-core> test generation::cff_tests::causal_repeated_generation_handles_energy_dependent_bubble_source ... FAILED
  1010. 51.97 s gammaloop-nextest-core>
  1011. 51.97 s gammaloop-nextest-core> failures:
  1012. 51.97 s gammaloop-nextest-core>
  1013. 51.97 s gammaloop-nextest-core> failures:
  1014. 51.97 s gammaloop-nextest-core> generation::cff_tests::causal_repeated_generation_handles_energy_dependent_bubble_source
  1015. 51.97 s gammaloop-nextest-core>
  1016. 51.97 s gammaloop-nextest-core> test result: FAILED. 0 passed; 1 failed; 0 ignored; 0 measured; 52 filtered out; finished in 0.00s
  1017. 51.97 s gammaloop-nextest-core> system-err
  1018. 51.97 s gammaloop-nextest-core> thread 'generation::cff_tests::causal_repeated_generation_handles_energy_dependent_bubble_source' (3121) panicked at crates/three-dimensional-reps/src/generation.rs:5806:9:
  1019. 51.97 s gammaloop-nextest-core> assertion `left == right` failed
  1020. 51.97 s gammaloop-nextest-core> left: GlobalSourceProduct
  1021. 51.97 s gammaloop-nextest-core> right: VariantLocal
  1022. 51.97 s gammaloop-nextest-core> stack backtrace:
  1023. 51.97 s gammaloop-nextest-core> 0: __rustc::rust_begin_unwind
  1024. 51.97 s gammaloop-nextest-core> 1: core::panicking::panic_fmt
  1025. 51.97 s gammaloop-nextest-core> 2: core::panicking::assert_failed_inner
  1026. 51.97 s gammaloop-nextest-core> 3: core::panicking::assert_failed::<three_dimensional_reps::generation::CffEnergyFactorOwnership, three_dimensional_reps::generation::CffEnergyFactorOwnership>
  1027. 51.97 s gammaloop-nextest-core> 4: three_dimensional_reps::generation::cff_tests::causal_repeated_generation_handles_energy_dependent_bubble_source
  1028. 51.97 s gammaloop-nextest-core> 5: <three_dimensional_reps::generation::cff_tests::causal_repeated_generation_handles_energy_dependent_bubble_source::{closure#0} as core::ops::function::FnOnce<()>>::call_once
  1029. 51.97 s gammaloop-nextest-core> note: Some details are omitted, run with `RUST_BACKTRACE=full` for a verbose backtrace.
  1030. 51.97 s gammaloop-nextest-core>
  1031. 51.97 s gammaloop-nextest-core> 2. three-dimensional-reps::generation::cff_tests::disconnected_mixed_energy_factor_ownership_keeps_both_component_factors
  1032. 51.97 s gammaloop-nextest-core> failure: test failure with exit code 101
  1033. 51.97 s gammaloop-nextest-core> thread 'generation::cff_tests::disconnected_mixed_energy_factor_ownership_keeps_both_component_factors' (3161) panicked at crates/three-dimensional-reps/src/generation.rs:5726:9:
  1034. 51.97 s gammaloop-nextest-core> assertion `left == right` failed
  1035. 51.97 s gammaloop-nextest-core> left: [GlobalSourceProduct, GlobalSourceProduct]
  1036. 51.97 s gammaloop-nextest-core> right: [VariantLocal, GlobalSourceProduct]
  1037. 51.97 s gammaloop-nextest-core> stack backtrace:
  1038. 51.97 s gammaloop-nextest-core> 0: __rustc::rust_begin_unwind
  1039. 51.97 s gammaloop-nextest-core> 1: core::panicking::panic_fmt
  1040. 51.97 s gammaloop-nextest-core> 2: core::panicking::assert_failed_inner
  1041. 51.97 s gammaloop-nextest-core> 3: core::panicking::assert_failed::<alloc::vec::Vec<three_dimensional_reps::generation::CffEnergyFactorOwnership>, alloc::vec::Vec<three_dimensional_reps::generation::CffEnergyFactorOwnership>>
  1042. 51.97 s gammaloop-nextest-core> 4: three_dimensional_reps::generation::cff_tests::disconnected_mixed_energy_factor_ownership_keeps_both_component_factors
  1043. 51.97 s gammaloop-nextest-core> 5: <three_dimensional_reps::generation::cff_tests::disconnected_mixed_energy_factor_ownership_keeps_both_component_factors::{closure#0} as core::ops::function::FnOnce<()>>::call_once
  1044. 51.97 s gammaloop-nextest-core> note: Some details are omitted, run with `RUST_BACKTRACE=full` for a verbose backtrace.
  1045. 51.97 s gammaloop-nextest-core> system-out
  1046. 51.97 s gammaloop-nextest-core> running 1 test
  1047. 51.97 s gammaloop-nextest-core> test generation::cff_tests::disconnected_mixed_energy_factor_ownership_keeps_both_component_factors ... FAILED
  1048. 51.97 s gammaloop-nextest-core>
  1049. 51.97 s gammaloop-nextest-core> failures:
  1050. 51.97 s gammaloop-nextest-core>
  1051. 51.97 s gammaloop-nextest-core> failures:
  1052. 51.97 s gammaloop-nextest-core> generation::cff_tests::disconnected_mixed_energy_factor_ownership_keeps_both_component_factors
  1053. 51.97 s gammaloop-nextest-core>
  1054. 51.97 s gammaloop-nextest-core> test result: FAILED. 0 passed; 1 failed; 0 ignored; 0 measured; 52 filtered out; finished in 0.00s
  1055. 51.97 s gammaloop-nextest-core> system-err
  1056. 51.97 s gammaloop-nextest-core> thread 'generation::cff_tests::disconnected_mixed_energy_factor_ownership_keeps_both_component_factors' (3161) panicked at crates/three-dimensional-reps/src/generation.rs:5726:9:
  1057. 51.97 s gammaloop-nextest-core> assertion `left == right` failed
  1058. 51.97 s gammaloop-nextest-core> left: [GlobalSourceProduct, GlobalSourceProduct]
  1059. 51.97 s gammaloop-nextest-core> right: [VariantLocal, GlobalSourceProduct]
  1060. 51.97 s gammaloop-nextest-core> stack backtrace:
  1061. 51.97 s gammaloop-nextest-core> 0: __rustc::rust_begin_unwind
  1062. 51.97 s gammaloop-nextest-core> 1: core::panicking::panic_fmt
  1063. 51.97 s gammaloop-nextest-core> 2: core::panicking::assert_failed_inner
  1064. 51.97 s gammaloop-nextest-core> 3: core::panicking::assert_failed::<alloc::vec::Vec<three_dimensional_reps::generation::CffEnergyFactorOwnership>, alloc::vec::Vec<three_dimensional_reps::generation::CffEnergyFactorOwnership>>
  1065. 51.97 s gammaloop-nextest-core> 4: three_dimensional_reps::generation::cff_tests::disconnected_mixed_energy_factor_ownership_keeps_both_component_factors
  1066. 51.97 s gammaloop-nextest-core> 5: <three_dimensional_reps::generation::cff_tests::disconnected_mixed_energy_factor_ownership_keeps_both_component_factors::{closure#0} as core::ops::function::FnOnce<()>>::call_once
  1067. 51.97 s gammaloop-nextest-core> note: Some details are omitted, run with `RUST_BACKTRACE=full` for a verbose backtrace.
  1068. 51.97 s gammaloop-nextest-core>
  1069. 51.97 s gammaloop-nextest-core> 3. three-dimensional-reps::generation::cff_tests::cff_generation_builds_multiloop_repeated_high_power_known_factor_completion
  1070. 51.97 s gammaloop-nextest-core> failure: test failure with exit code 101
  1071. 51.97 s gammaloop-nextest-core> thread 'generation::cff_tests::cff_generation_builds_multiloop_repeated_high_power_known_factor_completion' (3123) panicked at crates/three-dimensional-reps/src/generation.rs:5865:9:
  1072. 51.97 s gammaloop-nextest-core> assertion failed: variants.iter().any(|variant|
  1073. 51.97 s gammaloop-nextest-core> {
  1074. 51.97 s gammaloop-nextest-core> variant.origin.as_deref().is_some_and(|origin|
  1075. 51.97 s gammaloop-nextest-core> {
  1076. 51.97 s gammaloop-nextest-core> origin.starts_with("bounded_degree_quadratic_recursive_remainder")
  1077. 51.97 s gammaloop-nextest-core> })
  1078. 51.97 s gammaloop-nextest-core> })
  1079. 51.97 s gammaloop-nextest-core> stack backtrace:
  1080. 51.97 s gammaloop-nextest-core> 0: __rustc::rust_begin_unwind
  1081. 51.97 s gammaloop-nextest-core> 1: core::panicking::panic_fmt
  1082. 51.97 s gammaloop-nextest-core> 2: core::panicking::panic
  1083. 51.97 s gammaloop-nextest-core> 3: three_dimensional_reps::generation::cff_tests::cff_generation_builds_multiloop_repeated_high_power_known_factor_completion
  1084. 51.97 s gammaloop-nextest-core> 4: <three_dimensional_reps::generation::cff_tests::cff_generation_builds_multiloop_repeated_high_power_known_factor_completion::{closure#0} as core::ops::function::FnOnce<()>>::call_once
  1085. 51.97 s gammaloop-nextest-core> note: Some details are omitted, run with `RUST_BACKTRACE=full` for a verbose backtrace.
  1086. 51.97 s gammaloop-nextest-core> system-out
  1087. 51.97 s gammaloop-nextest-core> running 1 test
  1088. 51.97 s gammaloop-nextest-core> test generation::cff_tests::cff_generation_builds_multiloop_repeated_high_power_known_factor_completion ... FAILED
  1089. 51.97 s gammaloop-nextest-core>
  1090. 51.97 s gammaloop-nextest-core> failures:
  1091. 51.97 s gammaloop-nextest-core>
  1092. 51.97 s gammaloop-nextest-core> failures:
  1093. 51.97 s gammaloop-nextest-core> generation::cff_tests::cff_generation_builds_multiloop_repeated_high_power_known_factor_completion
  1094. 51.97 s gammaloop-nextest-core>
  1095. 51.97 s gammaloop-nextest-core> test result: FAILED. 0 passed; 1 failed; 0 ignored; 0 measured; 52 filtered out; finished in 0.03s
  1096. 51.97 s gammaloop-nextest-core> system-err
  1097. 51.97 s gammaloop-nextest-core> thread 'generation::cff_tests::cff_generation_builds_multiloop_repeated_high_power_known_factor_completion' (3123) panicked at crates/three-dimensional-reps/src/generation.rs:5865:9:
  1098. 51.97 s gammaloop-nextest-core> assertion failed: variants.iter().any(|variant|
  1099. 51.97 s gammaloop-nextest-core> {
  1100. 51.97 s gammaloop-nextest-core> variant.origin.as_deref().is_some_and(|origin|
  1101. 51.97 s gammaloop-nextest-core> {
  1102. 51.97 s gammaloop-nextest-core> origin.starts_with("bounded_degree_quadratic_recursive_remainder")
  1103. 51.97 s gammaloop-nextest-core> })
  1104. 51.97 s gammaloop-nextest-core> })
  1105. 51.97 s gammaloop-nextest-core> stack backtrace:
  1106. 51.97 s gammaloop-nextest-core> 0: __rustc::rust_begin_unwind
  1107. 51.97 s gammaloop-nextest-core> 1: core::panicking::panic_fmt
  1108. 51.97 s gammaloop-nextest-core> 2: core::panicking::panic
  1109. 51.97 s gammaloop-nextest-core> 3: three_dimensional_reps::generation::cff_tests::cff_generation_builds_multiloop_repeated_high_power_known_factor_completion
  1110. 51.97 s gammaloop-nextest-core> 4: <three_dimensional_reps::generation::cff_tests::cff_generation_builds_multiloop_repeated_high_power_known_factor_completion::{closure#0} as core::ops::function::FnOnce<()>>::call_once
  1111. 51.97 s gammaloop-nextest-core> note: Some details are omitted, run with `RUST_BACKTRACE=full` for a verbose backtrace.
  1112. 51.97 s gammaloop-nextest-core>
  1113. 51.97 s gammaloop-nextest-core> 4. three-dimensional-reps::generation::cff_tests::cff_generation_builds_one_loop_high_power_with_repeated_spectators
  1114. 51.97 s gammaloop-nextest-core> failure: test failure with exit code 101
  1115. 51.97 s gammaloop-nextest-core> thread 'generation::cff_tests::cff_generation_builds_one_loop_high_power_with_repeated_spectators' (3124) panicked at crates/three-dimensional-reps/src/generation.rs:6288:9:
  1116. 51.97 s gammaloop-nextest-core> assertion failed: variants.iter().any(|variant|
  1117. 51.97 s gammaloop-nextest-core> {
  1118. 51.97 s gammaloop-nextest-core> variant.origin.as_deref().is_some_and(|origin|
  1119. 51.97 s gammaloop-nextest-core> {
  1120. 51.97 s gammaloop-nextest-core> origin.starts_with("bounded_degree_quadratic_recursive_remainder")
  1121. 51.97 s gammaloop-nextest-core> })
  1122. 51.97 s gammaloop-nextest-core> })
  1123. 51.97 s gammaloop-nextest-core> stack backtrace:
  1124. 51.97 s gammaloop-nextest-core> 0: __rustc::rust_begin_unwind
  1125. 51.97 s gammaloop-nextest-core> 1: core::panicking::panic_fmt
  1126. 51.97 s gammaloop-nextest-core> 2: core::panicking::panic
  1127. 51.97 s gammaloop-nextest-core> 3: three_dimensional_reps::generation::cff_tests::cff_generation_builds_one_loop_high_power_with_repeated_spectators
  1128. 51.97 s gammaloop-nextest-core> 4: <three_dimensional_reps::generation::cff_tests::cff_generation_builds_one_loop_high_power_with_repeated_spectators::{closure#0} as core::ops::function::FnOnce<()>>::call_once
  1129. 51.97 s gammaloop-nextest-core> note: Some details are omitted, run with `RUST_BACKTRACE=full` for a verbose backtrace.
  1130. 51.97 s gammaloop-nextest-core> system-out
  1131. 51.97 s gammaloop-nextest-core> running 1 test
  1132. 51.97 s gammaloop-nextest-core> test generation::cff_tests::cff_generation_builds_one_loop_high_power_with_repeated_spectators ... FAILED
  1133. 51.97 s gammaloop-nextest-core>
  1134. 51.97 s gammaloop-nextest-core> failures:
  1135. 51.97 s gammaloop-nextest-core>
  1136. 51.97 s gammaloop-nextest-core> failures:
  1137. 51.97 s gammaloop-nextest-core> generation::cff_tests::cff_generation_builds_one_loop_high_power_with_repeated_spectators
  1138. 51.97 s gammaloop-nextest-core>
  1139. 51.97 s gammaloop-nextest-core> test result: FAILED. 0 passed; 1 failed; 0 ignored; 0 measured; 52 filtered out; finished in 0.10s
  1140. 51.97 s gammaloop-nextest-core> system-err
  1141. 51.97 s gammaloop-nextest-core> thread 'generation::cff_tests::cff_generation_builds_one_loop_high_power_with_repeated_spectators' (3124) panicked at crates/three-dimensional-reps/src/generation.rs:6288:9:
  1142. 51.97 s gammaloop-nextest-core> assertion failed: variants.iter().any(|variant|
  1143. 51.97 s gammaloop-nextest-core> {
  1144. 51.97 s gammaloop-nextest-core> variant.origin.as_deref().is_some_and(|origin|
  1145. 51.97 s gammaloop-nextest-core> {
  1146. 51.97 s gammaloop-nextest-core> origin.starts_with("bounded_degree_quadratic_recursive_remainder")
  1147. 51.97 s gammaloop-nextest-core> })
  1148. 51.97 s gammaloop-nextest-core> })
  1149. 51.97 s gammaloop-nextest-core> stack backtrace:
  1150. 51.97 s gammaloop-nextest-core> 0: __rustc::rust_begin_unwind
  1151. 51.97 s gammaloop-nextest-core> 1: core::panicking::panic_fmt
  1152. 51.97 s gammaloop-nextest-core> 2: core::panicking::panic
  1153. 51.97 s gammaloop-nextest-core> 3: three_dimensional_reps::generation::cff_tests::cff_generation_builds_one_loop_high_power_with_repeated_spectators
  1154. 51.97 s gammaloop-nextest-core> 4: <three_dimensional_reps::generation::cff_tests::cff_generation_builds_one_loop_high_power_with_repeated_spectators::{closure#0} as core::ops::function::FnOnce<()>>::call_once
  1155. 51.97 s gammaloop-nextest-core> note: Some details are omitted, run with `RUST_BACKTRACE=full` for a verbose backtrace.
  1156. 51.97 s gammaloop-nextest-core> =========================================
  1157. 52.03 s error: Cannot build '/nix/store/i3sh6ivcl5js2i7xcdz1qf32z60j8rna-gammaloop-nextest-core.drv'.
  1158. 52.03 s Reason: builder failed with exit code 100.
  1159. 52.03 s Output paths:
  1160. 52.03 s /nix/store/zw0sqrmrvf1b8g32rv52wgxnjn3i427b-gammaloop-nextest-core
  1161. 52.03 s Last 964 log lines:
  1162. 52.03 s > Extracting 3 binaries (including 1 non-test binary), 1 build script output directory, and 2 linked paths to /build/nextest-archive-2ydUp3
  1163. 52.03 s > Extracted 18 files to /build/nextest-archive-2ydUp3 in 0.49s
  1164. 52.03 s > ------------
  1165. 52.03 s > Nextest run ID a856d9f2-686d-40b2-86f7-4598c93484ce with nextest profile: ci_gammaloop
  1166. 52.03 s > Starting 367 tests across 2 binaries
  1167. 52.03 s > ------------
  1168. 52.03 s > Summary [ 0.745s] 367 tests run: 367 passed, 0 skipped
  1169. 52.03 s >
  1170. 52.03 s > ========== nextest test summary ==========
  1171. 52.03 s > report: target/nextest/ci_gammaloop/junit.xml
  1172. 52.03 s > tests: 367, failures: 0, errors: 0
  1173. 52.03 s > No failing testcases found.
  1174. 52.03 s > =========================================
  1175. 52.03 s > Extracting 1 binary and 1 linked path to /build/nextest-archive-DkaeiJ
  1176. 52.03 s > Extracted 7 files to /build/nextest-archive-DkaeiJ in 0.10s
  1177. 52.03 s > ------------
  1178. 52.03 s > Nextest run ID c41efd5b-b2bc-4170-acef-1bd18cf6bd37 with nextest profile: ci_gammaloop
  1179. 52.03 s > Starting 19 tests across 1 binary
  1180. 52.03 s > ------------
  1181. 52.03 s > Summary [ 0.020s] 19 tests run: 19 passed, 0 skipped
  1182. 52.03 s >
  1183. 52.03 s > ========== nextest test summary ==========
  1184. 52.03 s > report: target/nextest/ci_gammaloop/junit.xml
  1185. 52.03 s > tests: 19, failures: 0, errors: 0
  1186. 52.03 s > No failing testcases found.
  1187. 52.03 s > =========================================
  1188. 52.03 s > Extracting 1 binary to /build/nextest-archive-dfVR97
  1189. 52.03 s > Extracted 4 files to /build/nextest-archive-dfVR97 in 0.05s
  1190. 52.03 s > ------------
  1191. 52.03 s > Nextest run ID 38d99550-314d-416b-b229-5197891cf99f with nextest profile: ci_gammaloop
  1192. 52.03 s > Starting 0 tests across 1 binary
  1193. 52.03 s > ------------
  1194. 52.03 s > Summary [ 0.000s] 0 tests run: 0 passed, 0 skipped
  1195. 52.03 s >
  1196. 52.03 s > ========== nextest test summary ==========
  1197. 52.03 s > report: target/nextest/ci_gammaloop/junit.xml
  1198. 52.03 s > tests: 0, failures: 0, errors: 0
  1199. 52.03 s > No failing testcases found.
  1200. 52.03 s > =========================================
  1201. 52.03 s > Extracting 4 binaries, 1 build script output directory, and 2 linked paths to /build/nextest-archive-2r6Y3e
  1202. 52.03 s > Extracted 18 files to /build/nextest-archive-2r6Y3e in 0.69s
  1203. 52.03 s > ------------
  1204. 52.03 s > Nextest run ID 73669b91-3f0e-409c-a693-5d29f5a66b04 with nextest profile: ci_gammaloop
  1205. 52.03 s > Starting 501 tests across 4 binaries (59 tests skipped, including 58 tests via profile.ci_gammaloop.default-filter)
  1206. 52.03 s > FAIL [ 0.237s] (483/501) gammalooprs uv::hedge_poset::tests::union_terms_project_factorized_typed_4d_values
  1207. 52.03 s > stdout ---
  1208. 52.03 s >
  1209. 52.03 s > running 1 test
  1210. 52.03 s > test uv::hedge_poset::tests::union_terms_project_factorized_typed_4d_values ... FAILED
  1211. 52.03 s >
  1212. 52.03 s > failures:
  1213. 52.03 s >
  1214. 52.03 s > failures:
  1215. 52.03 s > uv::hedge_poset::tests::union_terms_project_factorized_typed_4d_values
  1216. 52.03 s >
  1217. 52.03 s > test result: FAILED. 0 passed; 1 failed; 0 ignored; 0 measured; 551 filtered out; finished in 0.22s
  1218. 52.03 s >
  1219. 52.03 s > stderr ---
  1220. 52.03 s > Error:
  1221. 52.03 s > 0: exact source occurrences for physical edge 1 disagree after on-shell-energy replacement: `-(mUVexp^2+Q(1,cind(1))^2+Q(1,cind(2))^2+Q(1,cind(3))^2)^(1/2)` versus `(mUVexp^2+Q(1,cind(1))^2+Q(1,cind(2))^2+Q(1,cind(3))^2)^(1/2)`; exact 4D term active denominators are [FourDDenominator { source_edge: EdgeIndex(1), momentum: gammalooprs::Q(1), mass_squared: gammalooprs::mUVexp^2, full_expr: -gammalooprs::mUV^2+spenso::dot(gammalooprs::Q(1,spenso::mink(gammalooprs::dim)),gammalooprs::Q(1,spenso::mink(gammalooprs::dim))) }, FourDDenominator { source_edge: EdgeIndex(1), momentum: gammalooprs::Q(1), mass_squared: gammalooprs::mUVexp^2, full_expr: -gammalooprs::mUV^2+spenso::dot(gammalooprs::Q(1,spenso::mink(gammalooprs::dim)),gammalooprs::Q(1,spenso::mink(gammalooprs::dim))) }, FourDDenominator { source_edge: EdgeIndex(3), momentum: gammalooprs::Q(3), mass_squared: gammalooprs::mUVexp^2, full_expr: -gammalooprs::mUV^2+spenso::dot(gammalooprs::Q(3,spenso::mink(gammalooprs::dim)),gammalooprs::Q(3,spenso::mink(gammalooprs::dim))) }, FourDDenominator { source_edge: EdgeIndex(3), momentum: gammalooprs::Q(3), mass_squared: gammalooprs::mUVexp^2, full_expr: -gammalooprs::mUV^2+spenso::dot(gammalooprs::Q(3,spenso::mink(gammalooprs::dim)),gammalooprs::Q(3,spenso::mink(gammalooprs::dim))) }, FourDDenominator { source_edge: EdgeIndex(0), momentum: gammalooprs::Q(0), mass_squared: UFO::mass_scalar_1^2, full_expr: -UFO::mass_scalar_1^2+spenso::dot(gammalooprs::Q(0,spenso::mink(gammalooprs::dim)),gammalooprs::Q(0,spenso::mink(gammalooprs::dim))) }]
  1222. 52.03 s >
  1223. 52.03 s > Location:
  1224. 52.03 s > crates/gammalooprs/src/uv/approx/local_3d.rs:641
  1225. 52.03 s >
  1226. 52.03 s > ━━━━━━━━━━━━━━━━━━━━━━━━━━━━━━━━━━ BACKTRACE ━━━━━━━━━━━━━━━━━━━━━━━━━━━━━━━━━━━
  1227. 52.03 s > 1: <color_eyre[51793ea62743adbd]::config::EyreHook>::into_eyre_hook::{closure#0}<unknown>
  1228. 52.03 s > at <unknown source file>:<unknown line>
  1229. 52.03 s > 2: eyre[cb2fd339c0c40fca]::capture_handler<unknown>
  1230. 52.03 s > at <unknown source file>:<unknown line>
  1231. 52.03 s > 3: <eyre[cb2fd339c0c40fca]::Report>::from_adhoc::<alloc[2ea6bcb46fca0c42]::string::String><unknown>
  1232. 52.03 s > at <unknown source file>:<unknown line>
  1233. 52.03 s > 4: <gammalooprs[6dc202c8af9e2ddf]::uv::approx::local_3d::Localizer>::project_4d<unknown>
  1234. 52.03 s > at <unknown source file>:<unknown line>
  1235. 52.03 s > 5: gammalooprs[6dc202c8af9e2ddf]::uv::hedge_poset::tests::union_terms_project_factorized_typed_4d_values<unknown>
  1236. 52.03 s > at <unknown source file>:<unknown line>
  1237. 52.03 s > 6: <gammalooprs[6dc202c8af9e2ddf]::uv::hedge_poset::tests::union_terms_project_factorized_typed_4d_values::{closure#0} as core[940e698046960fd5]::ops::function::FnOnce<()>>::call_once<unknown>
  1238. 52.03 s > at <unknown source file>:<unknown line>
  1239. 52.03 s > 7: test[75d6903177b1d7e9]::__rust_begin_short_backtrace::<core[940e698046960fd5]::result::Result<(), alloc[2ea6bcb46fca0c42]::string::String>, fn() -> core[940e698046960fd5]::result::Result<(), alloc[2ea6bcb46fca0c42]::string::String>><unknown>
  1240. 52.03 s > at <unknown source file>:<unknown line>
  1241. 52.03 s > 8: test[75d6903177b1d7e9]::run_test::{closure#0}<unknown>
  1242. 52.03 s > at <unknown source file>:<unknown line>
  1243. 52.03 s > 9: std[bcb96dfbba0ab899]::sys::backtrace::__rust_begin_short_backtrace::<test[75d6903177b1d7e9]::run_test::{closure#1}, ()><unknown>
  1244. 52.03 s > at <unknown source file>:<unknown line>
  1245. 52.03 s > 10: <std[bcb96dfbba0ab899]::thread::lifecycle::spawn_unchecked<test[75d6903177b1d7e9]::run_test::{closure#1}, ()>::{closure#1} as core[940e698046960fd5]::ops::function::FnOnce<()>>::call_once::{shim:vtable#0}<unknown>
  1246. 52.03 s > at <unknown source file>:<unknown line>
  1247. 52.03 s > 11: <std[bcb96dfbba0ab899]::sys::thread::unix::Thread>::new::thread_start<unknown>
  1248. 52.03 s > at <unknown source file>:<unknown line>
  1249. 52.03 s > 12: start_thread<unknown>
  1250. 52.03 s > at <unknown source file>:<unknown line>
  1251. 52.03 s > 13: __clone3<unknown>
  1252. 52.03 s > at <unknown source file>:<unknown line>
  1253. 52.03 s >
  1254. 52.03 s > Run with COLORBT_SHOW_HIDDEN=1 environment variable to disable frame filtering.
  1255. 52.03 s > Run with RUST_BACKTRACE=full to include source snippets.
  1256. 52.03 s >
  1257. 52.03 s > FAIL [ 5.655s] (497/501) gammalooprs::test_renormalization finite_part_ghost_2loop
  1258. 52.03 s > stdout ---
  1259. 52.03 s >
  1260. 52.03 s > running 1 test
  1261. 52.03 s > test finite_part_ghost_2loop ... FAILED
  1262. 52.03 s >
  1263. 52.03 s > failures:
  1264. 52.03 s >
  1265. 52.03 s > failures:
  1266. 52.03 s > finite_part_ghost_2loop
  1267. 52.03 s >
  1268. 52.03 s > test result: FAILED. 0 passed; 1 failed; 0 ignored; 0 measured; 5 filtered out; finished in 5.64s
  1269. 52.03 s >
  1270. 52.03 s > stderr ---
  1271. 52.03 s > [16:29:12.294] @gammalooprs::processes::amplitude ERROR :
  1272. 52.03 s > field value
  1273. 52.03 s > error generalized CFF expression generation failed for graph `d5` with source-edge numerator energy-degree bounds Some([(1, 1), (2, 1), (3, 1), (5, 2), (6, 2)]): energy-degree bounds do not certify vanishing residues at infinity under the conservative cap check: EnergyDivergenceReport { edge_degree_bounds: [1, 1, 1, 2, 2], loops: [EnergyDirectionReport { loop_id: Some(0), zero_edges: [], active_edges: [0, 1, 2, 4], nullity: None, numerator_degree_bound: 5, denominator_degree: 8, divergence_degree: -3, convergent: true }, EnergyDirectionReport { loop_id: Some(1), zero_edges: [], active_edges: [3, 4], nullity: None, numerator_degree_bound: 4, denominator_degree: 4, divergence_degree: 0, convergent: false }], directions: [EnergyDirectionReport { loop_id: None, zero_edges: [0, 1, 2], active_edges: [3, 4], nullity: Some(1), numerator_degree_bound: 4, denominator_degree: 4, divergence_degree: 0, convergent: false }, EnergyDirectionReport { loop_id: None, zero_edges: [], active_edges: [0, 1, 2, 3, 4], nullity: Some(2), numerator_degree_bound: 7, denominator_degree: 10, divergence_degree: -3, convergent: true }, EnergyDirectionReport { loop_id: None, zero_edges: [3], active_edges: [0, 1, 2, 4], nullity: Some(1), numerator_degree_bound: 5, denominator_degree: 8, divergence_degree: -3, convergent: true }, EnergyDirectionReport { loop_id: None, zero_edges: [4], active_edges: [0, 1, 2, 3], nullity: Some(1), numerator_degree_bound: 5, denominator_degree: 8, divergence_degree: -3, convergent: true }], coordinate_convergent: false, directional_convergent: false, convergent: false }
  1274. 52.03 s > 3D source has 2 loop names ["e1", "e5"], 5 internal edges [edge 0: 0 -> 1, loops=[1, 0], externals=[0, 0]; edge 1: 0 -> 2, loops=[-1, 0], externals=[1, 0]; edge 2: 1 -> 3, loops=[1, 0], externals=[-1, 0]; edge 3: 2 -> 3, loops=[0, 1], externals=[0, 0]; edge 4: 2 -> 3, loops=[-1, -1], externals=[1, 0]]
  1275. 52.03 s > at crates/gammalooprs/src/processes/amplitude.rs:825
  1276. 52.03 s > The application panicked (crashed).
  1277. 52.03 s > Message: called `Result::unwrap()` on an `Err` value:
  1278. 52.03 s > 0: generalized CFF expression generation failed for graph `d5` with source-edge numerator energy-degree bounds Some([(1, 1), (2, 1), (3, 1), (5, 2), (6, 2)]): energy-degree bounds do not certify vanishing residues at infinity under the conservative cap check: EnergyDivergenceReport { edge_degree_bounds: [1, 1, 1, 2, 2], loops: [EnergyDirectionReport { loop_id: Some(0), zero_edges: [], active_edges: [0, 1, 2, 4], nullity: None, numerator_degree_bound: 5, denominator_degree: 8, divergence_degree: -3, convergent: true }, EnergyDirectionReport { loop_id: Some(1), zero_edges: [], active_edges: [3, 4], nullity: None, numerator_degree_bound: 4, denominator_degree: 4, divergence_degree: 0, convergent: false }], directions: [EnergyDirectionReport { loop_id: None, zero_edges: [0, 1, 2], active_edges: [3, 4], nullity: Some(1), numerator_degree_bound: 4, denominator_degree: 4, divergence_degree: 0, convergent: false }, EnergyDirectionReport { loop_id: None, zero_edges: [], active_edges: [0, 1, 2, 3, 4], nullity: Some(2), numerator_degree_bound: 7, denominator_degree: 10, divergence_degree: -3, convergent: true }, EnergyDirectionReport { loop_id: None, zero_edges: [3], active_edges: [0, 1, 2, 4], nullity: Some(1), numerator_degree_bound: 5, denominator_degree: 8, divergence_degree: -3, convergent: true }, EnergyDirectionReport { loop_id: None, zero_edges: [4], active_edges: [0, 1, 2, 3], nullity: Some(1), numerator_degree_bound: 5, denominator_degree: 8, divergence_degree: -3, convergent: true }], coordinate_convergent: false, directional_convergent: false, convergent: false }
  1279. 52.03 s > 3D source has 2 loop names ["e1", "e5"], 5 internal edges [edge 0: 0 -> 1, loops=[1, 0], externals=[0, 0]; edge 1: 0 -> 2, loops=[-1, 0], externals=[1, 0]; edge 2: 1 -> 3, loops=[1, 0], externals=[-1, 0]; edge 3: 2 -> 3, loops=[0, 1], externals=[0, 0]; edge 4: 2 -> 3, loops=[-1, -1], externals=[1, 0]]
  1280. 52.03 s >
  1281. 52.03 s > Location:
  1282. 52.03 s > crates/gammalooprs/src/cff/generation.rs:226
  1283. 52.03 s >
  1284. 52.03 s > ━━━━━━━━━━━━━━━━━━━━━━━━━━━━━━━━━━ BACKTRACE ━━━━━━━━━━━━━━━━━━━━━━━━━━━━━━━━━━━
  1285. 52.03 s > 1: <color_eyre[51793ea62743adbd]::config::EyreHook>::into_eyre_hook::{closure#0}<unknown>
  1286. 52.03 s > at <unknown source file>:<unknown line>
  1287. 52.03 s > 2: eyre[cb2fd339c0c40fca]::capture_handler<unknown>
  1288. 52.03 s > at <unknown source file>:<unknown line>
  1289. 52.03 s > 3: <eyre[cb2fd339c0c40fca]::Report>::from_adhoc::<alloc[2ea6bcb46fca0c42]::string::String><unknown>
  1290. 52.03 s > at <unknown source file>:<unknown line>
  1291. 52.03 s > 4: <gammalooprs[1d0b14476f7eb2f8]::graph::Graph>::generate_3d_expression_for_integrand<unknown>
  1292. 52.03 s > at <unknown source file>:<unknown line>
  1293. 52.03 s > 5: <gammalooprs[1d0b14476f7eb2f8]::processes::amplitude::AmplitudeGraph>::generate_cff<unknown>
  1294. 52.03 s > at <unknown source file>:<unknown line>
  1295. 52.03 s > 6: <gammalooprs[1d0b14476f7eb2f8]::processes::amplitude::AmplitudeGraph>::renormalization_part<unknown>
  1296. 52.03 s > at <unknown source file>:<unknown line>
  1297. 52.03 s > 7: test_renormalization[879b57236d814a44]::finite_part_ghost_2loop<unknown>
  1298. 52.03 s > at <unknown source file>:<unknown line>
  1299. 52.03 s > 8: <test_renormalization[879b57236d814a44]::finite_part_ghost_2loop::{closure#0} as core[940e698046960fd5]::ops::function::FnOnce<()>>::call_once<unknown>
  1300. 52.03 s > at <unknown source file>:<unknown line>
  1301. 52.03 s > 9: test[75d6903177b1d7e9]::__rust_begin_short_backtrace::<core[940e698046960fd5]::result::Result<(), alloc[2ea6bcb46fca0c42]::string::String>, fn() -> core[940e698046960fd5]::result::Result<(), alloc[2ea6bcb46fca0c42]::string::String>><unknown>
  1302. 52.03 s > at <unknown source file>:<unknown line>
  1303. 52.03 s > 10: test[75d6903177b1d7e9]::run_test::{closure#0}<unknown>
  1304. 52.03 s > at <unknown source file>:<unknown line>
  1305. 52.03 s > 11: std[bcb96dfbba0ab899]::sys::backtrace::__rust_begin_short_backtrace::<test[75d6903177b1d7e9]::run_test::{closure#1}, ()><unknown>
  1306. 52.03 s > at <unknown source file>:<unknown line>
  1307. 52.03 s > 12: <std[bcb96dfbba0ab899]::thread::lifecycle::spawn_unchecked<test[75d6903177b1d7e9]::run_test::{closure#1}, ()>::{closure#1} as core[940e698046960fd5]::ops::function::FnOnce<()>>::call_once::{shim:vtable#0}<unknown>
  1308. 52.03 s > at <unknown source file>:<unknown line>
  1309. 52.03 s > 13: <std[bcb96dfbba0ab899]::sys::thread::unix::Thread>::new::thread_start<unknown>
  1310. 52.03 s > at <unknown source file>:<unknown line>
  1311. 52.03 s > 14: start_thread<unknown>
  1312. 52.03 s > at <unknown source file>:<unknown line>
  1313. 52.03 s > 15: __clone3<unknown>
  1314. 52.03 s > at <unknown source file>:<unknown line>
  1315. 52.03 s >
  1316. 52.03 s > Run with COLORBT_SHOW_HIDDEN=1 environment variable to disable frame filtering.
  1317. 52.03 s > Run with RUST_BACKTRACE=full to include source snippets.
  1318. 52.03 s > Warning: SpanTrace capture is Unsupported.
  1319. 52.03 s > Ensure that you've setup a tracing-error ErrorLayer and the semver versions are compatible
  1320. 52.03 s > Location: crates/gammalooprs/tests/test_renormalization.rs:495
  1321. 52.03 s >
  1322. 52.03 s > ━━━━━━━━━━━━━━━━━━━━━━━━━━━━━━━━━━ BACKTRACE ━━━━━━━━━━━━━━━━━━━━━━━━━━━━━━━━━━━
  1323. 52.03 s > 1: <color_eyre[51793ea62743adbd]::config::PanicHook>::panic_report<unknown>
  1324. 52.03 s > at <unknown source file>:<unknown line>
  1325. 52.03 s > 2: <color_eyre[51793ea62743adbd]::config::PanicHook>::into_panic_hook::{closure#0}<unknown>
  1326. 52.03 s > at <unknown source file>:<unknown line>
  1327. 52.03 s > 3: std[bcb96dfbba0ab899]::panicking::panic_with_hook<unknown>
  1328. 52.03 s > at <unknown source file>:<unknown line>
  1329. 52.03 s > 4: std[bcb96dfbba0ab899]::panicking::panic_handler::{closure#0}<unknown>
  1330. 52.03 s > at <unknown source file>:<unknown line>
  1331. 52.03 s > 5: std[bcb96dfbba0ab899]::sys::backtrace::__rust_end_short_backtrace::<std[bcb96dfbba0ab899]::panicking::panic_handler::{closure#0}, !><unknown>
  1332. 52.03 s > at <unknown source file>:<unknown line>
  1333. 52.03 s > 6: __rustc[6c289b9f9c454d21]::rust_begin_unwind<unknown>
  1334. 52.03 s > at <unknown source file>:<unknown line>
  1335. 52.03 s > 7: core[940e698046960fd5]::panicking::panic_fmt<unknown>
  1336. 52.03 s > at <unknown source file>:<unknown line>
  1337. 52.03 s > 8: core[940e698046960fd5]::result::unwrap_failed<unknown>
  1338. 52.03 s > at <unknown source file>:<unknown line>
  1339. 52.03 s > 9: test_renormalization[879b57236d814a44]::finite_part_ghost_2loop<unknown>
  1340. 52.03 s > at <unknown source file>:<unknown line>
  1341. 52.03 s > 10: <test_renormalization[879b57236d814a44]::finite_part_ghost_2loop::{closure#0} as core[940e698046960fd5]::ops::function::FnOnce<()>>::call_once<unknown>
  1342. 52.03 s > at <unknown source file>:<unknown line>
  1343. 52.03 s > 11: test[75d6903177b1d7e9]::__rust_begin_short_backtrace::<core[940e698046960fd5]::result::Result<(), alloc[2ea6bcb46fca0c42]::string::String>, fn() -> core[940e698046960fd5]::result::Result<(), alloc[2ea6bcb46fca0c42]::string::String>><unknown>
  1344. 52.03 s > at <unknown source file>:<unknown line>
  1345. 52.03 s > 12: test[75d6903177b1d7e9]::run_test::{closure#0}<unknown>
  1346. 52.03 s > at <unknown source file>:<unknown line>
  1347. 52.03 s > 13: std[bcb96dfbba0ab899]::sys::backtrace::__rust_begin_short_backtrace::<test[75d6903177b1d7e9]::run_test::{closure#1}, ()><unknown>
  1348. 52.03 s > at <unknown source file>:<unknown line>
  1349. 52.03 s > 14: <std[bcb96dfbba0ab899]::thread::lifecycle::spawn_unchecked<test[75d6903177b1d7e9]::run_test::{closure#1}, ()>::{closure#1} as core[940e698046960fd5]::ops::function::FnOnce<()>>::call_once::{shim:vtable#0}<unknown>
  1350. 52.03 s > at <unknown source file>:<unknown line>
  1351. 52.03 s > 15: <std[bcb96dfbba0ab899]::sys::thread::unix::Thread>::new::thread_start<unknown>
  1352. 52.03 s > at <unknown source file>:<unknown line>
  1353. 52.03 s > 16: start_thread<unknown>
  1354. 52.03 s > at <unknown source file>:<unknown line>
  1355. 52.03 s > 17: __clone3<unknown>
  1356. 52.03 s > at <unknown source file>:<unknown line>
  1357. 52.03 s >
  1358. 52.03 s > Run with COLORBT_SHOW_HIDDEN=1 environment variable to disable frame filtering.
  1359. 52.03 s > Run with RUST_BACKTRACE=full to include source snippets.
  1360. 52.03 s >
  1361. 52.03 s > ------------
  1362. 52.03 s > Summary [ 11.484s] 501 tests run: 499 passed, 2 failed, 59 skipped
  1363. 52.03 s > FAIL [ 0.237s] (483/501) gammalooprs uv::hedge_poset::tests::union_terms_project_factorized_typed_4d_values
  1364. 52.03 s > stdout ---
  1365. 52.03 s >
  1366. 52.03 s > running 1 test
  1367. 52.03 s > test uv::hedge_poset::tests::union_terms_project_factorized_typed_4d_values ... FAILED
  1368. 52.03 s >
  1369. 52.03 s > failures:
  1370. 52.03 s >
  1371. 52.03 s > failures:
  1372. 52.03 s > uv::hedge_poset::tests::union_terms_project_factorized_typed_4d_values
  1373. 52.03 s >
  1374. 52.03 s > test result: FAILED. 0 passed; 1 failed; 0 ignored; 0 measured; 551 filtered out; finished in 0.22s
  1375. 52.03 s >
  1376. 52.03 s > stderr ---
  1377. 52.03 s > Error:
  1378. 52.03 s > 0: exact source occurrences for physical edge 1 disagree after on-shell-energy replacement: `-(mUVexp^2+Q(1,cind(1))^2+Q(1,cind(2))^2+Q(1,cind(3))^2)^(1/2)` versus `(mUVexp^2+Q(1,cind(1))^2+Q(1,cind(2))^2+Q(1,cind(3))^2)^(1/2)`; exact 4D term active denominators are [FourDDenominator { source_edge: EdgeIndex(1), momentum: gammalooprs::Q(1), mass_squared: gammalooprs::mUVexp^2, full_expr: -gammalooprs::mUV^2+spenso::dot(gammalooprs::Q(1,spenso::mink(gammalooprs::dim)),gammalooprs::Q(1,spenso::mink(gammalooprs::dim))) }, FourDDenominator { source_edge: EdgeIndex(1), momentum: gammalooprs::Q(1), mass_squared: gammalooprs::mUVexp^2, full_expr: -gammalooprs::mUV^2+spenso::dot(gammalooprs::Q(1,spenso::mink(gammalooprs::dim)),gammalooprs::Q(1,spenso::mink(gammalooprs::dim))) }, FourDDenominator { source_edge: EdgeIndex(3), momentum: gammalooprs::Q(3), mass_squared: gammalooprs::mUVexp^2, full_expr: -gammalooprs::mUV^2+spenso::dot(gammalooprs::Q(3,spenso::mink(gammalooprs::dim)),gammalooprs::Q(3,spenso::mink(gammalooprs::dim))) }, FourDDenominator { source_edge: EdgeIndex(3), momentum: gammalooprs::Q(3), mass_squared: gammalooprs::mUVexp^2, full_expr: -gammalooprs::mUV^2+spenso::dot(gammalooprs::Q(3,spenso::mink(gammalooprs::dim)),gammalooprs::Q(3,spenso::mink(gammalooprs::dim))) }, FourDDenominator { source_edge: EdgeIndex(0), momentum: gammalooprs::Q(0), mass_squared: UFO::mass_scalar_1^2, full_expr: -UFO::mass_scalar_1^2+spenso::dot(gammalooprs::Q(0,spenso::mink(gammalooprs::dim)),gammalooprs::Q(0,spenso::mink(gammalooprs::dim))) }]
  1379. 52.03 s >
  1380. 52.03 s > Location:
  1381. 52.03 s > crates/gammalooprs/src/uv/approx/local_3d.rs:641
  1382. 52.03 s >
  1383. 52.03 s > ━━━━━━━━━━━━━━━━━━━━━━━━━━━━━━━━━━ BACKTRACE ━━━━━━━━━━━━━━━━━━━━━━━━━━━━━━━━━━━
  1384. 52.03 s > 1: <color_eyre[51793ea62743adbd]::config::EyreHook>::into_eyre_hook::{closure#0}<unknown>
  1385. 52.03 s > at <unknown source file>:<unknown line>
  1386. 52.03 s > 2: eyre[cb2fd339c0c40fca]::capture_handler<unknown>
  1387. 52.03 s > at <unknown source file>:<unknown line>
  1388. 52.03 s > 3: <eyre[cb2fd339c0c40fca]::Report>::from_adhoc::<alloc[2ea6bcb46fca0c42]::string::String><unknown>
  1389. 52.03 s > at <unknown source file>:<unknown line>
  1390. 52.03 s > 4: <gammalooprs[6dc202c8af9e2ddf]::uv::approx::local_3d::Localizer>::project_4d<unknown>
  1391. 52.03 s > at <unknown source file>:<unknown line>
  1392. 52.03 s > 5: gammalooprs[6dc202c8af9e2ddf]::uv::hedge_poset::tests::union_terms_project_factorized_typed_4d_values<unknown>
  1393. 52.03 s > at <unknown source file>:<unknown line>
  1394. 52.03 s > 6: <gammalooprs[6dc202c8af9e2ddf]::uv::hedge_poset::tests::union_terms_project_factorized_typed_4d_values::{closure#0} as core[940e698046960fd5]::ops::function::FnOnce<()>>::call_once<unknown>
  1395. 52.03 s > at <unknown source file>:<unknown line>
  1396. 52.03 s > 7: test[75d6903177b1d7e9]::__rust_begin_short_backtrace::<core[940e698046960fd5]::result::Result<(), alloc[2ea6bcb46fca0c42]::string::String>, fn() -> core[940e698046960fd5]::result::Result<(), alloc[2ea6bcb46fca0c42]::string::String>><unknown>
  1397. 52.03 s > at <unknown source file>:<unknown line>
  1398. 52.03 s > 8: test[75d6903177b1d7e9]::run_test::{closure#0}<unknown>
  1399. 52.03 s > at <unknown source file>:<unknown line>
  1400. 52.03 s > 9: std[bcb96dfbba0ab899]::sys::backtrace::__rust_begin_short_backtrace::<test[75d6903177b1d7e9]::run_test::{closure#1}, ()><unknown>
  1401. 52.03 s > at <unknown source file>:<unknown line>
  1402. 52.03 s > 10: <std[bcb96dfbba0ab899]::thread::lifecycle::spawn_unchecked<test[75d6903177b1d7e9]::run_test::{closure#1}, ()>::{closure#1} as core[940e698046960fd5]::ops::function::FnOnce<()>>::call_once::{shim:vtable#0}<unknown>
  1403. 52.03 s > at <unknown source file>:<unknown line>
  1404. 52.03 s > 11: <std[bcb96dfbba0ab899]::sys::thread::unix::Thread>::new::thread_start<unknown>
  1405. 52.03 s > at <unknown source file>:<unknown line>
  1406. 52.03 s > 12: start_thread<unknown>
  1407. 52.03 s > at <unknown source file>:<unknown line>
  1408. 52.03 s > 13: __clone3<unknown>
  1409. 52.03 s > at <unknown source file>:<unknown line>
  1410. 52.03 s >
  1411. 52.03 s > Run with COLORBT_SHOW_HIDDEN=1 environment variable to disable frame filtering.
  1412. 52.03 s > Run with RUST_BACKTRACE=full to include source snippets.
  1413. 52.03 s >
  1414. 52.03 s > FAIL [ 5.655s] (497/501) gammalooprs::test_renormalization finite_part_ghost_2loop
  1415. 52.03 s > stdout ---
  1416. 52.03 s >
  1417. 52.03 s > running 1 test
  1418. 52.03 s > test finite_part_ghost_2loop ... FAILED
  1419. 52.03 s >
  1420. 52.03 s > failures:
  1421. 52.03 s >
  1422. 52.03 s > failures:
  1423. 52.03 s > finite_part_ghost_2loop
  1424. 52.03 s >
  1425. 52.03 s > test result: FAILED. 0 passed; 1 failed; 0 ignored; 0 measured; 5 filtered out; finished in 5.64s
  1426. 52.03 s >
  1427. 52.03 s > stderr ---
  1428. 52.03 s > [16:29:12.294] @gammalooprs::processes::amplitude ERROR :
  1429. 52.03 s > field value
  1430. 52.03 s > error generalized CFF expression generation failed for graph `d5` with source-edge numerator energy-degree bounds Some([(1, 1), (2, 1), (3, 1), (5, 2), (6, 2)]): energy-degree bounds do not certify vanishing residues at infinity under the conservative cap check: EnergyDivergenceReport { edge_degree_bounds: [1, 1, 1, 2, 2], loops: [EnergyDirectionReport { loop_id: Some(0), zero_edges: [], active_edges: [0, 1, 2, 4], nullity: None, numerator_degree_bound: 5, denominator_degree: 8, divergence_degree: -3, convergent: true }, EnergyDirectionReport { loop_id: Some(1), zero_edges: [], active_edges: [3, 4], nullity: None, numerator_degree_bound: 4, denominator_degree: 4, divergence_degree: 0, convergent: false }], directions: [EnergyDirectionReport { loop_id: None, zero_edges: [0, 1, 2], active_edges: [3, 4], nullity: Some(1), numerator_degree_bound: 4, denominator_degree: 4, divergence_degree: 0, convergent: false }, EnergyDirectionReport { loop_id: None, zero_edges: [], active_edges: [0, 1, 2, 3, 4], nullity: Some(2), numerator_degree_bound: 7, denominator_degree: 10, divergence_degree: -3, convergent: true }, EnergyDirectionReport { loop_id: None, zero_edges: [3], active_edges: [0, 1, 2, 4], nullity: Some(1), numerator_degree_bound: 5, denominator_degree: 8, divergence_degree: -3, convergent: true }, EnergyDirectionReport { loop_id: None, zero_edges: [4], active_edges: [0, 1, 2, 3], nullity: Some(1), numerator_degree_bound: 5, denominator_degree: 8, divergence_degree: -3, convergent: true }], coordinate_convergent: false, directional_convergent: false, convergent: false }
  1431. 52.03 s > 3D source has 2 loop names ["e1", "e5"], 5 internal edges [edge 0: 0 -> 1, loops=[1, 0], externals=[0, 0]; edge 1: 0 -> 2, loops=[-1, 0], externals=[1, 0]; edge 2: 1 -> 3, loops=[1, 0], externals=[-1, 0]; edge 3: 2 -> 3, loops=[0, 1], externals=[0, 0]; edge 4: 2 -> 3, loops=[-1, -1], externals=[1, 0]]
  1432. 52.03 s > at crates/gammalooprs/src/processes/amplitude.rs:825
  1433. 52.03 s > The application panicked (crashed).
  1434. 52.03 s > Message: called `Result::unwrap()` on an `Err` value:
  1435. 52.03 s > 0: generalized CFF expression generation failed for graph `d5` with source-edge numerator energy-degree bounds Some([(1, 1), (2, 1), (3, 1), (5, 2), (6, 2)]): energy-degree bounds do not certify vanishing residues at infinity under the conservative cap check: EnergyDivergenceReport { edge_degree_bounds: [1, 1, 1, 2, 2], loops: [EnergyDirectionReport { loop_id: Some(0), zero_edges: [], active_edges: [0, 1, 2, 4], nullity: None, numerator_degree_bound: 5, denominator_degree: 8, divergence_degree: -3, convergent: true }, EnergyDirectionReport { loop_id: Some(1), zero_edges: [], active_edges: [3, 4], nullity: None, numerator_degree_bound: 4, denominator_degree: 4, divergence_degree: 0, convergent: false }], directions: [EnergyDirectionReport { loop_id: None, zero_edges: [0, 1, 2], active_edges: [3, 4], nullity: Some(1), numerator_degree_bound: 4, denominator_degree: 4, divergence_degree: 0, convergent: false }, EnergyDirectionReport { loop_id: None, zero_edges: [], active_edges: [0, 1, 2, 3, 4], nullity: Some(2), numerator_degree_bound: 7, denominator_degree: 10, divergence_degree: -3, convergent: true }, EnergyDirectionReport { loop_id: None, zero_edges: [3], active_edges: [0, 1, 2, 4], nullity: Some(1), numerator_degree_bound: 5, denominator_degree: 8, divergence_degree: -3, convergent: true }, EnergyDirectionReport { loop_id: None, zero_edges: [4], active_edges: [0, 1, 2, 3], nullity: Some(1), numerator_degree_bound: 5, denominator_degree: 8, divergence_degree: -3, convergent: true }], coordinate_convergent: false, directional_convergent: false, convergent: false }
  1436. 52.03 s > 3D source has 2 loop names ["e1", "e5"], 5 internal edges [edge 0: 0 -> 1, loops=[1, 0], externals=[0, 0]; edge 1: 0 -> 2, loops=[-1, 0], externals=[1, 0]; edge 2: 1 -> 3, loops=[1, 0], externals=[-1, 0]; edge 3: 2 -> 3, loops=[0, 1], externals=[0, 0]; edge 4: 2 -> 3, loops=[-1, -1], externals=[1, 0]]
  1437. 52.03 s >
  1438. 52.03 s > Location:
  1439. 52.03 s > crates/gammalooprs/src/cff/generation.rs:226
  1440. 52.03 s >
  1441. 52.03 s > ━━━━━━━━━━━━━━━━━━━━━━━━━━━━━━━━━━ BACKTRACE ━━━━━━━━━━━━━━━━━━━━━━━━━━━━━━━━━━━
  1442. 52.03 s > 1: <color_eyre[51793ea62743adbd]::config::EyreHook>::into_eyre_hook::{closure#0}<unknown>
  1443. 52.03 s > at <unknown source file>:<unknown line>
  1444. 52.03 s > 2: eyre[cb2fd339c0c40fca]::capture_handler<unknown>
  1445. 52.03 s > at <unknown source file>:<unknown line>
  1446. 52.03 s > 3: <eyre[cb2fd339c0c40fca]::Report>::from_adhoc::<alloc[2ea6bcb46fca0c42]::string::String><unknown>
  1447. 52.03 s > at <unknown source file>:<unknown line>
  1448. 52.03 s > 4: <gammalooprs[1d0b14476f7eb2f8]::graph::Graph>::generate_3d_expression_for_integrand<unknown>
  1449. 52.03 s > at <unknown source file>:<unknown line>
  1450. 52.03 s > 5: <gammalooprs[1d0b14476f7eb2f8]::processes::amplitude::AmplitudeGraph>::generate_cff<unknown>
  1451. 52.03 s > at <unknown source file>:<unknown line>
  1452. 52.03 s > 6: <gammalooprs[1d0b14476f7eb2f8]::processes::amplitude::AmplitudeGraph>::renormalization_part<unknown>
  1453. 52.03 s > at <unknown source file>:<unknown line>
  1454. 52.03 s > 7: test_renormalization[879b57236d814a44]::finite_part_ghost_2loop<unknown>
  1455. 52.03 s > at <unknown source file>:<unknown line>
  1456. 52.03 s > 8: <test_renormalization[879b57236d814a44]::finite_part_ghost_2loop::{closure#0} as core[940e698046960fd5]::ops::function::FnOnce<()>>::call_once<unknown>
  1457. 52.03 s > at <unknown source file>:<unknown line>
  1458. 52.03 s > 9: test[75d6903177b1d7e9]::__rust_begin_short_backtrace::<core[940e698046960fd5]::result::Result<(), alloc[2ea6bcb46fca0c42]::string::String>, fn() -> core[940e698046960fd5]::result::Result<(), alloc[2ea6bcb46fca0c42]::string::String>><unknown>
  1459. 52.03 s > at <unknown source file>:<unknown line>
  1460. 52.03 s > 10: test[75d6903177b1d7e9]::run_test::{closure#0}<unknown>
  1461. 52.03 s > at <unknown source file>:<unknown line>
  1462. 52.03 s > 11: std[bcb96dfbba0ab899]::sys::backtrace::__rust_begin_short_backtrace::<test[75d6903177b1d7e9]::run_test::{closure#1}, ()><unknown>
  1463. 52.03 s > at <unknown source file>:<unknown line>
  1464. 52.03 s > 12: <std[bcb96dfbba0ab899]::thread::lifecycle::spawn_unchecked<test[75d6903177b1d7e9]::run_test::{closure#1}, ()>::{closure#1} as core[940e698046960fd5]::ops::function::FnOnce<()>>::call_once::{shim:vtable#0}<unknown>
  1465. 52.03 s > at <unknown source file>:<unknown line>
  1466. 52.03 s > 13: <std[bcb96dfbba0ab899]::sys::thread::unix::Thread>::new::thread_start<unknown>
  1467. 52.03 s > at <unknown source file>:<unknown line>
  1468. 52.03 s > 14: start_thread<unknown>
  1469. 52.03 s > at <unknown source file>:<unknown line>
  1470. 52.03 s > 15: __clone3<unknown>
  1471. 52.03 s > at <unknown source file>:<unknown line>
  1472. 52.03 s >
  1473. 52.03 s > Run with COLORBT_SHOW_HIDDEN=1 environment variable to disable frame filtering.
  1474. 52.03 s > Run with RUST_BACKTRACE=full to include source snippets.
  1475. 52.03 s > Warning: SpanTrace capture is Unsupported.
  1476. 52.03 s > Ensure that you've setup a tracing-error ErrorLayer and the semver versions are compatible
  1477. 52.03 s > Location: crates/gammalooprs/tests/test_renormalization.rs:495
  1478. 52.03 s >
  1479. 52.03 s > ━━━━━━━━━━━━━━━━━━━━━━━━━━━━━━━━━━ BACKTRACE ━━━━━━━━━━━━━━━━━━━━━━━━━━━━━━━━━━━
  1480. 52.03 s > 1: <color_eyre[51793ea62743adbd]::config::PanicHook>::panic_report<unknown>
  1481. 52.03 s > at <unknown source file>:<unknown line>
  1482. 52.03 s > 2: <color_eyre[51793ea62743adbd]::config::PanicHook>::into_panic_hook::{closure#0}<unknown>
  1483. 52.03 s > at <unknown source file>:<unknown line>
  1484. 52.03 s > 3: std[bcb96dfbba0ab899]::panicking::panic_with_hook<unknown>
  1485. 52.03 s > at <unknown source file>:<unknown line>
  1486. 52.03 s > 4: std[bcb96dfbba0ab899]::panicking::panic_handler::{closure#0}<unknown>
  1487. 52.03 s > at <unknown source file>:<unknown line>
  1488. 52.03 s > 5: std[bcb96dfbba0ab899]::sys::backtrace::__rust_end_short_backtrace::<std[bcb96dfbba0ab899]::panicking::panic_handler::{closure#0}, !><unknown>
  1489. 52.03 s > at <unknown source file>:<unknown line>
  1490. 52.03 s > 6: __rustc[6c289b9f9c454d21]::rust_begin_unwind<unknown>
  1491. 52.03 s > at <unknown source file>:<unknown line>
  1492. 52.03 s > 7: core[940e698046960fd5]::panicking::panic_fmt<unknown>
  1493. 52.03 s > at <unknown source file>:<unknown line>
  1494. 52.03 s > 8: core[940e698046960fd5]::result::unwrap_failed<unknown>
  1495. 52.03 s > at <unknown source file>:<unknown line>
  1496. 52.03 s > 9: test_renormalization[879b57236d814a44]::finite_part_ghost_2loop<unknown>
  1497. 52.03 s > at <unknown source file>:<unknown line>
  1498. 52.03 s > 10: <test_renormalization[879b57236d814a44]::finite_part_ghost_2loop::{closure#0} as core[940e698046960fd5]::ops::function::FnOnce<()>>::call_once<unknown>
  1499. 52.03 s > at <unknown source file>:<unknown line>
  1500. 52.03 s > 11: test[75d6903177b1d7e9]::__rust_begin_short_backtrace::<core[940e698046960fd5]::result::Result<(), alloc[2ea6bcb46fca0c42]::string::String>, fn() -> core[940e698046960fd5]::result::Result<(), alloc[2ea6bcb46fca0c42]::string::String>><unknown>
  1501. 52.03 s > at <unknown source file>:<unknown line>
  1502. 52.03 s > 12: test[75d6903177b1d7e9]::run_test::{closure#0}<unknown>
  1503. 52.03 s > at <unknown source file>:<unknown line>
  1504. 52.03 s > 13: std[bcb96dfbba0ab899]::sys::backtrace::__rust_begin_short_backtrace::<test[75d6903177b1d7e9]::run_test::{closure#1}, ()><unknown>
  1505. 52.03 s > at <unknown source file>:<unknown line>
  1506. 52.03 s > 14: <std[bcb96dfbba0ab899]::thread::lifecycle::spawn_unchecked<test[75d6903177b1d7e9]::run_test::{closure#1}, ()>::{closure#1} as core[940e698046960fd5]::ops::function::FnOnce<()>>::call_once::{shim:vtable#0}<unknown>
  1507. 52.03 s > at <unknown source file>:<unknown line>
  1508. 52.03 s > 15: <std[bcb96dfbba0ab899]::sys::thread::unix::Thread>::new::thread_start<unknown>
  1509. 52.03 s > at <unknown source file>:<unknown line>
  1510. 52.03 s > 16: start_thread<unknown>
  1511. 52.03 s > at <unknown source file>:<unknown line>
  1512. 52.03 s > 17: __clone3<unknown>
  1513. 52.03 s > at <unknown source file>:<unknown line>
  1514. 52.03 s >
  1515. 52.03 s > Run with COLORBT_SHOW_HIDDEN=1 environment variable to disable frame filtering.
  1516. 52.03 s > Run with RUST_BACKTRACE=full to include source snippets.
  1517. 52.03 s >
  1518. 52.03 s > error: test run failed
  1519. 52.03 s >
  1520. 52.03 s > ========== nextest test summary ==========
  1521. 52.03 s > report: target/nextest/ci_gammaloop/junit.xml
  1522. 52.03 s > tests: 501, failures: 2, errors: 0
  1523. 52.03 s >
  1524. 52.03 s > 1. gammalooprs::uv::hedge_poset::tests::union_terms_project_factorized_typed_4d_values
  1525. 52.03 s > failure: test failure with exit code 101
  1526. 52.03 s > Error:
  1527. 52.03 s > 0: exact source occurrences for physical edge 1 disagree after on-shell-energy replacement: `-(mUVexp^2+Q(1,cind(1))^2+Q(1,cind(2))^2+Q(1,cind(3))^2)^(1/2)` versus `(mUVexp^2+Q(1,cind(1))^2+Q(1,cind(2))^2+Q(1,cind(3))^2)^(1/2)`; exact 4D term active denominators are [FourDDenominator { source_edge: EdgeIndex(1), momentum: gammalooprs::Q(1), mass_squared: gammalooprs::mUVexp^2, full_expr: -gammalooprs::mUV^2+spenso::dot(gammalooprs::Q(1,spenso::mink(gammalooprs::dim)),gammalooprs::Q(1,spenso::mink(gammalooprs::dim))) }, FourDDenominator { source_edge: EdgeIndex(1), momentum: gammalooprs::Q(1), mass_squared: gammalooprs::mUVexp^2, full_expr: -gammalooprs::mUV^2+spenso::dot(gammalooprs::Q(1,spenso::mink(gammalooprs::dim)),gammalooprs::Q(1,spenso::mink(gammalooprs::dim))) }, FourDDenominator { source_edge: EdgeIndex(3), momentum: gammalooprs::Q(3), mass_squared: gammalooprs::mUVexp^2, full_expr: -gammalooprs::mUV^2+spenso::dot(gammalooprs::Q(3,spenso::mink(gammalooprs::dim)),gammalooprs::Q(3,spenso::mink(gammalooprs::dim))) }, FourDDenominator { source_edge: EdgeIndex(3), momentum: gammalooprs::Q(3), mass_squared: gammalooprs::mUVexp^2, full_expr: -gammalooprs::mUV^2+spenso::dot(gammalooprs::Q(3,spenso::mink(gammalooprs::dim)),gammalooprs::Q(3,spenso::mink(gammalooprs::dim))) }, FourDDenominator { source_edge: EdgeIndex(0), momentum: gammalooprs::Q(0), mass_squared: UFO::mass_scalar_1^2, full_expr: -UFO::mass_scalar_1^2+spenso::dot(gammalooprs::Q(0,spenso::mink(gammalooprs::dim)),gammalooprs::Q(0,spenso::mink(gammalooprs::dim))) }]
  1528. 52.03 s >
  1529. 52.03 s > Location:
  1530. 52.03 s > crates/gammalooprs/src/uv/approx/local_3d.rs:641
  1531. 52.03 s >
  1532. 52.03 s > ━━━━━━━━━━━━━━━━━━━━━━━━━━━━━━━━━━ BACKTRACE ━━━━━━━━━━━━━━━━━━━━━━━━━━━━━━━━━━━
  1533. 52.03 s > 1: <color_eyre[51793ea62743adbd]::config::EyreHook>::into_eyre_hook::{closure#0}<unknown>
  1534. 52.03 s > at <unknown source file>:<unknown line>
  1535. 52.03 s > 2: eyre[cb2fd339c0c40fca]::capture_handler<unknown>
  1536. 52.03 s > at <unknown source file>:<unknown line>
  1537. 52.03 s > 3: <eyre[cb2fd339c0c40fca]::Report>::from_adhoc::<alloc[2ea6bcb46fca0c42]::string::String><unknown>
  1538. 52.03 s > at <unknown source file>:<unknown line>
  1539. 52.03 s > 4: <gammalooprs[6dc202c8af9e2ddf]::uv::approx::local_3d::Localizer>::project_4d<unknown>
  1540. 52.03 s > at <unknown source file>:<unknown line>
  1541. 52.03 s > 5: gammalooprs[6dc202c8af9e2ddf]::uv::hedge_poset::tests::union_terms_project_factorized_typed_4d_values<unknown>
  1542. 52.03 s > at <unknown source file>:<unknown line>
  1543. 52.03 s > 6: <gammalooprs[6dc202c8af9e2ddf]::uv::hedge_poset::tests::union_terms_project_factorized_typed_4d_values::{closure#0} as core[940e698046960fd5]::ops::function::FnOnce<()>>::call_once<unknown>
  1544. 52.03 s > at <unknown source file>:<unknown line>
  1545. 52.03 s > 7: test[75d6903177b1d7e9]::__rust_begin_short_backtrace::<core[940e698046960fd5]::result::Result<(), alloc[2ea6bcb46fca0c42]::string::String>, fn() -> core[940e698046960fd5]::result::Result<(), alloc[2ea6bcb46fca0c42]::string::String>><unknown>
  1546. 52.03 s > at <unknown source file>:<unknown line>
  1547. 52.03 s > 8: test[75d6903177b1d7e9]::run_test::{closure#0}<unknown>
  1548. 52.03 s > at <unknown source file>:<unknown line>
  1549. 52.03 s > 9: std[bcb96dfbba0ab899]::sys::backtrace::__rust_begin_short_backtrace::<test[75d6903177b1d7e9]::run_test::{closure#1}, ()><unknown>
  1550. 52.03 s > at <unknown source file>:<unknown line>
  1551. 52.03 s > 10: <std[bcb96dfbba0ab899]::thread::lifecycle::spawn_unchecked<test[75d6903177b1d7e9]::run_test::{closure#1}, ()>::{closure#1} as core[940e698046960fd5]::ops::function::FnOnce<()>>::call_once::{shim:vtable#0}<unknown>
  1552. 52.03 s > at <unknown source file>:<unknown line>
  1553. 52.03 s > 11: <std[bcb96dfbba0ab899]::sys::thread::unix::Thread>::new::thread_start<unknown>
  1554. 52.03 s > at <unknown source file>:<unknown line>
  1555. 52.03 s > 12: start_thread<unknown>
  1556. 52.03 s > at <unknown source file>:<unknown line>
  1557. 52.03 s > 13: __clone3<unknown>
  1558. 52.03 s > at <unknown source file>:<unknown line>
  1559. 52.03 s >
  1560. 52.03 s > Run with COLORBT_SHOW_HIDDEN=1 environment variable to disable frame filtering.
  1561. 52.03 s > Run with RUST_BACKTRACE=full to include source snippets.
  1562. 52.03 s > system-out
  1563. 52.03 s > running 1 test
  1564. 52.03 s > test uv::hedge_poset::tests::union_terms_project_factorized_typed_4d_values ... FAILED
  1565. 52.03 s >
  1566. 52.03 s > failures:
  1567. 52.03 s >
  1568. 52.03 s > failures:
  1569. 52.03 s > uv::hedge_poset::tests::union_terms_project_factorized_typed_4d_values
  1570. 52.03 s >
  1571. 52.03 s > test result: FAILED. 0 passed; 1 failed; 0 ignored; 0 measured; 551 filtered out; finished in 0.22s
  1572. 52.03 s > system-err
  1573. 52.03 s > Error:
  1574. 52.03 s > 0: exact source occurrences for physical edge 1 disagree after on-shell-energy replacement: `-(mUVexp^2+Q(1,cind(1))^2+Q(1,cind(2))^2+Q(1,cind(3))^2)^(1/2)` versus `(mUVexp^2+Q(1,cind(1))^2+Q(1,cind(2))^2+Q(1,cind(3))^2)^(1/2)`; exact 4D term active denominators are [FourDDenominator { source_edge: EdgeIndex(1), momentum: gammalooprs::Q(1), mass_squared: gammalooprs::mUVexp^2, full_expr: -gammalooprs::mUV^2+spenso::dot(gammalooprs::Q(1,spenso::mink(gammalooprs::dim)),gammalooprs::Q(1,spenso::mink(gammalooprs::dim))) }, FourDDenominator { source_edge: EdgeIndex(1), momentum: gammalooprs::Q(1), mass_squared: gammalooprs::mUVexp^2, full_expr: -gammalooprs::mUV^2+spenso::dot(gammalooprs::Q(1,spenso::mink(gammalooprs::dim)),gammalooprs::Q(1,spenso::mink(gammalooprs::dim))) }, FourDDenominator { source_edge: EdgeIndex(3), momentum: gammalooprs::Q(3), mass_squared: gammalooprs::mUVexp^2, full_expr: -gammalooprs::mUV^2+spenso::dot(gammalooprs::Q(3,spenso::mink(gammalooprs::dim)),gammalooprs::Q(3,spenso::mink(gammalooprs::dim))) }, FourDDenominator { source_edge: EdgeIndex(3), momentum: gammalooprs::Q(3), mass_squared: gammalooprs::mUVexp^2, full_expr: -gammalooprs::mUV^2+spenso::dot(gammalooprs::Q(3,spenso::mink(gammalooprs::dim)),gammalooprs::Q(3,spenso::mink(gammalooprs::dim))) }, FourDDenominator { source_edge: EdgeIndex(0), momentum: gammalooprs::Q(0), mass_squared: UFO::mass_scalar_1^2, full_expr: -UFO::mass_scalar_1^2+spenso::dot(gammalooprs::Q(0,spenso::mink(gammalooprs::dim)),gammalooprs::Q(0,spenso::mink(gammalooprs::dim))) }]
  1575. 52.03 s >
  1576. 52.03 s > Location:
  1577. 52.03 s > crates/gammalooprs/src/uv/approx/local_3d.rs:641
  1578. 52.03 s >
  1579. 52.03 s > ━━━━━━━━━━━━━━━━━━━━━━━━━━━━━━━━━━ BACKTRACE ━━━━━━━━━━━━━━━━━━━━━━━━━━━━━━━━━━━
  1580. 52.03 s > 1: <color_eyre[51793ea62743adbd]::config::EyreHook>::into_eyre_hook::{closure#0}<unknown>
  1581. 52.03 s > at <unknown source file>:<unknown line>
  1582. 52.03 s > 2: eyre[cb2fd339c0c40fca]::capture_handler<unknown>
  1583. 52.03 s > at <unknown source file>:<unknown line>
  1584. 52.03 s > 3: <eyre[cb2fd339c0c40fca]::Report>::from_adhoc::<alloc[2ea6bcb46fca0c42]::string::String><unknown>
  1585. 52.03 s > at <unknown source file>:<unknown line>
  1586. 52.03 s > 4: <gammalooprs[6dc202c8af9e2ddf]::uv::approx::local_3d::Localizer>::project_4d<unknown>
  1587. 52.03 s > at <unknown source file>:<unknown line>
  1588. 52.03 s > 5: gammalooprs[6dc202c8af9e2ddf]::uv::hedge_poset::tests::union_terms_project_factorized_typed_4d_values<unknown>
  1589. 52.03 s > at <unknown source file>:<unknown line>
  1590. 52.03 s > 6: <gammalooprs[6dc202c8af9e2ddf]::uv::hedge_poset::tests::union_terms_project_factorized_typed_4d_values::{closure#0} as core[940e698046960fd5]::ops::function::FnOnce<()>>::call_once<unknown>
  1591. 52.03 s > at <unknown source file>:<unknown line>
  1592. 52.03 s > 7: test[75d6903177b1d7e9]::__rust_begin_short_backtrace::<core[940e698046960fd5]::result::Result<(), alloc[2ea6bcb46fca0c42]::string::String>, fn() -> core[940e698046960fd5]::result::Result<(), alloc[2ea6bcb46fca0c42]::string::String>><unknown>
  1593. 52.03 s > at <unknown source file>:<unknown line>
  1594. 52.03 s > 8: test[75d6903177b1d7e9]::run_test::{closure#0}<unknown>
  1595. 52.03 s > at <unknown source file>:<unknown line>
  1596. 52.03 s > 9: std[bcb96dfbba0ab899]::sys::backtrace::__rust_begin_short_backtrace::<test[75d6903177b1d7e9]::run_test::{closure#1}, ()><unknown>
  1597. 52.03 s > at <unknown source file>:<unknown line>
  1598. 52.03 s > 10: <std[bcb96dfbba0ab899]::thread::lifecycle::spawn_unchecked<test[75d6903177b1d7e9]::run_test::{closure#1}, ()>::{closure#1} as core[940e698046960fd5]::ops::function::FnOnce<()>>::call_once::{shim:vtable#0}<unknown>
  1599. 52.03 s > at <unknown source file>:<unknown line>
  1600. 52.03 s > 11: <std[bcb96dfbba0ab899]::sys::thread::unix::Thread>::new::thread_start<unknown>
  1601. 52.03 s > at <unknown source file>:<unknown line>
  1602. 52.03 s > 12: start_thread<unknown>
  1603. 52.03 s > at <unknown source file>:<unknown line>
  1604. 52.03 s > 13: __clone3<unknown>
  1605. 52.03 s > at <unknown source file>:<unknown line>
  1606. 52.03 s >
  1607. 52.03 s > Run with COLORBT_SHOW_HIDDEN=1 environment variable to disable frame filtering.
  1608. 52.03 s > Run with RUST_BACKTRACE=full to include source snippets.
  1609. 52.03 s >
  1610. 52.03 s > 2. gammalooprs::test_renormalization::finite_part_ghost_2loop
  1611. 52.03 s > failure: test failure with exit code 101
  1612. 52.03 s > system-out
  1613. 52.03 s > running 1 test
  1614. 52.03 s > test finite_part_ghost_2loop ... FAILED
  1615. 52.03 s >
  1616. 52.03 s > failures:
  1617. 52.03 s >
  1618. 52.03 s > failures:
  1619. 52.03 s > finite_part_ghost_2loop
  1620. 52.03 s >
  1621. 52.03 s > test result: FAILED. 0 passed; 1 failed; 0 ignored; 0 measured; 5 filtered out; finished in 5.64s
  1622. 52.03 s > system-err
  1623. 52.03 s > [16:29:12.294] @gammalooprs::processes::amplitude ERROR :
  1624. 52.03 s > field value
  1625. 52.03 s > error generalized CFF expression generation failed for graph `d5` with source-edge numerator energy-degree bounds Some([(1, 1), (2, 1), (3, 1), (5, 2), (6, 2)]): energy-degree bounds do not certify vanishing residues at infinity under the conservative cap check: EnergyDivergenceReport { edge_degree_bounds: [1, 1, 1, 2, 2], loops: [EnergyDirectionReport { loop_id: Some(0), zero_edges: [], active_edges: [0, 1, 2, 4], nullity: None, numerator_degree_bound: 5, denominator_degree: 8, divergence_degree: -3, convergent: true }, EnergyDirectionReport { loop_id: Some(1), zero_edges: [], active_edges: [3, 4], nullity: None, numerator_degree_bound: 4, denominator_degree: 4, divergence_degree: 0, convergent: false }], directions: [EnergyDirectionReport { loop_id: None, zero_edges: [0, 1, 2], active_edges: [3, 4], nullity: Some(1), numerator_degree_bound: 4, denominator_degree: 4, divergence_degree: 0, convergent: false }, EnergyDirectionReport { loop_id: None, zero_edges: [], active_edges: [0, 1, 2, 3, 4], nullity: Some(2), numerator_degree_bound: 7, denominator_degree: 10, divergence_degree: -3, convergent: true }, EnergyDirectionReport { loop_id: None, zero_edges: [3], active_edges: [0, 1, 2, 4], nullity: Some(1), numerator_degree_bound: 5, denominator_degree: 8, divergence_degree: -3, convergent: true }, EnergyDirectionReport { loop_id: None, zero_edges: [4], active_edges: [0, 1, 2, 3], nullity: Some(1), numerator_degree_bound: 5, denominator_degree: 8, divergence_degree: -3, convergent: true }], coordinate_convergent: false, directional_convergent: false, convergent: false }
  1626. 52.03 s > 3D source has 2 loop names ["e1", "e5"], 5 internal edges [edge 0: 0 -> 1, loops=[1, 0], externals=[0, 0]; edge 1: 0 -> 2, loops=[-1, 0], externals=[1, 0]; edge 2: 1 -> 3, loops=[1, 0], externals=[-1, 0]; edge 3: 2 -> 3, loops=[0, 1], externals=[0, 0]; edge 4: 2 -> 3, loops=[-1, -1], externals=[1, 0]]
  1627. 52.03 s > at crates/gammalooprs/src/processes/amplitude.rs:825
  1628. 52.03 s > The application panicked (crashed).
  1629. 52.03 s > Message: called `Result::unwrap()` on an `Err` value:
  1630. 52.03 s > 0: generalized CFF expression generation failed for graph `d5` with source-edge numerator energy-degree bounds Some([(1, 1), (2, 1), (3, 1), (5, 2), (6, 2)]): energy-degree bounds do not certify vanishing residues at infinity under the conservative cap check: EnergyDivergenceReport { edge_degree_bounds: [1, 1, 1, 2, 2], loops: [EnergyDirectionReport { loop_id: Some(0), zero_edges: [], active_edges: [0, 1, 2, 4], nullity: None, numerator_degree_bound: 5, denominator_degree: 8, divergence_degree: -3, convergent: true }, EnergyDirectionReport { loop_id: Some(1), zero_edges: [], active_edges: [3, 4], nullity: None, numerator_degree_bound: 4, denominator_degree: 4, divergence_degree: 0, convergent: false }], directions: [EnergyDirectionReport { loop_id: None, zero_edges: [0, 1, 2], active_edges: [3, 4], nullity: Some(1), numerator_degree_bound: 4, denominator_degree: 4, divergence_degree: 0, convergent: false }, EnergyDirectionReport { loop_id: None, zero_edges: [], active_edges: [0, 1, 2, 3, 4], nullity: Some(2), numerator_degree_bound: 7, denominator_degree: 10, divergence_degree: -3, convergent: true }, EnergyDirectionReport { loop_id: None, zero_edges: [3], active_edges: [0, 1, 2, 4], nullity: Some(1), numerator_degree_bound: 5, denominator_degree: 8, divergence_degree: -3, convergent: true }, EnergyDirectionReport { loop_id: None, zero_edges: [4], active_edges: [0, 1, 2, 3], nullity: Some(1), numerator_degree_bound: 5, denominator_degree: 8, divergence_degree: -3, convergent: true }], coordinate_convergent: false, directional_convergent: false, convergent: false }
  1631. 52.03 s > 3D source has 2 loop names ["e1", "e5"], 5 internal edges [edge 0: 0 -> 1, loops=[1, 0], externals=[0, 0]; edge 1: 0 -> 2, loops=[-1, 0], externals=[1, 0]; edge 2: 1 -> 3, loops=[1, 0], externals=[-1, 0]; edge 3: 2 -> 3, loops=[0, 1], externals=[0, 0]; edge 4: 2 -> 3, loops=[-1, -1], externals=[1, 0]]
  1632. 52.03 s >
  1633. 52.03 s > Location:
  1634. 52.03 s > crates/gammalooprs/src/cff/generation.rs:226
  1635. 52.03 s >
  1636. 52.03 s > ━━━━━━━━━━━━━━━━━━━━━━━━━━━━━━━━━━ BACKTRACE ━━━━━━━━━━━━━━━━━━━━━━━━━━━━━━━━━━━
  1637. 52.03 s > 1: <color_eyre[51793ea62743adbd]::config::EyreHook>::into_eyre_hook::{closure#0}<unknown>
  1638. 52.03 s > at <unknown source file>:<unknown line>
  1639. 52.03 s > 2: eyre[cb2fd339c0c40fca]::capture_handler<unknown>
  1640. 52.03 s > at <unknown source file>:<unknown line>
  1641. 52.03 s > 3: <eyre[cb2fd339c0c40fca]::Report>::from_adhoc::<alloc[2ea6bcb46fca0c42]::string::String><unknown>
  1642. 52.03 s > at <unknown source file>:<unknown line>
  1643. 52.03 s > 4: <gammalooprs[1d0b14476f7eb2f8]::graph::Graph>::generate_3d_expression_for_integrand<unknown>
  1644. 52.03 s > at <unknown source file>:<unknown line>
  1645. 52.03 s > 5: <gammalooprs[1d0b14476f7eb2f8]::processes::amplitude::AmplitudeGraph>::generate_cff<unknown>
  1646. 52.03 s > at <unknown source file>:<unknown line>
  1647. 52.03 s > 6: <gammalooprs[1d0b14476f7eb2f8]::processes::amplitude::AmplitudeGraph>::renormalization_part<unknown>
  1648. 52.03 s > at <unknown source file>:<unknown line>
  1649. 52.03 s > 7: test_renormalization[879b57236d814a44]::finite_part_ghost_2loop<unknown>
  1650. 52.03 s > at <unknown source file>:<unknown line>
  1651. 52.03 s > 8: <test_renormalization[879b57236d814a44]::finite_part_ghost_2loop::{closure#0} as core[940e698046960fd5]::ops::function::FnOnce<()>>::call_once<unknown>
  1652. 52.03 s > at <unknown source file>:<unknown line>
  1653. 52.03 s > 9: test[75d6903177b1d7e9]::__rust_begin_short_backtrace::<core[940e698046960fd5]::result::Result<(), alloc[2ea6bcb46fca0c42]::string::String>, fn() -> core[940e698046960fd5]::result::Result<(), alloc[2ea6bcb46fca0c42]::string::String>><unknown>
  1654. 52.03 s > at <unknown source file>:<unknown line>
  1655. 52.03 s > 10: test[75d6903177b1d7e9]::run_test::{closure#0}<unknown>
  1656. 52.03 s > at <unknown source file>:<unknown line>
  1657. 52.03 s > 11: std[bcb96dfbba0ab899]::sys::backtrace::__rust_begin_short_backtrace::<test[75d6903177b1d7e9]::run_test::{closure#1}, ()><unknown>
  1658. 52.03 s > at <unknown source file>:<unknown line>
  1659. 52.03 s > 12: <std[bcb96dfbba0ab899]::thread::lifecycle::spawn_unchecked<test[75d6903177b1d7e9]::run_test::{closure#1}, ()>::{closure#1} as core[940e698046960fd5]::ops::function::FnOnce<()>>::call_once::{shim:vtable#0}<unknown>
  1660. 52.03 s > at <unknown source file>:<unknown line>
  1661. 52.03 s > 13: <std[bcb96dfbba0ab899]::sys::thread::unix::Thread>::new::thread_start<unknown>
  1662. 52.03 s > at <unknown source file>:<unknown line>
  1663. 52.03 s > 14: start_thread<unknown>
  1664. 52.03 s > at <unknown source file>:<unknown line>
  1665. 52.03 s > 15: __clone3<unknown>
  1666. 52.03 s > at <unknown source file>:<unknown line>
  1667. 52.03 s >
  1668. 52.03 s > Run with COLORBT_SHOW_HIDDEN=1 environment variable to disable frame filtering.
  1669. 52.03 s > Run with RUST_BACKTRACE=full to include source snippets.
  1670. 52.03 s > Warning: SpanTrace capture is Unsupported.
  1671. 52.03 s > Ensure that you've setup a tracing-error ErrorLayer and the semver versions are compatible
  1672. 52.03 s > Location: crates/gammalooprs/tests/test_renormalization.rs:495
  1673. 52.03 s >
  1674. 52.03 s > ━━━━━━━━━━━━━━━━━━━━━━━━━━━━━━━━━━ BACKTRACE ━━━━━━━━━━━━━━━━━━━━━━━━━━━━━━━━━━━
  1675. 52.03 s > 1: <color_eyre[51793ea62743adbd]::config::PanicHook>::panic_report<unknown>
  1676. 52.03 s > at <unknown source file>:<unknown line>
  1677. 52.03 s > 2: <color_eyre[51793ea62743adbd]::config::PanicHook>::into_panic_hook::{closure#0}<unknown>
  1678. 52.03 s > at <unknown source file>:<unknown line>
  1679. 52.03 s > 3: std[bcb96dfbba0ab899]::panicking::panic_with_hook<unknown>
  1680. 52.03 s > at <unknown source file>:<unknown line>
  1681. 52.03 s > 4: std[bcb96dfbba0ab899]::panicking::panic_handler::{closure#0}<unknown>
  1682. 52.03 s > at <unknown source file>:<unknown line>
  1683. 52.03 s > 5: std[bcb96dfbba0ab899]::sys::backtrace::__rust_end_short_backtrace::<std[bcb96dfbba0ab899]::panicking::panic_handler::{closure#0}, !><unknown>
  1684. 52.03 s > at <unknown source file>:<unknown line>
  1685. 52.03 s > 6: __rustc[6c289b9f9c454d21]::rust_begin_unwind<unknown>
  1686. 52.03 s > at <unknown source file>:<unknown line>
  1687. 52.03 s > 7: core[940e698046960fd5]::panicking::panic_fmt<unknown>
  1688. 52.03 s > at <unknown source file>:<unknown line>
  1689. 52.03 s > 8: core[940e698046960fd5]::result::unwrap_failed<unknown>
  1690. 52.03 s > at <unknown source file>:<unknown line>
  1691. 52.03 s > 9: test_renormalization[879b57236d814a44]::finite_part_ghost_2loop<unknown>
  1692. 52.03 s > at <unknown source file>:<unknown line>
  1693. 52.03 s > 10: <test_renormalization[879b57236d814a44]::finite_part_ghost_2loop::{closure#0} as core[940e698046960fd5]::ops::function::FnOnce<()>>::call_once<unknown>
  1694. 52.03 s > at <unknown source file>:<unknown line>
  1695. 52.03 s > 11: test[75d6903177b1d7e9]::__rust_begin_short_backtrace::<core[940e698046960fd5]::result::Result<(), alloc[2ea6bcb46fca0c42]::string::String>, fn() -> core[940e698046960fd5]::result::Result<(), alloc[2ea6bcb46fca0c42]::string::String>><unknown>
  1696. 52.03 s > at <unknown source file>:<unknown line>
  1697. 52.03 s > 12: test[75d6903177b1d7e9]::run_test::{closure#0}<unknown>
  1698. 52.03 s > at <unknown source file>:<unknown line>
  1699. 52.03 s > 13: std[bcb96dfbba0ab899]::sys::backtrace::__rust_begin_short_backtrace::<test[75d6903177b1d7e9]::run_test::{closure#1}, ()><unknown>
  1700. 52.03 s > at <unknown source file>:<unknown line>
  1701. 52.03 s > 14: <std[bcb96dfbba0ab899]::thread::lifecycle::spawn_unchecked<test[75d6903177b1d7e9]::run_test::{closure#1}, ()>::{closure#1} as core[940e698046960fd5]::ops::function::FnOnce<()>>::call_once::{shim:vtable#0}<unknown>
  1702. 52.03 s > at <unknown source file>:<unknown line>
  1703. 52.03 s > 15: <std[bcb96dfbba0ab899]::sys::thread::unix::Thread>::new::thread_start<unknown>
  1704. 52.03 s > at <unknown source file>:<unknown line>
  1705. 52.03 s > 16: start_thread<unknown>
  1706. 52.03 s > at <unknown source file>:<unknown line>
  1707. 52.03 s > 17: __clone3<unknown>
  1708. 52.03 s > at <unknown source file>:<unknown line>
  1709. 52.03 s >
  1710. 52.03 s > Run with COLORBT_SHOW_HIDDEN=1 environment variable to disable frame filtering.
  1711. 52.03 s > Run with RUST_BACKTRACE=full to include source snippets.
  1712. 52.03 s > =========================================
  1713. 52.03 s > Extracting 1 binary and 1 linked path to /build/nextest-archive-nJbJJM
  1714. 52.03 s > Extracted 7 files to /build/nextest-archive-nJbJJM in 0.07s
  1715. 52.03 s > ------------
  1716. 52.03 s > Nextest run ID 5ee752d7-c83e-4808-bd96-7329b548f774 with nextest profile: ci_gammaloop
  1717. 52.03 s > Starting 53 tests across 1 binary
  1718. 52.03 s > FAIL [ 0.009s] (17/53) three-dimensional-reps generation::cff_tests::causal_repeated_generation_handles_energy_dependent_bubble_source
  1719. 52.03 s > stdout ---
  1720. 52.03 s >
  1721. 52.03 s > running 1 test
  1722. 52.03 s > test generation::cff_tests::causal_repeated_generation_handles_energy_dependent_bubble_source ... FAILED
  1723. 52.03 s >
  1724. 52.03 s > failures:
  1725. 52.03 s >
  1726. 52.03 s > failures:
  1727. 52.03 s > generation::cff_tests::causal_repeated_generation_handles_energy_dependent_bubble_source
  1728. 52.03 s >
  1729. 52.03 s > test result: FAILED. 0 passed; 1 failed; 0 ignored; 0 measured; 52 filtered out; finished in 0.00s
  1730. 52.03 s >
  1731. 52.03 s > stderr ---
  1732. 52.03 s >
  1733. 52.03 s > thread 'generation::cff_tests::causal_repeated_generation_handles_energy_dependent_bubble_source' (3121) panicked at crates/three-dimensional-reps/src/generation.rs:5806:9:
  1734. 52.03 s > assertion `left == right` failed
  1735. 52.03 s > left: GlobalSourceProduct
  1736. 52.03 s > right: VariantLocal
  1737. 52.03 s > stack backtrace:
  1738. 52.03 s > 0: __rustc::rust_begin_unwind
  1739. 52.03 s > 1: core::panicking::panic_fmt
  1740. 52.03 s > 2: core::panicking::assert_failed_inner
  1741. 52.03 s > 3: core::panicking::assert_failed::<three_dimensional_reps::generation::CffEnergyFactorOwnership, three_dimensional_reps::generation::CffEnergyFactorOwnership>
  1742. 52.03 s > 4: three_dimensional_reps::generation::cff_tests::causal_repeated_generation_handles_energy_dependent_bubble_source
  1743. 52.03 s > 5: <three_dimensional_reps::generation::cff_tests::causal_repeated_generation_handles_energy_dependent_bubble_source::{closure#0} as core::ops::function::FnOnce<()>>::call_once
  1744. 52.03 s > note: Some details are omitted, run with `RUST_BACKTRACE=full` for a verbose backtrace.
  1745. 52.03 s >
  1746. 52.03 s > FAIL [ 0.015s] (30/53) three-dimensional-reps generation::cff_tests::disconnected_mixed_energy_factor_ownership_keeps_both_component_factors
  1747. 52.03 s > stdout ---
  1748. 52.03 s >
  1749. 52.03 s > running 1 test
  1750. 52.03 s > test generation::cff_tests::disconnected_mixed_energy_factor_ownership_keeps_both_component_factors ... FAILED
  1751. 52.03 s >
  1752. 52.03 s > failures:
  1753. 52.03 s >
  1754. 52.03 s > failures:
  1755. 52.03 s > generation::cff_tests::disconnected_mixed_energy_factor_ownership_keeps_both_component_factors
  1756. 52.03 s >
  1757. 52.03 s > test result: FAILED. 0 passed; 1 failed; 0 ignored; 0 measured; 52 filtered out; finished in 0.00s
  1758. 52.03 s >
  1759. 52.03 s > stderr ---
  1760. 52.03 s >
  1761. 52.03 s > thread 'generation::cff_tests::disconnected_mixed_energy_factor_ownership_keeps_both_component_factors' (3161) panicked at crates/three-dimensional-reps/src/generation.rs:5726:9:
  1762. 52.03 s > assertion `left == right` failed
  1763. 52.03 s > left: [GlobalSourceProduct, GlobalSourceProduct]
  1764. 52.03 s > right: [VariantLocal, GlobalSourceProduct]
  1765. 52.03 s > stack backtrace:
  1766. 52.03 s > 0: __rustc::rust_begin_unwind
  1767. 52.03 s > 1: core::panicking::panic_fmt
  1768. 52.03 s > 2: core::panicking::assert_failed_inner
  1769. 52.03 s > 3: core::panicking::assert_failed::<alloc::vec::Vec<three_dimensional_reps::generation::CffEnergyFactorOwnership>, alloc::vec::Vec<three_dimensional_reps::generation::CffEnergyFactorOwnership>>
  1770. 52.03 s > 4: three_dimensional_reps::generation::cff_tests::disconnected_mixed_energy_factor_ownership_keeps_both_component_factors
  1771. 52.03 s > 5: <three_dimensional_reps::generation::cff_tests::disconnected_mixed_energy_factor_ownership_keeps_both_component_factors::{closure#0} as core::ops::function::FnOnce<()>>::call_once
  1772. 52.03 s > note: Some details are omitted, run with `RUST_BACKTRACE=full` for a verbose backtrace.
  1773. 52.03 s >
  1774. 52.03 s > FAIL [ 0.040s] (42/53) three-dimensional-reps generation::cff_tests::cff_generation_builds_multiloop_repeated_high_power_known_factor_completion
  1775. 52.03 s > stdout ---
  1776. 52.03 s >
  1777. 52.03 s > running 1 test
  1778. 52.03 s > test generation::cff_tests::cff_generation_builds_multiloop_repeated_high_power_known_factor_completion ... FAILED
  1779. 52.03 s >
  1780. 52.03 s > failures:
  1781. 52.03 s >
  1782. 52.03 s > failures:
  1783. 52.03 s > generation::cff_tests::cff_generation_builds_multiloop_repeated_high_power_known_factor_completion
  1784. 52.03 s >
  1785. 52.03 s > test result: FAILED. 0 passed; 1 failed; 0 ignored; 0 measured; 52 filtered out; finished in 0.03s
  1786. 52.03 s >
  1787. 52.03 s > stderr ---
  1788. 52.03 s >
  1789. 52.03 s > thread 'generation::cff_tests::cff_generation_builds_multiloop_repeated_high_power_known_factor_completion' (3123) panicked at crates/three-dimensional-reps/src/generation.rs:5865:9:
  1790. 52.03 s > assertion failed: variants.iter().any(|variant|
  1791. 52.03 s > {
  1792. 52.03 s > variant.origin.as_deref().is_some_and(|origin|
  1793. 52.03 s > {
  1794. 52.03 s > origin.starts_with("bounded_degree_quadratic_recursive_remainder")
  1795. 52.03 s > })
  1796. 52.03 s > })
  1797. 52.03 s > stack backtrace:
  1798. 52.03 s > 0: __rustc::rust_begin_unwind
  1799. 52.03 s > 1: core::panicking::panic_fmt
  1800. 52.03 s > 2: core::panicking::panic
  1801. 52.03 s > 3: three_dimensional_reps::generation::cff_tests::cff_generation_builds_multiloop_repeated_high_power_known_factor_completion
  1802. 52.03 s > 4: <three_dimensional_reps::generation::cff_tests::cff_generation_builds_multiloop_repeated_high_power_known_factor_completion::{closure#0} as core::ops::function::FnOnce<()>>::call_once
  1803. 52.03 s > note: Some details are omitted, run with `RUST_BACKTRACE=full` for a verbose backtrace.
  1804. 52.03 s >
  1805. 52.03 s > FAIL [ 0.108s] (49/53) three-dimensional-reps generation::cff_tests::cff_generation_builds_one_loop_high_power_with_repeated_spectators
  1806. 52.03 s > stdout ---
  1807. 52.03 s >
  1808. 52.03 s > running 1 test
  1809. 52.03 s > test generation::cff_tests::cff_generation_builds_one_loop_high_power_with_repeated_spectators ... FAILED
  1810. 52.03 s >
  1811. 52.03 s > failures:
  1812. 52.03 s >
  1813. 52.03 s > failures:
  1814. 52.03 s > generation::cff_tests::cff_generation_builds_one_loop_high_power_with_repeated_spectators
  1815. 52.03 s >
  1816. 52.03 s > test result: FAILED. 0 passed; 1 failed; 0 ignored; 0 measured; 52 filtered out; finished in 0.10s
  1817. 52.03 s >
  1818. 52.03 s > stderr ---
  1819. 52.03 s >
  1820. 52.03 s > thread 'generation::cff_tests::cff_generation_builds_one_loop_high_power_with_repeated_spectators' (3124) panicked at crates/three-dimensional-reps/src/generation.rs:6288:9:
  1821. 52.03 s > assertion failed: variants.iter().any(|variant|
  1822. 52.03 s > {
  1823. 52.03 s > variant.origin.as_deref().is_some_and(|origin|
  1824. 52.03 s > {
  1825. 52.03 s > origin.starts_with("bounded_degree_quadratic_recursive_remainder")
  1826. 52.03 s > })
  1827. 52.03 s > })
  1828. 52.03 s > stack backtrace:
  1829. 52.03 s > 0: __rustc::rust_begin_unwind
  1830. 52.03 s > 1: core::panicking::panic_fmt
  1831. 52.03 s > 2: core::panicking::panic
  1832. 52.03 s > 3: three_dimensional_reps::generation::cff_tests::cff_generation_builds_one_loop_high_power_with_repeated_spectators
  1833. 52.03 s > 4: <three_dimensional_reps::generation::cff_tests::cff_generation_builds_one_loop_high_power_with_repeated_spectators::{closure#0} as core::ops::function::FnOnce<()>>::call_once
  1834. 52.03 s > note: Some details are omitted, run with `RUST_BACKTRACE=full` for a verbose backtrace.
  1835. 52.03 s >
  1836. 52.03 s > ------------
  1837. 52.03 s > Summary [ 0.547s] 53 tests run: 49 passed, 4 failed, 0 skipped
  1838. 52.03 s > FAIL [ 0.009s] (17/53) three-dimensional-reps generation::cff_tests::causal_repeated_generation_handles_energy_dependent_bubble_source
  1839. 52.03 s > stdout ---
  1840. 52.03 s >
  1841. 52.03 s > running 1 test
  1842. 52.03 s > test generation::cff_tests::causal_repeated_generation_handles_energy_dependent_bubble_source ... FAILED
  1843. 52.03 s >
  1844. 52.03 s > failures:
  1845. 52.03 s >
  1846. 52.03 s > failures:
  1847. 52.03 s > generation::cff_tests::causal_repeated_generation_handles_energy_dependent_bubble_source
  1848. 52.03 s >
  1849. 52.03 s > test result: FAILED. 0 passed; 1 failed; 0 ignored; 0 measured; 52 filtered out; finished in 0.00s
  1850. 52.03 s >
  1851. 52.03 s > stderr ---
  1852. 52.03 s >
  1853. 52.03 s > thread 'generation::cff_tests::causal_repeated_generation_handles_energy_dependent_bubble_source' (3121) panicked at crates/three-dimensional-reps/src/generation.rs:5806:9:
  1854. 52.03 s > assertion `left == right` failed
  1855. 52.03 s > left: GlobalSourceProduct
  1856. 52.03 s > right: VariantLocal
  1857. 52.03 s > stack backtrace:
  1858. 52.03 s > 0: __rustc::rust_begin_unwind
  1859. 52.03 s > 1: core::panicking::panic_fmt
  1860. 52.03 s > 2: core::panicking::assert_failed_inner
  1861. 52.03 s > 3: core::panicking::assert_failed::<three_dimensional_reps::generation::CffEnergyFactorOwnership, three_dimensional_reps::generation::CffEnergyFactorOwnership>
  1862. 52.03 s > 4: three_dimensional_reps::generation::cff_tests::causal_repeated_generation_handles_energy_dependent_bubble_source
  1863. 52.03 s > 5: <three_dimensional_reps::generation::cff_tests::causal_repeated_generation_handles_energy_dependent_bubble_source::{closure#0} as core::ops::function::FnOnce<()>>::call_once
  1864. 52.03 s > note: Some details are omitted, run with `RUST_BACKTRACE=full` for a verbose backtrace.
  1865. 52.03 s >
  1866. 52.03 s > FAIL [ 0.015s] (30/53) three-dimensional-reps generation::cff_tests::disconnected_mixed_energy_factor_ownership_keeps_both_component_factors
  1867. 52.03 s > stdout ---
  1868. 52.03 s >
  1869. 52.03 s > running 1 test
  1870. 52.03 s > test generation::cff_tests::disconnected_mixed_energy_factor_ownership_keeps_both_component_factors ... FAILED
  1871. 52.03 s >
  1872. 52.03 s > failures:
  1873. 52.03 s >
  1874. 52.03 s > failures:
  1875. 52.03 s > generation::cff_tests::disconnected_mixed_energy_factor_ownership_keeps_both_component_factors
  1876. 52.03 s >
  1877. 52.03 s > test result: FAILED. 0 passed; 1 failed; 0 ignored; 0 measured; 52 filtered out; finished in 0.00s
  1878. 52.03 s >
  1879. 52.03 s > stderr ---
  1880. 52.03 s >
  1881. 52.03 s > thread 'generation::cff_tests::disconnected_mixed_energy_factor_ownership_keeps_both_component_factors' (3161) panicked at crates/three-dimensional-reps/src/generation.rs:5726:9:
  1882. 52.03 s > assertion `left == right` failed
  1883. 52.03 s > left: [GlobalSourceProduct, GlobalSourceProduct]
  1884. 52.03 s > right: [VariantLocal, GlobalSourceProduct]
  1885. 52.03 s > stack backtrace:
  1886. 52.03 s > 0: __rustc::rust_begin_unwind
  1887. 52.03 s > 1: core::panicking::panic_fmt
  1888. 52.03 s > 2: core::panicking::assert_failed_inner
  1889. 52.03 s > 3: core::panicking::assert_failed::<alloc::vec::Vec<three_dimensional_reps::generation::CffEnergyFactorOwnership>, alloc::vec::Vec<three_dimensional_reps::generation::CffEnergyFactorOwnership>>
  1890. 52.03 s > 4: three_dimensional_reps::generation::cff_tests::disconnected_mixed_energy_factor_ownership_keeps_both_component_factors
  1891. 52.03 s > 5: <three_dimensional_reps::generation::cff_tests::disconnected_mixed_energy_factor_ownership_keeps_both_component_factors::{closure#0} as core::ops::function::FnOnce<()>>::call_once
  1892. 52.03 s > note: Some details are omitted, run with `RUST_BACKTRACE=full` for a verbose backtrace.
  1893. 52.03 s >
  1894. 52.03 s > FAIL [ 0.040s] (42/53) three-dimensional-reps generation::cff_tests::cff_generation_builds_multiloop_repeated_high_power_known_factor_completion
  1895. 52.03 s > stdout ---
  1896. 52.03 s >
  1897. 52.03 s > running 1 test
  1898. 52.03 s > test generation::cff_tests::cff_generation_builds_multiloop_repeated_high_power_known_factor_completion ... FAILED
  1899. 52.03 s >
  1900. 52.03 s > failures:
  1901. 52.03 s >
  1902. 52.03 s > failures:
  1903. 52.03 s > generation::cff_tests::cff_generation_builds_multiloop_repeated_high_power_known_factor_completion
  1904. 52.03 s >
  1905. 52.03 s > test result: FAILED. 0 passed; 1 failed; 0 ignored; 0 measured; 52 filtered out; finished in 0.03s
  1906. 52.03 s >
  1907. 52.03 s > stderr ---
  1908. 52.03 s >
  1909. 52.03 s > thread 'generation::cff_tests::cff_generation_builds_multiloop_repeated_high_power_known_factor_completion' (3123) panicked at crates/three-dimensional-reps/src/generation.rs:5865:9:
  1910. 52.03 s > assertion failed: variants.iter().any(|variant|
  1911. 52.03 s > {
  1912. 52.03 s > variant.origin.as_deref().is_some_and(|origin|
  1913. 52.03 s > {
  1914. 52.03 s > origin.starts_with("bounded_degree_quadratic_recursive_remainder")
  1915. 52.03 s > })
  1916. 52.03 s > })
  1917. 52.03 s > stack backtrace:
  1918. 52.03 s > 0: __rustc::rust_begin_unwind
  1919. 52.03 s > 1: core::panicking::panic_fmt
  1920. 52.03 s > 2: core::panicking::panic
  1921. 52.03 s > 3: three_dimensional_reps::generation::cff_tests::cff_generation_builds_multiloop_repeated_high_power_known_factor_completion
  1922. 52.03 s > 4: <three_dimensional_reps::generation::cff_tests::cff_generation_builds_multiloop_repeated_high_power_known_factor_completion::{closure#0} as core::ops::function::FnOnce<()>>::call_once
  1923. 52.03 s > note: Some details are omitted, run with `RUST_BACKTRACE=full` for a verbose backtrace.
  1924. 52.03 s >
  1925. 52.03 s > FAIL [ 0.108s] (49/53) three-dimensional-reps generation::cff_tests::cff_generation_builds_one_loop_high_power_with_repeated_spectators
  1926. 52.03 s > stdout ---
  1927. 52.03 s >
  1928. 52.03 s > running 1 test
  1929. 52.03 s > test generation::cff_tests::cff_generation_builds_one_loop_high_power_with_repeated_spectators ... FAILED
  1930. 52.03 s >
  1931. 52.03 s > failures:
  1932. 52.03 s >
  1933. 52.03 s > failures:
  1934. 52.03 s > generation::cff_tests::cff_generation_builds_one_loop_high_power_with_repeated_spectators
  1935. 52.03 s >
  1936. 52.03 s > test result: FAILED. 0 passed; 1 failed; 0 ignored; 0 measured; 52 filtered out; finished in 0.10s
  1937. 52.03 s >
  1938. 52.03 s > stderr ---
  1939. 52.03 s >
  1940. 52.03 s > thread 'generation::cff_tests::cff_generation_builds_one_loop_high_power_with_repeated_spectators' (3124) panicked at crates/three-dimensional-reps/src/generation.rs:6288:9:
  1941. 52.03 s > assertion failed: variants.iter().any(|variant|
  1942. 52.03 s > {
  1943. 52.03 s > variant.origin.as_deref().is_some_and(|origin|
  1944. 52.03 s > {
  1945. 52.03 s > origin.starts_with("bounded_degree_quadratic_recursive_remainder")
  1946. 52.03 s > })
  1947. 52.03 s > })
  1948. 52.03 s > stack backtrace:
  1949. 52.03 s > 0: __rustc::rust_begin_unwind
  1950. 52.03 s > 1: core::panicking::panic_fmt
  1951. 52.03 s > 2: core::panicking::panic
  1952. 52.03 s > 3: three_dimensional_reps::generation::cff_tests::cff_generation_builds_one_loop_high_power_with_repeated_spectators
  1953. 52.03 s > 4: <three_dimensional_reps::generation::cff_tests::cff_generation_builds_one_loop_high_power_with_repeated_spectators::{closure#0} as core::ops::function::FnOnce<()>>::call_once
  1954. 52.03 s > note: Some details are omitted, run with `RUST_BACKTRACE=full` for a verbose backtrace.
  1955. 52.03 s >
  1956. 52.03 s > error: test run failed
  1957. 52.03 s >
  1958. 52.03 s > ========== nextest test summary ==========
  1959. 52.03 s > report: target/nextest/ci_gammaloop/junit.xml
  1960. 52.03 s > tests: 53, failures: 4, errors: 0
  1961. 52.03 s >
  1962. 52.03 s > 1. three-dimensional-reps::generation::cff_tests::causal_repeated_generation_handles_energy_dependent_bubble_source
  1963. 52.03 s > failure: test failure with exit code 101
  1964. 52.03 s > thread 'generation::cff_tests::causal_repeated_generation_handles_energy_dependent_bubble_source' (3121) panicked at crates/three-dimensional-reps/src/generation.rs:5806:9:
  1965. 52.03 s > assertion `left == right` failed
  1966. 52.03 s > left: GlobalSourceProduct
  1967. 52.03 s > right: VariantLocal
  1968. 52.03 s > stack backtrace:
  1969. 52.03 s > 0: __rustc::rust_begin_unwind
  1970. 52.03 s > 1: core::panicking::panic_fmt
  1971. 52.03 s > 2: core::panicking::assert_failed_inner
  1972. 52.03 s > 3: core::panicking::assert_failed::<three_dimensional_reps::generation::CffEnergyFactorOwnership, three_dimensional_reps::generation::CffEnergyFactorOwnership>
  1973. 52.03 s > 4: three_dimensional_reps::generation::cff_tests::causal_repeated_generation_handles_energy_dependent_bubble_source
  1974. 52.03 s > 5: <three_dimensional_reps::generation::cff_tests::causal_repeated_generation_handles_energy_dependent_bubble_source::{closure#0} as core::ops::function::FnOnce<()>>::call_once
  1975. 52.03 s > note: Some details are omitted, run with `RUST_BACKTRACE=full` for a verbose backtrace.
  1976. 52.03 s > system-out
  1977. 52.03 s > running 1 test
  1978. 52.03 s > test generation::cff_tests::causal_repeated_generation_handles_energy_dependent_bubble_source ... FAILED
  1979. 52.03 s >
  1980. 52.03 s > failures:
  1981. 52.03 s >
  1982. 52.03 s > failures:
  1983. 52.03 s > generation::cff_tests::causal_repeated_generation_handles_energy_dependent_bubble_source
  1984. 52.03 s >
  1985. 52.03 s > test result: FAILED. 0 passed; 1 failed; 0 ignored; 0 measured; 52 filtered out; finished in 0.00s
  1986. 52.03 s > system-err
  1987. 52.03 s > thread 'generation::cff_tests::causal_repeated_generation_handles_energy_dependent_bubble_source' (3121) panicked at crates/three-dimensional-reps/src/generation.rs:5806:9:
  1988. 52.03 s > assertion `left == right` failed
  1989. 52.03 s > left: GlobalSourceProduct
  1990. 52.03 s > right: VariantLocal
  1991. 52.03 s > stack backtrace:
  1992. 52.03 s > 0: __rustc::rust_begin_unwind
  1993. 52.03 s > 1: core::panicking::panic_fmt
  1994. 52.03 s > 2: core::panicking::assert_failed_inner
  1995. 52.03 s > 3: core::panicking::assert_failed::<three_dimensional_reps::generation::CffEnergyFactorOwnership, three_dimensional_reps::generation::CffEnergyFactorOwnership>
  1996. 52.03 s > 4: three_dimensional_reps::generation::cff_tests::causal_repeated_generation_handles_energy_dependent_bubble_source
  1997. 52.03 s > 5: <three_dimensional_reps::generation::cff_tests::causal_repeated_generation_handles_energy_dependent_bubble_source::{closure#0} as core::ops::function::FnOnce<()>>::call_once
  1998. 52.03 s > note: Some details are omitted, run with `RUST_BACKTRACE=full` for a verbose backtrace.
  1999. 52.03 s >
  2000. 52.03 s > 2. three-dimensional-reps::generation::cff_tests::disconnected_mixed_energy_factor_ownership_keeps_both_component_factors
  2001. 52.03 s > failure: test failure with exit code 101
  2002. 52.03 s > thread 'generation::cff_tests::disconnected_mixed_energy_factor_ownership_keeps_both_component_factors' (3161) panicked at crates/three-dimensional-reps/src/generation.rs:5726:9:
  2003. 52.03 s > assertion `left == right` failed
  2004. 52.03 s > left: [GlobalSourceProduct, GlobalSourceProduct]
  2005. 52.03 s > right: [VariantLocal, GlobalSourceProduct]
  2006. 52.03 s > stack backtrace:
  2007. 52.03 s > 0: __rustc::rust_begin_unwind
  2008. 52.03 s > 1: core::panicking::panic_fmt
  2009. 52.03 s > 2: core::panicking::assert_failed_inner
  2010. 52.03 s > 3: core::panicking::assert_failed::<alloc::vec::Vec<three_dimensional_reps::generation::CffEnergyFactorOwnership>, alloc::vec::Vec<three_dimensional_reps::generation::CffEnergyFactorOwnership>>
  2011. 52.03 s > 4: three_dimensional_reps::generation::cff_tests::disconnected_mixed_energy_factor_ownership_keeps_both_component_factors
  2012. 52.03 s > 5: <three_dimensional_reps::generation::cff_tests::disconnected_mixed_energy_factor_ownership_keeps_both_component_factors::{closure#0} as core::ops::function::FnOnce<()>>::call_once
  2013. 52.03 s > note: Some details are omitted, run with `RUST_BACKTRACE=full` for a verbose backtrace.
  2014. 52.03 s > system-out
  2015. 52.03 s > running 1 test
  2016. 52.03 s > test generation::cff_tests::disconnected_mixed_energy_factor_ownership_keeps_both_component_factors ... FAILED
  2017. 52.03 s >
  2018. 52.03 s > failures:
  2019. 52.03 s >
  2020. 52.03 s > failures:
  2021. 52.03 s > generation::cff_tests::disconnected_mixed_energy_factor_ownership_keeps_both_component_factors
  2022. 52.03 s >
  2023. 52.03 s > test result: FAILED. 0 passed; 1 failed; 0 ignored; 0 measured; 52 filtered out; finished in 0.00s
  2024. 52.03 s > system-err
  2025. 52.03 s > thread 'generation::cff_tests::disconnected_mixed_energy_factor_ownership_keeps_both_component_factors' (3161) panicked at crates/three-dimensional-reps/src/generation.rs:5726:9:
  2026. 52.03 s > assertion `left == right` failed
  2027. 52.03 s > left: [GlobalSourceProduct, GlobalSourceProduct]
  2028. 52.03 s > right: [VariantLocal, GlobalSourceProduct]
  2029. 52.03 s > stack backtrace:
  2030. 52.03 s > 0: __rustc::rust_begin_unwind
  2031. 52.03 s > 1: core::panicking::panic_fmt
  2032. 52.03 s > 2: core::panicking::assert_failed_inner
  2033. 52.03 s > 3: core::panicking::assert_failed::<alloc::vec::Vec<three_dimensional_reps::generation::CffEnergyFactorOwnership>, alloc::vec::Vec<three_dimensional_reps::generation::CffEnergyFactorOwnership>>
  2034. 52.03 s > 4: three_dimensional_reps::generation::cff_tests::disconnected_mixed_energy_factor_ownership_keeps_both_component_factors
  2035. 52.03 s > 5: <three_dimensional_reps::generation::cff_tests::disconnected_mixed_energy_factor_ownership_keeps_both_component_factors::{closure#0} as core::ops::function::FnOnce<()>>::call_once
  2036. 52.03 s > note: Some details are omitted, run with `RUST_BACKTRACE=full` for a verbose backtrace.
  2037. 52.03 s >
  2038. 52.03 s > 3. three-dimensional-reps::generation::cff_tests::cff_generation_builds_multiloop_repeated_high_power_known_factor_completion
  2039. 52.03 s > failure: test failure with exit code 101
  2040. 52.03 s > thread 'generation::cff_tests::cff_generation_builds_multiloop_repeated_high_power_known_factor_completion' (3123) panicked at crates/three-dimensional-reps/src/generation.rs:5865:9:
  2041. 52.03 s > assertion failed: variants.iter().any(|variant|
  2042. 52.03 s > {
  2043. 52.03 s > variant.origin.as_deref().is_some_and(|origin|
  2044. 52.03 s > {
  2045. 52.03 s > origin.starts_with("bounded_degree_quadratic_recursive_remainder")
  2046. 52.03 s > })
  2047. 52.03 s > })
  2048. 52.03 s > stack backtrace:
  2049. 52.03 s > 0: __rustc::rust_begin_unwind
  2050. 52.03 s > 1: core::panicking::panic_fmt
  2051. 52.03 s > 2: core::panicking::panic
  2052. 52.03 s > 3: three_dimensional_reps::generation::cff_tests::cff_generation_builds_multiloop_repeated_high_power_known_factor_completion
  2053. 52.03 s > 4: <three_dimensional_reps::generation::cff_tests::cff_generation_builds_multiloop_repeated_high_power_known_factor_completion::{closure#0} as core::ops::function::FnOnce<()>>::call_once
  2054. 52.03 s > note: Some details are omitted, run with `RUST_BACKTRACE=full` for a verbose backtrace.
  2055. 52.03 s > system-out
  2056. 52.03 s > running 1 test
  2057. 52.03 s > test generation::cff_tests::cff_generation_builds_multiloop_repeated_high_power_known_factor_completion ... FAILED
  2058. 52.03 s >
  2059. 52.03 s > failures:
  2060. 52.03 s >
  2061. 52.03 s > failures:
  2062. 52.03 s > generation::cff_tests::cff_generation_builds_multiloop_repeated_high_power_known_factor_completion
  2063. 52.03 s >
  2064. 52.03 s > test result: FAILED. 0 passed; 1 failed; 0 ignored; 0 measured; 52 filtered out; finished in 0.03s
  2065. 52.03 s > system-err
  2066. 52.03 s > thread 'generation::cff_tests::cff_generation_builds_multiloop_repeated_high_power_known_factor_completion' (3123) panicked at crates/three-dimensional-reps/src/generation.rs:5865:9:
  2067. 52.03 s > assertion failed: variants.iter().any(|variant|
  2068. 52.03 s > {
  2069. 52.03 s > variant.origin.as_deref().is_some_and(|origin|
  2070. 52.03 s > {
  2071. 52.03 s > origin.starts_with("bounded_degree_quadratic_recursive_remainder")
  2072. 52.03 s > })
  2073. 52.03 s > })
  2074. 52.03 s > stack backtrace:
  2075. 52.03 s > 0: __rustc::rust_begin_unwind
  2076. 52.03 s > 1: core::panicking::panic_fmt
  2077. 52.03 s > 2: core::panicking::panic
  2078. 52.03 s > 3: three_dimensional_reps::generation::cff_tests::cff_generation_builds_multiloop_repeated_high_power_known_factor_completion
  2079. 52.03 s > 4: <three_dimensional_reps::generation::cff_tests::cff_generation_builds_multiloop_repeated_high_power_known_factor_completion::{closure#0} as core::ops::function::FnOnce<()>>::call_once
  2080. 52.03 s > note: Some details are omitted, run with `RUST_BACKTRACE=full` for a verbose backtrace.
  2081. 52.03 s >
  2082. 52.03 s > 4. three-dimensional-reps::generation::cff_tests::cff_generation_builds_one_loop_high_power_with_repeated_spectators
  2083. 52.03 s > failure: test failure with exit code 101
  2084. 52.03 s > thread 'generation::cff_tests::cff_generation_builds_one_loop_high_power_with_repeated_spectators' (3124) panicked at crates/three-dimensional-reps/src/generation.rs:6288:9:
  2085. 52.03 s > assertion failed: variants.iter().any(|variant|
  2086. 52.03 s > {
  2087. 52.03 s > variant.origin.as_deref().is_some_and(|origin|
  2088. 52.03 s > {
  2089. 52.03 s > origin.starts_with("bounded_degree_quadratic_recursive_remainder")
  2090. 52.03 s > })
  2091. 52.03 s > })
  2092. 52.03 s > stack backtrace:
  2093. 52.03 s > 0: __rustc::rust_begin_unwind
  2094. 52.03 s > 1: core::panicking::panic_fmt
  2095. 52.03 s > 2: core::panicking::panic
  2096. 52.03 s > 3: three_dimensional_reps::generation::cff_tests::cff_generation_builds_one_loop_high_power_with_repeated_spectators
  2097. 52.03 s > 4: <three_dimensional_reps::generation::cff_tests::cff_generation_builds_one_loop_high_power_with_repeated_spectators::{closure#0} as core::ops::function::FnOnce<()>>::call_once
  2098. 52.03 s > note: Some details are omitted, run with `RUST_BACKTRACE=full` for a verbose backtrace.
  2099. 52.03 s > system-out
  2100. 52.03 s > running 1 test
  2101. 52.03 s > test generation::cff_tests::cff_generation_builds_one_loop_high_power_with_repeated_spectators ... FAILED
  2102. 52.03 s >
  2103. 52.03 s > failures:
  2104. 52.03 s >
  2105. 52.03 s > failures:
  2106. 52.03 s > generation::cff_tests::cff_generation_builds_one_loop_high_power_with_repeated_spectators
  2107. 52.03 s >
  2108. 52.03 s > test result: FAILED. 0 passed; 1 failed; 0 ignored; 0 measured; 52 filtered out; finished in 0.10s
  2109. 52.03 s > system-err
  2110. 52.03 s > thread 'generation::cff_tests::cff_generation_builds_one_loop_high_power_with_repeated_spectators' (3124) panicked at crates/three-dimensional-reps/src/generation.rs:6288:9:
  2111. 52.03 s > assertion failed: variants.iter().any(|variant|
  2112. 52.03 s > {
  2113. 52.03 s > variant.origin.as_deref().is_some_and(|origin|
  2114. 52.03 s > {
  2115. 52.03 s > origin.starts_with("bounded_degree_quadratic_recursive_remainder")
  2116. 52.03 s > })
  2117. 52.03 s > })
  2118. 52.03 s > stack backtrace:
  2119. 52.03 s > 0: __rustc::rust_begin_unwind
  2120. 52.03 s > 1: core::panicking::panic_fmt
  2121. 52.03 s > 2: core::panicking::panic
  2122. 52.03 s > 3: three_dimensional_reps::generation::cff_tests::cff_generation_builds_one_loop_high_power_with_repeated_spectators
  2123. 52.03 s > 4: <three_dimensional_reps::generation::cff_tests::cff_generation_builds_one_loop_high_power_with_repeated_spectators::{closure#0} as core::ops::function::FnOnce<()>>::call_once
  2124. 52.03 s > note: Some details are omitted, run with `RUST_BACKTRACE=full` for a verbose backtrace.
  2125. 52.03 s > =========================================
  2126. 52.03 s For full logs, run:
  2127. 52.03 s nix log /nix/store/i3sh6ivcl5js2i7xcdz1qf32z60j8rna-gammaloop-nextest-core.drv
  2128. 52.16 s [0 built (1 failed), 0.0Run failed.