1. 0.00 s $ /nix/store/9ypz3flqsrl5xl495mm8h645gadjsxi1-coreutils-9.11/bin/timeout --kill-after=15s 7200s /nix/store/23zk8sgzamrbmj1fday15szf7f2279s8-nix-2.34.7/bin/nix --extra-experimental-features nix-command --extra-experimental-features flakes --log-format internal-json build --no-link --print-out-paths git+https://github.com/alphal00p/gammaloop?ref=raised_energy_cff_wip&rev=e30d799ef8733d35777ff9aa076aeb12e74ee256&shallow=1#packages.x86_64-linux.crate-test-binaries-three-dimensional-reps --print-build-logs
  2. 0.55 s error (ignored): SQLite database '/var/cache/nix-ci-worker/eval-cache-v6/1af7ce54381e008e1ba25632c4b8b432a9dc7753e12ebe47f32e96c35358ea75.sqlite' is busy
  3. 2.43 s
  4. 3.17 s Building /nix/store/jw4czjjdv1cc9jr1gsiygk91yx66v8ip-gammaloop-crate-test-binaries-three-dimensional-reps-50150770f831b638-deps-0.1.0.drv
  5. 3.33 s [gammaloop-crate-test-binaries-three-dimensional-reps-50150770f831b638-deps] Phase: unpackPhase
  6. 3.35 s [gammaloop-crate-test-binaries-three-dimensional-reps-50150770f831b638-deps] unpacking source archive /nix/store/s1ajjdsb6bzj5dvvg360rj0kxnvgb27s-source
  7. 3.67 s [gammaloop-crate-test-binaries-three-dimensional-reps-50150770f831b638-deps] source root is source
  8. 3.70 s [gammaloop-crate-test-binaries-three-dimensional-reps-50150770f831b638-deps] Phase: patchPhase
  9. 4.20 s [gammaloop-crate-test-binaries-three-dimensional-reps-50150770f831b638-deps] Executing configureCargoCommonVars
  10. 4.21 s [gammaloop-crate-test-binaries-three-dimensional-reps-50150770f831b638-deps] copying cargo artifacts from /nix/store/71lg5z9qr6b69cp7v2y427r8blvhr0lh-gammaloop-crate-test-binaries-three-dimensional-reps-50150770f831b638-inputs/target to target
  11. 4.21 s [gammaloop-crate-test-binaries-three-dimensional-reps-50150770f831b638-deps] will deep copy artifacts (instead of symlinking) as requested
  12. 8.12 s [gammaloop-crate-test-binaries-three-dimensional-reps-50150770f831b638-deps] Phase: updateAutotoolsGnuConfigScriptsPhase
  13. 8.16 s [gammaloop-crate-test-binaries-three-dimensional-reps-50150770f831b638-deps] Phase: configurePhase
  14. 8.16 s [gammaloop-crate-test-binaries-three-dimensional-reps-50150770f831b638-deps] will append /build/source/.cargo-home/config.toml with contents of /nix/store/1sigmg52bb61pfngmk9k8wq5fz9r7bf1-vendor-cargo-deps/config.toml
  15. 8.17 s [gammaloop-crate-test-binaries-three-dimensional-reps-50150770f831b638-deps] default configurePhase, nothing to do
  16. 8.17 s [gammaloop-crate-test-binaries-three-dimensional-reps-50150770f831b638-deps] Phase: buildPhase
  17. 8.18 s [gammaloop-crate-test-binaries-three-dimensional-reps-50150770f831b638-deps] +++ command cargo --version
  18. 8.18 s [gammaloop-crate-test-binaries-three-dimensional-reps-50150770f831b638-deps] cargo 1.97.0 (c980f4866 2026-06-30)
  19. 8.18 s [gammaloop-crate-test-binaries-three-dimensional-reps-50150770f831b638-deps] +++ command cargo test --profile ci-optim --no-run --offline -p three-dimensional-reps --features three-dimensional-reps/serde
  20. 8.59 s [gammaloop-crate-test-binaries-three-dimensional-reps-50150770f831b638-deps] Compiling three-dimensional-reps v0.1.0 (/build/source/crates/three-dimensional-reps)
  21. 8.80 s [gammaloop-crate-test-binaries-three-dimensional-reps-50150770f831b638-deps] error[E0433]: cannot find `eval` in `crate`
  22. 8.80 s [gammaloop-crate-test-binaries-three-dimensional-reps-50150770f831b638-deps] --> crates/three-dimensional-reps/src/generation.rs:8045:28
  23. 8.80 s [gammaloop-crate-test-binaries-three-dimensional-reps-50150770f831b638-deps] |
  24. 8.80 s [gammaloop-crate-test-binaries-three-dimensional-reps-50150770f831b638-deps] 8045 | let input = crate::eval::EvaluationInput {
  25. 8.80 s [gammaloop-crate-test-binaries-three-dimensional-reps-50150770f831b638-deps] | ^^^^ could not find `eval` in the crate root
  26. 8.80 s [gammaloop-crate-test-binaries-three-dimensional-reps-50150770f831b638-deps] |
  27. 8.80 s [gammaloop-crate-test-binaries-three-dimensional-reps-50150770f831b638-deps] note: found an item that was configured out
  28. 8.80 s [gammaloop-crate-test-binaries-three-dimensional-reps-50150770f831b638-deps] --> crates/three-dimensional-reps/src/lib.rs:7:9
  29. 8.80 s [gammaloop-crate-test-binaries-three-dimensional-reps-50150770f831b638-deps] |
  30. 8.80 s [gammaloop-crate-test-binaries-three-dimensional-reps-50150770f831b638-deps] 6 | #[cfg(feature = "eval")]
  31. 8.80 s [gammaloop-crate-test-binaries-three-dimensional-reps-50150770f831b638-deps] | ---------------- the item is gated behind the `eval` feature
  32. 8.80 s [gammaloop-crate-test-binaries-three-dimensional-reps-50150770f831b638-deps] 7 | pub mod eval;
  33. 8.80 s [gammaloop-crate-test-binaries-three-dimensional-reps-50150770f831b638-deps] | ^^^^
  34. 8.80 s [gammaloop-crate-test-binaries-three-dimensional-reps-50150770f831b638-deps]
  35. 8.80 s [gammaloop-crate-test-binaries-three-dimensional-reps-50150770f831b638-deps] error[E0433]: cannot find `eval` in `crate`
  36. 8.80 s [gammaloop-crate-test-binaries-three-dimensional-reps-50150770f831b638-deps] --> crates/three-dimensional-reps/src/generation.rs:8052:30
  37. 8.80 s [gammaloop-crate-test-binaries-three-dimensional-reps-50150770f831b638-deps] |
  38. 8.80 s [gammaloop-crate-test-binaries-three-dimensional-reps-50150770f831b638-deps] 8052 | let contact = crate::eval::evaluate_expression(
  39. 8.80 s [gammaloop-crate-test-binaries-three-dimensional-reps-50150770f831b638-deps] | ^^^^ could not find `eval` in the crate root
  40. 8.80 s [gammaloop-crate-test-binaries-three-dimensional-reps-50150770f831b638-deps] |
  41. 8.80 s [gammaloop-crate-test-binaries-three-dimensional-reps-50150770f831b638-deps] note: found an item that was configured out
  42. 8.80 s [gammaloop-crate-test-binaries-three-dimensional-reps-50150770f831b638-deps] --> crates/three-dimensional-reps/src/lib.rs:7:9
  43. 8.80 s [gammaloop-crate-test-binaries-three-dimensional-reps-50150770f831b638-deps] |
  44. 8.80 s [gammaloop-crate-test-binaries-three-dimensional-reps-50150770f831b638-deps] 6 | #[cfg(feature = "eval")]
  45. 8.80 s [gammaloop-crate-test-binaries-three-dimensional-reps-50150770f831b638-deps] | ---------------- the item is gated behind the `eval` feature
  46. 8.80 s [gammaloop-crate-test-binaries-three-dimensional-reps-50150770f831b638-deps] 7 | pub mod eval;
  47. 8.80 s [gammaloop-crate-test-binaries-three-dimensional-reps-50150770f831b638-deps] | ^^^^
  48. 8.80 s [gammaloop-crate-test-binaries-three-dimensional-reps-50150770f831b638-deps]
  49. 8.81 s [gammaloop-crate-test-binaries-three-dimensional-reps-50150770f831b638-deps] error[E0433]: cannot find `eval` in `crate`
  50. 8.81 s [gammaloop-crate-test-binaries-three-dimensional-reps-50150770f831b638-deps] --> crates/three-dimensional-reps/src/generation.rs:8060:32
  51. 8.81 s [gammaloop-crate-test-binaries-three-dimensional-reps-50150770f831b638-deps] |
  52. 8.81 s [gammaloop-crate-test-binaries-three-dimensional-reps-50150770f831b638-deps] 8060 | let remainder = crate::eval::evaluate_expression(
  53. 8.81 s [gammaloop-crate-test-binaries-three-dimensional-reps-50150770f831b638-deps] | ^^^^ could not find `eval` in the crate root
  54. 8.81 s [gammaloop-crate-test-binaries-three-dimensional-reps-50150770f831b638-deps] |
  55. 8.81 s [gammaloop-crate-test-binaries-three-dimensional-reps-50150770f831b638-deps] note: found an item that was configured out
  56. 8.81 s [gammaloop-crate-test-binaries-three-dimensional-reps-50150770f831b638-deps] --> crates/three-dimensional-reps/src/lib.rs:7:9
  57. 8.81 s [gammaloop-crate-test-binaries-three-dimensional-reps-50150770f831b638-deps] |
  58. 8.81 s [gammaloop-crate-test-binaries-three-dimensional-reps-50150770f831b638-deps] 6 | #[cfg(feature = "eval")]
  59. 8.81 s [gammaloop-crate-test-binaries-three-dimensional-reps-50150770f831b638-deps] | ---------------- the item is gated behind the `eval` feature
  60. 8.81 s [gammaloop-crate-test-binaries-three-dimensional-reps-50150770f831b638-deps] 7 | pub mod eval;
  61. 8.81 s [gammaloop-crate-test-binaries-three-dimensional-reps-50150770f831b638-deps] | ^^^^
  62. 8.81 s [gammaloop-crate-test-binaries-three-dimensional-reps-50150770f831b638-deps]
  63. 8.81 s [gammaloop-crate-test-binaries-three-dimensional-reps-50150770f831b638-deps] error[E0433]: cannot find `eval` in `crate`
  64. 8.81 s [gammaloop-crate-test-binaries-three-dimensional-reps-50150770f831b638-deps] --> crates/three-dimensional-reps/src/generation.rs:8068:28
  65. 8.81 s [gammaloop-crate-test-binaries-three-dimensional-reps-50150770f831b638-deps] |
  66. 8.81 s [gammaloop-crate-test-binaries-three-dimensional-reps-50150770f831b638-deps] 8068 | let total = crate::eval::evaluate_expression(&powered, &expression, numerator, &input)
  67. 8.81 s [gammaloop-crate-test-binaries-three-dimensional-reps-50150770f831b638-deps] | ^^^^ could not find `eval` in the crate root
  68. 8.81 s [gammaloop-crate-test-binaries-three-dimensional-reps-50150770f831b638-deps] |
  69. 8.81 s [gammaloop-crate-test-binaries-three-dimensional-reps-50150770f831b638-deps] note: found an item that was configured out
  70. 8.81 s [gammaloop-crate-test-binaries-three-dimensional-reps-50150770f831b638-deps] --> crates/three-dimensional-reps/src/lib.rs:7:9
  71. 8.81 s [gammaloop-crate-test-binaries-three-dimensional-reps-50150770f831b638-deps] |
  72. 8.81 s [gammaloop-crate-test-binaries-three-dimensional-reps-50150770f831b638-deps] 6 | #[cfg(feature = "eval")]
  73. 8.81 s [gammaloop-crate-test-binaries-three-dimensional-reps-50150770f831b638-deps] | ---------------- the item is gated behind the `eval` feature
  74. 8.81 s [gammaloop-crate-test-binaries-three-dimensional-reps-50150770f831b638-deps] 7 | pub mod eval;
  75. 8.81 s [gammaloop-crate-test-binaries-three-dimensional-reps-50150770f831b638-deps] | ^^^^
  76. 8.81 s [gammaloop-crate-test-binaries-three-dimensional-reps-50150770f831b638-deps]
  77. 10.65 s [gammaloop-crate-test-binaries-three-dimensional-reps-50150770f831b638-deps] For more information about this error, try `rustc --explain E0433`.
  78. 10.67 s [gammaloop-crate-test-binaries-three-dimensional-reps-50150770f831b638-deps] error: could not compile `three-dimensional-reps` (lib test) due to 4 previous errors
  79. 10.96 s Progress: 0 of 2 built (1 failed)
  80. 10.96 s Failed to build gammaloop-crate-test-binaries-three-dimensional-reps-50150770f831b638-deps after 7.7s
  81. 10.96 s error: Cannot build '/nix/store/jw4czjjdv1cc9jr1gsiygk91yx66v8ip-gammaloop-crate-test-binaries-three-dimensional-reps-50150770f831b638-deps-0.1.0.drv'.
  82. 10.96 s Reason: builder failed with exit code 101.
  83. 10.96 s Output paths:
  84. 10.96 s /nix/store/vf8ksab94faladqcwqcly6amf5fvpg1h-gammaloop-crate-test-binaries-three-dimensional-reps-50150770f831b638-deps-0.1.0
  85. 10.96 s Last 74 log lines:
  86. 10.96 s > Running phase: unpackPhase
  87. 10.96 s > unpacking source archive /nix/store/s1ajjdsb6bzj5dvvg360rj0kxnvgb27s-source
  88. 10.96 s > source root is source
  89. 10.96 s > Running phase: patchPhase
  90. 10.96 s > Executing configureCargoCommonVars
  91. 10.96 s > copying cargo artifacts from /nix/store/71lg5z9qr6b69cp7v2y427r8blvhr0lh-gammaloop-crate-test-binaries-three-dimensional-reps-50150770f831b638-inputs/target to target
  92. 10.96 s > will deep copy artifacts (instead of symlinking) as requested
  93. 10.96 s > Running phase: updateAutotoolsGnuConfigScriptsPhase
  94. 10.96 s > Running phase: configurePhase
  95. 10.96 s > will append /build/source/.cargo-home/config.toml with contents of /nix/store/1sigmg52bb61pfngmk9k8wq5fz9r7bf1-vendor-cargo-deps/config.toml
  96. 10.96 s > default configurePhase, nothing to do
  97. 10.96 s > Running phase: buildPhase
  98. 10.96 s > +++ command cargo --version
  99. 10.96 s > cargo 1.97.0 (c980f4866 2026-06-30)
  100. 10.96 s > +++ command cargo test --profile ci-optim --no-run --offline -p three-dimensional-reps --features three-dimensional-reps/serde
  101. 10.96 s > Compiling three-dimensional-reps v0.1.0 (/build/source/crates/three-dimensional-reps)
  102. 10.96 s > error[E0433]: cannot find `eval` in `crate`
  103. 10.96 s > --> crates/three-dimensional-reps/src/generation.rs:8045:28
  104. 10.96 s > |
  105. 10.96 s > 8045 | let input = crate::eval::EvaluationInput {
  106. 10.96 s > | ^^^^ could not find `eval` in the crate root
  107. 10.96 s > |
  108. 10.96 s > note: found an item that was configured out
  109. 10.96 s > --> crates/three-dimensional-reps/src/lib.rs:7:9
  110. 10.96 s > |
  111. 10.96 s > 6 | #[cfg(feature = "eval")]
  112. 10.96 s > | ---------------- the item is gated behind the `eval` feature
  113. 10.96 s > 7 | pub mod eval;
  114. 10.96 s > | ^^^^
  115. 10.96 s >
  116. 10.96 s > error[E0433]: cannot find `eval` in `crate`
  117. 10.96 s > --> crates/three-dimensional-reps/src/generation.rs:8052:30
  118. 10.96 s > |
  119. 10.96 s > 8052 | let contact = crate::eval::evaluate_expression(
  120. 10.96 s > | ^^^^ could not find `eval` in the crate root
  121. 10.96 s > |
  122. 10.96 s > note: found an item that was configured out
  123. 10.96 s > --> crates/three-dimensional-reps/src/lib.rs:7:9
  124. 10.96 s > |
  125. 10.96 s > 6 | #[cfg(feature = "eval")]
  126. 10.96 s > | ---------------- the item is gated behind the `eval` feature
  127. 10.96 s > 7 | pub mod eval;
  128. 10.96 s > | ^^^^
  129. 10.96 s >
  130. 10.96 s > error[E0433]: cannot find `eval` in `crate`
  131. 10.96 s > --> crates/three-dimensional-reps/src/generation.rs:8060:32
  132. 10.96 s > |
  133. 10.96 s > 8060 | let remainder = crate::eval::evaluate_expression(
  134. 10.96 s > | ^^^^ could not find `eval` in the crate root
  135. 10.96 s > |
  136. 10.96 s > note: found an item that was configured out
  137. 10.96 s > --> crates/three-dimensional-reps/src/lib.rs:7:9
  138. 10.96 s > |
  139. 10.96 s > 6 | #[cfg(feature = "eval")]
  140. 10.96 s > | ---------------- the item is gated behind the `eval` feature
  141. 10.96 s > 7 | pub mod eval;
  142. 10.96 s > | ^^^^
  143. 10.96 s >
  144. 10.96 s > error[E0433]: cannot find `eval` in `crate`
  145. 10.96 s > --> crates/three-dimensional-reps/src/generation.rs:8068:28
  146. 10.96 s > |
  147. 10.96 s > 8068 | let total = crate::eval::evaluate_expression(&powered, &expression, numerator, &input)
  148. 10.96 s > | ^^^^ could not find `eval` in the crate root
  149. 10.96 s > |
  150. 10.96 s > note: found an item that was configured out
  151. 10.96 s > --> crates/three-dimensional-reps/src/lib.rs:7:9
  152. 10.96 s > |
  153. 10.96 s > 6 | #[cfg(feature = "eval")]
  154. 10.96 s > | ---------------- the item is gated behind the `eval` feature
  155. 10.96 s > 7 | pub mod eval;
  156. 10.96 s > | ^^^^
  157. 10.96 s >
  158. 10.96 s > For more information about this error, try `rustc --explain E0433`.
  159. 10.96 s > error: could not compile `three-dimensional-reps` (lib test) due to 4 previous errors
  160. 10.96 s For full logs, run:
  161. 10.96 s nix log /nix/store/jw4czjjdv1cc9jr1gsiygk91yx66v8ip-gammaloop-crate-test-binaries-three-dimensional-reps-50150770f831b638-deps-0.1.0.drv
  162. 10.96 s error: Cannot build '/nix/store/0v0ynicwgs72f23jc7ac86j9bhgkb5nf-nix-ci-artifact-barrier-crate-test-binaries-three-dimensional-reps.drv'.
  163. 10.96 s Reason: 1 dependency failed.
  164. 10.96 s Output paths:
  165. 10.96 s /nix/store/gpmdw08idkj46pzbyx297378ck2pswym-nix-ci-artifact-barrier-crate-test-binaries-three-dimensional-reps
  166. 10.97 s Build failed due to failed dependency
  167. 11.03 s Build failed.