1. 0.00 s $ /nix/store/9ypz3flqsrl5xl495mm8h645gadjsxi1-coreutils-9.11/bin/timeout --kill-after=15s 7200s /nix/store/23zk8sgzamrbmj1fday15szf7f2279s8-nix-2.34.7/bin/nix --extra-experimental-features nix-command --extra-experimental-features flakes --log-format internal-json build --no-link --print-out-paths git+https://github.com/alphal00p/gammaloop?ref=simplify-spenso-api&rev=43649e2ed5bc140b6fa2364e5e528f13134be9f5&shallow=1#packages.x86_64-linux.alphal00p-docs-cargo-artifacts --print-build-logs
  2. 0.32 s error (ignored): SQLite database '/var/cache/nix-ci-worker/eval-cache-v6/53f1f761aa063087bfce3433834dcc35090204d1c4a41b158153a1d83b26920f.sqlite' is busy
  3. 1.76 s
  4. 2.05 s Building /nix/store/8y99gpj1qs95jysr3c6kccvh7lrd78i4-alphal00p-docs-cargo-0.1.0.drv
  5. 2.09 s [alphal00p-docs-cargo] cargoArtifacts not set, will not reuse any cargo artifacts
  6. 2.12 s [alphal00p-docs-cargo] Phase: unpackPhase
  7. 2.12 s [alphal00p-docs-cargo] unpacking source archive /nix/store/4pklqwhrgb01wfp3djh4jb2wr4xr9ila-source
  8. 2.27 s [alphal00p-docs-cargo] source root is source
  9. 2.29 s [alphal00p-docs-cargo] Phase: patchPhase
  10. 2.30 s [alphal00p-docs-cargo] Executing configureCargoCommonVars
  11. 2.31 s [alphal00p-docs-cargo] Phase: updateAutotoolsGnuConfigScriptsPhase
  12. 2.32 s [alphal00p-docs-cargo] Phase: configurePhase
  13. 2.33 s [alphal00p-docs-cargo] will append /build/source/.cargo-home/config.toml with contents of /nix/store/9rqk4093qnvgswmdk1pbxk9najcrjn7a-vendor-cargo-deps/config.toml
  14. 2.33 s [alphal00p-docs-cargo] default configurePhase, nothing to do
  15. 2.33 s [alphal00p-docs-cargo] Phase: buildPhase
  16. 2.33 s [alphal00p-docs-cargo] +++ command cargo --version
  17. 2.34 s [alphal00p-docs-cargo] cargo 1.98.1 (797e8a9bc 2026-08-05)
  18. 2.34 s [alphal00p-docs-cargo] +++ command cargo build --profile docs --locked -p alphal00p-docs-catalogs --bin alphal00p-docs-catalogs
  19. 2.73 s [alphal00p-docs-cargo] Compiling proc-macro2 v1.0.106
  20. 2.73 s [alphal00p-docs-cargo] Compiling unicode-ident v1.0.24
  21. 2.73 s [alphal00p-docs-cargo] Compiling quote v1.0.45
  22. 2.73 s [alphal00p-docs-cargo] Compiling serde_core v1.0.228
  23. 2.73 s [alphal00p-docs-cargo] Compiling memchr v2.8.0
  24. 2.73 s [alphal00p-docs-cargo] Compiling utf8parse v0.2.2
  25. 2.73 s [alphal00p-docs-cargo] Compiling zmij v1.0.21
  26. 2.73 s [alphal00p-docs-cargo] Compiling serde_json v1.0.149
  27. 2.73 s [alphal00p-docs-cargo] Compiling anstyle v1.0.14
  28. 2.74 s [alphal00p-docs-cargo] Compiling serde v1.0.228
  29. 2.75 s [alphal00p-docs-cargo] Compiling thiserror v2.0.18
  30. 2.75 s [alphal00p-docs-cargo] Compiling anstyle-query v1.1.5
  31. 2.76 s [alphal00p-docs-cargo] Compiling colorchoice v1.0.5
  32. 2.76 s [alphal00p-docs-cargo] Compiling is_terminal_polyfill v1.70.2
  33. 2.76 s [alphal00p-docs-cargo] Compiling equivalent v1.0.2
  34. 2.76 s [alphal00p-docs-cargo] Compiling eyre v0.6.12
  35. 2.80 s [alphal00p-docs-cargo] Compiling anstyle-parse v1.0.0
  36. 2.81 s [alphal00p-docs-cargo] Compiling regex-syntax v0.8.10
  37. 2.84 s [alphal00p-docs-cargo] Compiling heck v0.5.0
  38. 2.86 s [alphal00p-docs-cargo] Compiling strsim v0.11.1
  39. 2.87 s [alphal00p-docs-cargo] Compiling clap_lex v1.1.0
  40. 2.88 s [alphal00p-docs-cargo] Compiling itoa v1.0.18
  41. 2.94 s [alphal00p-docs-cargo] Compiling hashbrown v0.17.1
  42. 3.01 s [alphal00p-docs-cargo] Compiling anstream v1.0.0
  43. 3.01 s [alphal00p-docs-cargo] Compiling indenter v0.3.4
  44. 3.04 s [alphal00p-docs-cargo] Compiling once_cell v1.21.4
  45. 3.18 s [alphal00p-docs-cargo] Compiling aho-corasick v1.1.4
  46. 3.25 s [alphal00p-docs-cargo] Compiling clap_builder v4.6.0
  47. 3.62 s [alphal00p-docs-cargo] Compiling syn v2.0.117
  48. 4.14 s [alphal00p-docs-cargo] Compiling regex-automata v0.4.14
  49. 4.48 s [alphal00p-docs-cargo] Compiling indexmap v2.14.0
  50. 5.24 s [alphal00p-docs-cargo] Compiling serde_derive v1.0.228
  51. 5.24 s [alphal00p-docs-cargo] Compiling thiserror-impl v2.0.18
  52. 5.24 s [alphal00p-docs-cargo] Compiling clap_derive v4.6.1
  53. 5.24 s [alphal00p-docs-cargo] Compiling alphal00p-docs-macros v0.1.0 (/build/source/crates/alphal00p-docs-macros)
  54. 5.42 s [alphal00p-docs-cargo] Compiling regex v1.12.3
  55. 6.27 s [alphal00p-docs-cargo] Compiling clap v4.6.1
  56. 7.04 s [alphal00p-docs-cargo] Compiling alphal00p-docs-schema v0.1.0 (/build/source/crates/alphal00p-docs-schema)
  57. 7.51 s [alphal00p-docs-cargo] Compiling alphal00p-docs-catalogs v0.1.0 (/build/source/crates/alphal00p-docs-catalogs)
  58. 11.83 s [alphal00p-docs-cargo] Finished `docs` profile [unoptimized] target(s) in 9.48s
  59. 11.87 s [alphal00p-docs-cargo] +++ command cargo build --profile docs --locked -p alphal00p-docs-python-exporter --features gammaloop
  60. 12.23 s [alphal00p-docs-cargo] Compiling serde_core v1.0.228
  61. 12.23 s [alphal00p-docs-cargo] Compiling libc v0.2.186
  62. 12.23 s [alphal00p-docs-cargo] Compiling cfg-if v1.0.4
  63. 12.23 s [alphal00p-docs-cargo] Compiling serde v1.0.228
  64. 12.23 s [alphal00p-docs-cargo] Compiling memchr v2.8.0
  65. 12.23 s [alphal00p-docs-cargo] Compiling autocfg v1.5.0
  66. 12.23 s [alphal00p-docs-cargo] Compiling libm v0.2.16
  67. 12.23 s [alphal00p-docs-cargo] Compiling version_check v0.9.5
  68. 12.24 s [alphal00p-docs-cargo] Compiling either v1.15.0
  69. 12.24 s [alphal00p-docs-cargo] Compiling zerocopy v0.8.48
  70. 12.25 s [alphal00p-docs-cargo] Compiling crossbeam-utils v0.8.21
  71. 12.25 s [alphal00p-docs-cargo] Compiling log v0.4.29
  72. 12.25 s [alphal00p-docs-cargo] Compiling unicode-width v0.2.2
  73. 12.25 s [alphal00p-docs-cargo] Compiling rayon-core v1.13.0
  74. 12.25 s [alphal00p-docs-cargo] Compiling foldhash v0.2.0
  75. 12.25 s [alphal00p-docs-cargo] Compiling syn v2.0.117
  76. 12.27 s [alphal00p-docs-cargo] Compiling syn v3.0.4
  77. 12.35 s [alphal00p-docs-cargo] Compiling target-lexicon v0.13.5
  78. 12.36 s [alphal00p-docs-cargo] Compiling serde_json v1.0.149
  79. 12.37 s [alphal00p-docs-cargo] Compiling lazy_static v1.5.0
  80. 12.40 s [alphal00p-docs-cargo] Compiling getrandom v0.3.4
  81. 12.40 s [alphal00p-docs-cargo] Compiling paste v1.0.15
  82. 12.40 s [alphal00p-docs-cargo] Compiling siphasher v1.0.2
  83. 12.46 s [alphal00p-docs-cargo] Compiling crunchy v0.2.4
  84. 12.49 s [alphal00p-docs-cargo] Compiling num-traits v0.2.19
  85. 12.50 s [alphal00p-docs-cargo] Compiling tiny-keccak v2.0.2
  86. 12.52 s [alphal00p-docs-cargo] Compiling anyhow v1.0.102
  87. 12.55 s [alphal00p-docs-cargo] Compiling itertools v0.14.0
  88. 12.55 s [alphal00p-docs-cargo] Compiling aho-corasick v1.1.4
  89. 12.65 s [alphal00p-docs-cargo] Compiling static_assertions v1.1.0
  90. 12.68 s [alphal00p-docs-cargo] Compiling rustix v1.1.4
  91. 12.69 s [alphal00p-docs-cargo] Compiling num-conv v0.2.1
  92. 12.73 s [alphal00p-docs-cargo] Compiling powerfmt v0.2.0
  93. 12.75 s [alphal00p-docs-cargo] Compiling crossbeam-epoch v0.9.18
  94. 12.77 s [alphal00p-docs-cargo] Compiling time-core v0.1.8
  95. 12.80 s [alphal00p-docs-cargo] Compiling linux-raw-sys v0.12.1
  96. 12.86 s [alphal00p-docs-cargo] Compiling deranged v0.5.8
  97. 12.88 s [alphal00p-docs-cargo] Compiling time-macros v0.2.27
  98. 12.90 s [alphal00p-docs-cargo] Compiling crossbeam-deque v0.8.6
  99. 12.93 s [alphal00p-docs-cargo] Compiling num_threads v0.1.7
  100. 13.00 s [alphal00p-docs-cargo] Compiling allocator-api2 v0.2.21
  101. 13.01 s [alphal00p-docs-cargo] Compiling tracing-core v0.1.36
  102. 13.02 s [alphal00p-docs-cargo] Compiling pyo3-build-config v0.28.3
  103. 13.03 s [alphal00p-docs-cargo] Compiling virtue v0.0.18
  104. 13.05 s [alphal00p-docs-cargo] Compiling winnow v1.0.2
  105. 13.24 s [alphal00p-docs-cargo] Compiling hashbrown v0.16.1
  106. 13.33 s [alphal00p-docs-cargo] Compiling regex-automata v0.4.14
  107. 13.37 s [alphal00p-docs-cargo] Compiling rayon v1.12.0
  108. 13.44 s [alphal00p-docs-cargo] Compiling arrayvec v0.7.6
  109. 13.53 s [alphal00p-docs-cargo] Compiling getrandom v0.2.17
  110. 13.58 s [alphal00p-docs-cargo] Compiling bincode_derive v2.0.1
  111. 13.59 s [alphal00p-docs-cargo] Compiling num-integer v0.1.46
  112. 13.62 s [alphal00p-docs-cargo] Compiling approx v0.5.1
  113. 13.63 s [alphal00p-docs-cargo] Compiling rand_core v0.6.4
  114. 13.65 s [alphal00p-docs-cargo] Compiling rand_core v0.9.5
  115. 13.65 s [alphal00p-docs-cargo] Compiling phf_shared v0.11.3
  116. 13.66 s [alphal00p-docs-cargo] Compiling toml_writer v1.1.1+spec-1.1.0
  117. 13.69 s [alphal00p-docs-cargo] Compiling time v0.3.47
  118. 13.71 s [alphal00p-docs-cargo] Compiling gmp-mpfr-sys v1.7.1
  119. 13.75 s [alphal00p-docs-cargo] Compiling unty v0.0.4
  120. 13.76 s [alphal00p-docs-cargo] Compiling pin-project-lite v0.2.17
  121. 13.77 s [alphal00p-docs-cargo] Compiling nu-ansi-term v0.50.3
  122. 13.78 s [alphal00p-docs-cargo] Compiling tracing-log v0.2.0
  123. 13.82 s [alphal00p-docs-cargo] Compiling toml_parser v1.1.2+spec-1.1.0
  124. 13.82 s [alphal00p-docs-cargo] Compiling matrixmultiply v0.3.10
  125. 13.84 s [alphal00p-docs-cargo] Compiling sharded-slab v0.1.7
  126. 13.84 s [alphal00p-docs-cargo] Compiling hashbrown v0.17.1
  127. 13.87 s [alphal00p-docs-cargo] Compiling thread_local v1.1.9
  128. 13.90 s [alphal00p-docs-cargo] Compiling syn v1.0.109
  129. 13.99 s [alphal00p-docs-cargo] Compiling rug v1.30.0
  130. 14.01 s [alphal00p-docs-cargo] Compiling option-ext v0.2.0
  131. 14.04 s [alphal00p-docs-cargo] Compiling typenum v1.20.0
  132. 14.05 s [alphal00p-docs-cargo] Compiling dirs-sys v0.5.0
  133. 14.06 s [alphal00p-docs-cargo] Compiling bitflags v2.11.1
  134. 14.14 s [alphal00p-docs-cargo] Compiling serde_spanned v1.1.1
  135. 14.21 s [alphal00p-docs-cargo] Compiling toml_datetime v1.1.1+spec-1.1.0
  136. 14.22 s [alphal00p-docs-cargo] Compiling num-complex v0.4.6
  137. 14.23 s [alphal00p-docs-cargo] Compiling rawpointer v0.2.1
  138. 14.23 s [alphal00p-docs-cargo] Compiling fnv v1.0.7
  139. 14.24 s [alphal00p-docs-cargo] Compiling pyo3-ffi v0.28.3
  140. 14.25 s [alphal00p-docs-cargo] Compiling az v1.3.0
  141. 14.28 s [alphal00p-docs-cargo] Compiling alloc-no-stdlib v2.0.4
  142. 14.29 s [alphal00p-docs-cargo] Compiling dyn-clone v1.0.20
  143. 14.34 s [alphal00p-docs-cargo] Compiling alloc-stdlib v0.2.2
  144. 14.36 s [alphal00p-docs-cargo] Compiling bytemuck_derive v1.12.0
  145. 14.37 s [alphal00p-docs-cargo] Compiling pyo3-macros-backend v0.28.3
  146. 14.39 s [alphal00p-docs-cargo] Compiling num-bigint v0.4.6
  147. 14.51 s [alphal00p-docs-cargo] Compiling generic-array v0.14.7
  148. 14.56 s [alphal00p-docs-cargo] Compiling colored v3.1.1
  149. 14.59 s [alphal00p-docs-cargo] Compiling bitflags v1.3.2
  150. 14.62 s [alphal00p-docs-cargo] Compiling errno v0.3.14
  151. 14.63 s [alphal00p-docs-cargo] Compiling getopts v0.2.24
  152. 14.70 s [alphal00p-docs-cargo] Compiling signal-hook v0.3.18
  153. 14.73 s [alphal00p-docs-cargo] Compiling same-file v1.0.6
  154. 14.76 s [alphal00p-docs-cargo] Compiling ident_case v1.0.1
  155. 14.79 s [alphal00p-docs-cargo] Compiling parking_lot_core v0.9.12
  156. 14.82 s [alphal00p-docs-cargo] Compiling walkdir v2.5.0
  157. 14.86 s [alphal00p-docs-cargo] Compiling indexmap v2.14.0
  158. 14.88 s [alphal00p-docs-cargo] Compiling synstructure v0.13.2
  159. 14.94 s [alphal00p-docs-cargo] Compiling signal-hook-registry v1.4.8
  160. 14.99 s [alphal00p-docs-cargo] Compiling region v3.0.2
  161. 15.02 s [alphal00p-docs-cargo] Compiling toml v1.1.2+spec-1.1.0
  162. 15.03 s [alphal00p-docs-cargo] Compiling const-random-macro v0.1.16
  163. 15.08 s [alphal00p-docs-cargo] Compiling vte v0.14.1
  164. 15.12 s [alphal00p-docs-cargo] Compiling wasmtime-jit-icache-coherence v34.0.2
  165. 15.13 s [alphal00p-docs-cargo] Compiling hugepage-rs v0.1.1
  166. 15.16 s [alphal00p-docs-cargo] Compiling smartstring v1.0.1
  167. 15.18 s [alphal00p-docs-cargo] Compiling ahash v0.8.12
  168. 15.23 s [alphal00p-docs-cargo] Compiling spec_math v0.1.6
  169. 15.25 s [alphal00p-docs-cargo] Compiling scopeguard v1.2.0
  170. 15.29 s [alphal00p-docs-cargo] Compiling unic-char-range v0.9.0
  171. 15.30 s [alphal00p-docs-cargo] Compiling unic-common v0.9.0
  172. 15.33 s [alphal00p-docs-cargo] Compiling inventory v0.3.24
  173. 15.36 s [alphal00p-docs-cargo] Compiling unic-ucd-version v0.9.0
  174. 15.38 s [alphal00p-docs-cargo] Compiling unic-char-property v0.9.0
  175. 15.39 s [alphal00p-docs-cargo] Compiling matchers v0.2.0
  176. 15.40 s [alphal00p-docs-cargo] Compiling regex v1.12.3
  177. 15.43 s [alphal00p-docs-cargo] Compiling const-random v0.1.18
  178. 15.43 s [alphal00p-docs-cargo] Compiling bytemuck v1.25.0
  179. 15.44 s [alphal00p-docs-cargo] Compiling lock_api v0.4.14
  180. 15.47 s [alphal00p-docs-cargo] Compiling brotli-decompressor v5.0.0
  181. 15.47 s [alphal00p-docs-cargo] Compiling mio v1.2.0
  182. 15.60 s [alphal00p-docs-cargo] Compiling terminal_size v0.4.4
  183. 15.60 s [alphal00p-docs-cargo] Compiling rustpython-parser-vendored v0.4.0
  184. 15.61 s [alphal00p-docs-cargo] Compiling safe_arch v0.7.4
  185. 15.62 s [alphal00p-docs-cargo] Compiling safe_arch v1.2.0
  186. 15.63 s [alphal00p-docs-cargo] Compiling itertools v0.11.0
  187. 15.66 s [alphal00p-docs-cargo] Compiling unicase v2.9.0
  188. 15.69 s [alphal00p-docs-cargo] Compiling minimal-lexical v0.2.1
  189. 15.76 s [alphal00p-docs-cargo] Compiling indenter v0.3.4
  190. 15.77 s [alphal00p-docs-cargo] Compiling rustix v0.38.44
  191. 15.77 s [alphal00p-docs-cargo] Compiling fastrand v2.4.1
  192. 15.80 s [alphal00p-docs-cargo] Compiling winnow v0.7.15
  193. 15.82 s [alphal00p-docs-cargo] Compiling wide v0.7.33
  194. 15.83 s [alphal00p-docs-cargo] Compiling iana-time-zone v0.1.65
  195. 15.84 s [alphal00p-docs-cargo] Compiling nom v7.1.3
  196. 15.87 s [alphal00p-docs-cargo] Compiling wide v1.7.0
  197. 15.89 s [alphal00p-docs-cargo] Compiling clap_builder v4.6.0
  198. 15.93 s [alphal00p-docs-cargo] Compiling signal-hook-mio v0.2.5
  199. 15.99 s [alphal00p-docs-cargo] Compiling crypto-common v0.1.7
  200. 15.99 s [alphal00p-docs-cargo] Compiling block-buffer v0.10.4
  201. 16.05 s [alphal00p-docs-cargo] Compiling brotli v8.0.2
  202. 16.06 s [alphal00p-docs-cargo] Compiling numpy v0.28.0
  203. 16.08 s [alphal00p-docs-cargo] Compiling directories v6.0.0
  204. 16.10 s [alphal00p-docs-cargo] Compiling phf v0.11.3
  205. 16.12 s [alphal00p-docs-cargo] Compiling serde_derive v1.0.228
  206. 16.18 s [alphal00p-docs-cargo] Compiling zerocopy-derive v0.8.48
  207. 16.21 s [alphal00p-docs-cargo] Compiling tracing-attributes v0.1.31
  208. 16.22 s [alphal00p-docs-cargo] Compiling thiserror-impl v2.0.18
  209. 16.26 s [alphal00p-docs-cargo] Compiling strum_macros v0.27.2
  210. 16.54 s [alphal00p-docs-cargo] Compiling is-macro v0.3.7
  211. 16.54 s [alphal00p-docs-cargo] Compiling clap_derive v4.6.1
  212. 16.92 s [alphal00p-docs-cargo] Compiling simba v0.9.1
  213. 17.00 s [alphal00p-docs-cargo] Compiling zerofrom-derive v0.1.7
  214. 17.09 s [alphal00p-docs-cargo] Compiling libloading v0.9.0
  215. 17.13 s [alphal00p-docs-cargo] Compiling rustpython-parser-core v0.4.0
  216. 17.22 s [alphal00p-docs-cargo] Compiling ed25519-compact v2.4.2
  217. 17.28 s [alphal00p-docs-cargo] Compiling rustc-hash v2.1.2
  218. 17.34 s [alphal00p-docs-cargo] Compiling tracing v0.1.44
  219. 17.34 s [alphal00p-docs-cargo] Compiling self_cell v1.2.2
  220. 17.38 s [alphal00p-docs-cargo] Compiling thiserror v2.0.18
  221. 17.39 s [alphal00p-docs-cargo] Compiling data-encoding v2.11.1
  222. 17.43 s [alphal00p-docs-cargo] Compiling byteorder v1.5.0
  223. 17.44 s [alphal00p-docs-cargo] Compiling linux-raw-sys v0.4.15
  224. 17.49 s [alphal00p-docs-cargo] Compiling append-only-vec v0.1.8
  225. 17.56 s [alphal00p-docs-cargo] Compiling unicode-segmentation v1.13.2
  226. 17.58 s [alphal00p-docs-cargo] Compiling tinyjson v2.5.1
  227. 17.58 s [alphal00p-docs-cargo] Compiling bytes v1.11.1
  228. 17.78 s [alphal00p-docs-cargo] Compiling rustpython-ast v0.4.0
  229. 17.86 s [alphal00p-docs-cargo] Compiling ansitok v0.3.0
  230. 17.89 s [alphal00p-docs-cargo] Compiling yoke-derive v0.8.2
  231. 17.94 s [alphal00p-docs-cargo] Compiling strum v0.27.2
  232. 18.00 s [alphal00p-docs-cargo] Compiling digest v0.10.7
  233. 18.02 s [alphal00p-docs-cargo] Compiling unic-emoji-char v0.9.0
  234. 18.11 s [alphal00p-docs-cargo] Compiling unic-ucd-ident v0.9.0
  235. 18.12 s [alphal00p-docs-cargo] Compiling pyo3 v0.28.3
  236. 18.13 s [alphal00p-docs-cargo] Compiling bstr v1.12.1
  237. 18.14 s [alphal00p-docs-cargo] Compiling zerofrom v0.1.8
  238. 18.14 s [alphal00p-docs-cargo] Compiling clap v4.6.1
  239. 18.18 s [alphal00p-docs-cargo] Compiling phf_shared v0.13.1
  240. 18.19 s [alphal00p-docs-cargo] Compiling rustc-hash v1.1.0
  241. 18.20 s [alphal00p-docs-cargo] Compiling ciborium-io v0.2.2
  242. 18.22 s [alphal00p-docs-cargo] Compiling plotters-backend v0.3.7
  243. 18.23 s [alphal00p-docs-cargo] Compiling typeid v1.0.3
  244. 18.25 s [alphal00p-docs-cargo] Compiling stable_deref_trait v1.2.1
  245. 18.30 s [alphal00p-docs-cargo] Compiling getrandom v0.4.2
  246. 18.31 s [alphal00p-docs-cargo] Compiling cpufeatures v0.2.17
  247. 18.32 s [alphal00p-docs-cargo] Compiling pyo3-macros v0.28.3
  248. 18.35 s [alphal00p-docs-cargo] Compiling lalrpop-util v0.20.2
  249. 18.36 s [alphal00p-docs-cargo] Compiling plotters-svg v0.3.7
  250. 18.37 s [alphal00p-docs-cargo] Compiling sha2 v0.10.9
  251. 18.38 s [alphal00p-docs-cargo] Compiling eyre v0.6.12
  252. 18.38 s [alphal00p-docs-cargo] Compiling num-rational v0.4.2
  253. 18.46 s [alphal00p-docs-cargo] Compiling globset v0.4.18
  254. 18.47 s [alphal00p-docs-cargo] Compiling zerovec-derive v0.11.6
  255. 18.49 s [alphal00p-docs-cargo] Compiling toml_datetime v0.7.5+spec-1.1.0
  256. 18.53 s [alphal00p-docs-cargo] Compiling console v0.16.3
  257. 18.55 s [alphal00p-docs-cargo] Compiling itertools v0.10.5
  258. 18.56 s [alphal00p-docs-cargo] Compiling toml_write v0.1.2
  259. 18.63 s [alphal00p-docs-cargo] Compiling ucd-trie v0.1.7
  260. 18.66 s [alphal00p-docs-cargo] Compiling adler2 v2.0.1
  261. 18.68 s [alphal00p-docs-cargo] Compiling symbolica v2.2.0 (https://github.com/symbolica-dev/symbolica?rev=4f1323185fe5e0c0f8c864ab89edd1905e7adef1#4f132318)
  262. 18.71 s [alphal00p-docs-cargo] Compiling rustversion v1.0.22
  263. 18.79 s [alphal00p-docs-cargo] Compiling cast v0.3.0
  264. 18.83 s [alphal00p-docs-cargo] Compiling simd-adler32 v0.3.10
  265. 18.89 s [alphal00p-docs-cargo] Compiling pest v2.8.6
  266. 18.91 s [alphal00p-docs-cargo] Compiling rust-embed-utils v8.11.0
  267. 18.93 s [alphal00p-docs-cargo] Compiling yoke v0.8.3
  268. 18.93 s [alphal00p-docs-cargo] Compiling miniz_oxide v0.8.9
  269. 18.94 s [alphal00p-docs-cargo] Compiling toml v0.9.12+spec-1.1.0
  270. 19.01 s [alphal00p-docs-cargo] Compiling plotters v0.3.7
  271. 19.02 s [alphal00p-docs-cargo] Compiling ansi-str v0.9.0
  272. 19.04 s [alphal00p-docs-cargo] Compiling ndarray v0.17.2
  273. 19.04 s [alphal00p-docs-cargo] Compiling displaydoc v0.2.7
  274. 19.11 s [alphal00p-docs-cargo] Compiling smallvec v1.15.1
  275. 19.22 s [alphal00p-docs-cargo] Compiling bincode v2.0.1
  276. 19.25 s [alphal00p-docs-cargo] Compiling tracing-serde v0.2.0
  277. 19.35 s [alphal00p-docs-cargo] Compiling tracing-subscriber v0.3.23
  278. 19.42 s [alphal00p-docs-cargo] Compiling chrono v0.4.44
  279. 19.55 s [alphal00p-docs-cargo] Compiling parking_lot v0.12.5
  280. 19.59 s [alphal00p-docs-cargo] Compiling toml_datetime v0.6.11
  281. 19.69 s [alphal00p-docs-cargo] Compiling serde_spanned v0.6.9
  282. 19.76 s [alphal00p-docs-cargo] Compiling crossterm v0.28.1
  283. 19.77 s [alphal00p-docs-cargo] Compiling toml_edit v0.22.27
  284. 19.80 s [alphal00p-docs-cargo] Compiling xprec v0.2.2
  285. 19.81 s [alphal00p-docs-cargo] Compiling zerovec v0.11.8
  286. 19.83 s [alphal00p-docs-cargo] Compiling criterion-plot v0.5.0
  287. 19.92 s [alphal00p-docs-cargo] Compiling bincode-trait-derive v0.1.1
  288. 19.99 s [alphal00p-docs-cargo] Compiling tinytemplate v1.2.1
  289. 20.11 s [alphal00p-docs-cargo] Compiling ppv-lite86 v0.2.21
  290. 20.29 s [alphal00p-docs-cargo] Compiling half v2.7.1
  291. 20.34 s [alphal00p-docs-cargo] Compiling rand_chacha v0.3.1
  292. 20.40 s [alphal00p-docs-cargo] Compiling rand_chacha v0.9.0
  293. 20.52 s [alphal00p-docs-cargo] Compiling rand v0.8.6
  294. 20.53 s [alphal00p-docs-cargo] Compiling ciborium-ll v0.2.2
  295. 20.54 s [alphal00p-docs-cargo] Compiling is-terminal v0.4.17
  296. 20.59 s [alphal00p-docs-cargo] Compiling rand v0.9.4
  297. 20.65 s [alphal00p-docs-cargo] Compiling ciborium v0.2.2
  298. 20.67 s [alphal00p-docs-cargo] Compiling slotmap v1.1.1
  299. 20.70 s [alphal00p-docs-cargo] Compiling bytecount v0.6.9
  300. 20.70 s [alphal00p-docs-cargo] Compiling anes v0.1.6
  301. 20.73 s [alphal00p-docs-cargo] Compiling oorandom v11.1.5
  302. 20.75 s [alphal00p-docs-cargo] Compiling maplit v1.0.2
  303. 20.76 s [alphal00p-docs-cargo] Compiling papergrid v0.18.0
  304. 20.79 s [alphal00p-docs-cargo] Compiling tinystr v0.8.4
  305. 20.81 s [alphal00p-docs-cargo] Compiling pest_meta v2.8.6
  306. 20.86 s [alphal00p-docs-cargo] Compiling ron v0.12.1
  307. 20.93 s [alphal00p-docs-cargo] Compiling tempfile v3.27.0
  308. 20.97 s [alphal00p-docs-cargo] Compiling testing_table v0.3.0
  309. 21.02 s [alphal00p-docs-cargo] Compiling phf_generator v0.11.3
  310. 21.04 s [alphal00p-docs-cargo] Compiling symjit v2.25.6
  311. 21.06 s [alphal00p-docs-cargo] Compiling criterion v0.5.1
  312. 21.09 s [alphal00p-docs-cargo] Compiling tabled_derive v0.12.0
  313. 21.14 s [alphal00p-docs-cargo] Compiling phf_codegen v0.11.3
  314. 21.15 s [alphal00p-docs-cargo] Compiling toml v0.8.23
  315. 21.22 s [alphal00p-docs-cargo] Compiling unicode_names2_generator v1.3.0
  316. 21.24 s [alphal00p-docs-cargo] Compiling rustpython-parser v0.4.0
  317. 21.48 s [alphal00p-docs-cargo] Compiling toml_edit v0.25.11+spec-1.1.0
  318. 21.62 s [alphal00p-docs-cargo] Compiling similar v2.7.0
  319. 21.64 s [alphal00p-docs-cargo] Compiling pest_generator v2.8.6
  320. 21.68 s [alphal00p-docs-cargo] Compiling unic-langid-impl v0.9.6
  321. 21.76 s [alphal00p-docs-cargo] Compiling unicode_names2 v1.3.0
  322. 21.99 s [alphal00p-docs-cargo] Compiling proc-macro2-diagnostics v0.10.1
  323. 22.03 s [alphal00p-docs-cargo] Compiling proc-macro-error-attr v1.0.4
  324. 22.18 s [alphal00p-docs-cargo] Compiling insta v1.47.2
  325. 22.19 s [alphal00p-docs-cargo] Compiling tabled v0.22.0
  326. 22.20 s [alphal00p-docs-cargo] Compiling uncased v0.9.10
  327. 22.23 s [alphal00p-docs-cargo] Compiling slab v0.4.12
  328. 22.23 s [alphal00p-docs-cargo] Compiling strsim v0.10.0
  329. 22.39 s [alphal00p-docs-cargo] Compiling radium v0.7.0
  330. 22.45 s [alphal00p-docs-cargo] Compiling darling_core v0.14.4
  331. 22.51 s [alphal00p-docs-cargo] Compiling pest_derive v2.8.6
  332. 22.54 s [alphal00p-docs-cargo] Compiling darling_core v0.23.0
  333. 22.58 s [alphal00p-docs-cargo] Compiling figment v0.10.19
  334. 22.62 s [alphal00p-docs-cargo] Compiling proc-macro-error v1.0.4
  335. 22.76 s [alphal00p-docs-cargo] Compiling tap v1.0.1
  336. 22.82 s [alphal00p-docs-cargo] Compiling ryu v1.0.23
  337. 22.87 s [alphal00p-docs-cargo] Compiling wyz v0.5.1
  338. 23.05 s [alphal00p-docs-cargo] Compiling castaway v0.2.4
  339. 23.11 s [alphal00p-docs-cargo] Compiling funty v2.0.0
  340. 23.11 s [alphal00p-docs-cargo] Compiling shlex v1.3.0
  341. 23.12 s [alphal00p-docs-cargo] Compiling heck v0.4.1
  342. 23.13 s [alphal00p-docs-cargo] Compiling indoc v2.0.7
  343. 23.22 s [alphal00p-docs-cargo] Compiling instability v0.3.12
  344. 23.22 s [alphal00p-docs-cargo] Compiling find-msvc-tools v0.1.9
  345. 23.37 s [alphal00p-docs-cargo] Compiling bitvec v1.0.1
  346. 23.38 s [alphal00p-docs-cargo] Compiling cc v1.2.61
  347. 23.47 s [alphal00p-docs-cargo] Compiling duplicate v2.0.1
  348. 23.48 s [alphal00p-docs-cargo] Compiling compact_str v0.9.0
  349. 23.74 s [alphal00p-docs-cargo] Compiling dot-parser v0.5.1
  350. 23.91 s [alphal00p-docs-cargo] Compiling unicode-truncate v2.0.1
  351. 23.93 s [alphal00p-docs-cargo] Compiling darling_macro v0.14.4
  352. 23.98 s [alphal00p-docs-cargo] Compiling convert_case v0.10.0
  353. 24.10 s [alphal00p-docs-cargo] Compiling kasuari v0.4.12
  354. 24.16 s [alphal00p-docs-cargo] Compiling serde_repr v0.1.20
  355. 24.19 s [alphal00p-docs-cargo] Compiling env_filter v1.0.1
  356. 24.28 s [alphal00p-docs-cargo] Compiling num-iter v0.1.45
  357. 24.30 s [alphal00p-docs-cargo] Compiling lru v0.16.4
  358. 24.35 s [alphal00p-docs-cargo] Compiling convert_case v0.4.0
  359. 24.37 s [alphal00p-docs-cargo] Compiling ref-ops v0.2.5
  360. 24.38 s [alphal00p-docs-cargo] Compiling jiff v0.2.24
  361. 24.40 s [alphal00p-docs-cargo] Compiling ratatui-core v0.1.0
  362. 24.43 s [alphal00p-docs-cargo] Compiling num v0.4.3
  363. 24.46 s [alphal00p-docs-cargo] Compiling darling v0.14.4
  364. 24.47 s [alphal00p-docs-cargo] Compiling blake3 v1.8.5
  365. 24.48 s [alphal00p-docs-cargo] Compiling darling_macro v0.23.0
  366. 24.50 s [alphal00p-docs-cargo] Compiling derive_builder_core v0.11.2
  367. 24.56 s [alphal00p-docs-cargo] Compiling derive_more v0.99.20
  368. 24.57 s [alphal00p-docs-cargo] Compiling derive_more-impl v2.1.1
  369. 24.58 s [alphal00p-docs-cargo] Compiling duplicate v1.0.0
  370. 24.63 s [alphal00p-docs-cargo] Compiling enum-try-as-inner v0.1.1
  371. 24.70 s [alphal00p-docs-cargo] Compiling delegate v0.12.0
  372. 24.79 s [alphal00p-docs-cargo] Compiling rand_xoshiro v0.6.0
  373. 24.89 s [alphal00p-docs-cargo] Compiling features v0.10.0
  374. 24.91 s [alphal00p-docs-cargo] Compiling colored v2.2.0
  375. 24.93 s [alphal00p-docs-cargo] Compiling owo-colors v4.3.0
  376. 24.98 s [alphal00p-docs-cargo] Compiling portable-atomic v1.13.1
  377. 25.03 s [alphal00p-docs-cargo] Compiling darling v0.23.0
  378. 25.09 s [alphal00p-docs-cargo] Compiling constcat v0.5.1
  379. 25.12 s [alphal00p-docs-cargo] Compiling cfg_aliases v0.2.1
  380. 25.13 s [alphal00p-docs-cargo] Compiling object v0.37.3
  381. 25.14 s [alphal00p-docs-cargo] Compiling thiserror v1.0.69
  382. 25.17 s [alphal00p-docs-cargo] Compiling gat-lending-iterator v0.1.8
  383. 25.18 s [alphal00p-docs-cargo] Compiling litrs v1.0.0
  384. 25.27 s [alphal00p-docs-cargo] Compiling nix v0.31.2
  385. 25.29 s [alphal00p-docs-cargo] Compiling derive_builder_macro v0.11.2
  386. 25.32 s [alphal00p-docs-cargo] Compiling derive_more v2.1.1
  387. 25.36 s [alphal00p-docs-cargo] Compiling rand_distr v0.4.3
  388. 25.37 s [alphal00p-docs-cargo] Compiling simba v0.6.0
  389. 25.38 s [alphal00p-docs-cargo] Compiling phf_generator v0.13.1
  390. 25.43 s [alphal00p-docs-cargo] Compiling nalgebra-macros v0.1.0
  391. 25.44 s [alphal00p-docs-cargo] Compiling thiserror-impl v1.0.69
  392. 25.45 s [alphal00p-docs-cargo] Compiling line-clipping v0.3.7
  393. 25.48 s [alphal00p-docs-cargo] Compiling dirs v6.0.0
  394. 25.52 s [alphal00p-docs-cargo] Compiling document-features v0.2.12
  395. 25.53 s [alphal00p-docs-cargo] Compiling vte v0.15.0
  396. 25.57 s [alphal00p-docs-cargo] Compiling constant_time_eq v0.4.2
  397. 25.58 s [alphal00p-docs-cargo] Compiling ref-cast v1.0.25
  398. 25.63 s [alphal00p-docs-cargo] Compiling gimli v0.32.3
  399. 25.64 s [alphal00p-docs-cargo] Compiling color-spantrace v0.3.0
  400. 25.65 s [alphal00p-docs-cargo] Compiling clarabel v0.11.1
  401. 25.66 s [alphal00p-docs-cargo] Compiling joinery v2.1.0
  402. 25.69 s [alphal00p-docs-cargo] Compiling cpufeatures v0.3.0
  403. 25.71 s [alphal00p-docs-cargo] Compiling arrayref v0.3.9
  404. 25.73 s [alphal00p-docs-cargo] Compiling ratatui-widgets v0.3.0
  405. 25.76 s [alphal00p-docs-cargo] Compiling titlecase v2.2.1
  406. 25.79 s [alphal00p-docs-cargo] Compiling derive_builder v0.11.2
  407. 25.84 s [alphal00p-docs-cargo] Compiling vt100 v0.16.2
  408. 25.86 s [alphal00p-docs-cargo] Compiling phf_macros v0.13.1
  409. 25.95 s [alphal00p-docs-cargo] Compiling tracing-error v0.2.1
  410. 25.97 s [alphal00p-docs-cargo] Compiling crossterm v0.29.0
  411. 26.07 s [alphal00p-docs-cargo] Compiling serde-big-array v0.5.1
  412. 26.10 s [alphal00p-docs-cargo] Compiling ref-cast-impl v1.0.25
  413. 26.14 s [alphal00p-docs-cargo] Compiling delegate v0.13.5
  414. 26.22 s [alphal00p-docs-cargo] Compiling enum_dispatch v0.3.13
  415. 26.30 s [alphal00p-docs-cargo] Compiling serde_derive_internals v0.29.1
  416. 26.54 s [alphal00p-docs-cargo] Compiling amd v0.2.2
  417. 26.59 s [alphal00p-docs-cargo] Compiling subprocess v0.2.15
  418. 26.63 s [alphal00p-docs-cargo] Compiling rust_lisp v0.18.0
  419. 26.64 s [alphal00p-docs-cargo] Compiling vakint v0.1.2 (/build/source/crates/vakint)
  420. 26.70 s [alphal00p-docs-cargo] Compiling env_logger v0.11.10
  421. 26.74 s [alphal00p-docs-cargo] Compiling unit-prefix v0.5.2
  422. 26.75 s [alphal00p-docs-cargo] Compiling base64 v0.22.1
  423. 26.78 s [alphal00p-docs-cargo] Compiling rustc-demangle v0.1.27
  424. 26.81 s [alphal00p-docs-cargo] Compiling semver v1.0.28
  425. 26.83 s [alphal00p-docs-cargo] Compiling indicatif v0.18.4
  426. 26.90 s [alphal00p-docs-cargo] Compiling schemars_derive v1.2.1
  427. 26.92 s [alphal00p-docs-cargo] Compiling phf v0.13.1
  428. 26.94 s [alphal00p-docs-cargo] Compiling string-template-plus v0.4.3
  429. 27.00 s [alphal00p-docs-cargo] Compiling deprecate-until v1.0.0
  430. 27.03 s [alphal00p-docs-cargo] Compiling ratatui-crossterm v0.1.0
  431. 27.08 s [alphal00p-docs-cargo] Compiling ratatui-macros v0.7.0
  432. 27.12 s [alphal00p-docs-cargo] Compiling shellexpand v3.1.2
  433. 27.15 s [alphal00p-docs-cargo] Compiling xpct v0.5.1
  434. 27.17 s [alphal00p-docs-cargo] Compiling addr2line v0.25.1
  435. 27.21 s [alphal00p-docs-cargo] Compiling brotli-decompressor v4.0.3
  436. 27.26 s [alphal00p-docs-cargo] Compiling integer-sqrt v0.1.5
  437. 27.31 s [alphal00p-docs-cargo] Compiling crossbeam-channel v0.5.15
  438. 27.34 s [alphal00p-docs-cargo] Compiling itertools v0.12.1
  439. 27.40 s [alphal00p-docs-cargo] Compiling gammaloop-tracing-filter-macros v0.1.0 (/build/source/crates/gammaloop-tracing-filter-macros)
  440. 27.42 s [alphal00p-docs-cargo] Compiling include_dir_macros v0.7.4
  441. 27.44 s [alphal00p-docs-cargo] Compiling gammalooprs v0.3.4 (/build/source/crates/gammalooprs)
  442. 27.48 s [alphal00p-docs-cargo] Compiling symlink v0.1.0
  443. 27.50 s [alphal00p-docs-cargo] Compiling unsafe-libyaml v0.2.11
  444. 27.54 s [alphal00p-docs-cargo] Compiling version-compare v0.2.1
  445. 27.62 s [alphal00p-docs-cargo] Compiling tracing-appender v0.2.5
  446. 27.65 s [alphal00p-docs-cargo] Compiling ctrlc v3.5.2
  447. 27.65 s [alphal00p-docs-cargo] Compiling pathfinding v4.15.0
  448. 27.66 s [alphal00p-docs-cargo] Compiling rust-embed-impl v8.11.0
  449. 27.67 s [alphal00p-docs-cargo] Compiling tracing-indicatif v0.3.14
  450. 27.68 s [alphal00p-docs-cargo] Compiling ratatui v0.30.0
  451. 27.72 s [alphal00p-docs-cargo] Compiling json5 v0.4.1
  452. 27.80 s [alphal00p-docs-cargo] Compiling include_dir v0.7.4
  453. 27.82 s [alphal00p-docs-cargo] Compiling brotli v7.0.0
  454. 27.88 s [alphal00p-docs-cargo] Compiling strum_macros v0.26.4
  455. 27.91 s [alphal00p-docs-cargo] Compiling serde_yaml v0.9.34+deprecated
  456. 27.93 s [alphal00p-docs-cargo] Compiling typed-index-collections v3.5.0
  457. 27.94 s [alphal00p-docs-cargo] Compiling pyo3-stub-gen-derive v0.17.2
  458. 28.08 s [alphal00p-docs-cargo] Compiling nalgebra v0.29.0
  459. 28.09 s [alphal00p-docs-cargo] Compiling vectorize v0.2.0
  460. 28.13 s [alphal00p-docs-cargo] Compiling clap_complete v4.6.3
  461. 28.14 s [alphal00p-docs-cargo] Compiling fd-lock v4.0.4
  462. 28.19 s [alphal00p-docs-cargo] Compiling strip-ansi-escapes v0.2.1
  463. 28.22 s [alphal00p-docs-cargo] Compiling backtrace v0.3.76
  464. 28.23 s [alphal00p-docs-cargo] Compiling gammaloop-api v0.1.0 (/build/source/crates/gammaloop-api)
  465. 28.28 s [alphal00p-docs-cargo] Compiling itertools v0.13.0
  466. 28.33 s [alphal00p-docs-cargo] Compiling schemars v1.2.1
  467. 28.35 s [alphal00p-docs-cargo] Compiling strum v0.26.3
  468. 28.36 s [alphal00p-docs-cargo] Compiling base62 v2.2.4
  469. 28.38 s [alphal00p-docs-cargo] Compiling ringbuffer v0.16.0
  470. 28.44 s [alphal00p-docs-cargo] Compiling clap_complete_nushell v4.6.0
  471. 28.47 s [alphal00p-docs-cargo] Compiling sysinfo v0.33.1
  472. 28.62 s [alphal00p-docs-cargo] Compiling color-eyre v0.6.5
  473. 28.74 s [alphal00p-docs-cargo] Compiling rust-embed v8.11.0
  474. 29.24 s [alphal00p-docs-cargo] Compiling reedline v0.42.0
  475. 29.40 s [alphal00p-docs-cargo] Compiling pyo3-stub-gen v0.17.2
  476. 31.82 s [alphal00p-docs-cargo] Compiling statrs v0.16.1
  477. 32.20 s [alphal00p-docs-cargo] Compiling momtrop v0.3.0
  478. 95.83 s [alphal00p-docs-cargo] Compiling numerica v3.0.0 (https://github.com/symbolica-dev/symbolica?rev=4f1323185fe5e0c0f8c864ab89edd1905e7adef1#4f132318)
  479. 98.00 s [alphal00p-docs-cargo] Compiling graphica v3.0.0 (https://github.com/symbolica-dev/symbolica?rev=4f1323185fe5e0c0f8c864ab89edd1905e7adef1#4f132318)
  480. 114.58 s [alphal00p-docs-cargo] Compiling symbolica-utils v0.1.0 (/build/source/crates/symbolica-utils)
  481. 125.89 s [alphal00p-docs-cargo] Compiling gammaloop-workspace-hack v0.1.0 (/build/source/crates/gammaloop-workspace-hack)
  482. 125.89 s [alphal00p-docs-cargo] Compiling spenso-macros v0.3.2 (/build/source/crates/spenso-macros)
  483. 126.05 s [alphal00p-docs-cargo] Compiling linnet v0.17.0 (/build/source/crates/linnet)
  484. 128.37 s [alphal00p-docs-cargo] Compiling spenso v0.6.0 (/build/source/crates/spenso)
  485. 132.49 s [alphal00p-docs-cargo] Compiling idenso v0.3.0 (/build/source/crates/idenso)
  486. 132.49 s [alphal00p-docs-cargo] Compiling gammaloop-tracing-filter v0.1.0 (/build/source/crates/gammaloop-tracing-filter)
  487. 134.71 s [alphal00p-docs-cargo] Compiling spenso-hep-lib v0.1.7 (/build/source/crates/spenso-hep-lib)
  488. 197.20 s [alphal00p-docs-cargo] Compiling alphal00p-docs-python-exporter v0.1.0 (/build/source/crates/alphal00p-docs-python-exporter)
  489. 211.26 s [alphal00p-docs-cargo] Finished `docs` profile [unoptimized] target(s) in 3m 19s
  490. 211.31 s [alphal00p-docs-cargo] +++ command cargo build --profile docs --locked -p alphal00p-docs-python-exporter --features linnet
  491. 212.34 s [alphal00p-docs-cargo] Compiling libc v0.2.186
  492. 212.34 s [alphal00p-docs-cargo] Compiling serde_core v1.0.228
  493. 212.34 s [alphal00p-docs-cargo] Compiling zerocopy v0.8.48
  494. 212.34 s [alphal00p-docs-cargo] Compiling log v0.4.29
  495. 212.36 s [alphal00p-docs-cargo] Compiling num-traits v0.2.19
  496. 212.36 s [alphal00p-docs-cargo] Compiling syn v1.0.109
  497. 212.36 s [alphal00p-docs-cargo] Compiling syn v2.0.117
  498. 212.37 s [alphal00p-docs-cargo] Compiling ahash v0.7.8
  499. 212.37 s [alphal00p-docs-cargo] Compiling bytecheck v0.6.12
  500. 212.37 s [alphal00p-docs-cargo] Compiling regex-syntax v0.8.10
  501. 212.38 s [alphal00p-docs-cargo] Compiling simdutf8 v0.1.5
  502. 212.38 s [alphal00p-docs-cargo] Compiling rend v0.4.2
  503. 212.38 s [alphal00p-docs-cargo] Compiling indexmap v2.14.0
  504. 212.39 s [alphal00p-docs-cargo] Compiling ahash v0.8.12
  505. 212.39 s [alphal00p-docs-cargo] Compiling figment v0.10.19
  506. 212.39 s [alphal00p-docs-cargo] Compiling rkyv v0.7.46
  507. 212.45 s [alphal00p-docs-cargo] Compiling either v1.15.0
  508. 212.68 s [alphal00p-docs-cargo] Compiling cgmath v0.18.0
  509. 212.68 s [alphal00p-docs-cargo] Compiling itertools v0.11.0
  510. 212.68 s [alphal00p-docs-cargo] Compiling bincode v2.0.1
  511. 212.68 s [alphal00p-docs-cargo] Compiling pyo3 v0.28.3
  512. 212.68 s [alphal00p-docs-cargo] Compiling venial v0.5.0
  513. 212.69 s [alphal00p-docs-cargo] Compiling rustix v1.1.4
  514. 212.69 s [alphal00p-docs-cargo] Compiling seahash v4.1.0
  515. 212.70 s [alphal00p-docs-cargo] Compiling winnow v1.0.2
  516. 212.79 s [alphal00p-docs-cargo] Compiling arrayvec v0.7.6
  517. 212.84 s [alphal00p-docs-cargo] Compiling bitflags v2.11.1
  518. 212.93 s [alphal00p-docs-cargo] Compiling polycool v0.4.0
  519. 212.94 s [alphal00p-docs-cargo] Compiling toml_writer v1.1.1+spec-1.1.0
  520. 212.97 s [alphal00p-docs-cargo] Compiling toml_parser v1.1.2+spec-1.1.0
  521. 213.01 s [alphal00p-docs-cargo] Compiling winnow v0.7.15
  522. 213.03 s [alphal00p-docs-cargo] Compiling smallvec v1.15.1
  523. 213.11 s [alphal00p-docs-cargo] Compiling linnet-py v0.1.0 (/build/source/crates/linnet-py)
  524. 213.15 s [alphal00p-docs-cargo] Compiling kurbo v0.13.1
  525. 213.20 s [alphal00p-docs-cargo] Compiling num-integer v0.1.46
  526. 213.24 s [alphal00p-docs-cargo] Compiling regex-automata v0.4.14
  527. 213.26 s [alphal00p-docs-cargo] Compiling approx v0.4.0
  528. 213.33 s [alphal00p-docs-cargo] Compiling wasm-minimal-protocol v0.2.0
  529. 213.34 s [alphal00p-docs-cargo] Compiling num-complex v0.4.6
  530. 213.43 s [alphal00p-docs-cargo] Compiling chrono v0.4.44
  531. 213.50 s [alphal00p-docs-cargo] Compiling getrandom v0.2.17
  532. 213.52 s [alphal00p-docs-cargo] Compiling dirs-sys v0.5.0
  533. 213.62 s [alphal00p-docs-cargo] Compiling rand_core v0.6.4
  534. 213.67 s [alphal00p-docs-cargo] Compiling const-random-macro v0.1.16
  535. 213.78 s [alphal00p-docs-cargo] Compiling num-bigint v0.4.6
  536. 213.78 s [alphal00p-docs-cargo] Compiling hashbrown v0.12.3
  537. 213.79 s [alphal00p-docs-cargo] Compiling dirs v6.0.0
  538. 213.80 s [alphal00p-docs-cargo] Compiling pyo3-ffi v0.28.3
  539. 213.86 s [alphal00p-docs-cargo] Compiling shellexpand v3.1.2
  540. 213.87 s [alphal00p-docs-cargo] Compiling getrandom v0.4.2
  541. 214.01 s [alphal00p-docs-cargo] Compiling const-random v0.1.18
  542. 214.20 s [alphal00p-docs-cargo] Compiling toml_datetime v0.7.5+spec-1.1.0
  543. 214.20 s [alphal00p-docs-cargo] Compiling serde_spanned v1.1.1
  544. 214.20 s [alphal00p-docs-cargo] Compiling serde_json v1.0.149
  545. 214.23 s [alphal00p-docs-cargo] Compiling tempfile v3.27.0
  546. 214.33 s [alphal00p-docs-cargo] Compiling toml v0.9.12+spec-1.1.0
  547. 214.53 s [alphal00p-docs-cargo] Compiling ptr_meta_derive v0.1.4
  548. 214.53 s [alphal00p-docs-cargo] Compiling bytecheck_derive v0.6.12
  549. 214.53 s [alphal00p-docs-cargo] Compiling rkyv_derive v0.7.46
  550. 214.66 s [alphal00p-docs-cargo] Compiling globset v0.4.18
  551. 214.90 s [alphal00p-docs-cargo] Compiling ptr_meta v0.1.4
  552. 214.90 s [alphal00p-docs-cargo] Compiling rust-embed-utils v8.11.0
  553. 215.10 s [alphal00p-docs-cargo] Compiling pest_generator v2.8.6
  554. 215.10 s [alphal00p-docs-cargo] Compiling pyo3-macros-backend v0.28.3
  555. 215.10 s [alphal00p-docs-cargo] Compiling proc-macro2-diagnostics v0.10.1
  556. 215.41 s [alphal00p-docs-cargo] Compiling zerocopy-derive v0.8.48
  557. 215.41 s [alphal00p-docs-cargo] Compiling serde_derive v1.0.228
  558. 215.41 s [alphal00p-docs-cargo] Compiling is-macro v0.3.7
  559. 215.41 s [alphal00p-docs-cargo] Compiling thiserror-impl v2.0.18
  560. 215.41 s [alphal00p-docs-cargo] Compiling bincode-trait-derive v0.1.1
  561. 215.41 s [alphal00p-docs-cargo] Compiling duplicate v2.0.1
  562. 215.41 s [alphal00p-docs-cargo] Compiling serde_repr v0.1.20
  563. 215.41 s [alphal00p-docs-cargo] Compiling rust-embed-impl v8.11.0
  564. 215.50 s [alphal00p-docs-cargo] Compiling pest_derive v2.8.6
  565. 215.69 s [alphal00p-docs-cargo] Compiling ppv-lite86 v0.2.21
  566. 215.91 s [alphal00p-docs-cargo] Compiling rand_chacha v0.3.1
  567. 216.02 s [alphal00p-docs-cargo] Compiling rustpython-parser-core v0.4.0
  568. 216.04 s [alphal00p-docs-cargo] Compiling rand v0.8.6
  569. 216.04 s [alphal00p-docs-cargo] Compiling dot-parser v0.5.1
  570. 216.09 s [alphal00p-docs-cargo] Compiling rustpython-ast v0.4.0
  571. 216.34 s [alphal00p-docs-cargo] Compiling thiserror v2.0.18
  572. 216.37 s [alphal00p-docs-cargo] Compiling rust-embed v8.11.0
  573. 216.46 s [alphal00p-docs-cargo] Compiling phf_generator v0.11.3
  574. 216.52 s [alphal00p-docs-cargo] Compiling phf_codegen v0.11.3
  575. 216.56 s [alphal00p-docs-cargo] Compiling unicode_names2_generator v1.3.0
  576. 216.57 s [alphal00p-docs-cargo] Compiling rustpython-parser v0.4.0
  577. 216.82 s [alphal00p-docs-cargo] Compiling unicode_names2 v1.3.0
  578. 217.17 s [alphal00p-docs-cargo] Compiling serde v1.0.228
  579. 217.21 s [alphal00p-docs-cargo] Compiling pyo3-macros v0.28.3
  580. 217.47 s [alphal00p-docs-cargo] Compiling bitvec v1.0.1
  581. 218.86 s [alphal00p-docs-cargo] Compiling half v2.7.1
  582. 219.01 s [alphal00p-docs-cargo] Compiling ciborium-ll v0.2.2
  583. 219.09 s [alphal00p-docs-cargo] Compiling ciborium v0.2.2
  584. 219.43 s [alphal00p-docs-cargo] Compiling kurvst v0.1.0 (/build/source/crates/kurvst)
  585. 220.28 s [alphal00p-docs-cargo] Compiling linnet v0.17.0 (/build/source/crates/linnet)
  586. 221.52 s [alphal00p-docs-cargo] Compiling pyo3-stub-gen-derive v0.17.2
  587. 222.56 s [alphal00p-docs-cargo] Compiling pyo3-stub-gen v0.17.2
  588. 223.72 s [alphal00p-docs-cargo] Compiling linnest v0.1.0 (/build/source/crates/linnest)
  589. 233.41 s [alphal00p-docs-cargo] Compiling alphal00p-docs-python-exporter v0.1.0 (/build/source/crates/alphal00p-docs-python-exporter)
  590. 234.32 s [alphal00p-docs-cargo] Finished `docs` profile [unoptimized] target(s) in 23.00s
  591. 234.36 s [alphal00p-docs-cargo] +++ command cargo build --profile docs --locked -p alphal00p-docs-python-exporter --features spenso
  592. 234.69 s [alphal00p-docs-cargo] Compiling pyo3-build-config v0.28.3
  593. 234.70 s [alphal00p-docs-cargo] Compiling symbolica v2.2.0 (https://github.com/symbolica-dev/symbolica?rev=4f1323185fe5e0c0f8c864ab89edd1905e7adef1#4f132318)
  594. 234.70 s [alphal00p-docs-cargo] Compiling syn v1.0.109
  595. 234.71 s [alphal00p-docs-cargo] Compiling figment v0.10.19
  596. 235.08 s [alphal00p-docs-cargo] Compiling proc-macro-error v1.0.4
  597. 235.19 s [alphal00p-docs-cargo] Compiling duplicate v1.0.0
  598. 235.34 s [alphal00p-docs-cargo] Compiling pyo3-macros-backend v0.28.3
  599. 235.34 s [alphal00p-docs-cargo] Compiling numpy v0.28.0
  600. 235.34 s [alphal00p-docs-cargo] Compiling pyo3-ffi v0.28.3
  601. 235.34 s [alphal00p-docs-cargo] Compiling pyo3 v0.28.3
  602. 236.98 s [alphal00p-docs-cargo] Compiling pyo3-macros v0.28.3
  603. 239.57 s [alphal00p-docs-cargo] Compiling pyo3-stub-gen v0.17.2
  604. 240.10 s [alphal00p-docs-cargo] Compiling numerica v3.0.0 (https://github.com/symbolica-dev/symbolica?rev=4f1323185fe5e0c0f8c864ab89edd1905e7adef1#4f132318)
  605. 240.25 s [alphal00p-docs-cargo] Compiling gammaloop-workspace-hack v0.1.0 (/build/source/crates/gammaloop-workspace-hack)
  606. 242.82 s [alphal00p-docs-cargo] Compiling graphica v3.0.0 (https://github.com/symbolica-dev/symbolica?rev=4f1323185fe5e0c0f8c864ab89edd1905e7adef1#4f132318)
  607. 287.74 s [alphal00p-docs-cargo] Compiling symbolica-utils v0.1.0 (/build/source/crates/symbolica-utils)
  608. 287.74 s [alphal00p-docs-cargo] Compiling tymbolica-atom-payload v0.1.0 (https://github.com/lcnbr/tymbolica?rev=32ae00483b4845161401afac8be755cc336cb2bb#32ae0048)
  609. 288.71 s [alphal00p-docs-cargo] Compiling linnet v0.17.0 (/build/source/crates/linnet)
  610. 295.53 s [alphal00p-docs-cargo] Compiling spenso v0.6.0 (/build/source/crates/spenso)
  611. 316.85 s [alphal00p-docs-cargo] Compiling idenso v0.3.0 (/build/source/crates/idenso)
  612. 326.44 s [alphal00p-docs-cargo] Compiling spenso-hep-lib v0.1.7 (/build/source/crates/spenso-hep-lib)
  613. 327.30 s [alphal00p-docs-cargo] Compiling spynso3 v0.1.2 (/build/source/crates/spynso3)
  614. 340.30 s [alphal00p-docs-cargo] Compiling alphal00p-docs-python-exporter v0.1.0 (/build/source/crates/alphal00p-docs-python-exporter)
  615. 357.06 s [alphal00p-docs-cargo] Finished `docs` profile [unoptimized] target(s) in 2m 02s
  616. 357.20 s [alphal00p-docs-cargo] +++ command cargo build --profile docs --locked -p alphal00p-docs-python-exporter --features idenso
  617. 359.85 s [alphal00p-docs-cargo] Compiling pyo3 v0.28.3
  618. 364.19 s [alphal00p-docs-cargo] Compiling numpy v0.28.0
  619. 365.50 s [alphal00p-docs-cargo] Compiling pyo3-stub-gen v0.17.2
  620. 366.68 s [alphal00p-docs-cargo] Compiling numerica v3.0.0 (https://github.com/symbolica-dev/symbolica?rev=4f1323185fe5e0c0f8c864ab89edd1905e7adef1#4f132318)
  621. 373.42 s [alphal00p-docs-cargo] Compiling graphica v3.0.0 (https://github.com/symbolica-dev/symbolica?rev=4f1323185fe5e0c0f8c864ab89edd1905e7adef1#4f132318)
  622. 374.56 s [alphal00p-docs-cargo] Compiling symbolica v2.2.0 (https://github.com/symbolica-dev/symbolica?rev=4f1323185fe5e0c0f8c864ab89edd1905e7adef1#4f132318)
  623. 436.75 s [alphal00p-docs-cargo] Compiling gammaloop-workspace-hack v0.1.0 (/build/source/crates/gammaloop-workspace-hack)
  624. 436.75 s [alphal00p-docs-cargo] Compiling symbolica-utils v0.1.0 (/build/source/crates/symbolica-utils)
  625. 437.40 s [alphal00p-docs-cargo] Compiling linnet v0.17.0 (/build/source/crates/linnet)
  626. 442.34 s [alphal00p-docs-cargo] Compiling spenso v0.6.0 (/build/source/crates/spenso)
  627. 453.22 s [alphal00p-docs-cargo] Compiling idenso v0.3.0 (/build/source/crates/idenso)
  628. 464.31 s [alphal00p-docs-cargo] Compiling alphal00p-docs-python-exporter v0.1.0 (/build/source/crates/alphal00p-docs-python-exporter)
  629. 478.99 s [alphal00p-docs-cargo] Finished `docs` profile [unoptimized] target(s) in 2m 01s
  630. 479.10 s [alphal00p-docs-cargo] +++ command cargo build --profile docs --locked -p alphal00p-docs-python-exporter --features vakint
  631. 479.71 s [alphal00p-docs-cargo] Compiling libc v0.2.186
  632. 479.72 s [alphal00p-docs-cargo] Compiling tiny-keccak v2.0.2
  633. 479.72 s [alphal00p-docs-cargo] Compiling bytemuck v1.25.0
  634. 479.73 s [alphal00p-docs-cargo] Compiling matrixmultiply v0.3.10
  635. 479.74 s [alphal00p-docs-cargo] Compiling getrandom v0.3.4
  636. 479.74 s [alphal00p-docs-cargo] Compiling num-integer v0.1.46
  637. 479.76 s [alphal00p-docs-cargo] Compiling pyo3 v0.28.3
  638. 479.76 s [alphal00p-docs-cargo] Compiling regex-automata v0.4.14
  639. 479.76 s [alphal00p-docs-cargo] Compiling pyo3-macros-backend v0.28.3
  640. 479.76 s [alphal00p-docs-cargo] Compiling pyo3-ffi v0.28.3
  641. 479.76 s [alphal00p-docs-cargo] Compiling ahash v0.8.12
  642. 479.76 s [alphal00p-docs-cargo] Compiling approx v0.5.1
  643. 479.83 s [alphal00p-docs-cargo] Compiling serde v1.0.228
  644. 479.83 s [alphal00p-docs-cargo] Compiling itertools v0.14.0
  645. 479.83 s [alphal00p-docs-cargo] Compiling gmp-mpfr-sys v1.7.1
  646. 479.83 s [alphal00p-docs-cargo] Compiling smallvec v1.15.1
  647. 479.99 s [alphal00p-docs-cargo] Compiling rayon v1.12.0
  648. 480.07 s [alphal00p-docs-cargo] Compiling safe_arch v0.7.4
  649. 480.20 s [alphal00p-docs-cargo] Compiling safe_arch v1.2.0
  650. 480.39 s [alphal00p-docs-cargo] Compiling tracing-attributes v0.1.31
  651. 480.44 s [alphal00p-docs-cargo] Compiling smartstring v1.0.1
  652. 480.58 s [alphal00p-docs-cargo] Compiling rand_core v0.9.5
  653. 480.70 s [alphal00p-docs-cargo] Compiling phf_shared v0.13.1
  654. 480.89 s [alphal00p-docs-cargo] Compiling fastrand v2.4.1
  655. 480.97 s [alphal00p-docs-cargo] Compiling rand_chacha v0.9.0
  656. 481.17 s [alphal00p-docs-cargo] Compiling wide v1.7.0
  657. 481.32 s [alphal00p-docs-cargo] Compiling rug v1.30.0
  658. 481.40 s [alphal00p-docs-cargo] Compiling symbolica v2.2.0 (https://github.com/symbolica-dev/symbolica?rev=4f1323185fe5e0c0f8c864ab89edd1905e7adef1#4f132318)
  659. 481.51 s [alphal00p-docs-cargo] Compiling wide v0.7.33
  660. 481.56 s [alphal00p-docs-cargo] Compiling rand v0.9.4
  661. 481.65 s [alphal00p-docs-cargo] Compiling ndarray v0.17.2
  662. 482.04 s [alphal00p-docs-cargo] Compiling phf_generator v0.13.1
  663. 482.27 s [alphal00p-docs-cargo] Compiling directories v6.0.0
  664. 482.32 s [alphal00p-docs-cargo] Compiling subprocess v0.2.15
  665. 482.39 s [alphal00p-docs-cargo] Compiling phf_macros v0.13.1
  666. 482.44 s [alphal00p-docs-cargo] Compiling vakint v0.1.2 (/build/source/crates/vakint)
  667. 483.02 s [alphal00p-docs-cargo] Compiling getrandom v0.2.17
  668. 483.40 s [alphal00p-docs-cargo] Compiling rand_core v0.6.4
  669. 483.69 s [alphal00p-docs-cargo] Compiling rand_chacha v0.3.1
  670. 484.01 s [alphal00p-docs-cargo] Compiling phf v0.13.1
  671. 484.13 s [alphal00p-docs-cargo] Compiling rand v0.8.6
  672. 484.15 s [alphal00p-docs-cargo] Compiling simba v0.9.1
  673. 484.39 s [alphal00p-docs-cargo] Compiling tracing v0.1.44
  674. 484.94 s [alphal00p-docs-cargo] Compiling phf_generator v0.11.3
  675. 485.07 s [alphal00p-docs-cargo] Compiling phf_codegen v0.11.3
  676. 485.15 s [alphal00p-docs-cargo] Compiling unicode_names2_generator v1.3.0
  677. 485.17 s [alphal00p-docs-cargo] Compiling rustpython-parser v0.4.0
  678. 485.72 s [alphal00p-docs-cargo] Compiling unicode_names2 v1.3.0
  679. 485.76 s [alphal00p-docs-cargo] Compiling regex v1.12.3
  680. 485.76 s [alphal00p-docs-cargo] Compiling matchers v0.2.0
  681. 485.89 s [alphal00p-docs-cargo] Compiling tracing-subscriber v0.3.23
  682. 486.39 s [alphal00p-docs-cargo] Compiling titlecase v2.2.1
  683. 486.67 s [alphal00p-docs-cargo] Compiling string-template-plus v0.4.3
  684. 486.81 s [alphal00p-docs-cargo] Compiling pyo3-macros v0.28.3
  685. 489.83 s [alphal00p-docs-cargo] Compiling xprec v0.2.2
  686. 491.96 s [alphal00p-docs-cargo] Compiling numpy v0.28.0
  687. 494.86 s [alphal00p-docs-cargo] Compiling pyo3-stub-gen-derive v0.17.2
  688. 497.33 s [alphal00p-docs-cargo] Compiling pyo3-stub-gen v0.17.2
  689. 498.51 s [alphal00p-docs-cargo] Compiling numerica v3.0.0 (https://github.com/symbolica-dev/symbolica?rev=4f1323185fe5e0c0f8c864ab89edd1905e7adef1#4f132318)
  690. 498.69 s [alphal00p-docs-cargo] error: select an integer backend: `integer-gmp` or `integer-malachite`
  691. 498.69 s [alphal00p-docs-cargo] --> /nix/store/9rqk4093qnvgswmdk1pbxk9najcrjn7a-vendor-cargo-deps/bc87b2b0f37b9a43ffdd82e8f11f3e864d9447ccd53a9a964250c3414c3656d9/numerica-3.0.0/src/lib.rs:40:1
  692. 498.69 s [alphal00p-docs-cargo] |
  693. 498.69 s [alphal00p-docs-cargo] 40 | compile_error!("select an integer backend: `integer-gmp` or `integer-malachite`");
  694. 498.69 s [alphal00p-docs-cargo] | ^^^^^^^^^^^^^^^^^^^^^^^^^^^^^^^^^^^^^^^^^^^^^^^^^^^^^^^^^^^^^^^^^^^^^^^^^^^^^^^^^
  695. 498.69 s [alphal00p-docs-cargo]
  696. 498.69 s [alphal00p-docs-cargo] error: select a float backend: `float-mpfr` or `float-astro`
  697. 498.69 s [alphal00p-docs-cargo] --> /nix/store/9rqk4093qnvgswmdk1pbxk9najcrjn7a-vendor-cargo-deps/bc87b2b0f37b9a43ffdd82e8f11f3e864d9447ccd53a9a964250c3414c3656d9/numerica-3.0.0/src/lib.rs:44:1
  698. 498.69 s [alphal00p-docs-cargo] |
  699. 498.69 s [alphal00p-docs-cargo] 44 | compile_error!("select a float backend: `float-mpfr` or `float-astro`");
  700. 498.69 s [alphal00p-docs-cargo] | ^^^^^^^^^^^^^^^^^^^^^^^^^^^^^^^^^^^^^^^^^^^^^^^^^^^^^^^^^^^^^^^^^^^^^^^
  701. 498.69 s [alphal00p-docs-cargo]
  702. 499.02 s [alphal00p-docs-cargo] error[E0432]: unresolved import `implementation::BackendRandState`
  703. 499.02 s [alphal00p-docs-cargo] --> /nix/store/9rqk4093qnvgswmdk1pbxk9najcrjn7a-vendor-cargo-deps/bc87b2b0f37b9a43ffdd82e8f11f3e864d9447ccd53a9a964250c3414c3656d9/numerica-3.0.0/src/domains/backend/integer.rs:1614:33
  704. 499.02 s [alphal00p-docs-cargo] |
  705. 499.02 s [alphal00p-docs-cargo] 1614 | pub(crate) use implementation::{BackendRandState, Complete, RemRounding};
  706. 499.02 s [alphal00p-docs-cargo] | ^^^^^^^^^^^^^^^^ no `BackendRandState` in `domains::backend::integer::implementation`
  707. 499.02 s [alphal00p-docs-cargo] |
  708. 499.02 s [alphal00p-docs-cargo] note: found an item that was configured out
  709. 499.02 s [alphal00p-docs-cargo] --> /nix/store/9rqk4093qnvgswmdk1pbxk9najcrjn7a-vendor-cargo-deps/bc87b2b0f37b9a43ffdd82e8f11f3e864d9447ccd53a9a964250c3414c3656d9/numerica-3.0.0/src/domains/backend/integer.rs:1378:23
  710. 499.02 s [alphal00p-docs-cargo] |
  711. 499.02 s [alphal00p-docs-cargo] 1377 | #[cfg(feature = "integer-malachite")]
  712. 499.02 s [alphal00p-docs-cargo] | ----------------------------- the item is gated behind the `integer-malachite` feature
  713. 499.02 s [alphal00p-docs-cargo] 1378 | pub(crate) struct BackendRandState {
  714. 499.02 s [alphal00p-docs-cargo] | ^^^^^^^^^^^^^^^^
  715. 499.02 s [alphal00p-docs-cargo] note: found an item that was configured out
  716. 499.02 s [alphal00p-docs-cargo] --> /nix/store/9rqk4093qnvgswmdk1pbxk9najcrjn7a-vendor-cargo-deps/bc87b2b0f37b9a43ffdd82e8f11f3e864d9447ccd53a9a964250c3414c3656d9/numerica-3.0.0/src/domains/backend/integer.rs:1413:23
  717. 499.02 s [alphal00p-docs-cargo] |
  718. 499.02 s [alphal00p-docs-cargo] 1412 | #[cfg(feature = "integer-gmp")]
  719. 499.02 s [alphal00p-docs-cargo] | ----------------------- the item is gated behind the `integer-gmp` feature
  720. 499.02 s [alphal00p-docs-cargo] 1413 | pub(crate) struct BackendRandState(rug::rand::RandState<'static>);
  721. 499.02 s [alphal00p-docs-cargo] | ^^^^^^^^^^^^^^^^
  722. 499.02 s [alphal00p-docs-cargo]
  723. 499.02 s [alphal00p-docs-cargo] error[E0432]: unresolved import `implementation::RawMultiPrecisionInteger`
  724. 499.02 s [alphal00p-docs-cargo] --> /nix/store/9rqk4093qnvgswmdk1pbxk9najcrjn7a-vendor-cargo-deps/bc87b2b0f37b9a43ffdd82e8f11f3e864d9447ccd53a9a964250c3414c3656d9/numerica-3.0.0/src/domains/backend/integer.rs:1616:61
  725. 499.02 s [alphal00p-docs-cargo] |
  726. 499.02 s [alphal00p-docs-cargo] 1616 | MultiPrecisionInteger, ParseMultiPrecisionIntegerError, RawMultiPrecisionInteger,
  727. 499.02 s [alphal00p-docs-cargo] | ^^^^^^^^^^^^^^^^^^^^^^^^ no `RawMultiPrecisionInteger` in `domains::backend::integer::implementation`
  728. 499.02 s [alphal00p-docs-cargo] |
  729. 499.02 s [alphal00p-docs-cargo] note: found an item that was configured out
  730. 499.02 s [alphal00p-docs-cargo] --> /nix/store/9rqk4093qnvgswmdk1pbxk9najcrjn7a-vendor-cargo-deps/bc87b2b0f37b9a43ffdd82e8f11f3e864d9447ccd53a9a964250c3414c3656d9/numerica-3.0.0/src/domains/backend/integer.rs:26:14
  731. 499.02 s [alphal00p-docs-cargo] |
  732. 499.02 s [alphal00p-docs-cargo] 25 | #[cfg(feature = "integer-malachite")]
  733. 499.02 s [alphal00p-docs-cargo] | ----------------------------- the item is gated behind the `integer-malachite` feature
  734. 499.02 s [alphal00p-docs-cargo] 26 | pub type RawMultiPrecisionInteger = malachite_nz::integer::Integer;
  735. 499.02 s [alphal00p-docs-cargo] | ^^^^^^^^^^^^^^^^^^^^^^^^
  736. 499.02 s [alphal00p-docs-cargo] note: found an item that was configured out
  737. 499.02 s [alphal00p-docs-cargo] --> /nix/store/9rqk4093qnvgswmdk1pbxk9najcrjn7a-vendor-cargo-deps/bc87b2b0f37b9a43ffdd82e8f11f3e864d9447ccd53a9a964250c3414c3656d9/numerica-3.0.0/src/domains/backend/integer.rs:29:14
  738. 499.02 s [alphal00p-docs-cargo] |
  739. 499.02 s [alphal00p-docs-cargo] 28 | #[cfg(feature = "integer-gmp")]
  740. 499.02 s [alphal00p-docs-cargo] | ----------------------- the item is gated behind the `integer-gmp` feature
  741. 499.02 s [alphal00p-docs-cargo] 29 | pub type RawMultiPrecisionInteger = rug::Integer;
  742. 499.02 s [alphal00p-docs-cargo] | ^^^^^^^^^^^^^^^^^^^^^^^^
  743. 499.02 s [alphal00p-docs-cargo] help: a similar name exists in the module
  744. 499.02 s [alphal00p-docs-cargo] |
  745. 499.02 s [alphal00p-docs-cargo] 1616 - MultiPrecisionInteger, ParseMultiPrecisionIntegerError, RawMultiPrecisionInteger,
  746. 499.02 s [alphal00p-docs-cargo] 1616 + MultiPrecisionInteger, ParseMultiPrecisionIntegerError, MultiPrecisionInteger,
  747. 499.02 s [alphal00p-docs-cargo] |
  748. 499.02 s [alphal00p-docs-cargo]
  749. 499.03 s [alphal00p-docs-cargo] error[E0432]: unresolved imports `implementation::from_be_bytes`, `implementation::to_be_bytes`
  750. 499.03 s [alphal00p-docs-cargo] --> /nix/store/9rqk4093qnvgswmdk1pbxk9najcrjn7a-vendor-cargo-deps/bc87b2b0f37b9a43ffdd82e8f11f3e864d9447ccd53a9a964250c3414c3656d9/numerica-3.0.0/src/domains/backend/integer.rs:1709:33
  751. 499.03 s [alphal00p-docs-cargo] |
  752. 499.03 s [alphal00p-docs-cargo] 1709 | pub(crate) use implementation::{from_be_bytes, to_be_bytes};
  753. 499.03 s [alphal00p-docs-cargo] | ^^^^^^^^^^^^^ ^^^^^^^^^^^ no `to_be_bytes` in `domains::backend::integer::implementation`
  754. 499.03 s [alphal00p-docs-cargo] | |
  755. 499.03 s [alphal00p-docs-cargo] | no `from_be_bytes` in `domains::backend::integer::implementation`
  756. 499.03 s [alphal00p-docs-cargo] |
  757. 499.03 s [alphal00p-docs-cargo] note: found an item that was configured out
  758. 499.03 s [alphal00p-docs-cargo] --> /nix/store/9rqk4093qnvgswmdk1pbxk9najcrjn7a-vendor-cargo-deps/bc87b2b0f37b9a43ffdd82e8f11f3e864d9447ccd53a9a964250c3414c3656d9/numerica-3.0.0/src/domains/backend/integer.rs:1370:19
  759. 499.03 s [alphal00p-docs-cargo] |
  760. 499.03 s [alphal00p-docs-cargo] 1369 | #[cfg(all(feature = "integer-malachite", feature = "bincode"))]
  761. 499.03 s [alphal00p-docs-cargo] | ----------------------------- the item is gated behind the `integer-malachite` feature
  762. 499.03 s [alphal00p-docs-cargo] 1370 | pub(crate) fn from_be_bytes(bytes: &[u8]) -> Result<MultiPrecisionInteger, &'static str> {
  763. 499.03 s [alphal00p-docs-cargo] | ^^^^^^^^^^^^^
  764. 499.03 s [alphal00p-docs-cargo] note: found an item that was configured out
  765. 499.03 s [alphal00p-docs-cargo] --> /nix/store/9rqk4093qnvgswmdk1pbxk9najcrjn7a-vendor-cargo-deps/bc87b2b0f37b9a43ffdd82e8f11f3e864d9447ccd53a9a964250c3414c3656d9/numerica-3.0.0/src/domains/backend/integer.rs:1405:19
  766. 499.03 s [alphal00p-docs-cargo] |
  767. 499.03 s [alphal00p-docs-cargo] 1404 | #[cfg(all(feature = "integer-gmp", feature = "bincode"))]
  768. 499.03 s [alphal00p-docs-cargo] | ----------------------- the item is gated behind the `integer-gmp` feature
  769. 499.03 s [alphal00p-docs-cargo] 1405 | pub(crate) fn from_be_bytes(bytes: &[u8]) -> Result<MultiPrecisionInteger, &'static str> {
  770. 499.03 s [alphal00p-docs-cargo] | ^^^^^^^^^^^^^
  771. 499.03 s [alphal00p-docs-cargo] note: found an item that was configured out
  772. 499.03 s [alphal00p-docs-cargo] --> /nix/store/9rqk4093qnvgswmdk1pbxk9najcrjn7a-vendor-cargo-deps/bc87b2b0f37b9a43ffdd82e8f11f3e864d9447ccd53a9a964250c3414c3656d9/numerica-3.0.0/src/domains/backend/integer.rs:1365:19
  773. 499.03 s [alphal00p-docs-cargo] |
  774. 499.03 s [alphal00p-docs-cargo] 1364 | #[cfg(all(feature = "integer-malachite", feature = "bincode"))]
  775. 499.03 s [alphal00p-docs-cargo] | ----------------------------- the item is gated behind the `integer-malachite` feature
  776. 499.03 s [alphal00p-docs-cargo] 1365 | pub(crate) fn to_be_bytes(value: &MultiPrecisionInteger) -> Vec<u8> {
  777. 499.03 s [alphal00p-docs-cargo] | ^^^^^^^^^^^
  778. 499.03 s [alphal00p-docs-cargo] note: found an item that was configured out
  779. 499.03 s [alphal00p-docs-cargo] --> /nix/store/9rqk4093qnvgswmdk1pbxk9najcrjn7a-vendor-cargo-deps/bc87b2b0f37b9a43ffdd82e8f11f3e864d9447ccd53a9a964250c3414c3656d9/numerica-3.0.0/src/domains/backend/integer.rs:1400:19
  780. 499.03 s [alphal00p-docs-cargo] |
  781. 499.03 s [alphal00p-docs-cargo] 1399 | #[cfg(all(feature = "integer-gmp", feature = "bincode"))]
  782. 499.03 s [alphal00p-docs-cargo] | ----------------------- the item is gated behind the `integer-gmp` feature
  783. 499.03 s [alphal00p-docs-cargo] 1400 | pub(crate) fn to_be_bytes(value: &MultiPrecisionInteger) -> Vec<u8> {
  784. 499.03 s [alphal00p-docs-cargo] | ^^^^^^^^^^^
  785. 499.03 s [alphal00p-docs-cargo]
  786. 499.04 s [alphal00p-docs-cargo] error[E0432]: unresolved imports `crate::domains::backend::float::Assign`, `crate::domains::backend::float::CompleteRound`, `crate::domains::backend::float::Constant`, `crate::domains::backend::float::MultiPrecisionFloat`, `crate::domains::backend::float::Pow`
  787. 499.05 s [alphal00p-docs-cargo] --> /nix/store/9rqk4093qnvgswmdk1pbxk9najcrjn7a-vendor-cargo-deps/bc87b2b0f37b9a43ffdd82e8f11f3e864d9447ccd53a9a964250c3414c3656d9/numerica-3.0.0/src/domains/float/multiprecision.rs:15:9
  788. 499.05 s [alphal00p-docs-cargo] |
  789. 499.05 s [alphal00p-docs-cargo] 15 | Assign, CompleteRound, Constant, MultiPrecisionFloat, MultiPrecisionFloatInteger,
  790. 499.05 s [alphal00p-docs-cargo] | ^^^^^^ ^^^^^^^^^^^^^ ^^^^^^^^ ^^^^^^^^^^^^^^^^^^^ no `MultiPrecisionFloat` in `domains::backend::float`
  791. 499.05 s [alphal00p-docs-cargo] | | | |
  792. 499.05 s [alphal00p-docs-cargo] | | | no `Constant` in `domains::backend::float`
  793. 499.05 s [alphal00p-docs-cargo] | | no `CompleteRound` in `domains::backend::float`
  794. 499.05 s [alphal00p-docs-cargo] | no `Assign` in `domains::backend::float`
  795. 499.05 s [alphal00p-docs-cargo] 16 | MultiPrecisionFloatRational, MultiPrecisionFloatRounding, Pow, RoundingDirection,
  796. 499.05 s [alphal00p-docs-cargo] | ^^^ no `Pow` in `domains::backend::float`
  797. 499.05 s [alphal00p-docs-cargo] |
  798. 499.05 s [alphal00p-docs-cargo] note: found an item that was configured out
  799. 499.05 s [alphal00p-docs-cargo] --> /nix/store/9rqk4093qnvgswmdk1pbxk9najcrjn7a-vendor-cargo-deps/bc87b2b0f37b9a43ffdd82e8f11f3e864d9447ccd53a9a964250c3414c3656d9/numerica-3.0.0/src/domains/backend/float.rs:17:5
  800. 499.05 s [alphal00p-docs-cargo] |
  801. 499.05 s [alphal00p-docs-cargo] 15 | #[cfg(feature = "float-mpfr")]
  802. 499.05 s [alphal00p-docs-cargo] | ---------------------- the item is gated behind the `float-mpfr` feature
  803. 499.05 s [alphal00p-docs-cargo] 16 | pub use rug::{
  804. 499.05 s [alphal00p-docs-cargo] 17 | Assign, Float as MultiPrecisionFloat, Rational as BackendRational,
  805. 499.05 s [alphal00p-docs-cargo] | ^^^^^^
  806. 499.05 s [alphal00p-docs-cargo] note: found an item that was configured out
  807. 499.05 s [alphal00p-docs-cargo] --> /nix/store/9rqk4093qnvgswmdk1pbxk9najcrjn7a-vendor-cargo-deps/bc87b2b0f37b9a43ffdd82e8f11f3e864d9447ccd53a9a964250c3414c3656d9/numerica-3.0.0/src/domains/backend/float.rs:1578:5
  808. 499.05 s [alphal00p-docs-cargo] |
  809. 499.05 s [alphal00p-docs-cargo] 1576 | #[cfg(feature = "float-astro")]
  810. 499.05 s [alphal00p-docs-cargo] | ----------------------- the item is gated behind the `float-astro` feature
  811. 499.05 s [alphal00p-docs-cargo] 1577 | pub use astro::{
  812. 499.05 s [alphal00p-docs-cargo] 1578 | Assign, BackendRational, CompleteRound, Constant, IntoMultiPrecisionFloat, MultiPrecisionFloat,
  813. 499.05 s [alphal00p-docs-cargo] | ^^^^^^
  814. 499.05 s [alphal00p-docs-cargo] note: found an item that was configured out
  815. 499.05 s [alphal00p-docs-cargo] --> /nix/store/9rqk4093qnvgswmdk1pbxk9najcrjn7a-vendor-cargo-deps/bc87b2b0f37b9a43ffdd82e8f11f3e864d9447ccd53a9a964250c3414c3656d9/numerica-3.0.0/src/domains/backend/float.rs:19:11
  816. 499.05 s [alphal00p-docs-cargo] |
  817. 499.05 s [alphal00p-docs-cargo] 15 | #[cfg(feature = "float-mpfr")]
  818. 499.05 s [alphal00p-docs-cargo] | ---------------------- the item is gated behind the `float-mpfr` feature
  819. 499.05 s [alphal00p-docs-cargo] ...
  820. 499.05 s [alphal00p-docs-cargo] 19 | ops::{CompleteRound, Pow},
  821. 499.05 s [alphal00p-docs-cargo] | ^^^^^^^^^^^^^
  822. 499.05 s [alphal00p-docs-cargo] note: found an item that was configured out
  823. 499.05 s [alphal00p-docs-cargo] --> /nix/store/9rqk4093qnvgswmdk1pbxk9najcrjn7a-vendor-cargo-deps/bc87b2b0f37b9a43ffdd82e8f11f3e864d9447ccd53a9a964250c3414c3656d9/numerica-3.0.0/src/domains/backend/float.rs:1578:30
  824. 499.05 s [alphal00p-docs-cargo] |
  825. 499.05 s [alphal00p-docs-cargo] 1576 | #[cfg(feature = "float-astro")]
  826. 499.05 s [alphal00p-docs-cargo] | ----------------------- the item is gated behind the `float-astro` feature
  827. 499.05 s [alphal00p-docs-cargo] 1577 | pub use astro::{
  828. 499.05 s [alphal00p-docs-cargo] 1578 | Assign, BackendRational, CompleteRound, Constant, IntoMultiPrecisionFloat, MultiPrecisionFloat,
  829. 499.05 s [alphal00p-docs-cargo] | ^^^^^^^^^^^^^
  830. 499.05 s [alphal00p-docs-cargo] note: found an item that was configured out
  831. 499.05 s [alphal00p-docs-cargo] --> /nix/store/9rqk4093qnvgswmdk1pbxk9najcrjn7a-vendor-cargo-deps/bc87b2b0f37b9a43ffdd82e8f11f3e864d9447ccd53a9a964250c3414c3656d9/numerica-3.0.0/src/domains/backend/float.rs:18:12
  832. 499.05 s [alphal00p-docs-cargo] |
  833. 499.05 s [alphal00p-docs-cargo] 15 | #[cfg(feature = "float-mpfr")]
  834. 499.05 s [alphal00p-docs-cargo] | ---------------------- the item is gated behind the `float-mpfr` feature
  835. 499.05 s [alphal00p-docs-cargo] ...
  836. 499.05 s [alphal00p-docs-cargo] 18 | float::Constant,
  837. 499.05 s [alphal00p-docs-cargo] | ^^^^^^^^
  838. 499.05 s [alphal00p-docs-cargo] note: found an item that was configured out
  839. 499.05 s [alphal00p-docs-cargo] --> /nix/store/9rqk4093qnvgswmdk1pbxk9najcrjn7a-vendor-cargo-deps/bc87b2b0f37b9a43ffdd82e8f11f3e864d9447ccd53a9a964250c3414c3656d9/numerica-3.0.0/src/domains/backend/float.rs:1578:45
  840. 499.05 s [alphal00p-docs-cargo] |
  841. 499.05 s [alphal00p-docs-cargo] 1576 | #[cfg(feature = "float-astro")]
  842. 499.05 s [alphal00p-docs-cargo] | ----------------------- the item is gated behind the `float-astro` feature
  843. 499.05 s [alphal00p-docs-cargo] 1577 | pub use astro::{
  844. 499.05 s [alphal00p-docs-cargo] 1578 | Assign, BackendRational, CompleteRound, Constant, IntoMultiPrecisionFloat, MultiPrecisionFloat,
  845. 499.05 s [alphal00p-docs-cargo] | ^^^^^^^^
  846. 499.05 s [alphal00p-docs-cargo] note: found an item that was configured out
  847. 499.05 s [alphal00p-docs-cargo] --> /nix/store/9rqk4093qnvgswmdk1pbxk9najcrjn7a-vendor-cargo-deps/bc87b2b0f37b9a43ffdd82e8f11f3e864d9447ccd53a9a964250c3414c3656d9/numerica-3.0.0/src/domains/backend/float.rs:17:22
  848. 499.05 s [alphal00p-docs-cargo] |
  849. 499.05 s [alphal00p-docs-cargo] 15 | #[cfg(feature = "float-mpfr")]
  850. 499.05 s [alphal00p-docs-cargo] | ---------------------- the item is gated behind the `float-mpfr` feature
  851. 499.05 s [alphal00p-docs-cargo] 16 | pub use rug::{
  852. 499.05 s [alphal00p-docs-cargo] 17 | Assign, Float as MultiPrecisionFloat, Rational as BackendRational,
  853. 499.05 s [alphal00p-docs-cargo] | ^^^^^^^^^^^^^^^^^^^
  854. 499.05 s [alphal00p-docs-cargo] note: found an item that was configured out
  855. 499.05 s [alphal00p-docs-cargo] --> /nix/store/9rqk4093qnvgswmdk1pbxk9najcrjn7a-vendor-cargo-deps/bc87b2b0f37b9a43ffdd82e8f11f3e864d9447ccd53a9a964250c3414c3656d9/numerica-3.0.0/src/domains/backend/float.rs:1578:80
  856. 499.05 s [alphal00p-docs-cargo] |
  857. 499.05 s [alphal00p-docs-cargo] 1576 | #[cfg(feature = "float-astro")]
  858. 499.05 s [alphal00p-docs-cargo] | ----------------------- the item is gated behind the `float-astro` feature
  859. 499.05 s [alphal00p-docs-cargo] 1577 | pub use astro::{
  860. 499.05 s [alphal00p-docs-cargo] 1578 | Assign, BackendRational, CompleteRound, Constant, IntoMultiPrecisionFloat, MultiPrecisionFloat,
  861. 499.05 s [alphal00p-docs-cargo] | ^^^^^^^^^^^^^^^^^^^
  862. 499.05 s [alphal00p-docs-cargo] note: found an item that was configured out
  863. 499.05 s [alphal00p-docs-cargo] --> /nix/store/9rqk4093qnvgswmdk1pbxk9najcrjn7a-vendor-cargo-deps/bc87b2b0f37b9a43ffdd82e8f11f3e864d9447ccd53a9a964250c3414c3656d9/numerica-3.0.0/src/domains/backend/float.rs:19:26
  864. 499.05 s [alphal00p-docs-cargo] |
  865. 499.05 s [alphal00p-docs-cargo] 15 | #[cfg(feature = "float-mpfr")]
  866. 499.05 s [alphal00p-docs-cargo] | ---------------------- the item is gated behind the `float-mpfr` feature
  867. 499.05 s [alphal00p-docs-cargo] ...
  868. 499.05 s [alphal00p-docs-cargo] 19 | ops::{CompleteRound, Pow},
  869. 499.05 s [alphal00p-docs-cargo] | ^^^
  870. 499.05 s [alphal00p-docs-cargo] note: found an item that was configured out
  871. 499.05 s [alphal00p-docs-cargo] --> /nix/store/9rqk4093qnvgswmdk1pbxk9najcrjn7a-vendor-cargo-deps/bc87b2b0f37b9a43ffdd82e8f11f3e864d9447ccd53a9a964250c3414c3656d9/numerica-3.0.0/src/domains/backend/float.rs:1579:5
  872. 499.05 s [alphal00p-docs-cargo] |
  873. 499.05 s [alphal00p-docs-cargo] 1576 | #[cfg(feature = "float-astro")]
  874. 499.05 s [alphal00p-docs-cargo] | ----------------------- the item is gated behind the `float-astro` feature
  875. 499.05 s [alphal00p-docs-cargo] ...
  876. 499.05 s [alphal00p-docs-cargo] 1579 | Pow,
  877. 499.05 s [alphal00p-docs-cargo] | ^^^
  878. 499.05 s [alphal00p-docs-cargo]
  879. 499.59 s [alphal00p-docs-cargo] error[E0425]: cannot find type `RawMultiPrecisionInteger` in this scope
  880. 499.59 s [alphal00p-docs-cargo] --> /nix/store/9rqk4093qnvgswmdk1pbxk9najcrjn7a-vendor-cargo-deps/bc87b2b0f37b9a43ffdd82e8f11f3e864d9447ccd53a9a964250c3414c3656d9/numerica-3.0.0/src/domains/backend/integer.rs:52:38
  881. 499.59 s [alphal00p-docs-cargo] |
  882. 499.59 s [alphal00p-docs-cargo] 52 | pub struct MultiPrecisionInteger(RawMultiPrecisionInteger);
  883. 499.59 s [alphal00p-docs-cargo] | ^^^^^^^^^^^^^^^^^^^^^^^^ not found in this scope
  884. 499.59 s [alphal00p-docs-cargo]
  885. 499.60 s [alphal00p-docs-cargo] error[E0425]: cannot find type `RawMultiPrecisionInteger` in this scope
  886. 499.60 s [alphal00p-docs-cargo] --> /nix/store/9rqk4093qnvgswmdk1pbxk9najcrjn7a-vendor-cargo-deps/bc87b2b0f37b9a43ffdd82e8f11f3e864d9447ccd53a9a964250c3414c3656d9/numerica-3.0.0/src/domains/backend/integer.rs:52:38
  887. 499.60 s [alphal00p-docs-cargo] |
  888. 499.60 s [alphal00p-docs-cargo] 52 | pub struct MultiPrecisionInteger(RawMultiPrecisionInteger);
  889. 499.60 s [alphal00p-docs-cargo] | ^^^^^^^^^^^^^^^^^^^^^^^^ not found in this scope
  890. 499.60 s [alphal00p-docs-cargo] |
  891. 499.60 s [alphal00p-docs-cargo] help: you might be missing a type parameter
  892. 499.60 s [alphal00p-docs-cargo] |
  893. 499.60 s [alphal00p-docs-cargo] 52 | pub struct MultiPrecisionInteger<RawMultiPrecisionInteger>(RawMultiPrecisionInteger);
  894. 499.60 s [alphal00p-docs-cargo] | ++++++++++++++++++++++++++
  895. 499.60 s [alphal00p-docs-cargo]
  896. 499.61 s [alphal00p-docs-cargo] error[E0425]: cannot find type `RawMultiPrecisionInteger` in this scope
  897. 499.61 s [alphal00p-docs-cargo] --> /nix/store/9rqk4093qnvgswmdk1pbxk9najcrjn7a-vendor-cargo-deps/bc87b2b0f37b9a43ffdd82e8f11f3e864d9447ccd53a9a964250c3414c3656d9/numerica-3.0.0/src/domains/backend/integer.rs:149:32
  898. 499.61 s [alphal00p-docs-cargo] |
  899. 499.61 s [alphal00p-docs-cargo] 52 | pub struct MultiPrecisionInteger(RawMultiPrecisionInteger);
  900. 499.61 s [alphal00p-docs-cargo] | ----------------------------------------------------------- similarly named struct `MultiPrecisionInteger` defined here
  901. 499.61 s [alphal00p-docs-cargo] ...
  902. 499.61 s [alphal00p-docs-cargo] 149 | pub fn from_raw(value: RawMultiPrecisionInteger) -> Self {
  903. 499.61 s [alphal00p-docs-cargo] | ^^^^^^^^^^^^^^^^^^^^^^^^
  904. 499.61 s [alphal00p-docs-cargo] |
  905. 499.61 s [alphal00p-docs-cargo] help: a struct with a similar name exists
  906. 499.61 s [alphal00p-docs-cargo] |
  907. 499.61 s [alphal00p-docs-cargo] 149 - pub fn from_raw(value: RawMultiPrecisionInteger) -> Self {
  908. 499.61 s [alphal00p-docs-cargo] 149 + pub fn from_raw(value: MultiPrecisionInteger) -> Self {
  909. 499.61 s [alphal00p-docs-cargo] |
  910. 499.61 s [alphal00p-docs-cargo]
  911. 499.63 s [alphal00p-docs-cargo] error[E0425]: cannot find type `RawMultiPrecisionInteger` in this scope
  912. 499.63 s [alphal00p-docs-cargo] --> /nix/store/9rqk4093qnvgswmdk1pbxk9najcrjn7a-vendor-cargo-deps/bc87b2b0f37b9a43ffdd82e8f11f3e864d9447ccd53a9a964250c3414c3656d9/numerica-3.0.0/src/domains/backend/integer.rs:187:34
  913. 499.63 s [alphal00p-docs-cargo] |
  914. 499.63 s [alphal00p-docs-cargo] 52 | pub struct MultiPrecisionInteger(RawMultiPrecisionInteger);
  915. 499.63 s [alphal00p-docs-cargo] | ----------------------------------------------------------- similarly named struct `MultiPrecisionInteger` defined here
  916. 499.63 s [alphal00p-docs-cargo] ...
  917. 499.63 s [alphal00p-docs-cargo] 187 | pub fn as_raw(&self) -> &RawMultiPrecisionInteger {
  918. 499.63 s [alphal00p-docs-cargo] | ^^^^^^^^^^^^^^^^^^^^^^^^
  919. 499.63 s [alphal00p-docs-cargo] |
  920. 499.63 s [alphal00p-docs-cargo] help: a struct with a similar name exists
  921. 499.63 s [alphal00p-docs-cargo] |
  922. 499.63 s [alphal00p-docs-cargo] 187 - pub fn as_raw(&self) -> &RawMultiPrecisionInteger {
  923. 499.63 s [alphal00p-docs-cargo] 187 + pub fn as_raw(&self) -> &MultiPrecisionInteger {
  924. 499.63 s [alphal00p-docs-cargo] |
  925. 499.63 s [alphal00p-docs-cargo]
  926. 499.64 s [alphal00p-docs-cargo] error[E0425]: cannot find type `RawMultiPrecisionInteger` in this scope
  927. 499.64 s [alphal00p-docs-cargo] --> /nix/store/9rqk4093qnvgswmdk1pbxk9najcrjn7a-vendor-cargo-deps/bc87b2b0f37b9a43ffdd82e8f11f3e864d9447ccd53a9a964250c3414c3656d9/numerica-3.0.0/src/domains/backend/integer.rs:193:33
  928. 499.64 s [alphal00p-docs-cargo] |
  929. 499.64 s [alphal00p-docs-cargo] 52 | pub struct MultiPrecisionInteger(RawMultiPrecisionInteger);
  930. 499.64 s [alphal00p-docs-cargo] | ----------------------------------------------------------- similarly named struct `MultiPrecisionInteger` defined here
  931. 499.64 s [alphal00p-docs-cargo] ...
  932. 499.64 s [alphal00p-docs-cargo] 193 | pub fn to_raw(&self) -> RawMultiPrecisionInteger {
  933. 499.64 s [alphal00p-docs-cargo] | ^^^^^^^^^^^^^^^^^^^^^^^^
  934. 499.64 s [alphal00p-docs-cargo] |
  935. 499.64 s [alphal00p-docs-cargo] help: a struct with a similar name exists
  936. 499.64 s [alphal00p-docs-cargo] |
  937. 499.64 s [alphal00p-docs-cargo] 193 - pub fn to_raw(&self) -> RawMultiPrecisionInteger {
  938. 499.64 s [alphal00p-docs-cargo] 193 + pub fn to_raw(&self) -> MultiPrecisionInteger {
  939. 499.64 s [alphal00p-docs-cargo] |
  940. 499.64 s [alphal00p-docs-cargo]
  941. 499.66 s [alphal00p-docs-cargo] error[E0425]: cannot find type `RawMultiPrecisionInteger` in this scope
  942. 499.66 s [alphal00p-docs-cargo] --> /nix/store/9rqk4093qnvgswmdk1pbxk9najcrjn7a-vendor-cargo-deps/bc87b2b0f37b9a43ffdd82e8f11f3e864d9447ccd53a9a964250c3414c3656d9/numerica-3.0.0/src/domains/backend/integer.rs:199:34
  943. 499.66 s [alphal00p-docs-cargo] |
  944. 499.66 s [alphal00p-docs-cargo] 52 | pub struct MultiPrecisionInteger(RawMultiPrecisionInteger);
  945. 499.66 s [alphal00p-docs-cargo] | ----------------------------------------------------------- similarly named struct `MultiPrecisionInteger` defined here
  946. 499.66 s [alphal00p-docs-cargo] ...
  947. 499.66 s [alphal00p-docs-cargo] 199 | pub fn into_raw(self) -> RawMultiPrecisionInteger {
  948. 499.66 s [alphal00p-docs-cargo] | ^^^^^^^^^^^^^^^^^^^^^^^^
  949. 499.66 s [alphal00p-docs-cargo] |
  950. 499.66 s [alphal00p-docs-cargo] help: a struct with a similar name exists
  951. 499.66 s [alphal00p-docs-cargo] |
  952. 499.66 s [alphal00p-docs-cargo] 199 - pub fn into_raw(self) -> RawMultiPrecisionInteger {
  953. 499.66 s [alphal00p-docs-cargo] 199 + pub fn into_raw(self) -> MultiPrecisionInteger {
  954. 499.66 s [alphal00p-docs-cargo] |
  955. 499.66 s [alphal00p-docs-cargo]
  956. 499.67 s [alphal00p-docs-cargo] error[E0425]: cannot find type `RawMultiPrecisionInteger` in this scope
  957. 499.67 s [alphal00p-docs-cargo] --> /nix/store/9rqk4093qnvgswmdk1pbxk9najcrjn7a-vendor-cargo-deps/bc87b2b0f37b9a43ffdd82e8f11f3e864d9447ccd53a9a964250c3414c3656d9/numerica-3.0.0/src/domains/backend/integer.rs:567:27
  958. 499.67 s [alphal00p-docs-cargo] |
  959. 499.67 s [alphal00p-docs-cargo] 52 | pub struct MultiPrecisionInteger(RawMultiPrecisionInteger);
  960. 499.67 s [alphal00p-docs-cargo] | ----------------------------------------------------------- similarly named struct `MultiPrecisionInteger` defined here
  961. 499.67 s [alphal00p-docs-cargo] ...
  962. 499.67 s [alphal00p-docs-cargo] 567 | fn rem_trunc(lhs: RawMultiPrecisionInteger, rhs: RawMultiPrecisionInteger) -> Self {
  963. 499.67 s [alphal00p-docs-cargo] | ^^^^^^^^^^^^^^^^^^^^^^^^
  964. 499.67 s [alphal00p-docs-cargo] |
  965. 499.67 s [alphal00p-docs-cargo] help: a struct with a similar name exists
  966. 499.67 s [alphal00p-docs-cargo] |
  967. 499.67 s [alphal00p-docs-cargo] 567 - fn rem_trunc(lhs: RawMultiPrecisionInteger, rhs: RawMultiPrecisionInteger) -> Self {
  968. 499.67 s [alphal00p-docs-cargo] 567 + fn rem_trunc(lhs: MultiPrecisionInteger, rhs: RawMultiPrecisionInteger) -> Self {
  969. 499.67 s [alphal00p-docs-cargo] |
  970. 499.67 s [alphal00p-docs-cargo]
  971. 499.68 s [alphal00p-docs-cargo] error[E0425]: cannot find type `RawMultiPrecisionInteger` in this scope
  972. 499.68 s [alphal00p-docs-cargo] --> /nix/store/9rqk4093qnvgswmdk1pbxk9najcrjn7a-vendor-cargo-deps/bc87b2b0f37b9a43ffdd82e8f11f3e864d9447ccd53a9a964250c3414c3656d9/numerica-3.0.0/src/domains/backend/integer.rs:567:58
  973. 499.68 s [alphal00p-docs-cargo] |
  974. 499.68 s [alphal00p-docs-cargo] 52 | pub struct MultiPrecisionInteger(RawMultiPrecisionInteger);
  975. 499.68 s [alphal00p-docs-cargo] | ----------------------------------------------------------- similarly named struct `MultiPrecisionInteger` defined here
  976. 499.68 s [alphal00p-docs-cargo] ...
  977. 499.68 s [alphal00p-docs-cargo] 567 | fn rem_trunc(lhs: RawMultiPrecisionInteger, rhs: RawMultiPrecisionInteger) -> Self {
  978. 499.68 s [alphal00p-docs-cargo] | ^^^^^^^^^^^^^^^^^^^^^^^^
  979. 499.68 s [alphal00p-docs-cargo] |
  980. 499.68 s [alphal00p-docs-cargo] help: a struct with a similar name exists
  981. 499.68 s [alphal00p-docs-cargo] |
  982. 499.68 s [alphal00p-docs-cargo] 567 - fn rem_trunc(lhs: RawMultiPrecisionInteger, rhs: RawMultiPrecisionInteger) -> Self {
  983. 499.68 s [alphal00p-docs-cargo] 567 + fn rem_trunc(lhs: RawMultiPrecisionInteger, rhs: MultiPrecisionInteger) -> Self {
  984. 499.68 s [alphal00p-docs-cargo] |
  985. 499.68 s [alphal00p-docs-cargo]
  986. 499.70 s [alphal00p-docs-cargo] error[E0425]: cannot find type `RawMultiPrecisionInteger` in this scope
  987. 499.70 s [alphal00p-docs-cargo] --> /nix/store/9rqk4093qnvgswmdk1pbxk9najcrjn7a-vendor-cargo-deps/bc87b2b0f37b9a43ffdd82e8f11f3e864d9447ccd53a9a964250c3414c3656d9/numerica-3.0.0/src/domains/backend/integer.rs:582:27
  988. 499.70 s [alphal00p-docs-cargo] |
  989. 499.70 s [alphal00p-docs-cargo] 52 | pub struct MultiPrecisionInteger(RawMultiPrecisionInteger);
  990. 499.70 s [alphal00p-docs-cargo] | ----------------------------------------------------------- similarly named struct `MultiPrecisionInteger` defined here
  991. 499.70 s [alphal00p-docs-cargo] ...
  992. 499.70 s [alphal00p-docs-cargo] 582 | fn shl_raw(value: RawMultiPrecisionInteger, rhs: u64) -> RawMultiPrecisionInteger {
  993. 499.70 s [alphal00p-docs-cargo] | ^^^^^^^^^^^^^^^^^^^^^^^^
  994. 499.70 s [alphal00p-docs-cargo] |
  995. 499.70 s [alphal00p-docs-cargo] help: a struct with a similar name exists
  996. 499.70 s [alphal00p-docs-cargo] |
  997. 499.70 s [alphal00p-docs-cargo] 582 - fn shl_raw(value: RawMultiPrecisionInteger, rhs: u64) -> RawMultiPrecisionInteger {
  998. 499.70 s [alphal00p-docs-cargo] 582 + fn shl_raw(value: MultiPrecisionInteger, rhs: u64) -> RawMultiPrecisionInteger {
  999. 499.70 s [alphal00p-docs-cargo] |
  1000. 499.70 s [alphal00p-docs-cargo]
  1001. 499.71 s [alphal00p-docs-cargo] error[E0425]: cannot find type `RawMultiPrecisionInteger` in this scope
  1002. 499.71 s [alphal00p-docs-cargo] --> /nix/store/9rqk4093qnvgswmdk1pbxk9najcrjn7a-vendor-cargo-deps/bc87b2b0f37b9a43ffdd82e8f11f3e864d9447ccd53a9a964250c3414c3656d9/numerica-3.0.0/src/domains/backend/integer.rs:582:66
  1003. 499.71 s [alphal00p-docs-cargo] |
  1004. 499.71 s [alphal00p-docs-cargo] 52 | pub struct MultiPrecisionInteger(RawMultiPrecisionInteger);
  1005. 499.71 s [alphal00p-docs-cargo] | ----------------------------------------------------------- similarly named struct `MultiPrecisionInteger` defined here
  1006. 499.71 s [alphal00p-docs-cargo] ...
  1007. 499.71 s [alphal00p-docs-cargo] 582 | fn shl_raw(value: RawMultiPrecisionInteger, rhs: u64) -> RawMultiPrecisionInteger {
  1008. 499.71 s [alphal00p-docs-cargo] | ^^^^^^^^^^^^^^^^^^^^^^^^
  1009. 499.71 s [alphal00p-docs-cargo] |
  1010. 499.71 s [alphal00p-docs-cargo] help: a struct with a similar name exists
  1011. 499.71 s [alphal00p-docs-cargo] |
  1012. 499.71 s [alphal00p-docs-cargo] 582 - fn shl_raw(value: RawMultiPrecisionInteger, rhs: u64) -> RawMultiPrecisionInteger {
  1013. 499.71 s [alphal00p-docs-cargo] 582 + fn shl_raw(value: RawMultiPrecisionInteger, rhs: u64) -> MultiPrecisionInteger {
  1014. 499.71 s [alphal00p-docs-cargo] |
  1015. 499.71 s [alphal00p-docs-cargo]
  1016. 499.75 s [alphal00p-docs-cargo] error[E0425]: cannot find type `RawMultiPrecisionInteger` in this scope
  1017. 499.75 s [alphal00p-docs-cargo] --> /nix/store/9rqk4093qnvgswmdk1pbxk9najcrjn7a-vendor-cargo-deps/bc87b2b0f37b9a43ffdd82e8f11f3e864d9447ccd53a9a964250c3414c3656d9/numerica-3.0.0/src/domains/backend/integer.rs:590:27
  1018. 499.75 s [alphal00p-docs-cargo] |
  1019. 499.75 s [alphal00p-docs-cargo] 52 | pub struct MultiPrecisionInteger(RawMultiPrecisionInteger);
  1020. 499.75 s [alphal00p-docs-cargo] | ----------------------------------------------------------- similarly named struct `MultiPrecisionInteger` defined here
  1021. 499.75 s [alphal00p-docs-cargo] ...
  1022. 499.75 s [alphal00p-docs-cargo] 590 | fn shr_raw(value: RawMultiPrecisionInteger, rhs: u64) -> RawMultiPrecisionInteger {
  1023. 499.75 s [alphal00p-docs-cargo] | ^^^^^^^^^^^^^^^^^^^^^^^^
  1024. 499.75 s [alphal00p-docs-cargo] |
  1025. 499.75 s [alphal00p-docs-cargo] help: a struct with a similar name exists
  1026. 499.75 s [alphal00p-docs-cargo] |
  1027. 499.75 s [alphal00p-docs-cargo] 590 - fn shr_raw(value: RawMultiPrecisionInteger, rhs: u64) -> RawMultiPrecisionInteger {
  1028. 499.75 s [alphal00p-docs-cargo] 590 + fn shr_raw(value: MultiPrecisionInteger, rhs: u64) -> RawMultiPrecisionInteger {
  1029. 499.75 s [alphal00p-docs-cargo] |
  1030. 499.75 s [alphal00p-docs-cargo]
  1031. 499.75 s [alphal00p-docs-cargo] error[E0425]: cannot find type `RawMultiPrecisionInteger` in this scope
  1032. 499.75 s [alphal00p-docs-cargo] --> /nix/store/9rqk4093qnvgswmdk1pbxk9najcrjn7a-vendor-cargo-deps/bc87b2b0f37b9a43ffdd82e8f11f3e864d9447ccd53a9a964250c3414c3656d9/numerica-3.0.0/src/domains/backend/integer.rs:590:66
  1033. 499.75 s [alphal00p-docs-cargo] |
  1034. 499.75 s [alphal00p-docs-cargo] 52 | pub struct MultiPrecisionInteger(RawMultiPrecisionInteger);
  1035. 499.75 s [alphal00p-docs-cargo] | ----------------------------------------------------------- similarly named struct `MultiPrecisionInteger` defined here
  1036. 499.75 s [alphal00p-docs-cargo] ...
  1037. 499.75 s [alphal00p-docs-cargo] 590 | fn shr_raw(value: RawMultiPrecisionInteger, rhs: u64) -> RawMultiPrecisionInteger {
  1038. 499.75 s [alphal00p-docs-cargo] | ^^^^^^^^^^^^^^^^^^^^^^^^
  1039. 499.75 s [alphal00p-docs-cargo] |
  1040. 499.75 s [alphal00p-docs-cargo] help: a struct with a similar name exists
  1041. 499.75 s [alphal00p-docs-cargo] |
  1042. 499.75 s [alphal00p-docs-cargo] 590 - fn shr_raw(value: RawMultiPrecisionInteger, rhs: u64) -> RawMultiPrecisionInteger {
  1043. 499.75 s [alphal00p-docs-cargo] 590 + fn shr_raw(value: RawMultiPrecisionInteger, rhs: u64) -> MultiPrecisionInteger {
  1044. 499.75 s [alphal00p-docs-cargo] |
  1045. 499.75 s [alphal00p-docs-cargo]
  1046. 499.75 s [alphal00p-docs-cargo] error[E0425]: cannot find type `RawMultiPrecisionInteger` in this scope
  1047. 499.75 s [alphal00p-docs-cargo] --> /nix/store/9rqk4093qnvgswmdk1pbxk9najcrjn7a-vendor-cargo-deps/bc87b2b0f37b9a43ffdd82e8f11f3e864d9447ccd53a9a964250c3414c3656d9/numerica-3.0.0/src/domains/backend/integer.rs:654:15
  1048. 499.75 s [alphal00p-docs-cargo] |
  1049. 499.75 s [alphal00p-docs-cargo] 52 | pub struct MultiPrecisionInteger(RawMultiPrecisionInteger);
  1050. 499.75 s [alphal00p-docs-cargo] | ----------------------------------------------------------- similarly named struct `MultiPrecisionInteger` defined here
  1051. 499.75 s [alphal00p-docs-cargo] ...
  1052. 499.75 s [alphal00p-docs-cargo] 654 | impl From<RawMultiPrecisionInteger> for MultiPrecisionInteger {
  1053. 499.75 s [alphal00p-docs-cargo] | ^^^^^^^^^^^^^^^^^^^^^^^^
  1054. 499.75 s [alphal00p-docs-cargo] |
  1055. 499.75 s [alphal00p-docs-cargo] help: a struct with a similar name exists
  1056. 499.75 s [alphal00p-docs-cargo] |
  1057. 499.75 s [alphal00p-docs-cargo] 654 - impl From<RawMultiPrecisionInteger> for MultiPrecisionInteger {
  1058. 499.75 s [alphal00p-docs-cargo] 654 + impl From<MultiPrecisionInteger> for MultiPrecisionInteger {
  1059. 499.75 s [alphal00p-docs-cargo] |
  1060. 499.75 s [alphal00p-docs-cargo] help: you might be missing a type parameter
  1061. 499.75 s [alphal00p-docs-cargo] |
  1062. 499.75 s [alphal00p-docs-cargo] 654 | impl<RawMultiPrecisionInteger> From<RawMultiPrecisionInteger> for MultiPrecisionInteger {
  1063. 499.76 s [alphal00p-docs-cargo] | ++++++++++++++++++++++++++
  1064. 499.76 s [alphal00p-docs-cargo]
  1065. 499.76 s [alphal00p-docs-cargo] error[E0425]: cannot find type `RawMultiPrecisionInteger` in this scope
  1066. 499.76 s [alphal00p-docs-cargo] --> /nix/store/9rqk4093qnvgswmdk1pbxk9najcrjn7a-vendor-cargo-deps/bc87b2b0f37b9a43ffdd82e8f11f3e864d9447ccd53a9a964250c3414c3656d9/numerica-3.0.0/src/domains/backend/integer.rs:656:24
  1067. 499.76 s [alphal00p-docs-cargo] |
  1068. 499.76 s [alphal00p-docs-cargo] 52 | pub struct MultiPrecisionInteger(RawMultiPrecisionInteger);
  1069. 499.76 s [alphal00p-docs-cargo] | ----------------------------------------------------------- similarly named struct `MultiPrecisionInteger` defined here
  1070. 499.76 s [alphal00p-docs-cargo] ...
  1071. 499.76 s [alphal00p-docs-cargo] 656 | fn from(value: RawMultiPrecisionInteger) -> Self {
  1072. 499.76 s [alphal00p-docs-cargo] | ^^^^^^^^^^^^^^^^^^^^^^^^
  1073. 499.76 s [alphal00p-docs-cargo] |
  1074. 499.76 s [alphal00p-docs-cargo] help: a struct with a similar name exists
  1075. 499.76 s [alphal00p-docs-cargo] |
  1076. 499.77 s [alphal00p-docs-cargo] 656 - fn from(value: RawMultiPrecisionInteger) -> Self {
  1077. 499.77 s [alphal00p-docs-cargo] 656 + fn from(value: MultiPrecisionInteger) -> Self {
  1078. 499.77 s [alphal00p-docs-cargo] |
  1079. 499.77 s [alphal00p-docs-cargo]
  1080. 499.78 s [alphal00p-docs-cargo] error[E0425]: cannot find type `RawMultiPrecisionInteger` in this scope
  1081. 499.78 s [alphal00p-docs-cargo] --> /nix/store/9rqk4093qnvgswmdk1pbxk9najcrjn7a-vendor-cargo-deps/bc87b2b0f37b9a43ffdd82e8f11f3e864d9447ccd53a9a964250c3414c3656d9/numerica-3.0.0/src/domains/backend/integer.rs:661:42
  1082. 499.78 s [alphal00p-docs-cargo] |
  1083. 499.78 s [alphal00p-docs-cargo] 52 | pub struct MultiPrecisionInteger(RawMultiPrecisionInteger);
  1084. 499.78 s [alphal00p-docs-cargo] | ----------------------------------------------------------- similarly named struct `MultiPrecisionInteger` defined here
  1085. 499.78 s [alphal00p-docs-cargo] ...
  1086. 499.78 s [alphal00p-docs-cargo] 661 | impl From<MultiPrecisionInteger> for RawMultiPrecisionInteger {
  1087. 499.78 s [alphal00p-docs-cargo] | ^^^^^^^^^^^^^^^^^^^^^^^^
  1088. 499.78 s [alphal00p-docs-cargo] |
  1089. 499.78 s [alphal00p-docs-cargo] help: a struct with a similar name exists
  1090. 499.78 s [alphal00p-docs-cargo] |
  1091. 499.78 s [alphal00p-docs-cargo] 661 - impl From<MultiPrecisionInteger> for RawMultiPrecisionInteger {
  1092. 499.78 s [alphal00p-docs-cargo] 661 + impl From<MultiPrecisionInteger> for MultiPrecisionInteger {
  1093. 499.78 s [alphal00p-docs-cargo] |
  1094. 499.78 s [alphal00p-docs-cargo]
  1095. 500.50 s [alphal00p-docs-cargo] error[E0433]: cannot find type `RawMultiPrecisionInteger` in this scope
  1096. 500.50 s [alphal00p-docs-cargo] --> /nix/store/9rqk4093qnvgswmdk1pbxk9najcrjn7a-vendor-cargo-deps/bc87b2b0f37b9a43ffdd82e8f11f3e864d9447ccd53a9a964250c3414c3656d9/numerica-3.0.0/src/domains/backend/integer.rs:620:13
  1097. 500.50 s [alphal00p-docs-cargo] |
  1098. 500.50 s [alphal00p-docs-cargo] 620 | RawMultiPrecisionInteger::from_str(s)
  1099. 500.50 s [alphal00p-docs-cargo] | ^^^^^^^^^^^^^^^^^^^^^^^^ use of undeclared type `RawMultiPrecisionInteger`
  1100. 500.50 s [alphal00p-docs-cargo] |
  1101. 500.50 s [alphal00p-docs-cargo] help: a struct with a similar name exists
  1102. 500.50 s [alphal00p-docs-cargo] |
  1103. 500.50 s [alphal00p-docs-cargo] 620 - RawMultiPrecisionInteger::from_str(s)
  1104. 500.50 s [alphal00p-docs-cargo] 620 + MultiPrecisionInteger::from_str(s)
  1105. 500.50 s [alphal00p-docs-cargo] |
  1106. 500.50 s [alphal00p-docs-cargo]
  1107. 500.50 s [alphal00p-docs-cargo] error[E0433]: cannot find type `RawMultiPrecisionInteger` in this scope
  1108. 500.50 s [alphal00p-docs-cargo] --> /nix/store/9rqk4093qnvgswmdk1pbxk9najcrjn7a-vendor-cargo-deps/bc87b2b0f37b9a43ffdd82e8f11f3e864d9447ccd53a9a964250c3414c3656d9/numerica-3.0.0/src/domains/backend/integer.rs:674:35
  1109. 500.50 s [alphal00p-docs-cargo] |
  1110. 500.50 s [alphal00p-docs-cargo] 674 | self.0 == RawMultiPrecisionInteger::from(*other)
  1111. 500.50 s [alphal00p-docs-cargo] | ^^^^^^^^^^^^^^^^^^^^^^^^ use of undeclared type `RawMultiPrecisionInteger`
  1112. 500.50 s [alphal00p-docs-cargo] ...
  1113. 500.50 s [alphal00p-docs-cargo] 702 | impl_cmp_primitive!(i32, i64, i128, u32, u64, u128);
  1114. 500.50 s [alphal00p-docs-cargo] | --------------------------------------------------- in this macro invocation
  1115. 500.50 s [alphal00p-docs-cargo] |
  1116. 500.50 s [alphal00p-docs-cargo] = note: this error originates in the macro `impl_cmp_primitive` (in Nightly builds, run with -Z macro-backtrace for more info)
  1117. 500.50 s [alphal00p-docs-cargo] help: a struct with a similar name exists
  1118. 500.50 s [alphal00p-docs-cargo] |
  1119. 500.50 s [alphal00p-docs-cargo] 674 - self.0 == RawMultiPrecisionInteger::from(*other)
  1120. 500.50 s [alphal00p-docs-cargo] 674 + self.0 == MultiPrecisionInteger::from(*other)
  1121. 500.50 s [alphal00p-docs-cargo] |
  1122. 500.50 s [alphal00p-docs-cargo]
  1123. 500.50 s [alphal00p-docs-cargo] error[E0433]: cannot find type `RawMultiPrecisionInteger` in this scope
  1124. 500.50 s [alphal00p-docs-cargo] --> /nix/store/9rqk4093qnvgswmdk1pbxk9najcrjn7a-vendor-cargo-deps/bc87b2b0f37b9a43ffdd82e8f11f3e864d9447ccd53a9a964250c3414c3656d9/numerica-3.0.0/src/domains/backend/integer.rs:681:25
  1125. 500.50 s [alphal00p-docs-cargo] |
  1126. 500.50 s [alphal00p-docs-cargo] 681 | RawMultiPrecisionInteger::from(*self) == other.0
  1127. 500.50 s [alphal00p-docs-cargo] | ^^^^^^^^^^^^^^^^^^^^^^^^ use of undeclared type `RawMultiPrecisionInteger`
  1128. 500.50 s [alphal00p-docs-cargo] ...
  1129. 500.50 s [alphal00p-docs-cargo] 702 | impl_cmp_primitive!(i32, i64, i128, u32, u64, u128);
  1130. 500.50 s [alphal00p-docs-cargo] | --------------------------------------------------- in this macro invocation
  1131. 500.50 s [alphal00p-docs-cargo] |
  1132. 500.50 s [alphal00p-docs-cargo] = note: this error originates in the macro `impl_cmp_primitive` (in Nightly builds, run with -Z macro-backtrace for more info)
  1133. 500.50 s [alphal00p-docs-cargo] help: a struct with a similar name exists
  1134. 500.50 s [alphal00p-docs-cargo] |
  1135. 500.50 s [alphal00p-docs-cargo] 681 - RawMultiPrecisionInteger::from(*self) == other.0
  1136. 500.50 s [alphal00p-docs-cargo] 681 + MultiPrecisionInteger::from(*self) == other.0
  1137. 500.50 s [alphal00p-docs-cargo] |
  1138. 500.50 s [alphal00p-docs-cargo]
  1139. 500.50 s [alphal00p-docs-cargo] error[E0433]: cannot find type `RawMultiPrecisionInteger` in this scope
  1140. 500.50 s [alphal00p-docs-cargo] --> /nix/store/9rqk4093qnvgswmdk1pbxk9najcrjn7a-vendor-cargo-deps/bc87b2b0f37b9a43ffdd82e8f11f3e864d9447ccd53a9a964250c3414c3656d9/numerica-3.0.0/src/domains/backend/integer.rs:688:45
  1141. 500.50 s [alphal00p-docs-cargo] |
  1142. 500.50 s [alphal00p-docs-cargo] 688 | self.0.partial_cmp(&RawMultiPrecisionInteger::from(*other))
  1143. 500.50 s [alphal00p-docs-cargo] | ^^^^^^^^^^^^^^^^^^^^^^^^ use of undeclared type `RawMultiPrecisionInteger`
  1144. 500.50 s [alphal00p-docs-cargo] ...
  1145. 500.50 s [alphal00p-docs-cargo] 702 | impl_cmp_primitive!(i32, i64, i128, u32, u64, u128);
  1146. 500.50 s [alphal00p-docs-cargo] | --------------------------------------------------- in this macro invocation
  1147. 500.50 s [alphal00p-docs-cargo] |
  1148. 500.50 s [alphal00p-docs-cargo] = note: this error originates in the macro `impl_cmp_primitive` (in Nightly builds, run with -Z macro-backtrace for more info)
  1149. 500.50 s [alphal00p-docs-cargo] help: a struct with a similar name exists
  1150. 500.50 s [alphal00p-docs-cargo] |
  1151. 500.50 s [alphal00p-docs-cargo] 688 - self.0.partial_cmp(&RawMultiPrecisionInteger::from(*other))
  1152. 500.50 s [alphal00p-docs-cargo] 688 + self.0.partial_cmp(&MultiPrecisionInteger::from(*other))
  1153. 500.50 s [alphal00p-docs-cargo] |
  1154. 500.50 s [alphal00p-docs-cargo]
  1155. 500.50 s [alphal00p-docs-cargo] error[E0433]: cannot find type `RawMultiPrecisionInteger` in this scope
  1156. 500.50 s [alphal00p-docs-cargo] --> /nix/store/9rqk4093qnvgswmdk1pbxk9najcrjn7a-vendor-cargo-deps/bc87b2b0f37b9a43ffdd82e8f11f3e864d9447ccd53a9a964250c3414c3656d9/numerica-3.0.0/src/domains/backend/integer.rs:695:25
  1157. 500.50 s [alphal00p-docs-cargo] |
  1158. 500.50 s [alphal00p-docs-cargo] 695 | RawMultiPrecisionInteger::from(*self).partial_cmp(&other.0)
  1159. 500.50 s [alphal00p-docs-cargo] | ^^^^^^^^^^^^^^^^^^^^^^^^ use of undeclared type `RawMultiPrecisionInteger`
  1160. 500.50 s [alphal00p-docs-cargo] ...
  1161. 500.50 s [alphal00p-docs-cargo] 702 | impl_cmp_primitive!(i32, i64, i128, u32, u64, u128);
  1162. 500.50 s [alphal00p-docs-cargo] | --------------------------------------------------- in this macro invocation
  1163. 500.50 s [alphal00p-docs-cargo] |
  1164. 500.50 s [alphal00p-docs-cargo] = note: this error originates in the macro `impl_cmp_primitive` (in Nightly builds, run with -Z macro-backtrace for more info)
  1165. 500.50 s [alphal00p-docs-cargo] help: a struct with a similar name exists
  1166. 500.50 s [alphal00p-docs-cargo] |
  1167. 500.50 s [alphal00p-docs-cargo] 695 - RawMultiPrecisionInteger::from(*self).partial_cmp(&other.0)
  1168. 500.50 s [alphal00p-docs-cargo] 695 + MultiPrecisionInteger::from(*self).partial_cmp(&other.0)
  1169. 500.50 s [alphal00p-docs-cargo] |
  1170. 500.50 s [alphal00p-docs-cargo]
  1171. 500.50 s [alphal00p-docs-cargo] error[E0433]: cannot find type `RawMultiPrecisionInteger` in this scope
  1172. 500.50 s [alphal00p-docs-cargo] --> /nix/store/9rqk4093qnvgswmdk1pbxk9najcrjn7a-vendor-cargo-deps/bc87b2b0f37b9a43ffdd82e8f11f3e864d9447ccd53a9a964250c3414c3656d9/numerica-3.0.0/src/domains/backend/integer.rs:1180:35
  1173. 500.50 s [alphal00p-docs-cargo] |
  1174. 500.50 s [alphal00p-docs-cargo] 1180 | MultiPrecisionInteger(RawMultiPrecisionInteger::from((&self.0) & &rhs.0))
  1175. 500.50 s [alphal00p-docs-cargo] | ^^^^^^^^^^^^^^^^^^^^^^^^ use of undeclared type `RawMultiPrecisionInteger`
  1176. 500.50 s [alphal00p-docs-cargo] |
  1177. 500.50 s [alphal00p-docs-cargo] help: a struct with a similar name exists
  1178. 500.50 s [alphal00p-docs-cargo] |
  1179. 500.50 s [alphal00p-docs-cargo] 1180 - MultiPrecisionInteger(RawMultiPrecisionInteger::from((&self.0) & &rhs.0))
  1180. 500.50 s [alphal00p-docs-cargo] 1180 + MultiPrecisionInteger(MultiPrecisionInteger::from((&self.0) & &rhs.0))
  1181. 500.50 s [alphal00p-docs-cargo] |
  1182. 500.50 s [alphal00p-docs-cargo]
  1183. 500.50 s [alphal00p-docs-cargo] error[E0433]: cannot find type `RawMultiPrecisionInteger` in this scope
  1184. 500.50 s [alphal00p-docs-cargo] --> /nix/store/9rqk4093qnvgswmdk1pbxk9najcrjn7a-vendor-cargo-deps/bc87b2b0f37b9a43ffdd82e8f11f3e864d9447ccd53a9a964250c3414c3656d9/numerica-3.0.0/src/domains/backend/integer.rs:1212:35
  1185. 500.50 s [alphal00p-docs-cargo] |
  1186. 500.50 s [alphal00p-docs-cargo] 1212 | MultiPrecisionInteger(RawMultiPrecisionInteger::from(-&self.0))
  1187. 500.50 s [alphal00p-docs-cargo] | ^^^^^^^^^^^^^^^^^^^^^^^^ use of undeclared type `RawMultiPrecisionInteger`
  1188. 500.50 s [alphal00p-docs-cargo] |
  1189. 500.50 s [alphal00p-docs-cargo] help: a struct with a similar name exists
  1190. 500.50 s [alphal00p-docs-cargo] |
  1191. 500.50 s [alphal00p-docs-cargo] 1212 - MultiPrecisionInteger(RawMultiPrecisionInteger::from(-&self.0))
  1192. 500.50 s [alphal00p-docs-cargo] 1212 + MultiPrecisionInteger(MultiPrecisionInteger::from(-&self.0))
  1193. 500.50 s [alphal00p-docs-cargo] |
  1194. 500.50 s [alphal00p-docs-cargo]
  1195. 500.50 s [alphal00p-docs-cargo] error[E0425]: cannot find function `write_lsf_bytes` in this scope
  1196. 500.50 s [alphal00p-docs-cargo] --> /nix/store/9rqk4093qnvgswmdk1pbxk9najcrjn7a-vendor-cargo-deps/bc87b2b0f37b9a43ffdd82e8f11f3e864d9447ccd53a9a964250c3414c3656d9/numerica-3.0.0/src/domains/backend/integer.rs:1682:5
  1197. 500.50 s [alphal00p-docs-cargo] |
  1198. 500.50 s [alphal00p-docs-cargo] 1682 | write_lsf_bytes(value, &mut bytes);
  1199. 500.50 s [alphal00p-docs-cargo] | ^^^^^^^^^^^^^^^ not found in this scope
  1200. 500.50 s [alphal00p-docs-cargo]
  1201. 500.50 s [alphal00p-docs-cargo] Some errors have detailed explanations: E0425, E0432, E0433.
  1202. 500.50 s [alphal00p-docs-cargo] For more information about an error, try `rustc --explain E0425`.
  1203. 500.52 s [alphal00p-docs-cargo] error: could not compile `numerica` (lib) due to 29 previous errors
  1204. 500.52 s [alphal00p-docs-cargo] warning: build failed, waiting for other jobs to finish...
  1205. 693.78 s Progress: 0 of 1 built (1 failed)
  1206. 693.78 s Failed to build alphal00p-docs-cargo after 11m31s
  1207. 693.79 s Cannot build '/nix/store/8y99gpj1qs95jysr3c6kccvh7lrd78i4-alphal00p-docs-cargo-0.1.0.drv'.
  1208. 693.79 s Reason: builder failed with exit code 101.
  1209. 693.79 s Output paths:
  1210. 693.79 s /nix/store/fqkj46cxkiacfpx0ka5kpgqxjp46xnvs-alphal00p-docs-cargo-0.1.0
  1211. 693.79 s Last 1200 log lines:
  1212. 693.79 s > cargoArtifacts not set, will not reuse any cargo artifacts
  1213. 693.79 s > Running phase: unpackPhase
  1214. 693.79 s > unpacking source archive /nix/store/4pklqwhrgb01wfp3djh4jb2wr4xr9ila-source
  1215. 693.79 s > source root is source
  1216. 693.79 s > Running phase: patchPhase
  1217. 693.79 s > Executing configureCargoCommonVars
  1218. 693.79 s > Running phase: updateAutotoolsGnuConfigScriptsPhase
  1219. 693.79 s > Running phase: configurePhase
  1220. 693.79 s > will append /build/source/.cargo-home/config.toml with contents of /nix/store/9rqk4093qnvgswmdk1pbxk9najcrjn7a-vendor-cargo-deps/config.toml
  1221. 693.79 s > default configurePhase, nothing to do
  1222. 693.79 s > Running phase: buildPhase
  1223. 693.79 s > +++ command cargo --version
  1224. 693.79 s > cargo 1.98.1 (797e8a9bc 2026-08-05)
  1225. 693.79 s > +++ command cargo build --profile docs --locked -p alphal00p-docs-catalogs --bin alphal00p-docs-catalogs
  1226. 693.79 s > Compiling proc-macro2 v1.0.106
  1227. 693.79 s > Compiling unicode-ident v1.0.24
  1228. 693.79 s > Compiling quote v1.0.45
  1229. 693.79 s > Compiling serde_core v1.0.228
  1230. 693.79 s > Compiling memchr v2.8.0
  1231. 693.79 s > Compiling utf8parse v0.2.2
  1232. 693.79 s > Compiling zmij v1.0.21
  1233. 693.79 s > Compiling serde_json v1.0.149
  1234. 693.79 s > Compiling anstyle v1.0.14
  1235. 693.79 s > Compiling serde v1.0.228
  1236. 693.79 s > Compiling thiserror v2.0.18
  1237. 693.79 s > Compiling anstyle-query v1.1.5
  1238. 693.79 s > Compiling colorchoice v1.0.5
  1239. 693.79 s > Compiling is_terminal_polyfill v1.70.2
  1240. 693.79 s > Compiling equivalent v1.0.2
  1241. 693.79 s > Compiling eyre v0.6.12
  1242. 693.79 s > Compiling anstyle-parse v1.0.0
  1243. 693.79 s > Compiling regex-syntax v0.8.10
  1244. 693.79 s > Compiling heck v0.5.0
  1245. 693.79 s > Compiling strsim v0.11.1
  1246. 693.79 s > Compiling clap_lex v1.1.0
  1247. 693.79 s > Compiling itoa v1.0.18
  1248. 693.79 s > Compiling hashbrown v0.17.1
  1249. 693.79 s > Compiling anstream v1.0.0
  1250. 693.79 s > Compiling indenter v0.3.4
  1251. 693.79 s > Compiling once_cell v1.21.4
  1252. 693.79 s > Compiling aho-corasick v1.1.4
  1253. 693.79 s > Compiling clap_builder v4.6.0
  1254. 693.79 s > Compiling syn v2.0.117
  1255. 693.79 s > Compiling regex-automata v0.4.14
  1256. 693.79 s > Compiling indexmap v2.14.0
  1257. 693.79 s > Compiling serde_derive v1.0.228
  1258. 693.79 s > Compiling thiserror-impl v2.0.18
  1259. 693.79 s > Compiling clap_derive v4.6.1
  1260. 693.79 s > Compiling alphal00p-docs-macros v0.1.0 (/build/source/crates/alphal00p-docs-macros)
  1261. 693.79 s > Compiling regex v1.12.3
  1262. 693.79 s > Compiling clap v4.6.1
  1263. 693.79 s > Compiling alphal00p-docs-schema v0.1.0 (/build/source/crates/alphal00p-docs-schema)
  1264. 693.79 s > Compiling alphal00p-docs-catalogs v0.1.0 (/build/source/crates/alphal00p-docs-catalogs)
  1265. 693.79 s > Finished `docs` profile [unoptimized] target(s) in 9.48s
  1266. 693.79 s > +++ command cargo build --profile docs --locked -p alphal00p-docs-python-exporter --features gammaloop
  1267. 693.79 s > Compiling serde_core v1.0.228
  1268. 693.79 s > Compiling libc v0.2.186
  1269. 693.79 s > Compiling cfg-if v1.0.4
  1270. 693.79 s > Compiling serde v1.0.228
  1271. 693.79 s > Compiling memchr v2.8.0
  1272. 693.79 s > Compiling autocfg v1.5.0
  1273. 693.79 s > Compiling libm v0.2.16
  1274. 693.79 s > Compiling version_check v0.9.5
  1275. 693.79 s > Compiling either v1.15.0
  1276. 693.79 s > Compiling zerocopy v0.8.48
  1277. 693.79 s > Compiling crossbeam-utils v0.8.21
  1278. 693.79 s > Compiling log v0.4.29
  1279. 693.79 s > Compiling unicode-width v0.2.2
  1280. 693.79 s > Compiling rayon-core v1.13.0
  1281. 693.79 s > Compiling foldhash v0.2.0
  1282. 693.79 s > Compiling syn v2.0.117
  1283. 693.79 s > Compiling syn v3.0.4
  1284. 693.79 s > Compiling target-lexicon v0.13.5
  1285. 693.79 s > Compiling serde_json v1.0.149
  1286. 693.79 s > Compiling lazy_static v1.5.0
  1287. 693.79 s > Compiling getrandom v0.3.4
  1288. 693.79 s > Compiling paste v1.0.15
  1289. 693.79 s > Compiling siphasher v1.0.2
  1290. 693.79 s > Compiling crunchy v0.2.4
  1291. 693.79 s > Compiling num-traits v0.2.19
  1292. 693.79 s > Compiling tiny-keccak v2.0.2
  1293. 693.79 s > Compiling anyhow v1.0.102
  1294. 693.79 s > Compiling itertools v0.14.0
  1295. 693.79 s > Compiling aho-corasick v1.1.4
  1296. 693.79 s > Compiling static_assertions v1.1.0
  1297. 693.79 s > Compiling rustix v1.1.4
  1298. 693.79 s > Compiling num-conv v0.2.1
  1299. 693.79 s > Compiling powerfmt v0.2.0
  1300. 693.79 s > Compiling crossbeam-epoch v0.9.18
  1301. 693.79 s > Compiling time-core v0.1.8
  1302. 693.79 s > Compiling linux-raw-sys v0.12.1
  1303. 693.79 s > Compiling deranged v0.5.8
  1304. 693.79 s > Compiling time-macros v0.2.27
  1305. 693.79 s > Compiling crossbeam-deque v0.8.6
  1306. 693.79 s > Compiling num_threads v0.1.7
  1307. 693.79 s > Compiling allocator-api2 v0.2.21
  1308. 693.79 s > Compiling tracing-core v0.1.36
  1309. 693.79 s > Compiling pyo3-build-config v0.28.3
  1310. 693.79 s > Compiling virtue v0.0.18
  1311. 693.79 s > Compiling winnow v1.0.2
  1312. 693.79 s > Compiling hashbrown v0.16.1
  1313. 693.79 s > Compiling regex-automata v0.4.14
  1314. 693.79 s > Compiling rayon v1.12.0
  1315. 693.79 s > Compiling arrayvec v0.7.6
  1316. 693.79 s > Compiling getrandom v0.2.17
  1317. 693.79 s > Compiling bincode_derive v2.0.1
  1318. 693.79 s > Compiling num-integer v0.1.46
  1319. 693.79 s > Compiling approx v0.5.1
  1320. 693.79 s > Compiling rand_core v0.6.4
  1321. 693.79 s > Compiling rand_core v0.9.5
  1322. 693.79 s > Compiling phf_shared v0.11.3
  1323. 693.79 s > Compiling toml_writer v1.1.1+spec-1.1.0
  1324. 693.79 s > Compiling time v0.3.47
  1325. 693.79 s > Compiling gmp-mpfr-sys v1.7.1
  1326. 693.79 s > Compiling unty v0.0.4
  1327. 693.79 s > Compiling pin-project-lite v0.2.17
  1328. 693.79 s > Compiling nu-ansi-term v0.50.3
  1329. 693.79 s > Compiling tracing-log v0.2.0
  1330. 693.79 s > Compiling toml_parser v1.1.2+spec-1.1.0
  1331. 693.79 s > Compiling matrixmultiply v0.3.10
  1332. 693.79 s > Compiling sharded-slab v0.1.7
  1333. 693.79 s > Compiling hashbrown v0.17.1
  1334. 693.79 s > Compiling thread_local v1.1.9
  1335. 693.79 s > Compiling syn v1.0.109
  1336. 693.79 s > Compiling rug v1.30.0
  1337. 693.79 s > Compiling option-ext v0.2.0
  1338. 693.79 s > Compiling typenum v1.20.0
  1339. 693.79 s > Compiling dirs-sys v0.5.0
  1340. 693.79 s > Compiling bitflags v2.11.1
  1341. 693.79 s > Compiling serde_spanned v1.1.1
  1342. 693.79 s > Compiling toml_datetime v1.1.1+spec-1.1.0
  1343. 693.79 s > Compiling num-complex v0.4.6
  1344. 693.79 s > Compiling rawpointer v0.2.1
  1345. 693.79 s > Compiling fnv v1.0.7
  1346. 693.79 s > Compiling pyo3-ffi v0.28.3
  1347. 693.79 s > Compiling az v1.3.0
  1348. 693.79 s > Compiling alloc-no-stdlib v2.0.4
  1349. 693.79 s > Compiling dyn-clone v1.0.20
  1350. 693.79 s > Compiling alloc-stdlib v0.2.2
  1351. 693.79 s > Compiling bytemuck_derive v1.12.0
  1352. 693.79 s > Compiling pyo3-macros-backend v0.28.3
  1353. 693.79 s > Compiling num-bigint v0.4.6
  1354. 693.79 s > Compiling generic-array v0.14.7
  1355. 693.79 s > Compiling colored v3.1.1
  1356. 693.79 s > Compiling bitflags v1.3.2
  1357. 693.79 s > Compiling errno v0.3.14
  1358. 693.79 s > Compiling getopts v0.2.24
  1359. 693.79 s > Compiling signal-hook v0.3.18
  1360. 693.79 s > Compiling same-file v1.0.6
  1361. 693.79 s > Compiling ident_case v1.0.1
  1362. 693.79 s > Compiling parking_lot_core v0.9.12
  1363. 693.79 s > Compiling walkdir v2.5.0
  1364. 693.79 s > Compiling indexmap v2.14.0
  1365. 693.79 s > Compiling synstructure v0.13.2
  1366. 693.79 s > Compiling signal-hook-registry v1.4.8
  1367. 693.79 s > Compiling region v3.0.2
  1368. 693.79 s > Compiling toml v1.1.2+spec-1.1.0
  1369. 693.79 s > Compiling const-random-macro v0.1.16
  1370. 693.79 s > Compiling vte v0.14.1
  1371. 693.79 s > Compiling wasmtime-jit-icache-coherence v34.0.2
  1372. 693.79 s > Compiling hugepage-rs v0.1.1
  1373. 693.79 s > Compiling smartstring v1.0.1
  1374. 693.79 s > Compiling ahash v0.8.12
  1375. 693.79 s > Compiling spec_math v0.1.6
  1376. 693.79 s > Compiling scopeguard v1.2.0
  1377. 693.79 s > Compiling unic-char-range v0.9.0
  1378. 693.79 s > Compiling unic-common v0.9.0
  1379. 693.79 s > Compiling inventory v0.3.24
  1380. 693.79 s > Compiling unic-ucd-version v0.9.0
  1381. 693.79 s > Compiling unic-char-property v0.9.0
  1382. 693.79 s > Compiling matchers v0.2.0
  1383. 693.79 s > Compiling regex v1.12.3
  1384. 693.79 s > Compiling const-random v0.1.18
  1385. 693.79 s > Compiling bytemuck v1.25.0
  1386. 693.79 s > Compiling lock_api v0.4.14
  1387. 693.79 s > Compiling brotli-decompressor v5.0.0
  1388. 693.79 s > Compiling mio v1.2.0
  1389. 693.79 s > Compiling terminal_size v0.4.4
  1390. 693.79 s > Compiling rustpython-parser-vendored v0.4.0
  1391. 693.79 s > Compiling safe_arch v0.7.4
  1392. 693.79 s > Compiling safe_arch v1.2.0
  1393. 693.79 s > Compiling itertools v0.11.0
  1394. 693.79 s > Compiling unicase v2.9.0
  1395. 693.79 s > Compiling minimal-lexical v0.2.1
  1396. 693.79 s > Compiling indenter v0.3.4
  1397. 693.79 s > Compiling rustix v0.38.44
  1398. 693.79 s > Compiling fastrand v2.4.1
  1399. 693.79 s > Compiling winnow v0.7.15
  1400. 693.79 s > Compiling wide v0.7.33
  1401. 693.79 s > Compiling iana-time-zone v0.1.65
  1402. 693.79 s > Compiling nom v7.1.3
  1403. 693.79 s > Compiling wide v1.7.0
  1404. 693.79 s > Compiling clap_builder v4.6.0
  1405. 693.79 s > Compiling signal-hook-mio v0.2.5
  1406. 693.79 s > Compiling crypto-common v0.1.7
  1407. 693.79 s > Compiling block-buffer v0.10.4
  1408. 693.79 s > Compiling brotli v8.0.2
  1409. 693.79 s > Compiling numpy v0.28.0
  1410. 693.79 s > Compiling directories v6.0.0
  1411. 693.79 s > Compiling phf v0.11.3
  1412. 693.79 s > Compiling serde_derive v1.0.228
  1413. 693.79 s > Compiling zerocopy-derive v0.8.48
  1414. 693.79 s > Compiling tracing-attributes v0.1.31
  1415. 693.79 s > Compiling thiserror-impl v2.0.18
  1416. 693.79 s > Compiling strum_macros v0.27.2
  1417. 693.79 s > Compiling is-macro v0.3.7
  1418. 693.79 s > Compiling clap_derive v4.6.1
  1419. 693.79 s > Compiling simba v0.9.1
  1420. 693.79 s > Compiling zerofrom-derive v0.1.7
  1421. 693.79 s > Compiling libloading v0.9.0
  1422. 693.79 s > Compiling rustpython-parser-core v0.4.0
  1423. 693.79 s > Compiling ed25519-compact v2.4.2
  1424. 693.79 s > Compiling rustc-hash v2.1.2
  1425. 693.79 s > Compiling tracing v0.1.44
  1426. 693.79 s > Compiling self_cell v1.2.2
  1427. 693.79 s > Compiling thiserror v2.0.18
  1428. 693.79 s > Compiling data-encoding v2.11.1
  1429. 693.79 s > Compiling byteorder v1.5.0
  1430. 693.79 s > Compiling linux-raw-sys v0.4.15
  1431. 693.79 s > Compiling append-only-vec v0.1.8
  1432. 693.79 s > Compiling unicode-segmentation v1.13.2
  1433. 693.79 s > Compiling tinyjson v2.5.1
  1434. 693.79 s > Compiling bytes v1.11.1
  1435. 693.79 s > Compiling rustpython-ast v0.4.0
  1436. 693.79 s > Compiling ansitok v0.3.0
  1437. 693.79 s > Compiling yoke-derive v0.8.2
  1438. 693.79 s > Compiling strum v0.27.2
  1439. 693.79 s > Compiling digest v0.10.7
  1440. 693.79 s > Compiling unic-emoji-char v0.9.0
  1441. 693.79 s > Compiling unic-ucd-ident v0.9.0
  1442. 693.79 s > Compiling pyo3 v0.28.3
  1443. 693.79 s > Compiling bstr v1.12.1
  1444. 693.79 s > Compiling zerofrom v0.1.8
  1445. 693.79 s > Compiling clap v4.6.1
  1446. 693.79 s > Compiling phf_shared v0.13.1
  1447. 693.79 s > Compiling rustc-hash v1.1.0
  1448. 693.79 s > Compiling ciborium-io v0.2.2
  1449. 693.79 s > Compiling plotters-backend v0.3.7
  1450. 693.79 s > Compiling typeid v1.0.3
  1451. 693.79 s > Compiling stable_deref_trait v1.2.1
  1452. 693.79 s > Compiling getrandom v0.4.2
  1453. 693.79 s > Compiling cpufeatures v0.2.17
  1454. 693.79 s > Compiling pyo3-macros v0.28.3
  1455. 693.79 s > Compiling lalrpop-util v0.20.2
  1456. 693.79 s > Compiling plotters-svg v0.3.7
  1457. 693.79 s > Compiling sha2 v0.10.9
  1458. 693.79 s > Compiling eyre v0.6.12
  1459. 693.79 s > Compiling num-rational v0.4.2
  1460. 693.79 s > Compiling globset v0.4.18
  1461. 693.79 s > Compiling zerovec-derive v0.11.6
  1462. 693.79 s > Compiling toml_datetime v0.7.5+spec-1.1.0
  1463. 693.79 s > Compiling console v0.16.3
  1464. 693.79 s > Compiling itertools v0.10.5
  1465. 693.79 s > Compiling toml_write v0.1.2
  1466. 693.79 s > Compiling ucd-trie v0.1.7
  1467. 693.79 s > Compiling adler2 v2.0.1
  1468. 693.79 s > Compiling symbolica v2.2.0 (https://github.com/symbolica-dev/symbolica?rev=4f1323185fe5e0c0f8c864ab89edd1905e7adef1#4f132318)
  1469. 693.79 s > Compiling rustversion v1.0.22
  1470. 693.79 s > Compiling cast v0.3.0
  1471. 693.79 s > Compiling simd-adler32 v0.3.10
  1472. 693.79 s > Compiling pest v2.8.6
  1473. 693.79 s > Compiling rust-embed-utils v8.11.0
  1474. 693.79 s > Compiling yoke v0.8.3
  1475. 693.79 s > Compiling miniz_oxide v0.8.9
  1476. 693.79 s > Compiling toml v0.9.12+spec-1.1.0
  1477. 693.79 s > Compiling plotters v0.3.7
  1478. 693.79 s > Compiling ansi-str v0.9.0
  1479. 693.79 s > Compiling ndarray v0.17.2
  1480. 693.79 s > Compiling displaydoc v0.2.7
  1481. 693.79 s > Compiling smallvec v1.15.1
  1482. 693.79 s > Compiling bincode v2.0.1
  1483. 693.79 s > Compiling tracing-serde v0.2.0
  1484. 693.79 s > Compiling tracing-subscriber v0.3.23
  1485. 693.79 s > Compiling chrono v0.4.44
  1486. 693.79 s > Compiling parking_lot v0.12.5
  1487. 693.79 s > Compiling toml_datetime v0.6.11
  1488. 693.79 s > Compiling serde_spanned v0.6.9
  1489. 693.79 s > Compiling crossterm v0.28.1
  1490. 693.79 s > Compiling toml_edit v0.22.27
  1491. 693.79 s > Compiling xprec v0.2.2
  1492. 693.79 s > Compiling zerovec v0.11.8
  1493. 693.79 s > Compiling criterion-plot v0.5.0
  1494. 693.79 s > Compiling bincode-trait-derive v0.1.1
  1495. 693.79 s > Compiling tinytemplate v1.2.1
  1496. 693.79 s > Compiling ppv-lite86 v0.2.21
  1497. 693.79 s > Compiling half v2.7.1
  1498. 693.79 s > Compiling rand_chacha v0.3.1
  1499. 693.79 s > Compiling rand_chacha v0.9.0
  1500. 693.79 s > Compiling rand v0.8.6
  1501. 693.79 s > Compiling ciborium-ll v0.2.2
  1502. 693.79 s > Compiling is-terminal v0.4.17
  1503. 693.79 s > Compiling rand v0.9.4
  1504. 693.79 s > Compiling ciborium v0.2.2
  1505. 693.79 s > Compiling slotmap v1.1.1
  1506. 693.79 s > Compiling bytecount v0.6.9
  1507. 693.79 s > Compiling anes v0.1.6
  1508. 693.79 s > Compiling oorandom v11.1.5
  1509. 693.79 s > Compiling maplit v1.0.2
  1510. 693.79 s > Compiling papergrid v0.18.0
  1511. 693.79 s > Compiling tinystr v0.8.4
  1512. 693.79 s > Compiling pest_meta v2.8.6
  1513. 693.79 s > Compiling ron v0.12.1
  1514. 693.79 s > Compiling tempfile v3.27.0
  1515. 693.79 s > Compiling testing_table v0.3.0
  1516. 693.79 s > Compiling phf_generator v0.11.3
  1517. 693.79 s > Compiling symjit v2.25.6
  1518. 693.79 s > Compiling criterion v0.5.1
  1519. 693.79 s > Compiling tabled_derive v0.12.0
  1520. 693.79 s > Compiling phf_codegen v0.11.3
  1521. 693.79 s > Compiling toml v0.8.23
  1522. 693.79 s > Compiling unicode_names2_generator v1.3.0
  1523. 693.79 s > Compiling rustpython-parser v0.4.0
  1524. 693.79 s > Compiling toml_edit v0.25.11+spec-1.1.0
  1525. 693.79 s > Compiling similar v2.7.0
  1526. 693.79 s > Compiling pest_generator v2.8.6
  1527. 693.79 s > Compiling unic-langid-impl v0.9.6
  1528. 693.79 s > Compiling unicode_names2 v1.3.0
  1529. 693.79 s > Compiling proc-macro2-diagnostics v0.10.1
  1530. 693.79 s > Compiling proc-macro-error-attr v1.0.4
  1531. 693.79 s > Compiling insta v1.47.2
  1532. 693.79 s > Compiling tabled v0.22.0
  1533. 693.79 s > Compiling uncased v0.9.10
  1534. 693.79 s > Compiling slab v0.4.12
  1535. 693.79 s > Compiling strsim v0.10.0
  1536. 693.79 s > Compiling radium v0.7.0
  1537. 693.79 s > Compiling darling_core v0.14.4
  1538. 693.79 s > Compiling pest_derive v2.8.6
  1539. 693.79 s > Compiling darling_core v0.23.0
  1540. 693.79 s > Compiling figment v0.10.19
  1541. 693.79 s > Compiling proc-macro-error v1.0.4
  1542. 693.79 s > Compiling tap v1.0.1
  1543. 693.79 s > Compiling ryu v1.0.23
  1544. 693.79 s > Compiling wyz v0.5.1
  1545. 693.79 s > Compiling castaway v0.2.4
  1546. 693.79 s > Compiling funty v2.0.0
  1547. 693.79 s > Compiling shlex v1.3.0
  1548. 693.79 s > Compiling heck v0.4.1
  1549. 693.79 s > Compiling indoc v2.0.7
  1550. 693.79 s > Compiling instability v0.3.12
  1551. 693.79 s > Compiling find-msvc-tools v0.1.9
  1552. 693.79 s > Compiling bitvec v1.0.1
  1553. 693.79 s > Compiling cc v1.2.61
  1554. 693.79 s > Compiling duplicate v2.0.1
  1555. 693.79 s > Compiling compact_str v0.9.0
  1556. 693.79 s > Compiling dot-parser v0.5.1
  1557. 693.79 s > Compiling unicode-truncate v2.0.1
  1558. 693.79 s > Compiling darling_macro v0.14.4
  1559. 693.79 s > Compiling convert_case v0.10.0
  1560. 693.79 s > Compiling kasuari v0.4.12
  1561. 693.79 s > Compiling serde_repr v0.1.20
  1562. 693.79 s > Compiling env_filter v1.0.1
  1563. 693.79 s > Compiling num-iter v0.1.45
  1564. 693.79 s > Compiling lru v0.16.4
  1565. 693.79 s > Compiling convert_case v0.4.0
  1566. 693.79 s > Compiling ref-ops v0.2.5
  1567. 693.79 s > Compiling jiff v0.2.24
  1568. 693.79 s > Compiling ratatui-core v0.1.0
  1569. 693.79 s > Compiling num v0.4.3
  1570. 693.79 s > Compiling darling v0.14.4
  1571. 693.79 s > Compiling blake3 v1.8.5
  1572. 693.79 s > Compiling darling_macro v0.23.0
  1573. 693.79 s > Compiling derive_builder_core v0.11.2
  1574. 693.79 s > Compiling derive_more v0.99.20
  1575. 693.79 s > Compiling derive_more-impl v2.1.1
  1576. 693.79 s > Compiling duplicate v1.0.0
  1577. 693.79 s > Compiling enum-try-as-inner v0.1.1
  1578. 693.79 s > Compiling delegate v0.12.0
  1579. 693.79 s > Compiling rand_xoshiro v0.6.0
  1580. 693.79 s > Compiling features v0.10.0
  1581. 693.79 s > Compiling colored v2.2.0
  1582. 693.79 s > Compiling owo-colors v4.3.0
  1583. 693.79 s > Compiling portable-atomic v1.13.1
  1584. 693.79 s > Compiling darling v0.23.0
  1585. 693.79 s > Compiling constcat v0.5.1
  1586. 693.79 s > Compiling cfg_aliases v0.2.1
  1587. 693.79 s > Compiling object v0.37.3
  1588. 693.79 s > Compiling thiserror v1.0.69
  1589. 693.79 s > Compiling gat-lending-iterator v0.1.8
  1590. 693.79 s > Compiling litrs v1.0.0
  1591. 693.79 s > Compiling nix v0.31.2
  1592. 693.79 s > Compiling derive_builder_macro v0.11.2
  1593. 693.79 s > Compiling derive_more v2.1.1
  1594. 693.79 s > Compiling rand_distr v0.4.3
  1595. 693.79 s > Compiling simba v0.6.0
  1596. 693.79 s > Compiling phf_generator v0.13.1
  1597. 693.79 s > Compiling nalgebra-macros v0.1.0
  1598. 693.79 s > Compiling thiserror-impl v1.0.69
  1599. 693.79 s > Compiling line-clipping v0.3.7
  1600. 693.79 s > Compiling dirs v6.0.0
  1601. 693.79 s > Compiling document-features v0.2.12
  1602. 693.79 s > Compiling vte v0.15.0
  1603. 693.79 s > Compiling constant_time_eq v0.4.2
  1604. 693.79 s > Compiling ref-cast v1.0.25
  1605. 693.79 s > Compiling gimli v0.32.3
  1606. 693.79 s > Compiling color-spantrace v0.3.0
  1607. 693.79 s > Compiling clarabel v0.11.1
  1608. 693.79 s > Compiling joinery v2.1.0
  1609. 693.79 s > Compiling cpufeatures v0.3.0
  1610. 693.79 s > Compiling arrayref v0.3.9
  1611. 693.79 s > Compiling ratatui-widgets v0.3.0
  1612. 693.79 s > Compiling titlecase v2.2.1
  1613. 693.79 s > Compiling derive_builder v0.11.2
  1614. 693.79 s > Compiling vt100 v0.16.2
  1615. 693.79 s > Compiling phf_macros v0.13.1
  1616. 693.79 s > Compiling tracing-error v0.2.1
  1617. 693.79 s > Compiling crossterm v0.29.0
  1618. 693.79 s > Compiling serde-big-array v0.5.1
  1619. 693.79 s > Compiling ref-cast-impl v1.0.25
  1620. 693.79 s > Compiling delegate v0.13.5
  1621. 693.79 s > Compiling enum_dispatch v0.3.13
  1622. 693.79 s > Compiling serde_derive_internals v0.29.1
  1623. 693.79 s > Compiling amd v0.2.2
  1624. 693.79 s > Compiling subprocess v0.2.15
  1625. 693.79 s > Compiling rust_lisp v0.18.0
  1626. 693.79 s > Compiling vakint v0.1.2 (/build/source/crates/vakint)
  1627. 693.79 s > Compiling env_logger v0.11.10
  1628. 693.79 s > Compiling unit-prefix v0.5.2
  1629. 693.79 s > Compiling base64 v0.22.1
  1630. 693.79 s > Compiling rustc-demangle v0.1.27
  1631. 693.79 s > Compiling semver v1.0.28
  1632. 693.79 s > Compiling indicatif v0.18.4
  1633. 693.79 s > Compiling schemars_derive v1.2.1
  1634. 693.79 s > Compiling phf v0.13.1
  1635. 693.79 s > Compiling string-template-plus v0.4.3
  1636. 693.79 s > Compiling deprecate-until v1.0.0
  1637. 693.79 s > Compiling ratatui-crossterm v0.1.0
  1638. 693.79 s > Compiling ratatui-macros v0.7.0
  1639. 693.79 s > Compiling shellexpand v3.1.2
  1640. 693.79 s > Compiling xpct v0.5.1
  1641. 693.79 s > Compiling addr2line v0.25.1
  1642. 693.79 s > Compiling brotli-decompressor v4.0.3
  1643. 693.79 s > Compiling integer-sqrt v0.1.5
  1644. 693.79 s > Compiling crossbeam-channel v0.5.15
  1645. 693.79 s > Compiling itertools v0.12.1
  1646. 693.79 s > Compiling gammaloop-tracing-filter-macros v0.1.0 (/build/source/crates/gammaloop-tracing-filter-macros)
  1647. 693.79 s > Compiling include_dir_macros v0.7.4
  1648. 693.79 s > Compiling gammalooprs v0.3.4 (/build/source/crates/gammalooprs)
  1649. 693.79 s > Compiling symlink v0.1.0
  1650. 693.79 s > Compiling unsafe-libyaml v0.2.11
  1651. 693.79 s > Compiling version-compare v0.2.1
  1652. 693.79 s > Compiling tracing-appender v0.2.5
  1653. 693.79 s > Compiling ctrlc v3.5.2
  1654. 693.79 s > Compiling pathfinding v4.15.0
  1655. 693.79 s > Compiling rust-embed-impl v8.11.0
  1656. 693.79 s > Compiling tracing-indicatif v0.3.14
  1657. 693.79 s > Compiling ratatui v0.30.0
  1658. 693.79 s > Compiling json5 v0.4.1
  1659. 693.79 s > Compiling include_dir v0.7.4
  1660. 693.79 s > Compiling brotli v7.0.0
  1661. 693.79 s > Compiling strum_macros v0.26.4
  1662. 693.79 s > Compiling serde_yaml v0.9.34+deprecated
  1663. 693.79 s > Compiling typed-index-collections v3.5.0
  1664. 693.79 s > Compiling pyo3-stub-gen-derive v0.17.2
  1665. 693.79 s > Compiling nalgebra v0.29.0
  1666. 693.79 s > Compiling vectorize v0.2.0
  1667. 693.79 s > Compiling clap_complete v4.6.3
  1668. 693.79 s > Compiling fd-lock v4.0.4
  1669. 693.79 s > Compiling strip-ansi-escapes v0.2.1
  1670. 693.79 s > Compiling backtrace v0.3.76
  1671. 693.79 s > Compiling gammaloop-api v0.1.0 (/build/source/crates/gammaloop-api)
  1672. 693.79 s > Compiling itertools v0.13.0
  1673. 693.79 s > Compiling schemars v1.2.1
  1674. 693.79 s > Compiling strum v0.26.3
  1675. 693.79 s > Compiling base62 v2.2.4
  1676. 693.79 s > Compiling ringbuffer v0.16.0
  1677. 693.79 s > Compiling clap_complete_nushell v4.6.0
  1678. 693.79 s > Compiling sysinfo v0.33.1
  1679. 693.79 s > Compiling color-eyre v0.6.5
  1680. 693.79 s > Compiling rust-embed v8.11.0
  1681. 693.79 s > Compiling reedline v0.42.0
  1682. 693.79 s > Compiling pyo3-stub-gen v0.17.2
  1683. 693.79 s > Compiling statrs v0.16.1
  1684. 693.79 s > Compiling momtrop v0.3.0
  1685. 693.79 s > Compiling numerica v3.0.0 (https://github.com/symbolica-dev/symbolica?rev=4f1323185fe5e0c0f8c864ab89edd1905e7adef1#4f132318)
  1686. 693.79 s > Compiling graphica v3.0.0 (https://github.com/symbolica-dev/symbolica?rev=4f1323185fe5e0c0f8c864ab89edd1905e7adef1#4f132318)
  1687. 693.79 s > Compiling symbolica-utils v0.1.0 (/build/source/crates/symbolica-utils)
  1688. 693.79 s > Compiling gammaloop-workspace-hack v0.1.0 (/build/source/crates/gammaloop-workspace-hack)
  1689. 693.79 s > Compiling spenso-macros v0.3.2 (/build/source/crates/spenso-macros)
  1690. 693.79 s > Compiling linnet v0.17.0 (/build/source/crates/linnet)
  1691. 693.79 s > Compiling spenso v0.6.0 (/build/source/crates/spenso)
  1692. 693.79 s > Compiling idenso v0.3.0 (/build/source/crates/idenso)
  1693. 693.79 s > Compiling gammaloop-tracing-filter v0.1.0 (/build/source/crates/gammaloop-tracing-filter)
  1694. 693.79 s > Compiling spenso-hep-lib v0.1.7 (/build/source/crates/spenso-hep-lib)
  1695. 693.79 s > Compiling alphal00p-docs-python-exporter v0.1.0 (/build/source/crates/alphal00p-docs-python-exporter)
  1696. 693.79 s > Finished `docs` profile [unoptimized] target(s) in 3m 19s
  1697. 693.79 s > +++ command cargo build --profile docs --locked -p alphal00p-docs-python-exporter --features linnet
  1698. 693.79 s > Compiling libc v0.2.186
  1699. 693.79 s > Compiling serde_core v1.0.228
  1700. 693.79 s > Compiling zerocopy v0.8.48
  1701. 693.79 s > Compiling log v0.4.29
  1702. 693.79 s > Compiling num-traits v0.2.19
  1703. 693.79 s > Compiling syn v1.0.109
  1704. 693.79 s > Compiling syn v2.0.117
  1705. 693.79 s > Compiling ahash v0.7.8
  1706. 693.79 s > Compiling bytecheck v0.6.12
  1707. 693.79 s > Compiling regex-syntax v0.8.10
  1708. 693.79 s > Compiling simdutf8 v0.1.5
  1709. 693.79 s > Compiling rend v0.4.2
  1710. 693.79 s > Compiling indexmap v2.14.0
  1711. 693.79 s > Compiling ahash v0.8.12
  1712. 693.79 s > Compiling figment v0.10.19
  1713. 693.79 s > Compiling rkyv v0.7.46
  1714. 693.79 s > Compiling either v1.15.0
  1715. 693.79 s > Compiling cgmath v0.18.0
  1716. 693.79 s > Compiling itertools v0.11.0
  1717. 693.79 s > Compiling bincode v2.0.1
  1718. 693.79 s > Compiling pyo3 v0.28.3
  1719. 693.79 s > Compiling venial v0.5.0
  1720. 693.79 s > Compiling rustix v1.1.4
  1721. 693.79 s > Compiling seahash v4.1.0
  1722. 693.79 s > Compiling winnow v1.0.2
  1723. 693.79 s > Compiling arrayvec v0.7.6
  1724. 693.79 s > Compiling bitflags v2.11.1
  1725. 693.79 s > Compiling polycool v0.4.0
  1726. 693.79 s > Compiling toml_writer v1.1.1+spec-1.1.0
  1727. 693.79 s > Compiling toml_parser v1.1.2+spec-1.1.0
  1728. 693.79 s > Compiling winnow v0.7.15
  1729. 693.79 s > Compiling smallvec v1.15.1
  1730. 693.79 s > Compiling linnet-py v0.1.0 (/build/source/crates/linnet-py)
  1731. 693.79 s > Compiling kurbo v0.13.1
  1732. 693.79 s > Compiling num-integer v0.1.46
  1733. 693.79 s > Compiling regex-automata v0.4.14
  1734. 693.79 s > Compiling approx v0.4.0
  1735. 693.79 s > Compiling wasm-minimal-protocol v0.2.0
  1736. 693.79 s > Compiling num-complex v0.4.6
  1737. 693.79 s > Compiling chrono v0.4.44
  1738. 693.79 s > Compiling getrandom v0.2.17
  1739. 693.79 s > Compiling dirs-sys v0.5.0
  1740. 693.79 s > Compiling rand_core v0.6.4
  1741. 693.79 s > Compiling const-random-macro v0.1.16
  1742. 693.79 s > Compiling num-bigint v0.4.6
  1743. 693.79 s > Compiling hashbrown v0.12.3
  1744. 693.79 s > Compiling dirs v6.0.0
  1745. 693.79 s > Compiling pyo3-ffi v0.28.3
  1746. 693.79 s > Compiling shellexpand v3.1.2
  1747. 693.79 s > Compiling getrandom v0.4.2
  1748. 693.79 s > Compiling const-random v0.1.18
  1749. 693.79 s > Compiling toml_datetime v0.7.5+spec-1.1.0
  1750. 693.79 s > Compiling serde_spanned v1.1.1
  1751. 693.79 s > Compiling serde_json v1.0.149
  1752. 693.79 s > Compiling tempfile v3.27.0
  1753. 693.79 s > Compiling toml v0.9.12+spec-1.1.0
  1754. 693.79 s > Compiling ptr_meta_derive v0.1.4
  1755. 693.79 s > Compiling bytecheck_derive v0.6.12
  1756. 693.79 s > Compiling rkyv_derive v0.7.46
  1757. 693.79 s > Compiling globset v0.4.18
  1758. 693.79 s > Compiling ptr_meta v0.1.4
  1759. 693.79 s > Compiling rust-embed-utils v8.11.0
  1760. 693.79 s > Compiling pest_generator v2.8.6
  1761. 693.79 s > Compiling pyo3-macros-backend v0.28.3
  1762. 693.79 s > Compiling proc-macro2-diagnostics v0.10.1
  1763. 693.79 s > Compiling zerocopy-derive v0.8.48
  1764. 693.79 s > Compiling serde_derive v1.0.228
  1765. 693.79 s > Compiling is-macro v0.3.7
  1766. 693.79 s > Compiling thiserror-impl v2.0.18
  1767. 693.79 s > Compiling bincode-trait-derive v0.1.1
  1768. 693.79 s > Compiling duplicate v2.0.1
  1769. 693.79 s > Compiling serde_repr v0.1.20
  1770. 693.79 s > Compiling rust-embed-impl v8.11.0
  1771. 693.79 s > Compiling pest_derive v2.8.6
  1772. 693.79 s > Compiling ppv-lite86 v0.2.21
  1773. 693.79 s > Compiling rand_chacha v0.3.1
  1774. 693.79 s > Compiling rustpython-parser-core v0.4.0
  1775. 693.79 s > Compiling rand v0.8.6
  1776. 693.79 s > Compiling dot-parser v0.5.1
  1777. 693.79 s > Compiling rustpython-ast v0.4.0
  1778. 693.79 s > Compiling thiserror v2.0.18
  1779. 693.79 s > Compiling rust-embed v8.11.0
  1780. 693.79 s > Compiling phf_generator v0.11.3
  1781. 693.79 s > Compiling phf_codegen v0.11.3
  1782. 693.79 s > Compiling unicode_names2_generator v1.3.0
  1783. 693.79 s > Compiling rustpython-parser v0.4.0
  1784. 693.79 s > Compiling unicode_names2 v1.3.0
  1785. 693.79 s > Compiling serde v1.0.228
  1786. 693.79 s > Compiling pyo3-macros v0.28.3
  1787. 693.79 s > Compiling bitvec v1.0.1
  1788. 693.79 s > Compiling half v2.7.1
  1789. 693.79 s > Compiling ciborium-ll v0.2.2
  1790. 693.79 s > Compiling ciborium v0.2.2
  1791. 693.79 s > Compiling kurvst v0.1.0 (/build/source/crates/kurvst)
  1792. 693.79 s > Compiling linnet v0.17.0 (/build/source/crates/linnet)
  1793. 693.79 s > Compiling pyo3-stub-gen-derive v0.17.2
  1794. 693.79 s > Compiling pyo3-stub-gen v0.17.2
  1795. 693.79 s > Compiling linnest v0.1.0 (/build/source/crates/linnest)
  1796. 693.79 s > Compiling alphal00p-docs-python-exporter v0.1.0 (/build/source/crates/alphal00p-docs-python-exporter)
  1797. 693.79 s > Finished `docs` profile [unoptimized] target(s) in 23.00s
  1798. 693.79 s > +++ command cargo build --profile docs --locked -p alphal00p-docs-python-exporter --features spenso
  1799. 693.79 s > Compiling pyo3-build-config v0.28.3
  1800. 693.79 s > Compiling symbolica v2.2.0 (https://github.com/symbolica-dev/symbolica?rev=4f1323185fe5e0c0f8c864ab89edd1905e7adef1#4f132318)
  1801. 693.79 s > Compiling syn v1.0.109
  1802. 693.79 s > Compiling figment v0.10.19
  1803. 693.79 s > Compiling proc-macro-error v1.0.4
  1804. 693.79 s > Compiling duplicate v1.0.0
  1805. 693.79 s > Compiling pyo3-macros-backend v0.28.3
  1806. 693.79 s > Compiling numpy v0.28.0
  1807. 693.79 s > Compiling pyo3-ffi v0.28.3
  1808. 693.79 s > Compiling pyo3 v0.28.3
  1809. 693.79 s > Compiling pyo3-macros v0.28.3
  1810. 693.79 s > Compiling pyo3-stub-gen v0.17.2
  1811. 693.79 s > Compiling numerica v3.0.0 (https://github.com/symbolica-dev/symbolica?rev=4f1323185fe5e0c0f8c864ab89edd1905e7adef1#4f132318)
  1812. 693.79 s > Compiling gammaloop-workspace-hack v0.1.0 (/build/source/crates/gammaloop-workspace-hack)
  1813. 693.79 s > Compiling graphica v3.0.0 (https://github.com/symbolica-dev/symbolica?rev=4f1323185fe5e0c0f8c864ab89edd1905e7adef1#4f132318)
  1814. 693.79 s > Compiling symbolica-utils v0.1.0 (/build/source/crates/symbolica-utils)
  1815. 693.79 s > Compiling tymbolica-atom-payload v0.1.0 (https://github.com/lcnbr/tymbolica?rev=32ae00483b4845161401afac8be755cc336cb2bb#32ae0048)
  1816. 693.79 s > Compiling linnet v0.17.0 (/build/source/crates/linnet)
  1817. 693.79 s > Compiling spenso v0.6.0 (/build/source/crates/spenso)
  1818. 693.79 s > Compiling idenso v0.3.0 (/build/source/crates/idenso)
  1819. 693.79 s > Compiling spenso-hep-lib v0.1.7 (/build/source/crates/spenso-hep-lib)
  1820. 693.79 s > Compiling spynso3 v0.1.2 (/build/source/crates/spynso3)
  1821. 693.79 s > Compiling alphal00p-docs-python-exporter v0.1.0 (/build/source/crates/alphal00p-docs-python-exporter)
  1822. 693.79 s > Finished `docs` profile [unoptimized] target(s) in 2m 02s
  1823. 693.79 s > +++ command cargo build --profile docs --locked -p alphal00p-docs-python-exporter --features idenso
  1824. 693.79 s > Compiling pyo3 v0.28.3
  1825. 693.79 s > Compiling numpy v0.28.0
  1826. 693.79 s > Compiling pyo3-stub-gen v0.17.2
  1827. 693.79 s > Compiling numerica v3.0.0 (https://github.com/symbolica-dev/symbolica?rev=4f1323185fe5e0c0f8c864ab89edd1905e7adef1#4f132318)
  1828. 693.79 s > Compiling graphica v3.0.0 (https://github.com/symbolica-dev/symbolica?rev=4f1323185fe5e0c0f8c864ab89edd1905e7adef1#4f132318)
  1829. 693.79 s > Compiling symbolica v2.2.0 (https://github.com/symbolica-dev/symbolica?rev=4f1323185fe5e0c0f8c864ab89edd1905e7adef1#4f132318)
  1830. 693.79 s > Compiling gammaloop-workspace-hack v0.1.0 (/build/source/crates/gammaloop-workspace-hack)
  1831. 693.79 s > Compiling symbolica-utils v0.1.0 (/build/source/crates/symbolica-utils)
  1832. 693.79 s > Compiling linnet v0.17.0 (/build/source/crates/linnet)
  1833. 693.79 s > Compiling spenso v0.6.0 (/build/source/crates/spenso)
  1834. 693.79 s > Compiling idenso v0.3.0 (/build/source/crates/idenso)
  1835. 693.79 s > Compiling alphal00p-docs-python-exporter v0.1.0 (/build/source/crates/alphal00p-docs-python-exporter)
  1836. 693.79 s > Finished `docs` profile [unoptimized] target(s) in 2m 01s
  1837. 693.79 s > +++ command cargo build --profile docs --locked -p alphal00p-docs-python-exporter --features vakint
  1838. 693.79 s > Compiling libc v0.2.186
  1839. 693.79 s > Compiling tiny-keccak v2.0.2
  1840. 693.79 s > Compiling bytemuck v1.25.0
  1841. 693.79 s > Compiling matrixmultiply v0.3.10
  1842. 693.79 s > Compiling getrandom v0.3.4
  1843. 693.79 s > Compiling num-integer v0.1.46
  1844. 693.79 s > Compiling pyo3 v0.28.3
  1845. 693.79 s > Compiling regex-automata v0.4.14
  1846. 693.79 s > Compiling pyo3-macros-backend v0.28.3
  1847. 693.79 s > Compiling pyo3-ffi v0.28.3
  1848. 693.79 s > Compiling ahash v0.8.12
  1849. 693.79 s > Compiling approx v0.5.1
  1850. 693.79 s > Compiling serde v1.0.228
  1851. 693.79 s > Compiling itertools v0.14.0
  1852. 693.79 s > Compiling gmp-mpfr-sys v1.7.1
  1853. 693.79 s > Compiling smallvec v1.15.1
  1854. 693.79 s > Compiling rayon v1.12.0
  1855. 693.79 s > Compiling safe_arch v0.7.4
  1856. 693.79 s > Compiling safe_arch v1.2.0
  1857. 693.79 s > Compiling tracing-attributes v0.1.31
  1858. 693.79 s > Compiling smartstring v1.0.1
  1859. 693.79 s > Compiling rand_core v0.9.5
  1860. 693.79 s > Compiling phf_shared v0.13.1
  1861. 693.79 s > Compiling fastrand v2.4.1
  1862. 693.79 s > Compiling rand_chacha v0.9.0
  1863. 693.79 s > Compiling wide v1.7.0
  1864. 693.79 s > Compiling rug v1.30.0
  1865. 693.79 s > Compiling symbolica v2.2.0 (https://github.com/symbolica-dev/symbolica?rev=4f1323185fe5e0c0f8c864ab89edd1905e7adef1#4f132318)
  1866. 693.79 s > Compiling wide v0.7.33
  1867. 693.79 s > Compiling rand v0.9.4
  1868. 693.79 s > Compiling ndarray v0.17.2
  1869. 693.79 s > Compiling phf_generator v0.13.1
  1870. 693.79 s > Compiling directories v6.0.0
  1871. 693.79 s > Compiling subprocess v0.2.15
  1872. 693.79 s > Compiling phf_macros v0.13.1
  1873. 693.79 s > Compiling vakint v0.1.2 (/build/source/crates/vakint)
  1874. 693.79 s > Compiling getrandom v0.2.17
  1875. 693.79 s > Compiling rand_core v0.6.4
  1876. 693.79 s > Compiling rand_chacha v0.3.1
  1877. 693.79 s > Compiling phf v0.13.1
  1878. 693.79 s > Compiling rand v0.8.6
  1879. 693.79 s > Compiling simba v0.9.1
  1880. 693.79 s > Compiling tracing v0.1.44
  1881. 693.79 s > Compiling phf_generator v0.11.3
  1882. 693.79 s > Compiling phf_codegen v0.11.3
  1883. 693.79 s > Compiling unicode_names2_generator v1.3.0
  1884. 693.79 s > Compiling rustpython-parser v0.4.0
  1885. 693.79 s > Compiling unicode_names2 v1.3.0
  1886. 693.79 s > Compiling regex v1.12.3
  1887. 693.79 s > Compiling matchers v0.2.0
  1888. 693.79 s > Compiling tracing-subscriber v0.3.23
  1889. 693.79 s > Compiling titlecase v2.2.1
  1890. 693.79 s > Compiling string-template-plus v0.4.3
  1891. 693.79 s > Compiling pyo3-macros v0.28.3
  1892. 693.79 s > Compiling xprec v0.2.2
  1893. 693.79 s > Compiling numpy v0.28.0
  1894. 693.79 s > Compiling pyo3-stub-gen-derive v0.17.2
  1895. 693.79 s > Compiling pyo3-stub-gen v0.17.2
  1896. 693.79 s > Compiling numerica v3.0.0 (https://github.com/symbolica-dev/symbolica?rev=4f1323185fe5e0c0f8c864ab89edd1905e7adef1#4f132318)
  1897. 693.79 s > error: select an integer backend: `integer-gmp` or `integer-malachite`
  1898. 693.79 s > --> /nix/store/9rqk4093qnvgswmdk1pbxk9najcrjn7a-vendor-cargo-deps/bc87b2b0f37b9a43ffdd82e8f11f3e864d9447ccd53a9a964250c3414c3656d9/numerica-3.0.0/src/lib.rs:40:1
  1899. 693.79 s > |
  1900. 693.79 s > 40 | compile_error!("select an integer backend: `integer-gmp` or `integer-malachite`");
  1901. 693.79 s > | ^^^^^^^^^^^^^^^^^^^^^^^^^^^^^^^^^^^^^^^^^^^^^^^^^^^^^^^^^^^^^^^^^^^^^^^^^^^^^^^^^
  1902. 693.79 s >
  1903. 693.79 s > error: select a float backend: `float-mpfr` or `float-astro`
  1904. 693.79 s > --> /nix/store/9rqk4093qnvgswmdk1pbxk9najcrjn7a-vendor-cargo-deps/bc87b2b0f37b9a43ffdd82e8f11f3e864d9447ccd53a9a964250c3414c3656d9/numerica-3.0.0/src/lib.rs:44:1
  1905. 693.79 s > |
  1906. 693.79 s > 44 | compile_error!("select a float backend: `float-mpfr` or `float-astro`");
  1907. 693.79 s > | ^^^^^^^^^^^^^^^^^^^^^^^^^^^^^^^^^^^^^^^^^^^^^^^^^^^^^^^^^^^^^^^^^^^^^^^
  1908. 693.79 s >
  1909. 693.79 s > error[E0432]: unresolved import `implementation::BackendRandState`
  1910. 693.79 s > --> /nix/store/9rqk4093qnvgswmdk1pbxk9najcrjn7a-vendor-cargo-deps/bc87b2b0f37b9a43ffdd82e8f11f3e864d9447ccd53a9a964250c3414c3656d9/numerica-3.0.0/src/domains/backend/integer.rs:1614:33
  1911. 693.79 s > |
  1912. 693.79 s > 1614 | pub(crate) use implementation::{BackendRandState, Complete, RemRounding};
  1913. 693.79 s > | ^^^^^^^^^^^^^^^^ no `BackendRandState` in `domains::backend::integer::implementation`
  1914. 693.79 s > |
  1915. 693.79 s > note: found an item that was configured out
  1916. 693.79 s > --> /nix/store/9rqk4093qnvgswmdk1pbxk9najcrjn7a-vendor-cargo-deps/bc87b2b0f37b9a43ffdd82e8f11f3e864d9447ccd53a9a964250c3414c3656d9/numerica-3.0.0/src/domains/backend/integer.rs:1378:23
  1917. 693.79 s > |
  1918. 693.79 s > 1377 | #[cfg(feature = "integer-malachite")]
  1919. 693.79 s > | ----------------------------- the item is gated behind the `integer-malachite` feature
  1920. 693.79 s > 1378 | pub(crate) struct BackendRandState {
  1921. 693.79 s > | ^^^^^^^^^^^^^^^^
  1922. 693.79 s > note: found an item that was configured out
  1923. 693.79 s > --> /nix/store/9rqk4093qnvgswmdk1pbxk9najcrjn7a-vendor-cargo-deps/bc87b2b0f37b9a43ffdd82e8f11f3e864d9447ccd53a9a964250c3414c3656d9/numerica-3.0.0/src/domains/backend/integer.rs:1413:23
  1924. 693.79 s > |
  1925. 693.79 s > 1412 | #[cfg(feature = "integer-gmp")]
  1926. 693.79 s > | ----------------------- the item is gated behind the `integer-gmp` feature
  1927. 693.79 s > 1413 | pub(crate) struct BackendRandState(rug::rand::RandState<'static>);
  1928. 693.79 s > | ^^^^^^^^^^^^^^^^
  1929. 693.79 s >
  1930. 693.79 s > error[E0432]: unresolved import `implementation::RawMultiPrecisionInteger`
  1931. 693.79 s > --> /nix/store/9rqk4093qnvgswmdk1pbxk9najcrjn7a-vendor-cargo-deps/bc87b2b0f37b9a43ffdd82e8f11f3e864d9447ccd53a9a964250c3414c3656d9/numerica-3.0.0/src/domains/backend/integer.rs:1616:61
  1932. 693.79 s > |
  1933. 693.79 s > 1616 | MultiPrecisionInteger, ParseMultiPrecisionIntegerError, RawMultiPrecisionInteger,
  1934. 693.79 s > | ^^^^^^^^^^^^^^^^^^^^^^^^ no `RawMultiPrecisionInteger` in `domains::backend::integer::implementation`
  1935. 693.79 s > |
  1936. 693.79 s > note: found an item that was configured out
  1937. 693.79 s > --> /nix/store/9rqk4093qnvgswmdk1pbxk9najcrjn7a-vendor-cargo-deps/bc87b2b0f37b9a43ffdd82e8f11f3e864d9447ccd53a9a964250c3414c3656d9/numerica-3.0.0/src/domains/backend/integer.rs:26:14
  1938. 693.79 s > |
  1939. 693.79 s > 25 | #[cfg(feature = "integer-malachite")]
  1940. 693.79 s > | ----------------------------- the item is gated behind the `integer-malachite` feature
  1941. 693.79 s > 26 | pub type RawMultiPrecisionInteger = malachite_nz::integer::Integer;
  1942. 693.79 s > | ^^^^^^^^^^^^^^^^^^^^^^^^
  1943. 693.79 s > note: found an item that was configured out
  1944. 693.79 s > --> /nix/store/9rqk4093qnvgswmdk1pbxk9najcrjn7a-vendor-cargo-deps/bc87b2b0f37b9a43ffdd82e8f11f3e864d9447ccd53a9a964250c3414c3656d9/numerica-3.0.0/src/domains/backend/integer.rs:29:14
  1945. 693.79 s > |
  1946. 693.79 s > 28 | #[cfg(feature = "integer-gmp")]
  1947. 693.79 s > | ----------------------- the item is gated behind the `integer-gmp` feature
  1948. 693.79 s > 29 | pub type RawMultiPrecisionInteger = rug::Integer;
  1949. 693.79 s > | ^^^^^^^^^^^^^^^^^^^^^^^^
  1950. 693.79 s > help: a similar name exists in the module
  1951. 693.79 s > |
  1952. 693.79 s > 1616 - MultiPrecisionInteger, ParseMultiPrecisionIntegerError, RawMultiPrecisionInteger,
  1953. 693.79 s > 1616 + MultiPrecisionInteger, ParseMultiPrecisionIntegerError, MultiPrecisionInteger,
  1954. 693.79 s > |
  1955. 693.79 s >
  1956. 693.79 s > error[E0432]: unresolved imports `implementation::from_be_bytes`, `implementation::to_be_bytes`
  1957. 693.79 s > --> /nix/store/9rqk4093qnvgswmdk1pbxk9najcrjn7a-vendor-cargo-deps/bc87b2b0f37b9a43ffdd82e8f11f3e864d9447ccd53a9a964250c3414c3656d9/numerica-3.0.0/src/domains/backend/integer.rs:1709:33
  1958. 693.79 s > |
  1959. 693.79 s > 1709 | pub(crate) use implementation::{from_be_bytes, to_be_bytes};
  1960. 693.79 s > | ^^^^^^^^^^^^^ ^^^^^^^^^^^ no `to_be_bytes` in `domains::backend::integer::implementation`
  1961. 693.79 s > | |
  1962. 693.79 s > | no `from_be_bytes` in `domains::backend::integer::implementation`
  1963. 693.79 s > |
  1964. 693.79 s > note: found an item that was configured out
  1965. 693.79 s > --> /nix/store/9rqk4093qnvgswmdk1pbxk9najcrjn7a-vendor-cargo-deps/bc87b2b0f37b9a43ffdd82e8f11f3e864d9447ccd53a9a964250c3414c3656d9/numerica-3.0.0/src/domains/backend/integer.rs:1370:19
  1966. 693.79 s > |
  1967. 693.79 s > 1369 | #[cfg(all(feature = "integer-malachite", feature = "bincode"))]
  1968. 693.79 s > | ----------------------------- the item is gated behind the `integer-malachite` feature
  1969. 693.79 s > 1370 | pub(crate) fn from_be_bytes(bytes: &[u8]) -> Result<MultiPrecisionInteger, &'static str> {
  1970. 693.79 s > | ^^^^^^^^^^^^^
  1971. 693.79 s > note: found an item that was configured out
  1972. 693.79 s > --> /nix/store/9rqk4093qnvgswmdk1pbxk9najcrjn7a-vendor-cargo-deps/bc87b2b0f37b9a43ffdd82e8f11f3e864d9447ccd53a9a964250c3414c3656d9/numerica-3.0.0/src/domains/backend/integer.rs:1405:19
  1973. 693.79 s > |
  1974. 693.79 s > 1404 | #[cfg(all(feature = "integer-gmp", feature = "bincode"))]
  1975. 693.79 s > | ----------------------- the item is gated behind the `integer-gmp` feature
  1976. 693.79 s > 1405 | pub(crate) fn from_be_bytes(bytes: &[u8]) -> Result<MultiPrecisionInteger, &'static str> {
  1977. 693.79 s > | ^^^^^^^^^^^^^
  1978. 693.79 s > note: found an item that was configured out
  1979. 693.79 s > --> /nix/store/9rqk4093qnvgswmdk1pbxk9najcrjn7a-vendor-cargo-deps/bc87b2b0f37b9a43ffdd82e8f11f3e864d9447ccd53a9a964250c3414c3656d9/numerica-3.0.0/src/domains/backend/integer.rs:1365:19
  1980. 693.79 s > |
  1981. 693.79 s > 1364 | #[cfg(all(feature = "integer-malachite", feature = "bincode"))]
  1982. 693.79 s > | ----------------------------- the item is gated behind the `integer-malachite` feature
  1983. 693.79 s > 1365 | pub(crate) fn to_be_bytes(value: &MultiPrecisionInteger) -> Vec<u8> {
  1984. 693.79 s > | ^^^^^^^^^^^
  1985. 693.79 s > note: found an item that was configured out
  1986. 693.79 s > --> /nix/store/9rqk4093qnvgswmdk1pbxk9najcrjn7a-vendor-cargo-deps/bc87b2b0f37b9a43ffdd82e8f11f3e864d9447ccd53a9a964250c3414c3656d9/numerica-3.0.0/src/domains/backend/integer.rs:1400:19
  1987. 693.79 s > |
  1988. 693.79 s > 1399 | #[cfg(all(feature = "integer-gmp", feature = "bincode"))]
  1989. 693.79 s > | ----------------------- the item is gated behind the `integer-gmp` feature
  1990. 693.79 s > 1400 | pub(crate) fn to_be_bytes(value: &MultiPrecisionInteger) -> Vec<u8> {
  1991. 693.79 s > | ^^^^^^^^^^^
  1992. 693.79 s >
  1993. 693.79 s > error[E0432]: unresolved imports `crate::domains::backend::float::Assign`, `crate::domains::backend::float::CompleteRound`, `crate::domains::backend::float::Constant`, `crate::domains::backend::float::MultiPrecisionFloat`, `crate::domains::backend::float::Pow`
  1994. 693.79 s > --> /nix/store/9rqk4093qnvgswmdk1pbxk9najcrjn7a-vendor-cargo-deps/bc87b2b0f37b9a43ffdd82e8f11f3e864d9447ccd53a9a964250c3414c3656d9/numerica-3.0.0/src/domains/float/multiprecision.rs:15:9
  1995. 693.79 s > |
  1996. 693.79 s > 15 | Assign, CompleteRound, Constant, MultiPrecisionFloat, MultiPrecisionFloatInteger,
  1997. 693.79 s > | ^^^^^^ ^^^^^^^^^^^^^ ^^^^^^^^ ^^^^^^^^^^^^^^^^^^^ no `MultiPrecisionFloat` in `domains::backend::float`
  1998. 693.79 s > | | | |
  1999. 693.79 s > | | | no `Constant` in `domains::backend::float`
  2000. 693.79 s > | | no `CompleteRound` in `domains::backend::float`
  2001. 693.79 s > | no `Assign` in `domains::backend::float`
  2002. 693.79 s > 16 | MultiPrecisionFloatRational, MultiPrecisionFloatRounding, Pow, RoundingDirection,
  2003. 693.79 s > | ^^^ no `Pow` in `domains::backend::float`
  2004. 693.79 s > |
  2005. 693.79 s > note: found an item that was configured out
  2006. 693.79 s > --> /nix/store/9rqk4093qnvgswmdk1pbxk9najcrjn7a-vendor-cargo-deps/bc87b2b0f37b9a43ffdd82e8f11f3e864d9447ccd53a9a964250c3414c3656d9/numerica-3.0.0/src/domains/backend/float.rs:17:5
  2007. 693.79 s > |
  2008. 693.79 s > 15 | #[cfg(feature = "float-mpfr")]
  2009. 693.79 s > | ---------------------- the item is gated behind the `float-mpfr` feature
  2010. 693.79 s > 16 | pub use rug::{
  2011. 693.79 s > 17 | Assign, Float as MultiPrecisionFloat, Rational as BackendRational,
  2012. 693.79 s > | ^^^^^^
  2013. 693.79 s > note: found an item that was configured out
  2014. 693.79 s > --> /nix/store/9rqk4093qnvgswmdk1pbxk9najcrjn7a-vendor-cargo-deps/bc87b2b0f37b9a43ffdd82e8f11f3e864d9447ccd53a9a964250c3414c3656d9/numerica-3.0.0/src/domains/backend/float.rs:1578:5
  2015. 693.79 s > |
  2016. 693.79 s > 1576 | #[cfg(feature = "float-astro")]
  2017. 693.79 s > | ----------------------- the item is gated behind the `float-astro` feature
  2018. 693.79 s > 1577 | pub use astro::{
  2019. 693.79 s > 1578 | Assign, BackendRational, CompleteRound, Constant, IntoMultiPrecisionFloat, MultiPrecisionFloat,
  2020. 693.79 s > | ^^^^^^
  2021. 693.79 s > note: found an item that was configured out
  2022. 693.79 s > --> /nix/store/9rqk4093qnvgswmdk1pbxk9najcrjn7a-vendor-cargo-deps/bc87b2b0f37b9a43ffdd82e8f11f3e864d9447ccd53a9a964250c3414c3656d9/numerica-3.0.0/src/domains/backend/float.rs:19:11
  2023. 693.79 s > |
  2024. 693.79 s > 15 | #[cfg(feature = "float-mpfr")]
  2025. 693.79 s > | ---------------------- the item is gated behind the `float-mpfr` feature
  2026. 693.79 s > ...
  2027. 693.79 s > 19 | ops::{CompleteRound, Pow},
  2028. 693.79 s > | ^^^^^^^^^^^^^
  2029. 693.79 s > note: found an item that was configured out
  2030. 693.79 s > --> /nix/store/9rqk4093qnvgswmdk1pbxk9najcrjn7a-vendor-cargo-deps/bc87b2b0f37b9a43ffdd82e8f11f3e864d9447ccd53a9a964250c3414c3656d9/numerica-3.0.0/src/domains/backend/float.rs:1578:30
  2031. 693.79 s > |
  2032. 693.79 s > 1576 | #[cfg(feature = "float-astro")]
  2033. 693.79 s > | ----------------------- the item is gated behind the `float-astro` feature
  2034. 693.79 s > 1577 | pub use astro::{
  2035. 693.79 s > 1578 | Assign, BackendRational, CompleteRound, Constant, IntoMultiPrecisionFloat, MultiPrecisionFloat,
  2036. 693.79 s > | ^^^^^^^^^^^^^
  2037. 693.79 s > note: found an item that was configured out
  2038. 693.79 s > --> /nix/store/9rqk4093qnvgswmdk1pbxk9najcrjn7a-vendor-cargo-deps/bc87b2b0f37b9a43ffdd82e8f11f3e864d9447ccd53a9a964250c3414c3656d9/numerica-3.0.0/src/domains/backend/float.rs:18:12
  2039. 693.79 s > |
  2040. 693.79 s > 15 | #[cfg(feature = "float-mpfr")]
  2041. 693.79 s > | ---------------------- the item is gated behind the `float-mpfr` feature
  2042. 693.79 s > ...
  2043. 693.79 s > 18 | float::Constant,
  2044. 693.79 s > | ^^^^^^^^
  2045. 693.79 s > note: found an item that was configured out
  2046. 693.79 s > --> /nix/store/9rqk4093qnvgswmdk1pbxk9najcrjn7a-vendor-cargo-deps/bc87b2b0f37b9a43ffdd82e8f11f3e864d9447ccd53a9a964250c3414c3656d9/numerica-3.0.0/src/domains/backend/float.rs:1578:45
  2047. 693.79 s > |
  2048. 693.79 s > 1576 | #[cfg(feature = "float-astro")]
  2049. 693.79 s > | ----------------------- the item is gated behind the `float-astro` feature
  2050. 693.79 s > 1577 | pub use astro::{
  2051. 693.79 s > 1578 | Assign, BackendRational, CompleteRound, Constant, IntoMultiPrecisionFloat, MultiPrecisionFloat,
  2052. 693.79 s > | ^^^^^^^^
  2053. 693.79 s > note: found an item that was configured out
  2054. 693.79 s > --> /nix/store/9rqk4093qnvgswmdk1pbxk9najcrjn7a-vendor-cargo-deps/bc87b2b0f37b9a43ffdd82e8f11f3e864d9447ccd53a9a964250c3414c3656d9/numerica-3.0.0/src/domains/backend/float.rs:17:22
  2055. 693.79 s > |
  2056. 693.79 s > 15 | #[cfg(feature = "float-mpfr")]
  2057. 693.79 s > | ---------------------- the item is gated behind the `float-mpfr` feature
  2058. 693.79 s > 16 | pub use rug::{
  2059. 693.79 s > 17 | Assign, Float as MultiPrecisionFloat, Rational as BackendRational,
  2060. 693.79 s > | ^^^^^^^^^^^^^^^^^^^
  2061. 693.79 s > note: found an item that was configured out
  2062. 693.79 s > --> /nix/store/9rqk4093qnvgswmdk1pbxk9najcrjn7a-vendor-cargo-deps/bc87b2b0f37b9a43ffdd82e8f11f3e864d9447ccd53a9a964250c3414c3656d9/numerica-3.0.0/src/domains/backend/float.rs:1578:80
  2063. 693.79 s > |
  2064. 693.79 s > 1576 | #[cfg(feature = "float-astro")]
  2065. 693.79 s > | ----------------------- the item is gated behind the `float-astro` feature
  2066. 693.79 s > 1577 | pub use astro::{
  2067. 693.79 s > 1578 | Assign, BackendRational, CompleteRound, Constant, IntoMultiPrecisionFloat, MultiPrecisionFloat,
  2068. 693.79 s > | ^^^^^^^^^^^^^^^^^^^
  2069. 693.79 s > note: found an item that was configured out
  2070. 693.79 s > --> /nix/store/9rqk4093qnvgswmdk1pbxk9najcrjn7a-vendor-cargo-deps/bc87b2b0f37b9a43ffdd82e8f11f3e864d9447ccd53a9a964250c3414c3656d9/numerica-3.0.0/src/domains/backend/float.rs:19:26
  2071. 693.79 s > |
  2072. 693.79 s > 15 | #[cfg(feature = "float-mpfr")]
  2073. 693.79 s > | ---------------------- the item is gated behind the `float-mpfr` feature
  2074. 693.79 s > ...
  2075. 693.79 s > 19 | ops::{CompleteRound, Pow},
  2076. 693.79 s > | ^^^
  2077. 693.79 s > note: found an item that was configured out
  2078. 693.79 s > --> /nix/store/9rqk4093qnvgswmdk1pbxk9najcrjn7a-vendor-cargo-deps/bc87b2b0f37b9a43ffdd82e8f11f3e864d9447ccd53a9a964250c3414c3656d9/numerica-3.0.0/src/domains/backend/float.rs:1579:5
  2079. 693.79 s > |
  2080. 693.79 s > 1576 | #[cfg(feature = "float-astro")]
  2081. 693.79 s > | ----------------------- the item is gated behind the `float-astro` feature
  2082. 693.79 s > ...
  2083. 693.79 s > 1579 | Pow,
  2084. 693.79 s > | ^^^
  2085. 693.79 s >
  2086. 693.79 s > error[E0425]: cannot find type `RawMultiPrecisionInteger` in this scope
  2087. 693.79 s > --> /nix/store/9rqk4093qnvgswmdk1pbxk9najcrjn7a-vendor-cargo-deps/bc87b2b0f37b9a43ffdd82e8f11f3e864d9447ccd53a9a964250c3414c3656d9/numerica-3.0.0/src/domains/backend/integer.rs:52:38
  2088. 693.79 s > |
  2089. 693.79 s > 52 | pub struct MultiPrecisionInteger(RawMultiPrecisionInteger);
  2090. 693.79 s > | ^^^^^^^^^^^^^^^^^^^^^^^^ not found in this scope
  2091. 693.79 s >
  2092. 693.79 s > error[E0425]: cannot find type `RawMultiPrecisionInteger` in this scope
  2093. 693.79 s > --> /nix/store/9rqk4093qnvgswmdk1pbxk9najcrjn7a-vendor-cargo-deps/bc87b2b0f37b9a43ffdd82e8f11f3e864d9447ccd53a9a964250c3414c3656d9/numerica-3.0.0/src/domains/backend/integer.rs:52:38
  2094. 693.79 s > |
  2095. 693.79 s > 52 | pub struct MultiPrecisionInteger(RawMultiPrecisionInteger);
  2096. 693.79 s > | ^^^^^^^^^^^^^^^^^^^^^^^^ not found in this scope
  2097. 693.79 s > |
  2098. 693.79 s > help: you might be missing a type parameter
  2099. 693.79 s > |
  2100. 693.79 s > 52 | pub struct MultiPrecisionInteger<RawMultiPrecisionInteger>(RawMultiPrecisionInteger);
  2101. 693.79 s > | ++++++++++++++++++++++++++
  2102. 693.79 s >
  2103. 693.79 s > error[E0425]: cannot find type `RawMultiPrecisionInteger` in this scope
  2104. 693.79 s > --> /nix/store/9rqk4093qnvgswmdk1pbxk9najcrjn7a-vendor-cargo-deps/bc87b2b0f37b9a43ffdd82e8f11f3e864d9447ccd53a9a964250c3414c3656d9/numerica-3.0.0/src/domains/backend/integer.rs:149:32
  2105. 693.79 s > |
  2106. 693.79 s > 52 | pub struct MultiPrecisionInteger(RawMultiPrecisionInteger);
  2107. 693.79 s > | ----------------------------------------------------------- similarly named struct `MultiPrecisionInteger` defined here
  2108. 693.79 s > ...
  2109. 693.79 s > 149 | pub fn from_raw(value: RawMultiPrecisionInteger) -> Self {
  2110. 693.79 s > | ^^^^^^^^^^^^^^^^^^^^^^^^
  2111. 693.79 s > |
  2112. 693.79 s > help: a struct with a similar name exists
  2113. 693.79 s > |
  2114. 693.79 s > 149 - pub fn from_raw(value: RawMultiPrecisionInteger) -> Self {
  2115. 693.79 s > 149 + pub fn from_raw(value: MultiPrecisionInteger) -> Self {
  2116. 693.79 s > |
  2117. 693.79 s >
  2118. 693.79 s > error[E0425]: cannot find type `RawMultiPrecisionInteger` in this scope
  2119. 693.79 s > --> /nix/store/9rqk4093qnvgswmdk1pbxk9najcrjn7a-vendor-cargo-deps/bc87b2b0f37b9a43ffdd82e8f11f3e864d9447ccd53a9a964250c3414c3656d9/numerica-3.0.0/src/domains/backend/integer.rs:187:34
  2120. 693.79 s > |
  2121. 693.79 s > 52 | pub struct MultiPrecisionInteger(RawMultiPrecisionInteger);
  2122. 693.79 s > | ----------------------------------------------------------- similarly named struct `MultiPrecisionInteger` defined here
  2123. 693.79 s > ...
  2124. 693.79 s > 187 | pub fn as_raw(&self) -> &RawMultiPrecisionInteger {
  2125. 693.79 s > | ^^^^^^^^^^^^^^^^^^^^^^^^
  2126. 693.79 s > |
  2127. 693.79 s > help: a struct with a similar name exists
  2128. 693.79 s > |
  2129. 693.79 s > 187 - pub fn as_raw(&self) -> &RawMultiPrecisionInteger {
  2130. 693.79 s > 187 + pub fn as_raw(&self) -> &MultiPrecisionInteger {
  2131. 693.79 s > |
  2132. 693.79 s >
  2133. 693.79 s > error[E0425]: cannot find type `RawMultiPrecisionInteger` in this scope
  2134. 693.79 s > --> /nix/store/9rqk4093qnvgswmdk1pbxk9najcrjn7a-vendor-cargo-deps/bc87b2b0f37b9a43ffdd82e8f11f3e864d9447ccd53a9a964250c3414c3656d9/numerica-3.0.0/src/domains/backend/integer.rs:193:33
  2135. 693.79 s > |
  2136. 693.79 s > 52 | pub struct MultiPrecisionInteger(RawMultiPrecisionInteger);
  2137. 693.79 s > | ----------------------------------------------------------- similarly named struct `MultiPrecisionInteger` defined here
  2138. 693.79 s > ...
  2139. 693.79 s > 193 | pub fn to_raw(&self) -> RawMultiPrecisionInteger {
  2140. 693.79 s > | ^^^^^^^^^^^^^^^^^^^^^^^^
  2141. 693.79 s > |
  2142. 693.79 s > help: a struct with a similar name exists
  2143. 693.79 s > |
  2144. 693.79 s > 193 - pub fn to_raw(&self) -> RawMultiPrecisionInteger {
  2145. 693.79 s > 193 + pub fn to_raw(&self) -> MultiPrecisionInteger {
  2146. 693.79 s > |
  2147. 693.79 s >
  2148. 693.79 s > error[E0425]: cannot find type `RawMultiPrecisionInteger` in this scope
  2149. 693.79 s > --> /nix/store/9rqk4093qnvgswmdk1pbxk9najcrjn7a-vendor-cargo-deps/bc87b2b0f37b9a43ffdd82e8f11f3e864d9447ccd53a9a964250c3414c3656d9/numerica-3.0.0/src/domains/backend/integer.rs:199:34
  2150. 693.79 s > |
  2151. 693.79 s > 52 | pub struct MultiPrecisionInteger(RawMultiPrecisionInteger);
  2152. 693.79 s > | ----------------------------------------------------------- similarly named struct `MultiPrecisionInteger` defined here
  2153. 693.79 s > ...
  2154. 693.79 s > 199 | pub fn into_raw(self) -> RawMultiPrecisionInteger {
  2155. 693.79 s > | ^^^^^^^^^^^^^^^^^^^^^^^^
  2156. 693.79 s > |
  2157. 693.79 s > help: a struct with a similar name exists
  2158. 693.79 s > |
  2159. 693.79 s > 199 - pub fn into_raw(self) -> RawMultiPrecisionInteger {
  2160. 693.79 s > 199 + pub fn into_raw(self) -> MultiPrecisionInteger {
  2161. 693.79 s > |
  2162. 693.79 s >
  2163. 693.79 s > error[E0425]: cannot find type `RawMultiPrecisionInteger` in this scope
  2164. 693.79 s > --> /nix/store/9rqk4093qnvgswmdk1pbxk9najcrjn7a-vendor-cargo-deps/bc87b2b0f37b9a43ffdd82e8f11f3e864d9447ccd53a9a964250c3414c3656d9/numerica-3.0.0/src/domains/backend/integer.rs:567:27
  2165. 693.79 s > |
  2166. 693.79 s > 52 | pub struct MultiPrecisionInteger(RawMultiPrecisionInteger);
  2167. 693.79 s > | ----------------------------------------------------------- similarly named struct `MultiPrecisionInteger` defined here
  2168. 693.79 s > ...
  2169. 693.79 s > 567 | fn rem_trunc(lhs: RawMultiPrecisionInteger, rhs: RawMultiPrecisionInteger) -> Self {
  2170. 693.79 s > | ^^^^^^^^^^^^^^^^^^^^^^^^
  2171. 693.79 s > |
  2172. 693.79 s > help: a struct with a similar name exists
  2173. 693.79 s > |
  2174. 693.79 s > 567 - fn rem_trunc(lhs: RawMultiPrecisionInteger, rhs: RawMultiPrecisionInteger) -> Self {
  2175. 693.79 s > 567 + fn rem_trunc(lhs: MultiPrecisionInteger, rhs: RawMultiPrecisionInteger) -> Self {
  2176. 693.79 s > |
  2177. 693.79 s >
  2178. 693.79 s > error[E0425]: cannot find type `RawMultiPrecisionInteger` in this scope
  2179. 693.79 s > --> /nix/store/9rqk4093qnvgswmdk1pbxk9najcrjn7a-vendor-cargo-deps/bc87b2b0f37b9a43ffdd82e8f11f3e864d9447ccd53a9a964250c3414c3656d9/numerica-3.0.0/src/domains/backend/integer.rs:567:58
  2180. 693.79 s > |
  2181. 693.79 s > 52 | pub struct MultiPrecisionInteger(RawMultiPrecisionInteger);
  2182. 693.79 s > | ----------------------------------------------------------- similarly named struct `MultiPrecisionInteger` defined here
  2183. 693.79 s > ...
  2184. 693.79 s > 567 | fn rem_trunc(lhs: RawMultiPrecisionInteger, rhs: RawMultiPrecisionInteger) -> Self {
  2185. 693.79 s > | ^^^^^^^^^^^^^^^^^^^^^^^^
  2186. 693.79 s > |
  2187. 693.79 s > help: a struct with a similar name exists
  2188. 693.79 s > |
  2189. 693.79 s > 567 - fn rem_trunc(lhs: RawMultiPrecisionInteger, rhs: RawMultiPrecisionInteger) -> Self {
  2190. 693.79 s > 567 + fn rem_trunc(lhs: RawMultiPrecisionInteger, rhs: MultiPrecisionInteger) -> Self {
  2191. 693.79 s > |
  2192. 693.79 s >
  2193. 693.79 s > error[E0425]: cannot find type `RawMultiPrecisionInteger` in this scope
  2194. 693.79 s > --> /nix/store/9rqk4093qnvgswmdk1pbxk9najcrjn7a-vendor-cargo-deps/bc87b2b0f37b9a43ffdd82e8f11f3e864d9447ccd53a9a964250c3414c3656d9/numerica-3.0.0/src/domains/backend/integer.rs:582:27
  2195. 693.79 s > |
  2196. 693.79 s > 52 | pub struct MultiPrecisionInteger(RawMultiPrecisionInteger);
  2197. 693.79 s > | ----------------------------------------------------------- similarly named struct `MultiPrecisionInteger` defined here
  2198. 693.79 s > ...
  2199. 693.79 s > 582 | fn shl_raw(value: RawMultiPrecisionInteger, rhs: u64) -> RawMultiPrecisionInteger {
  2200. 693.79 s > | ^^^^^^^^^^^^^^^^^^^^^^^^
  2201. 693.79 s > |
  2202. 693.79 s > help: a struct with a similar name exists
  2203. 693.79 s > |
  2204. 693.79 s > 582 - fn shl_raw(value: RawMultiPrecisionInteger, rhs: u64) -> RawMultiPrecisionInteger {
  2205. 693.79 s > 582 + fn shl_raw(value: MultiPrecisionInteger, rhs: u64) -> RawMultiPrecisionInteger {
  2206. 693.79 s > |
  2207. 693.79 s >
  2208. 693.79 s > error[E0425]: cannot find type `RawMultiPrecisionInteger` in this scope
  2209. 693.79 s > --> /nix/store/9rqk4093qnvgswmdk1pbxk9najcrjn7a-vendor-cargo-deps/bc87b2b0f37b9a43ffdd82e8f11f3e864d9447ccd53a9a964250c3414c3656d9/numerica-3.0.0/src/domains/backend/integer.rs:582:66
  2210. 693.79 s > |
  2211. 693.79 s > 52 | pub struct MultiPrecisionInteger(RawMultiPrecisionInteger);
  2212. 693.79 s > | ----------------------------------------------------------- similarly named struct `MultiPrecisionInteger` defined here
  2213. 693.79 s > ...
  2214. 693.79 s > 582 | fn shl_raw(value: RawMultiPrecisionInteger, rhs: u64) -> RawMultiPrecisionInteger {
  2215. 693.79 s > | ^^^^^^^^^^^^^^^^^^^^^^^^
  2216. 693.79 s > |
  2217. 693.79 s > help: a struct with a similar name exists
  2218. 693.79 s > |
  2219. 693.79 s > 582 - fn shl_raw(value: RawMultiPrecisionInteger, rhs: u64) -> RawMultiPrecisionInteger {
  2220. 693.79 s > 582 + fn shl_raw(value: RawMultiPrecisionInteger, rhs: u64) -> MultiPrecisionInteger {
  2221. 693.79 s > |
  2222. 693.79 s >
  2223. 693.79 s > error[E0425]: cannot find type `RawMultiPrecisionInteger` in this scope
  2224. 693.79 s > --> /nix/store/9rqk4093qnvgswmdk1pbxk9najcrjn7a-vendor-cargo-deps/bc87b2b0f37b9a43ffdd82e8f11f3e864d9447ccd53a9a964250c3414c3656d9/numerica-3.0.0/src/domains/backend/integer.rs:590:27
  2225. 693.79 s > |
  2226. 693.79 s > 52 | pub struct MultiPrecisionInteger(RawMultiPrecisionInteger);
  2227. 693.79 s > | ----------------------------------------------------------- similarly named struct `MultiPrecisionInteger` defined here
  2228. 693.79 s > ...
  2229. 693.79 s > 590 | fn shr_raw(value: RawMultiPrecisionInteger, rhs: u64) -> RawMultiPrecisionInteger {
  2230. 693.79 s > | ^^^^^^^^^^^^^^^^^^^^^^^^
  2231. 693.79 s > |
  2232. 693.79 s > help: a struct with a similar name exists
  2233. 693.79 s > |
  2234. 693.79 s > 590 - fn shr_raw(value: RawMultiPrecisionInteger, rhs: u64) -> RawMultiPrecisionInteger {
  2235. 693.79 s > 590 + fn shr_raw(value: MultiPrecisionInteger, rhs: u64) -> RawMultiPrecisionInteger {
  2236. 693.79 s > |
  2237. 693.79 s >
  2238. 693.79 s > error[E0425]: cannot find type `RawMultiPrecisionInteger` in this scope
  2239. 693.79 s > --> /nix/store/9rqk4093qnvgswmdk1pbxk9najcrjn7a-vendor-cargo-deps/bc87b2b0f37b9a43ffdd82e8f11f3e864d9447ccd53a9a964250c3414c3656d9/numerica-3.0.0/src/domains/backend/integer.rs:590:66
  2240. 693.79 s > |
  2241. 693.79 s > 52 | pub struct MultiPrecisionInteger(RawMultiPrecisionInteger);
  2242. 693.79 s > | ----------------------------------------------------------- similarly named struct `MultiPrecisionInteger` defined here
  2243. 693.79 s > ...
  2244. 693.79 s > 590 | fn shr_raw(value: RawMultiPrecisionInteger, rhs: u64) -> RawMultiPrecisionInteger {
  2245. 693.79 s > | ^^^^^^^^^^^^^^^^^^^^^^^^
  2246. 693.79 s > |
  2247. 693.79 s > help: a struct with a similar name exists
  2248. 693.79 s > |
  2249. 693.79 s > 590 - fn shr_raw(value: RawMultiPrecisionInteger, rhs: u64) -> RawMultiPrecisionInteger {
  2250. 693.79 s > 590 + fn shr_raw(value: RawMultiPrecisionInteger, rhs: u64) -> MultiPrecisionInteger {
  2251. 693.79 s > |
  2252. 693.79 s >
  2253. 693.79 s > error[E0425]: cannot find type `RawMultiPrecisionInteger` in this scope
  2254. 693.79 s > --> /nix/store/9rqk4093qnvgswmdk1pbxk9najcrjn7a-vendor-cargo-deps/bc87b2b0f37b9a43ffdd82e8f11f3e864d9447ccd53a9a964250c3414c3656d9/numerica-3.0.0/src/domains/backend/integer.rs:654:15
  2255. 693.79 s > |
  2256. 693.79 s > 52 | pub struct MultiPrecisionInteger(RawMultiPrecisionInteger);
  2257. 693.79 s > | ----------------------------------------------------------- similarly named struct `MultiPrecisionInteger` defined here
  2258. 693.79 s > ...
  2259. 693.79 s > 654 | impl From<RawMultiPrecisionInteger> for MultiPrecisionInteger {
  2260. 693.79 s > | ^^^^^^^^^^^^^^^^^^^^^^^^
  2261. 693.79 s > |
  2262. 693.79 s > help: a struct with a similar name exists
  2263. 693.79 s > |
  2264. 693.79 s > 654 - impl From<RawMultiPrecisionInteger> for MultiPrecisionInteger {
  2265. 693.79 s > 654 + impl From<MultiPrecisionInteger> for MultiPrecisionInteger {
  2266. 693.79 s > |
  2267. 693.79 s > help: you might be missing a type parameter
  2268. 693.79 s > |
  2269. 693.79 s > 654 | impl<RawMultiPrecisionInteger> From<RawMultiPrecisionInteger> for MultiPrecisionInteger {
  2270. 693.79 s > | ++++++++++++++++++++++++++
  2271. 693.79 s >
  2272. 693.79 s > error[E0425]: cannot find type `RawMultiPrecisionInteger` in this scope
  2273. 693.79 s > --> /nix/store/9rqk4093qnvgswmdk1pbxk9najcrjn7a-vendor-cargo-deps/bc87b2b0f37b9a43ffdd82e8f11f3e864d9447ccd53a9a964250c3414c3656d9/numerica-3.0.0/src/domains/backend/integer.rs:656:24
  2274. 693.79 s > |
  2275. 693.79 s > 52 | pub struct MultiPrecisionInteger(RawMultiPrecisionInteger);
  2276. 693.79 s > | ----------------------------------------------------------- similarly named struct `MultiPrecisionInteger` defined here
  2277. 693.79 s > ...
  2278. 693.79 s > 656 | fn from(value: RawMultiPrecisionInteger) -> Self {
  2279. 693.79 s > | ^^^^^^^^^^^^^^^^^^^^^^^^
  2280. 693.79 s > |
  2281. 693.79 s > help: a struct with a similar name exists
  2282. 693.79 s > |
  2283. 693.79 s > 656 - fn from(value: RawMultiPrecisionInteger) -> Self {
  2284. 693.79 s > 656 + fn from(value: MultiPrecisionInteger) -> Self {
  2285. 693.79 s > |
  2286. 693.79 s >
  2287. 693.79 s > error[E0425]: cannot find type `RawMultiPrecisionInteger` in this scope
  2288. 693.79 s > --> /nix/store/9rqk4093qnvgswmdk1pbxk9najcrjn7a-vendor-cargo-deps/bc87b2b0f37b9a43ffdd82e8f11f3e864d9447ccd53a9a964250c3414c3656d9/numerica-3.0.0/src/domains/backend/integer.rs:661:42
  2289. 693.79 s > |
  2290. 693.79 s > 52 | pub struct MultiPrecisionInteger(RawMultiPrecisionInteger);
  2291. 693.79 s > | ----------------------------------------------------------- similarly named struct `MultiPrecisionInteger` defined here
  2292. 693.79 s > ...
  2293. 693.79 s > 661 | impl From<MultiPrecisionInteger> for RawMultiPrecisionInteger {
  2294. 693.79 s > | ^^^^^^^^^^^^^^^^^^^^^^^^
  2295. 693.79 s > |
  2296. 693.79 s > help: a struct with a similar name exists
  2297. 693.79 s > |
  2298. 693.79 s > 661 - impl From<MultiPrecisionInteger> for RawMultiPrecisionInteger {
  2299. 693.79 s > 661 + impl From<MultiPrecisionInteger> for MultiPrecisionInteger {
  2300. 693.79 s > |
  2301. 693.79 s >
  2302. 693.79 s > error[E0433]: cannot find type `RawMultiPrecisionInteger` in this scope
  2303. 693.79 s > --> /nix/store/9rqk4093qnvgswmdk1pbxk9najcrjn7a-vendor-cargo-deps/bc87b2b0f37b9a43ffdd82e8f11f3e864d9447ccd53a9a964250c3414c3656d9/numerica-3.0.0/src/domains/backend/integer.rs:620:13
  2304. 693.79 s > |
  2305. 693.79 s > 620 | RawMultiPrecisionInteger::from_str(s)
  2306. 693.79 s > | ^^^^^^^^^^^^^^^^^^^^^^^^ use of undeclared type `RawMultiPrecisionInteger`
  2307. 693.79 s > |
  2308. 693.79 s > help: a struct with a similar name exists
  2309. 693.79 s > |
  2310. 693.79 s > 620 - RawMultiPrecisionInteger::from_str(s)
  2311. 693.79 s > 620 + MultiPrecisionInteger::from_str(s)
  2312. 693.79 s > |
  2313. 693.79 s >
  2314. 693.79 s > error[E0433]: cannot find type `RawMultiPrecisionInteger` in this scope
  2315. 693.79 s > --> /nix/store/9rqk4093qnvgswmdk1pbxk9najcrjn7a-vendor-cargo-deps/bc87b2b0f37b9a43ffdd82e8f11f3e864d9447ccd53a9a964250c3414c3656d9/numerica-3.0.0/src/domains/backend/integer.rs:674:35
  2316. 693.79 s > |
  2317. 693.79 s > 674 | self.0 == RawMultiPrecisionInteger::from(*other)
  2318. 693.79 s > | ^^^^^^^^^^^^^^^^^^^^^^^^ use of undeclared type `RawMultiPrecisionInteger`
  2319. 693.79 s > ...
  2320. 693.79 s > 702 | impl_cmp_primitive!(i32, i64, i128, u32, u64, u128);
  2321. 693.79 s > | --------------------------------------------------- in this macro invocation
  2322. 693.79 s > |
  2323. 693.79 s > = note: this error originates in the macro `impl_cmp_primitive` (in Nightly builds, run with -Z macro-backtrace for more info)
  2324. 693.79 s > help: a struct with a similar name exists
  2325. 693.79 s > |
  2326. 693.79 s > 674 - self.0 == RawMultiPrecisionInteger::from(*other)
  2327. 693.79 s > 674 + self.0 == MultiPrecisionInteger::from(*other)
  2328. 693.79 s > |
  2329. 693.79 s >
  2330. 693.79 s > error[E0433]: cannot find type `RawMultiPrecisionInteger` in this scope
  2331. 693.79 s > --> /nix/store/9rqk4093qnvgswmdk1pbxk9najcrjn7a-vendor-cargo-deps/bc87b2b0f37b9a43ffdd82e8f11f3e864d9447ccd53a9a964250c3414c3656d9/numerica-3.0.0/src/domains/backend/integer.rs:681:25
  2332. 693.79 s > |
  2333. 693.79 s > 681 | RawMultiPrecisionInteger::from(*self) == other.0
  2334. 693.79 s > | ^^^^^^^^^^^^^^^^^^^^^^^^ use of undeclared type `RawMultiPrecisionInteger`
  2335. 693.79 s > ...
  2336. 693.79 s > 702 | impl_cmp_primitive!(i32, i64, i128, u32, u64, u128);
  2337. 693.79 s > | --------------------------------------------------- in this macro invocation
  2338. 693.79 s > |
  2339. 693.79 s > = note: this error originates in the macro `impl_cmp_primitive` (in Nightly builds, run with -Z macro-backtrace for more info)
  2340. 693.79 s > help: a struct with a similar name exists
  2341. 693.79 s > |
  2342. 693.79 s > 681 - RawMultiPrecisionInteger::from(*self) == other.0
  2343. 693.79 s > 681 + MultiPrecisionInteger::from(*self) == other.0
  2344. 693.79 s > |
  2345. 693.79 s >
  2346. 693.79 s > error[E0433]: cannot find type `RawMultiPrecisionInteger` in this scope
  2347. 693.79 s > --> /nix/store/9rqk4093qnvgswmdk1pbxk9najcrjn7a-vendor-cargo-deps/bc87b2b0f37b9a43ffdd82e8f11f3e864d9447ccd53a9a964250c3414c3656d9/numerica-3.0.0/src/domains/backend/integer.rs:688:45
  2348. 693.79 s > |
  2349. 693.79 s > 688 | self.0.partial_cmp(&RawMultiPrecisionInteger::from(*other))
  2350. 693.79 s > | ^^^^^^^^^^^^^^^^^^^^^^^^ use of undeclared type `RawMultiPrecisionInteger`
  2351. 693.79 s > ...
  2352. 693.79 s > 702 | impl_cmp_primitive!(i32, i64, i128, u32, u64, u128);
  2353. 693.79 s > | --------------------------------------------------- in this macro invocation
  2354. 693.79 s > |
  2355. 693.79 s > = note: this error originates in the macro `impl_cmp_primitive` (in Nightly builds, run with -Z macro-backtrace for more info)
  2356. 693.79 s > help: a struct with a similar name exists
  2357. 693.79 s > |
  2358. 693.79 s > 688 - self.0.partial_cmp(&RawMultiPrecisionInteger::from(*other))
  2359. 693.79 s > 688 + self.0.partial_cmp(&MultiPrecisionInteger::from(*other))
  2360. 693.79 s > |
  2361. 693.79 s >
  2362. 693.79 s > error[E0433]: cannot find type `RawMultiPrecisionInteger` in this scope
  2363. 693.79 s > --> /nix/store/9rqk4093qnvgswmdk1pbxk9najcrjn7a-vendor-cargo-deps/bc87b2b0f37b9a43ffdd82e8f11f3e864d9447ccd53a9a964250c3414c3656d9/numerica-3.0.0/src/domains/backend/integer.rs:695:25
  2364. 693.79 s > |
  2365. 693.79 s > 695 | RawMultiPrecisionInteger::from(*self).partial_cmp(&other.0)
  2366. 693.79 s > | ^^^^^^^^^^^^^^^^^^^^^^^^ use of undeclared type `RawMultiPrecisionInteger`
  2367. 693.79 s > ...
  2368. 693.79 s > 702 | impl_cmp_primitive!(i32, i64, i128, u32, u64, u128);
  2369. 693.79 s > | --------------------------------------------------- in this macro invocation
  2370. 693.79 s > |
  2371. 693.79 s > = note: this error originates in the macro `impl_cmp_primitive` (in Nightly builds, run with -Z macro-backtrace for more info)
  2372. 693.79 s > help: a struct with a similar name exists
  2373. 693.79 s > |
  2374. 693.79 s > 695 - RawMultiPrecisionInteger::from(*self).partial_cmp(&other.0)
  2375. 693.79 s > 695 + MultiPrecisionInteger::from(*self).partial_cmp(&other.0)
  2376. 693.79 s > |
  2377. 693.79 s >
  2378. 693.79 s > error[E0433]: cannot find type `RawMultiPrecisionInteger` in this scope
  2379. 693.79 s > --> /nix/store/9rqk4093qnvgswmdk1pbxk9najcrjn7a-vendor-cargo-deps/bc87b2b0f37b9a43ffdd82e8f11f3e864d9447ccd53a9a964250c3414c3656d9/numerica-3.0.0/src/domains/backend/integer.rs:1180:35
  2380. 693.79 s > |
  2381. 693.79 s > 1180 | MultiPrecisionInteger(RawMultiPrecisionInteger::from((&self.0) & &rhs.0))
  2382. 693.79 s > | ^^^^^^^^^^^^^^^^^^^^^^^^ use of undeclared type `RawMultiPrecisionInteger`
  2383. 693.79 s > |
  2384. 693.79 s > help: a struct with a similar name exists
  2385. 693.79 s > |
  2386. 693.79 s > 1180 - MultiPrecisionInteger(RawMultiPrecisionInteger::from((&self.0) & &rhs.0))
  2387. 693.79 s > 1180 + MultiPrecisionInteger(MultiPrecisionInteger::from((&self.0) & &rhs.0))
  2388. 693.79 s > |
  2389. 693.79 s >
  2390. 693.79 s > error[E0433]: cannot find type `RawMultiPrecisionInteger` in this scope
  2391. 693.79 s > --> /nix/store/9rqk4093qnvgswmdk1pbxk9najcrjn7a-vendor-cargo-deps/bc87b2b0f37b9a43ffdd82e8f11f3e864d9447ccd53a9a964250c3414c3656d9/numerica-3.0.0/src/domains/backend/integer.rs:1212:35
  2392. 693.79 s > |
  2393. 693.79 s > 1212 | MultiPrecisionInteger(RawMultiPrecisionInteger::from(-&self.0))
  2394. 693.79 s > | ^^^^^^^^^^^^^^^^^^^^^^^^ use of undeclared type `RawMultiPrecisionInteger`
  2395. 693.79 s > |
  2396. 693.79 s > help: a struct with a similar name exists
  2397. 693.79 s > |
  2398. 693.79 s > 1212 - MultiPrecisionInteger(RawMultiPrecisionInteger::from(-&self.0))
  2399. 693.79 s > 1212 + MultiPrecisionInteger(MultiPrecisionInteger::from(-&self.0))
  2400. 693.79 s > |
  2401. 693.79 s >
  2402. 693.79 s > error[E0425]: cannot find function `write_lsf_bytes` in this scope
  2403. 693.79 s > --> /nix/store/9rqk4093qnvgswmdk1pbxk9najcrjn7a-vendor-cargo-deps/bc87b2b0f37b9a43ffdd82e8f11f3e864d9447ccd53a9a964250c3414c3656d9/numerica-3.0.0/src/domains/backend/integer.rs:1682:5
  2404. 693.79 s > |
  2405. 693.79 s > 1682 | write_lsf_bytes(value, &mut bytes);
  2406. 693.79 s > | ^^^^^^^^^^^^^^^ not found in this scope
  2407. 693.79 s >
  2408. 693.79 s > Some errors have detailed explanations: E0425, E0432, E0433.
  2409. 693.79 s > For more information about an error, try `rustc --explain E0425`.
  2410. 693.79 s > error: could not compile `numerica` (lib) due to 29 previous errors
  2411. 693.79 s > warning: build failed, waiting for other jobs to finish...
  2412. 693.79 s For full logs, run:
  2413. 693.79 s nix log /nix/store/8y99gpj1qs95jysr3c6kccvh7lrd78i4-alphal00p-docs-cargo-0.1.0.drv
  2414. 693.83 s Build failed.