test packages.x86_64-linux.nix-ci-check-gammaloop-doctest
0.00 s
$ /nix/store/9ypz3flqsrl5xl495mm8h645gadjsxi1-coreutils-9.11/bin/timeout --kill-after=15s 7200s /nix/store/23zk8sgzamrbmj1fday15szf7f2279s8-nix-2.34.7/bin/nix --extra-experimental-features nix-command --extra-experimental-features flakes flake clone git+https://github.com/alphal00p/gammaloop --dest /tmp/nix-ci-worker/stable-pwd/repo/
0.28 s
Cloning into '/tmp/nix-ci-worker/stable-pwd/repo'...
2.56 s
remote: Enumerating objects: 84533
remote: Enumerating objects: 93444, done.
2.67 s
remote: Counting objects: 0% (1/8911)
remote: Counting objects: 1% (90/8911)
remote: Counting objects: 2% (179/8911)
remote: Counting objects: 3% (268/8911)
remote: Counting objects: 4% (357/8911)
remote: Counting objects: 5% (446/8911)
remote: Counting objects: 6% (535/8911)
remote: Counting objects: 7% (624/8911)
remote: Counting objects: 8% (713/8911)
remote: Counting objects: 9% (802/8911)
remote: Counting objects: 10% (892/8911)
remote: Counting objects: 11% (981/8911)
remote: Counting objects: 12% (1070/8911)
remote: Counting objects: 13% (1159/8911)
remote: Counting objects: 14% (1248/8911)
remote: Counting objects: 15% (1337/8911)
remote: Counting objects: 16% (1426/8911)
remote: Counting objects: 17% (1515/8911)
remote: Counting objects: 18% (1604/8911)
remote: Counting objects: 19% (1694/8911)
remote: Counting objects: 20% (1783/8911)
remote: Counting objects: 21% (1872/8911)
remote: Counting objects: 22% (1961/8911)
remote: Counting objects: 23% (2050/8911)
remote: Counting objects: 24% (2139/8911)
remote: Counting objects: 25% (2228/8911)
remote: Counting objects: 26% (2317/8911)
remote: Counting objects: 27% (2406/8911)
remote: Counting objects: 28% (2496/8911)
remote: Counting objects: 29% (2585/8911)
remote: Counting objects: 30% (2674/8911)
remote: Counting objects: 31% (2763/8911)
remote: Counting objects: 32% (2852/8911)
remote: Counting objects: 33% (2941/8911)
remote: Counting objects: 34% (3030/8911)
remote: Counting objects: 35% (3119/8911)
remote: Counting objects: 36% (3208/8911)
remote: Counting objects: 37% (3298/8911)
remote: Counting objects: 38% (3387/8911)
remote: Counting objects: 39% (3476/8911)
remote: Counting objects: 40% (3565/8911)
remote: Counting objects: 41% (3654/8911)
remote: Counting objects: 42% (3743/8911)
remote: Counting objects: 43% (3832/8911)
remote: Counting objects: 44% (3921/8911)
remote: Counting objects: 45% (4010/8911)
remote: Counting objects: 46% (4100/8911)
remote: Counting objects: 47% (4189/8911)
remote: Counting objects: 48% (4278/8911)
remote: Counting objects: 49% (4367/8911)
remote: Counting objects: 50% (4456/8911)
remote: Counting objects: 51% (4545/8911)
remote: Counting objects: 52% (4634/8911)
remote: Counting objects: 53% (4723/8911)
remote: Counting objects: 54% (4812/8911)
remote: Counting objects: 55% (4902/8911)
remote: Counting objects: 56% (4991/8911)
remote: Counting objects: 57% (5080/8911)
remote: Counting objects: 58% (5169/8911)
remote: Counting objects: 59% (5258/8911)
remote: Counting objects: 60% (5347/8911)
remote: Counting objects: 61% (5436/8911)
remote: Counting objects: 62% (5525/8911)
remote: Counting objects: 63% (5614/8911)
remote: Counting objects: 64% (5704/8911)
remote: Counting objects: 65% (5793/8911)
remote: Counting objects: 66% (5882/8911)
remote: Counting objects: 67% (5971/8911)
remote: Counting objects: 68% (6060/8911)
remote: Counting objects: 69% (6149/8911)
remote: Counting objects: 70% (6238/8911)
remote: Counting objects: 71% (6327/8911)
remote: Counting objects: 72% (6416/8911)
remote: Counting objects: 73% (6506/8911)
remote: Counting objects: 74% (6595/8911)
remote: Counting objects: 75% (6684/8911)
remote: Counting objects: 76% (6773/8911)
remote: Counting objects: 77% (6862/8911)
remote: Counting objects: 78% (6951/8911)
remote: Counting objects: 79% (7040/8911)
remote: Counting objects: 80% (7129/8911)
remote: Counting objects: 81% (7218/8911)
remote: Counting objects: 82% (7308/8911)
remote: Counting objects: 83% (7397/8911)
remote: Counting objects: 84% (7486/8911)
remote: Counting objects: 85% (7575/8911)
remote: Counting objects: 86% (7664/8911)
remote: Counting objects: 87% (7753/8911)
remote: Counting objects: 88% (7842/8911)
remote: Counting objects: 89% (7931/8911)
remote: Counting objects: 90% (8020/8911)
remote: Counting objects: 91% (8110/8911)
remote: Counting objects: 92% (8199/8911)
remote: Counting objects: 93% (8288/8911)
remote: Counting objects: 94% (8377/8911)
remote: Counting objects: 95% (8466/8911)
remote: Counting objects: 96% (8555/8911)
remote: Counting objects: 97% (8644/8911)
remote: Counting objects: 98% (8733/8911)
remote: Counting objects: 99% (8822/8911)
remote: Counting objects: 100% (8911/8911)
remote: Counting objects: 100% (8911/8911), done.
4.87 s
remote: Compressing objects: 0% (1/1814)
remote: Compressing objects: 1% (19/1814)
remote: Compressing objects: 2% (37/1814)
remote: Compressing objects: 3% (55/1814)
remote: Compressing objects: 4% (73/1814)
remote: Compressing objects: 5% (91/1814)
remote: Compressing objects: 6% (109/1814)
remote: Compressing objects: 7% (127/1814)
remote: Compressing objects: 7% (139/1814)
remote: Compressing objects: 8% (146/1814)
remote: Compressing objects: 9% (164/1814)
remote: Compressing objects: 10% (182/1814)
remote: Compressing objects: 11% (200/1814)
remote: Compressing objects: 12% (218/1814)
remote: Compressing objects: 13% (236/1814)
remote: Compressing objects: 14% (254/1814)
remote: Compressing objects: 15% (273/1814)
remote: Compressing objects: 16% (291/1814)
remote: Compressing objects: 17% (309/1814)
remote: Compressing objects: 18% (327/1814)
remote: Compressing objects: 19% (345/1814)
remote: Compressing objects: 20% (363/1814)
remote: Compressing objects: 21% (381/1814)
remote: Compressing objects: 22% (400/1814)
remote: Compressing objects: 22% (410/1814)
remote: Compressing objects: 23% (418/1814)
remote: Compressing objects: 24% (436/1814)
remote: Compressing objects: 25% (454/1814)
remote: Compressing objects: 26% (472/1814)
remote: Compressing objects: 27% (490/1814)
remote: Compressing objects: 28% (508/1814)
remote: Compressing objects: 29% (527/1814)
remote: Compressing objects: 30% (545/1814)
remote: Compressing objects: 31% (563/1814)
remote: Compressing objects: 32% (581/1814)
remote: Compressing objects: 33% (599/1814)
remote: Compressing objects: 34% (617/1814)
remote: Compressing objects: 35% (635/1814)
remote: Compressing objects: 36% (654/1814)
remote: Compressing objects: 37% (672/1814)
remote: Compressing objects: 38% (690/1814)
remote: Compressing objects: 39% (708/1814)
remote: Compressing objects: 40% (726/1814)
remote: Compressing objects: 41% (744/1814)
remote: Compressing objects: 42% (762/1814)
remote: Compressing objects: 43% (781/1814)
remote: Compressing objects: 44% (799/1814)
remote: Compressing objects: 45% (817/1814)
remote: Compressing objects: 46% (835/1814)
remote: Compressing objects: 47% (853/1814)
remote: Compressing objects: 48% (871/1814)
remote: Compressing objects: 49% (889/1814)
remote: Compressing objects: 50% (907/1814)
remote: Compressing objects: 51% (926/1814)
remote: Compressing objects: 52% (944/1814)
remote: Compressing objects: 53% (962/1814)
remote: Compressing objects: 54% (980/1814)
remote: Compressing objects: 55% (998/1814)
remote: Compressing objects: 56% (1016/1814)
remote: Compressing objects: 57% (1034/1814)
remote: Compressing objects: 58% (1053/1814)
remote: Compressing objects: 59% (1071/1814)
remote: Compressing objects: 60% (1089/1814)
remote: Compressing objects: 61% (1107/1814)
remote: Compressing objects: 62% (1125/1814)
remote: Compressing objects: 63% (1143/1814)
remote: Compressing objects: 64% (1161/1814)
remote: Compressing objects: 65% (1180/1814)
remote: Compressing objects: 66% (1198/1814)
remote: Compressing objects: 67% (1216/1814)
remote: Compressing objects: 68% (1234/1814)
remote: Compressing objects: 69% (1252/1814)
remote: Compressing objects: 70% (1270/1814)
remote: Compressing objects: 71% (1288/1814)
remote: Compressing objects: 72% (1307/1814)
remote: Compressing objects: 73% (1325/1814)
remote: Compressing objects: 74% (1343/1814)
remote: Compressing objects: 75% (1361/1814)
remote: Compressing objects: 76% (1379/1814)
remote: Compressing objects: 77% (1397/1814)
remote: Compressing objects: 78% (1415/1814)
remote: Compressing objects: 79% (1434/1814)
remote: Compressing objects: 80% (1452/1814)
remote: Compressing objects: 81% (1470/1814)
remote: Compressing objects: 82% (1488/1814)
remote: Compressing objects: 83% (1506/1814)
remote: Compressing objects: 84% (1524/1814)
remote: Compressing objects: 85% (1542/1814)
remote: Compressing objects: 86% (1561/1814)
remote: Compressing objects: 87% (1579/1814)
remote: Compressing objects: 88% (1597/1814)
remote: Compressing objects: 89% (1615/1814)
remote: Compressing objects: 90% (1633/1814)
remote: Compressing objects: 91% (1651/1814)
remote: Compressing objects: 92% (1669/1814)
remote: Compressing objects: 93% (1688/1814)
remote: Compressing objects: 94% (1706/1814)
remote: Compressing objects: 95% (1724/1814)
remote: Compressing objects: 96% (1742/1814)
remote: Compressing objects: 97% (1760/1814)
remote: Compressing objects: 98% (1778/1814)
remote: Compressing objects: 99% (1796/1814)
remote: Compressing objects: 100% (1814/1814)
remote: Compressing objects: 100% (1814/1814), done.
13.64 s
Receiving objects: 0% (1/93444)
Receiving objects: 1% (935/93444)
Receiving objects: 2% (1869/93444)
Receiving objects: 3% (2804/93444)
Receiving objects: 4% (3738/93444)
Receiving objects: 5% (4673/93444)
Receiving objects: 6% (5607/93444)
Receiving objects: 7% (6542/93444)
Receiving objects: 8% (7476/93444), 11.58 MiB | 23.14 MiB/s
Receiving objects: 9% (8410/93444), 11.58 MiB | 23.14 MiB/s
Receiving objects: 10% (9345/93444), 11.58 MiB | 23.14 MiB/s
Receiving objects: 11% (10279/93444), 11.58 MiB | 23.14 MiB/s
Receiving objects: 12% (11214/93444), 11.58 MiB | 23.14 MiB/s
Receiving objects: 13% (12148/93444), 11.58 MiB | 23.14 MiB/s
Receiving objects: 14% (13083/93444), 11.58 MiB | 23.14 MiB/s
Receiving objects: 15% (14017/93444), 11.58 MiB | 23.14 MiB/s
Receiving objects: 16% (14952/93444), 11.58 MiB | 23.14 MiB/s
Receiving objects: 17% (15886/93444), 11.58 MiB | 23.14 MiB/s
Receiving objects: 18% (16820/93444), 11.58 MiB | 23.14 MiB/s
Receiving objects: 19% (17755/93444), 11.58 MiB | 23.14 MiB/s
Receiving objects: 20% (18689/93444), 11.58 MiB | 23.14 MiB/s
Receiving objects: 21% (19624/93444), 11.58 MiB | 23.14 MiB/s
Receiving objects: 22% (20558/93444), 11.58 MiB | 23.14 MiB/s
Receiving objects: 23% (21493/93444), 11.58 MiB | 23.14 MiB/s
Receiving objects: 24% (22427/93444), 11.58 MiB | 23.14 MiB/s
Receiving objects: 25% (23361/93444), 11.58 MiB | 23.14 MiB/s
Receiving objects: 26% (24296/93444), 11.58 MiB | 23.14 MiB/s
Receiving objects: 27% (25230/93444), 11.58 MiB | 23.14 MiB/s
Receiving objects: 28% (26165/93444), 11.58 MiB | 23.14 MiB/s
Receiving objects: 29% (27099/93444), 11.58 MiB | 23.14 MiB/s
Receiving objects: 30% (28034/93444), 11.58 MiB | 23.14 MiB/s
Receiving objects: 31% (28968/93444), 11.58 MiB | 23.14 MiB/s
Receiving objects: 32% (29903/93444), 11.58 MiB | 23.14 MiB/s
Receiving objects: 33% (30837/93444), 11.58 MiB | 23.14 MiB/s
Receiving objects: 33% (31444/93444), 29.30 MiB | 29.26 MiB/s
Receiving objects: 34% (31771/93444), 29.30 MiB | 29.26 MiB/s
Receiving objects: 35% (32706/93444), 29.30 MiB | 29.26 MiB/s
Receiving objects: 36% (33640/93444), 29.30 MiB | 29.26 MiB/s
Receiving objects: 37% (34575/93444), 29.30 MiB | 29.26 MiB/s
Receiving objects: 38% (35509/93444), 29.30 MiB | 29.26 MiB/s
Receiving objects: 39% (36444/93444), 29.30 MiB | 29.26 MiB/s
Receiving objects: 40% (37378/93444), 29.30 MiB | 29.26 MiB/s
Receiving objects: 41% (38313/93444), 29.30 MiB | 29.26 MiB/s
Receiving objects: 42% (39247/93444), 44.70 MiB | 29.77 MiB/s
Receiving objects: 43% (40181/93444), 44.70 MiB | 29.77 MiB/s
Receiving objects: 44% (41116/93444), 44.70 MiB | 29.77 MiB/s
Receiving objects: 45% (42050/93444), 44.70 MiB | 29.77 MiB/s
Receiving objects: 46% (42985/93444), 44.70 MiB | 29.77 MiB/s
Receiving objects: 47% (43919/93444), 44.70 MiB | 29.77 MiB/s
Receiving objects: 48% (44854/93444), 44.70 MiB | 29.77 MiB/s
Receiving objects: 49% (45788/93444), 44.70 MiB | 29.77 MiB/s
Receiving objects: 50% (46722/93444), 44.70 MiB | 29.77 MiB/s
Receiving objects: 50% (47558/93444), 60.14 MiB | 29.91 MiB/s
Receiving objects: 51% (47657/93444), 60.14 MiB | 29.91 MiB/s
Receiving objects: 52% (48591/93444), 60.14 MiB | 29.91 MiB/s
Receiving objects: 53% (49526/93444), 60.14 MiB | 29.91 MiB/s
Receiving objects: 54% (50460/93444), 60.14 MiB | 29.91 MiB/s
Receiving objects: 55% (51395/93444), 60.14 MiB | 29.91 MiB/s
Receiving objects: 56% (52329/93444), 60.14 MiB | 29.91 MiB/s
Receiving objects: 57% (53264/93444), 60.14 MiB | 29.91 MiB/s
Receiving objects: 58% (54198/93444), 77.07 MiB | 30.66 MiB/s
Receiving objects: 59% (55132/93444), 77.07 MiB | 30.66 MiB/s
Receiving objects: 60% (56067/93444), 77.07 MiB | 30.66 MiB/s
Receiving objects: 61% (57001/93444), 77.07 MiB | 30.66 MiB/s
Receiving objects: 61% (57045/93444), 93.89 MiB | 31.10 MiB/s
Receiving objects: 61% (57115/93444), 109.96 MiB | 31.26 MiB/s
Receiving objects: 61% (57208/93444), 159.44 MiB | 32.73 MiB/s
Receiving objects: 62% (57936/93444), 176.49 MiB | 32.59 MiB/s
Receiving objects: 63% (58870/93444), 176.49 MiB | 32.59 MiB/s
Receiving objects: 64% (59805/93444), 176.49 MiB | 32.59 MiB/s
Receiving objects: 65% (60739/93444), 176.49 MiB | 32.59 MiB/s
Receiving objects: 66% (61674/93444), 176.49 MiB | 32.59 MiB/s
Receiving objects: 66% (62148/93444), 176.49 MiB | 32.59 MiB/s
Receiving objects: 67% (62608/93444), 193.14 MiB | 32.85 MiB/s
Receiving objects: 68% (63542/93444), 193.14 MiB | 32.85 MiB/s
Receiving objects: 69% (64477/93444), 193.14 MiB | 32.85 MiB/s
Receiving objects: 70% (65411/93444), 209.71 MiB | 33.17 MiB/s
Receiving objects: 71% (66346/93444), 209.71 MiB | 33.17 MiB/s
Receiving objects: 72% (67280/93444), 209.71 MiB | 33.17 MiB/s
Receiving objects: 73% (68215/93444), 209.71 MiB | 33.17 MiB/s
Receiving objects: 74% (69149/93444), 209.71 MiB | 33.17 MiB/s
Receiving objects: 75% (70083/93444), 209.71 MiB | 33.17 MiB/s
Receiving objects: 76% (71018/93444), 209.71 MiB | 33.17 MiB/s
Receiving objects: 77% (71952/93444), 209.71 MiB | 33.17 MiB/s
Receiving objects: 78% (72887/93444), 209.71 MiB | 33.17 MiB/s
Receiving objects: 79% (73821/93444), 209.71 MiB | 33.17 MiB/s
Receiving objects: 80% (74756/93444), 209.71 MiB | 33.17 MiB/s
Receiving objects: 81% (75690/93444), 209.71 MiB | 33.17 MiB/s
Receiving objects: 81% (75926/93444), 209.71 MiB | 33.17 MiB/s
Receiving objects: 82% (76625/93444), 226.54 MiB | 33.13 MiB/s
Receiving objects: 83% (77559/93444), 243.64 MiB | 33.21 MiB/s
Receiving objects: 84% (78493/93444), 243.64 MiB | 33.21 MiB/s
Receiving objects: 85% (79428/93444), 243.64 MiB | 33.21 MiB/s
Receiving objects: 85% (79910/93444), 243.64 MiB | 33.21 MiB/s
Receiving objects: 86% (80362/93444), 260.70 MiB | 33.43 MiB/s
Receiving objects: 87% (81297/93444), 260.70 MiB | 33.43 MiB/s
Receiving objects: 88% (82231/93444), 260.70 MiB | 33.43 MiB/s
Receiving objects: 89% (83166/93444), 260.70 MiB | 33.43 MiB/s
Receiving objects: 90% (84100/93444), 260.70 MiB | 33.43 MiB/s
Receiving objects: 91% (85035/93444), 260.70 MiB | 33.43 MiB/s
Receiving objects: 92% (85969/93444), 260.70 MiB | 33.43 MiB/s
Receiving objects: 93% (86903/93444), 260.70 MiB | 33.43 MiB/s
Receiving objects: 94% (87838/93444), 260.70 MiB | 33.43 MiB/s
Receiving objects: 95% (88772/93444), 260.70 MiB | 33.43 MiB/s
Receiving objects: 96% (89707/93444), 277.21 MiB | 33.38 MiB/s
Receiving objects: 97% (90641/93444), 277.21 MiB | 33.38 MiB/s
Receiving objects: 98% (91576/93444), 277.21 MiB | 33.38 MiB/s
Receiving objects: 99% (92510/93444), 277.21 MiB | 33.38 MiB/s
remote: Total 93444 (delta 7772), reused 7109 (delta 7093), pack-reused 84533 (from 2)
13.64 s
Receiving objects: 100% (93444/93444), 277.21 MiB | 33.38 MiB/s
Receiving objects: 100% (93444/93444), 284.30 MiB | 32.52 MiB/s, done.
16.15 s
Resolving deltas: 0% (0/63027)
Resolving deltas: 1% (631/63027)
Resolving deltas: 2% (1261/63027)
Resolving deltas: 3% (1891/63027)
Resolving deltas: 4% (2522/63027)
Resolving deltas: 5% (3152/63027)
Resolving deltas: 6% (3782/63027)
Resolving deltas: 7% (4412/63027)
Resolving deltas: 8% (5043/63027)
Resolving deltas: 9% (5673/63027)
Resolving deltas: 10% (6303/63027)
Resolving deltas: 11% (6933/63027)
Resolving deltas: 12% (7564/63027)
Resolving deltas: 13% (8194/63027)
Resolving deltas: 14% (8824/63027)
Resolving deltas: 15% (9455/63027)
Resolving deltas: 16% (10086/63027)
Resolving deltas: 17% (10715/63027)
Resolving deltas: 18% (11345/63027)
Resolving deltas: 19% (11976/63027)
Resolving deltas: 20% (12606/63027)
Resolving deltas: 21% (13236/63027)
Resolving deltas: 22% (13866/63027)
Resolving deltas: 23% (14498/63027)
Resolving deltas: 24% (15127/63027)
Resolving deltas: 25% (15757/63027)
Resolving deltas: 26% (16388/63027)
Resolving deltas: 27% (17018/63027)
Resolving deltas: 28% (17648/63027)
Resolving deltas: 29% (18278/63027)
Resolving deltas: 30% (18909/63027)
Resolving deltas: 31% (19539/63027)
Resolving deltas: 32% (20169/63027)
Resolving deltas: 33% (20799/63027)
Resolving deltas: 34% (21430/63027)
Resolving deltas: 35% (22060/63027)
Resolving deltas: 36% (22690/63027)
Resolving deltas: 37% (23320/63027)
Resolving deltas: 38% (23951/63027)
Resolving deltas: 39% (24581/63027)
Resolving deltas: 40% (25211/63027)
Resolving deltas: 41% (25842/63027)
Resolving deltas: 42% (26473/63027)
Resolving deltas: 43% (27102/63027)
Resolving deltas: 44% (27732/63027)
Resolving deltas: 45% (28363/63027)
Resolving deltas: 46% (28993/63027)
Resolving deltas: 47% (29623/63027)
Resolving deltas: 48% (30253/63027)
Resolving deltas: 49% (30884/63027)
Resolving deltas: 50% (31514/63027)
Resolving deltas: 51% (32144/63027)
Resolving deltas: 52% (32775/63027)
Resolving deltas: 52% (33332/63027)
Resolving deltas: 53% (33405/63027)
Resolving deltas: 54% (34035/63027)
Resolving deltas: 55% (34665/63027)
Resolving deltas: 56% (35296/63027)
Resolving deltas: 57% (35926/63027)
Resolving deltas: 58% (36556/63027)
Resolving deltas: 59% (37186/63027)
Resolving deltas: 60% (37817/63027)
Resolving deltas: 61% (38447/63027)
Resolving deltas: 62% (39077/63027)
Resolving deltas: 63% (39708/63027)
Resolving deltas: 64% (40338/63027)
Resolving deltas: 65% (40968/63027)
Resolving deltas: 66% (41598/63027)
Resolving deltas: 67% (42229/63027)
Resolving deltas: 68% (42859/63027)
Resolving deltas: 69% (43489/63027)
Resolving deltas: 70% (44119/63027)
Resolving deltas: 71% (44750/63027)
Resolving deltas: 72% (45381/63027)
Resolving deltas: 73% (46010/63027)
Resolving deltas: 74% (46640/63027)
Resolving deltas: 75% (47271/63027)
Resolving deltas: 76% (47901/63027)
Resolving deltas: 77% (48531/63027)
Resolving deltas: 78% (49162/63027)
Resolving deltas: 79% (49792/63027)
Resolving deltas: 80% (50422/63027)
Resolving deltas: 81% (51052/63027)
Resolving deltas: 81% (51573/63027)
Resolving deltas: 82% (51683/63027)
Resolving deltas: 83% (52313/63027)
Resolving deltas: 84% (52943/63027)
Resolving deltas: 85% (53573/63027)
Resolving deltas: 86% (54204/63027)
Resolving deltas: 87% (54834/63027)
Resolving deltas: 88% (55464/63027)
Resolving deltas: 89% (56095/63027)
Resolving deltas: 90% (56725/63027)
Resolving deltas: 91% (57355/63027)
Resolving deltas: 92% (57985/63027)
Resolving deltas: 93% (58616/63027)
Resolving deltas: 94% (59246/63027)
Resolving deltas: 95% (59876/63027)
Resolving deltas: 96% (60506/63027)
Resolving deltas: 97% (61137/63027)
Resolving deltas: 98% (61767/63027)
Resolving deltas: 99% (62397/63027)
Resolving deltas: 100% (63027/63027)
Resolving deltas: 100% (63027/63027), done.
16.63 s
Fetching commit 43649e2ed5bc140b6fa2364e5e528f13134be9f5 for simplify-spenso-api ...
16.63 s
$ /nix/store/bcnisk3ydfgv26v2gw3zlky24g00yww2-git-2.54.0/bin/git fetch origin 43649e2ed5bc140b6fa2364e5e528f13134be9f5
17.24 s
From https://github.com/alphal00p/gammaloop
17.24 s
* branch 43649e2ed5bc140b6fa2364e5e528f13134be9f5 -> FETCH_HEAD
17.29 s
$ /nix/store/9ypz3flqsrl5xl495mm8h645gadjsxi1-coreutils-9.11/bin/timeout --kill-after=15s 7200s /nix/store/bcnisk3ydfgv26v2gw3zlky24g00yww2-git-2.54.0/bin/git -c advice.detachedHead=false checkout 43649e2ed5bc140b6fa2364e5e528f13134be9f5
17.60 s
HEAD is now at 43649e2ed align Tymbolica interop with fixed Symbolica main
17.63 s
$ /nix/store/9ypz3flqsrl5xl495mm8h645gadjsxi1-coreutils-9.11/bin/timeout --kill-after=15s 7200s /nix/store/23zk8sgzamrbmj1fday15szf7f2279s8-nix-2.34.7/bin/nix --extra-experimental-features nix-command --extra-experimental-features flakes --log-format internal-json run .#packages.x86_64-linux.nix-ci-check-gammaloop-doctest --print-build-logs
20.45 s
24.88 s
evaluating derivation 'g
copying '/nix/store/iccx
evaluating derivation 'g
querying gammaloop-works
[0.0 KiB DL]
[0 /1 built, 0.0 KiB DL]
[1 /0 /1 built, 0.0 KiB DLgammaloop-workspace-doctest> Running phase: unpackPhase
24.89 s
gammaloop-workspace-doctest> unpacking source archive /nix/store/0b6y73sx10i7jc9h7gv2p4wq7jn4fbkv-source
25.04 s
gammaloop-workspace-doctest> source root is source
25.09 s
gammaloop-workspace-doctest> Running phase: patchPhase
25.11 s
gammaloop-workspace-doctest> Executing configureCargoCommonVars
25.12 s
gammaloop-workspace-doctest> decompressing cargo artifacts from /nix/store/8zs9bds37a34fqlhv8z320b7lfv0rp55-gammaloop-workspace-deps-deps-0.1.0/target.tar.zst to target
28.52 s
gammaloop-workspace-doctest> Running phase: updateAutotoolsGnuConfigScriptsPhase
28.59 s
gammaloop-workspace-doctest> Running phase: configurePhase
28.60 s
gammaloop-workspace-doctest> will append /build/source/.cargo-home/config.toml with contents of /nix/store/9rqk4093qnvgswmdk1pbxk9najcrjn7a-vendor-cargo-deps/config.toml
28.60 s
gammaloop-workspace-doctest> default configurePhase, nothing to do
28.61 s
gammaloop-workspace-doctest> Running phase: buildPhase
28.61 s
gammaloop-workspace-doctest> +++ command cargo --version
28.62 s
gammaloop-workspace-doctest> cargo 1.98.1 (797e8a9bc 2026-08-05)
28.67 s
gammaloop-workspace-doctest> +++ command cargo test --profile ci-optim --doc --locked --workspace --features gammaloop-api/cli,gammaloop-tracing-filter/clap,gammaloop-tracing-filter/symbolica,idenso/bincode,idenso/native,idenso/reference-cases,linnet/bincode,linnet/drawing,linnet/nodestore-vec,linnet/rkyv,linnet/serde,linnet/symbolica,spenso-macros/native,spenso-macros/shadowing,spenso/native,spenso/native-code-generation,spenso/shadowing,symbolica-utils/native,symbolica/tracing_max_level_info --exclude alphal00p-docs-python-exporter
30.10 s
gammaloop-workspace-doctest> Compiling pyo3-build-config v0.28.3
30.10 s
gammaloop-workspace-doctest> Compiling const-random-macro v0.1.16
30.10 s
gammaloop-workspace-doctest> Compiling phf_generator v0.11.3
30.13 s
gammaloop-workspace-doctest> Compiling rustpython-ast v0.4.0
30.14 s
gammaloop-workspace-doctest> Compiling similar v2.7.0
30.14 s
gammaloop-workspace-doctest> Compiling symbolica v2.2.0 (https://github.com/symbolica-dev/symbolica?rev=4f1323185fe5e0c0f8c864ab89edd1905e7adef1#4f132318)
30.14 s
gammaloop-workspace-doctest> Compiling derive_more-impl v2.1.1
30.17 s
gammaloop-workspace-doctest> Compiling gammaloop-tracing-filter-macros v0.1.0 (/build/source/crates/gammaloop-tracing-filter-macros)
30.17 s
gammaloop-workspace-doctest> Compiling vakint v0.1.2 (/build/source/crates/vakint)
30.20 s
gammaloop-workspace-doctest> Compiling gammalooprs v0.3.4 (/build/source/crates/gammalooprs)
30.20 s
gammaloop-workspace-doctest> Compiling gammaloop-api v0.1.0 (/build/source/crates/gammaloop-api)
30.21 s
gammaloop-workspace-doctest> Compiling alphal00p-docs-macros v0.1.0 (/build/source/crates/alphal00p-docs-macros)
30.21 s
gammaloop-workspace-doctest> Compiling proc-macro-error-attr2 v2.0.0
30.21 s
gammaloop-workspace-doctest> Compiling alphal00p-docs-schema v0.1.0 (/build/source/crates/alphal00p-docs-schema)
30.21 s
gammaloop-workspace-doctest> Compiling rustc_version v0.4.1
30.72 s
gammaloop-workspace-doctest> Compiling phf_codegen v0.11.3
30.85 s
gammaloop-workspace-doctest> Compiling figment v0.10.19
30.92 s
gammaloop-workspace-doctest> Compiling unicode_names2_generator v1.3.0
30.93 s
gammaloop-workspace-doctest> Compiling bincode v1.3.3
31.03 s
gammaloop-workspace-doctest> Compiling rustpython-parser v0.4.0
31.48 s
gammaloop-workspace-doctest> Compiling target-triple v1.0.1
31.61 s
gammaloop-workspace-doctest> Compiling gungraun-runner v0.18.2
32.02 s
gammaloop-workspace-doctest> Compiling iai-callgrind-runner v0.14.2
32.28 s
gammaloop-workspace-doctest> Compiling const-random v0.1.18
32.29 s
gammaloop-workspace-doctest> Compiling insta v1.47.2
32.34 s
gammaloop-workspace-doctest> Compiling ahash v0.8.12
32.86 s
gammaloop-workspace-doctest> Compiling kurvst v0.1.0 (/build/source/crates/kurvst)
32.88 s
gammaloop-workspace-doctest> Compiling gungraun-macros v0.8.0
32.96 s
gammaloop-workspace-doctest> Compiling symjit v2.25.6
32.98 s
gammaloop-workspace-doctest> Compiling numerica v3.0.0 (https://github.com/symbolica-dev/symbolica?rev=4f1323185fe5e0c0f8c864ab89edd1905e7adef1#4f132318)
33.08 s
gammaloop-workspace-doctest> Compiling momtrop v0.3.0
33.61 s
gammaloop-workspace-doctest> Compiling proc-macro-error2 v2.0.1
33.77 s
gammaloop-workspace-doctest> Compiling alphal00p-docs-catalogs v0.1.0 (/build/source/crates/alphal00p-docs-catalogs)
33.92 s
gammaloop-workspace-doctest> Compiling gammaloop-integration-tests v0.1.0 (/build/source/tests)
34.42 s
gammaloop-workspace-doctest> Compiling wait-timeout v0.2.1
34.48 s
gammaloop-workspace-doctest> Compiling test-log-core v0.2.20
35.47 s
gammaloop-workspace-doctest> Compiling iai-callgrind v0.14.2
35.81 s
gammaloop-workspace-doctest> Compiling bit-vec v0.8.0
35.88 s
gammaloop-workspace-doctest> Compiling quick-error v1.2.3
35.98 s
gammaloop-workspace-doctest> Compiling rusty-fork v0.3.1
36.19 s
gammaloop-workspace-doctest> Compiling bit-set v0.8.0
38.50 s
gammaloop-workspace-doctest> Compiling unicode_names2 v1.3.0
39.14 s
gammaloop-workspace-doctest> Compiling rand_xorshift v0.4.0
39.34 s
gammaloop-workspace-doctest> Compiling console v0.15.11
39.37 s
gammaloop-workspace-doctest> Compiling termcolor v1.4.1
39.74 s
gammaloop-workspace-doctest> Compiling test-log-macros v0.2.20
40.13 s
gammaloop-workspace-doctest> Compiling base64 v0.21.7
40.58 s
gammaloop-workspace-doctest> Compiling glob v0.3.4
40.82 s
gammaloop-workspace-doctest> Compiling unarray v0.1.4
40.94 s
gammaloop-workspace-doctest> Compiling clinnet v0.1.8 (/build/source/crates/clinnet)
42.11 s
gammaloop-workspace-doctest> Compiling trybuild v1.0.120
42.58 s
gammaloop-workspace-doctest> Compiling proptest v1.11.0
42.99 s
gammaloop-workspace-doctest> Compiling alphal00p-docs-examples v0.1.0 (/build/source/crates/alphal00p-docs-examples)
43.30 s
gammaloop-workspace-doctest> Compiling ron v0.8.1
44.88 s
gammaloop-workspace-doctest> Compiling pyo3-macros-backend v0.28.3
46.61 s
gammaloop-workspace-doctest> Compiling numpy v0.28.0
47.28 s
gammaloop-workspace-doctest> Compiling pyo3-ffi v0.28.3
48.31 s
gammaloop-workspace-doctest> Compiling pyo3 v0.28.3
49.09 s
gammaloop-workspace-doctest> Compiling graphica v3.0.0 (https://github.com/symbolica-dev/symbolica?rev=4f1323185fe5e0c0f8c864ab89edd1905e7adef1#4f132318)
49.10 s
gammaloop-workspace-doctest> Compiling linnet-py v0.1.0 (/build/source/crates/linnet-py)
49.22 s
gammaloop-workspace-doctest> Compiling test-log v0.2.20
49.31 s
gammaloop-workspace-doctest> Compiling alphal00p-docs-builder v0.1.0 (/build/source/crates/alphal00p-docs-builder)
49.46 s
gammaloop-workspace-doctest> Compiling similar-asserts v1.7.0
59.09 s
gammaloop-workspace-doctest> Compiling derive_more v2.1.1
59.15 s
gammaloop-workspace-doctest> Compiling crossterm v0.29.0
62.25 s
gammaloop-workspace-doctest> Compiling ratatui-crossterm v0.1.0
62.59 s
gammaloop-workspace-doctest> Compiling ratatui v0.30.0
63.91 s
gammaloop-workspace-doctest> Compiling iai-callgrind-macros v0.5.1
75.39 s
gammaloop-workspace-doctest> Compiling pyo3-stub-gen-derive v0.17.2
81.04 s
gammaloop-workspace-doctest> Compiling gungraun v0.18.2
81.99 s
gammaloop-workspace-doctest> Compiling pyo3-macros v0.28.3
93.99 s
gammaloop-workspace-doctest> Compiling pyo3-stub-gen v0.17.2
110.75 s
gammaloop-workspace-doctest> Compiling symbolica-utils v0.1.0 (/build/source/crates/symbolica-utils)
139.86 s
gammaloop-workspace-doctest> Compiling tymbolica-atom-payload v0.1.0 (https://github.com/lcnbr/tymbolica?rev=32ae00483b4845161401afac8be755cc336cb2bb#32ae0048)
411.89 s
gammaloop-workspace-doctest> Compiling gammaloop-workspace-hack v0.1.0 (/build/source/crates/gammaloop-workspace-hack)
411.89 s
gammaloop-workspace-doctest> Compiling spenso-macros v0.3.2 (/build/source/crates/spenso-macros)
412.21 s
gammaloop-workspace-doctest> Compiling linnet v0.17.0 (/build/source/crates/linnet)
415.93 s
gammaloop-workspace-doctest> Compiling spenso v0.6.0 (/build/source/crates/spenso)
425.28 s
gammaloop-workspace-doctest> Compiling idenso v0.3.0 (/build/source/crates/idenso)
425.28 s
gammaloop-workspace-doctest> Compiling gammaloop-tracing-filter v0.1.0 (/build/source/crates/gammaloop-tracing-filter)
432.11 s
gammaloop-workspace-doctest> Compiling spenso-hep-lib v0.1.7 (/build/source/crates/spenso-hep-lib)
432.36 s
gammaloop-workspace-doctest> Compiling spynso3 v0.1.2 (/build/source/crates/spynso3)
481.38 s
gammaloop-workspace-doctest> Compiling linnest v0.1.0 (/build/source/crates/linnest)
726.62 s
gammaloop-workspace-doctest> Finished `ci-optim` profile [optimized] target(s) in 11m 37s
726.81 s
gammaloop-workspace-doctest> warning : the following packages contain code that will be rejected by a future version of Rust: proc-macro-error2 v2.0.1
726.81 s
gammaloop-workspace-doctest> note : to see what the problems were, use the option `--future-incompat-report`, or run `cargo report future-incompatibilities --id 1`
726.86 s
gammaloop-workspace-doctest> Doc-tests alphal00p_docs_builder
727.17 s
gammaloop-workspace-doctest>
727.17 s
gammaloop-workspace-doctest> running 0 tests
727.17 s
gammaloop-workspace-doctest>
727.17 s
gammaloop-workspace-doctest> test result: ok. 0 passed; 0 failed; 0 ignored; 0 measured; 0 filtered out; finished in 0.00s
727.17 s
gammaloop-workspace-doctest>
727.18 s
gammaloop-workspace-doctest> Doc-tests alphal00p_docs_catalogs
729.01 s
gammaloop-workspace-doctest>
729.01 s
gammaloop-workspace-doctest> running 0 tests
729.01 s
gammaloop-workspace-doctest>
729.01 s
gammaloop-workspace-doctest> test result: ok. 0 passed; 0 failed; 0 ignored; 0 measured; 0 filtered out; finished in 0.00s
729.01 s
gammaloop-workspace-doctest>
729.01 s
gammaloop-workspace-doctest> Doc-tests alphal00p_docs_examples
729.03 s
gammaloop-workspace-doctest>
729.03 s
gammaloop-workspace-doctest> running 0 tests
729.03 s
gammaloop-workspace-doctest>
729.03 s
gammaloop-workspace-doctest> test result: ok. 0 passed; 0 failed; 0 ignored; 0 measured; 0 filtered out; finished in 0.00s
729.03 s
gammaloop-workspace-doctest>
729.03 s
gammaloop-workspace-doctest> Doc-tests alphal00p_docs
729.10 s
gammaloop-workspace-doctest>
729.10 s
gammaloop-workspace-doctest> running 0 tests
729.10 s
gammaloop-workspace-doctest>
729.10 s
gammaloop-workspace-doctest> test result: ok. 0 passed; 0 failed; 0 ignored; 0 measured; 0 filtered out; finished in 0.00s
729.10 s
gammaloop-workspace-doctest>
729.10 s
gammaloop-workspace-doctest> Doc-tests alphal00p_docs_schema
729.21 s
gammaloop-workspace-doctest>
729.21 s
gammaloop-workspace-doctest> running 0 tests
729.21 s
gammaloop-workspace-doctest>
729.21 s
gammaloop-workspace-doctest> test result: ok. 0 passed; 0 failed; 0 ignored; 0 measured; 0 filtered out; finished in 0.00s
729.21 s
gammaloop-workspace-doctest>
729.21 s
gammaloop-workspace-doctest> Doc-tests clinnet
729.27 s
gammaloop-workspace-doctest>
729.27 s
gammaloop-workspace-doctest> running 0 tests
729.27 s
gammaloop-workspace-doctest>
729.27 s
gammaloop-workspace-doctest> test result: ok. 0 passed; 0 failed; 0 ignored; 0 measured; 0 filtered out; finished in 0.00s
729.27 s
gammaloop-workspace-doctest>
729.28 s
gammaloop-workspace-doctest> Doc-tests gammaloop_api
730.27 s
gammaloop-workspace-doctest>
730.27 s
gammaloop-workspace-doctest> running 2 tests
730.38 s
gammaloop-workspace-doctest> test crates/gammaloop-api/src/lib.rs - (line 18) - compile ... ok
733.36 s
gammaloop-workspace-doctest> test crates/gammaloop-api/src/commands/evaluate_samples.rs - commands::evaluate_samples::EvaluateSamples (line 49) ... ok
733.36 s
gammaloop-workspace-doctest>
733.36 s
gammaloop-workspace-doctest> test result: ok. 2 passed; 0 failed; 0 ignored; 0 measured; 0 filtered out; finished in 3.09s
733.36 s
gammaloop-workspace-doctest>
733.37 s
gammaloop-workspace-doctest> Doc-tests gammaloop_integration_tests
733.44 s
gammaloop-workspace-doctest>
733.44 s
gammaloop-workspace-doctest> running 0 tests
733.44 s
gammaloop-workspace-doctest>
733.44 s
gammaloop-workspace-doctest> test result: ok. 0 passed; 0 failed; 0 ignored; 0 measured; 0 filtered out; finished in 0.00s
733.44 s
gammaloop-workspace-doctest>
733.44 s
gammaloop-workspace-doctest> Doc-tests gammaloop_tracing_filter
733.52 s
gammaloop-workspace-doctest>
733.52 s
gammaloop-workspace-doctest> running 0 tests
733.52 s
gammaloop-workspace-doctest>
733.52 s
gammaloop-workspace-doctest> test result: ok. 0 passed; 0 failed; 0 ignored; 0 measured; 0 filtered out; finished in 0.00s
733.52 s
gammaloop-workspace-doctest>
733.52 s
gammaloop-workspace-doctest> Doc-tests gammaloop_tracing_filter_macros
733.90 s
gammaloop-workspace-doctest>
733.90 s
gammaloop-workspace-doctest> running 2 tests
733.90 s
gammaloop-workspace-doctest> test crates/gammaloop-tracing-filter-macros/src/lib.rs - debug_instrument (line 14) ... ignored
733.90 s
gammaloop-workspace-doctest> test crates/gammaloop-tracing-filter-macros/src/lib.rs - debug_instrument (line 8) ... ignored
733.90 s
gammaloop-workspace-doctest>
733.90 s
gammaloop-workspace-doctest> test result: ok. 0 passed; 0 failed; 2 ignored; 0 measured; 0 filtered out; finished in 0.00s
733.90 s
gammaloop-workspace-doctest>
733.90 s
gammaloop-workspace-doctest> all doctests ran in 0.36s; merged doctests compilation took 0.36s
733.91 s
gammaloop-workspace-doctest> Doc-tests gammaloop_workspace_hack
733.93 s
gammaloop-workspace-doctest>
733.93 s
gammaloop-workspace-doctest> running 0 tests
733.93 s
gammaloop-workspace-doctest>
733.93 s
gammaloop-workspace-doctest> test result: ok. 0 passed; 0 failed; 0 ignored; 0 measured; 0 filtered out; finished in 0.00s
733.93 s
gammaloop-workspace-doctest>
733.94 s
gammaloop-workspace-doctest> Doc-tests gammalooprs
739.19 s
gammaloop-workspace-doctest>
739.19 s
gammaloop-workspace-doctest> running 2 tests
739.19 s
gammaloop-workspace-doctest> test crates/gammalooprs/src/integrands/process/mod.rs - integrands::process::ProcessIntegrandImpl::signal_external_momenta_changed (line 2381) ... ignored
739.20 s
gammaloop-workspace-doctest> test crates/gammalooprs/src/utils/linnet_ext.rs - utils::linnet_ext::Permutation::from_mappings (line 27) ... ok
739.20 s
gammaloop-workspace-doctest>
739.20 s
gammaloop-workspace-doctest> test result: ok. 1 passed; 0 failed; 1 ignored; 0 measured; 0 filtered out; finished in 0.01s
739.20 s
gammaloop-workspace-doctest>
739.22 s
gammaloop-workspace-doctest> all doctests ran in 1.81s; merged doctests compilation took 1.78s
739.23 s
gammaloop-workspace-doctest> Doc-tests idenso
740.07 s
gammaloop-workspace-doctest>
740.07 s
gammaloop-workspace-doctest> running 5 tests
740.07 s
gammaloop-workspace-doctest> test crates/idenso/src/color/macros.rs - color::macros::color_f (line 109) ... ignored
740.07 s
gammaloop-workspace-doctest> test crates/idenso/src/color/macros.rs - color::macros::color_t (line 18) ... ignored
740.07 s
gammaloop-workspace-doctest> test crates/idenso/src/dirac/macros.rs - dirac::macros::gamma (line 28) ... ignored
740.07 s
gammaloop-workspace-doctest> test crates/idenso/src/dirac/macros.rs - dirac::macros::gamma0 (line 259) ... ignored
740.07 s
gammaloop-workspace-doctest> test crates/idenso/src/dirac/macros.rs - dirac::macros::u (line 155) ... ignored
740.07 s
gammaloop-workspace-doctest>
740.07 s
gammaloop-workspace-doctest> test result: ok. 0 passed; 0 failed; 5 ignored; 0 measured; 0 filtered out; finished in 0.00s
740.07 s
gammaloop-workspace-doctest>
740.08 s
gammaloop-workspace-doctest> all doctests ran in 0.36s; merged doctests compilation took 0.35s
740.08 s
gammaloop-workspace-doctest> Doc-tests kurvst
740.19 s
gammaloop-workspace-doctest>
740.19 s
gammaloop-workspace-doctest> running 0 tests
740.19 s
gammaloop-workspace-doctest>
740.19 s
gammaloop-workspace-doctest> test result: ok. 0 passed; 0 failed; 0 ignored; 0 measured; 0 filtered out; finished in 0.00s
740.19 s
gammaloop-workspace-doctest>
740.20 s
gammaloop-workspace-doctest> Doc-tests linnest
740.51 s
gammaloop-workspace-doctest>
740.51 s
gammaloop-workspace-doctest> running 0 tests
740.51 s
gammaloop-workspace-doctest>
740.51 s
gammaloop-workspace-doctest> test result: ok. 0 passed; 0 failed; 0 ignored; 0 measured; 0 filtered out; finished in 0.00s
740.51 s
gammaloop-workspace-doctest>
740.51 s
gammaloop-workspace-doctest> Doc-tests linnet
741.06 s
gammaloop-workspace-doctest>
741.06 s
gammaloop-workspace-doctest> running 46 tests
741.06 s
gammaloop-workspace-doctest> test crates/linnet/src/half_edge/algorithms/transitive_ops.rs - half_edge::algorithms::transitive_ops::HedgeGraph<E,V,H,N>::transitive_closure (line 164) ... ignored
741.06 s
gammaloop-workspace-doctest> test crates/linnet/src/half_edge/algorithms/transitive_ops.rs - half_edge::algorithms::transitive_ops::HedgeGraph<E,V,H,N>::transitive_reduction (line 300) ... ignored
741.06 s
gammaloop-workspace-doctest> test crates/linnet/src/half_edge/builder.rs - half_edge::builder::HedgeGraphBuilder (line 108) ... ignored
744.63 s
gammaloop-workspace-doctest> test crates/linnet/src/half_edge/algorithms/trace_unfold.rs - half_edge::algorithms::trace_unfold::TraceKeyView (line 872) ... ok
744.99 s
gammaloop-workspace-doctest> test crates/linnet/src/half_edge/algorithms/trace_unfold.rs - half_edge::algorithms::trace_unfold::TraceKey<O,D>::from_levels (line 1089) ... ok
745.08 s
gammaloop-workspace-doctest> test crates/linnet/src/permutation.rs - permutation::Permutation (line 61) ... ok
745.38 s
gammaloop-workspace-doctest> test crates/linnet/src/half_edge/algorithms/trace_unfold.rs - half_edge::algorithms::trace_unfold::TraceKey<O,D>::view (line 1110) ... ok
745.39 s
gammaloop-workspace-doctest> test crates/linnet/src/half_edge/algorithms/trace_unfold.rs - half_edge::algorithms::trace_unfold::TraceKey<O,D>::empty (line 1071) ... ok
745.40 s
gammaloop-workspace-doctest> test crates/linnet/src/half_edge/algorithms/trace_unfold.rs - half_edge::algorithms::trace_unfold::TraceKey<O,D>::push (line 1253) ... ok
745.51 s
gammaloop-workspace-doctest> test crates/linnet/src/half_edge/algorithms/trace_unfold.rs - half_edge::algorithms::trace_unfold::TraceKey<O,D>::iter_leaf_ops (line 1222) ... ok
745.66 s
gammaloop-workspace-doctest> test crates/linnet/src/half_edge/algorithms/trace_unfold.rs - half_edge::algorithms::trace_unfold::TraceKey<O,D>::is_empty (line 1136) ... ok
745.69 s
gammaloop-workspace-doctest> test crates/linnet/src/half_edge/algorithms/trace_unfold.rs - half_edge::algorithms::trace_unfold::TraceKey<O,D>::iter_levels_top_down (line 1164) ... ok
745.83 s
gammaloop-workspace-doctest> test crates/linnet/src/half_edge/algorithms/trace_unfold.rs - half_edge::algorithms::trace_unfold::TraceKey (line 1029) ... ok
745.94 s
gammaloop-workspace-doctest> test crates/linnet/src/half_edge/algorithms/trace_unfold.rs - half_edge::algorithms::trace_unfold::TraceKey<O,D>::iter_levels_bottom_up (line 1194) ... ok
746.08 s
gammaloop-workspace-doctest> test crates/linnet/src/half_edge/algorithms/trace_unfold.rs - half_edge::algorithms::trace_unfold::TraceUnfold::realizations_for_op (line 213) ... ok
746.08 s
gammaloop-workspace-doctest> test crates/linnet/src/half_edge/algorithms/trace_unfold.rs - half_edge::algorithms::trace_unfold::TraceUnfold (line 127) ... ok
746.26 s
gammaloop-workspace-doctest> test crates/linnet/src/parser/mod.rs - parser (line 17) ... ok
746.53 s
gammaloop-workspace-doctest> test crates/linnet/src/half_edge/algorithms/trace_unfold.rs - half_edge::algorithms::trace_unfold::TraceKeyView<'a,O,D>::to_owned (line 979) ... ok
746.62 s
gammaloop-workspace-doctest> test crates/linnet/src/half_edge/algorithms/trace_unfold.rs - half_edge::algorithms::trace_unfold::TraceKey<O,D>::write_foata_like (line 1356) ... ok
749.35 s
gammaloop-workspace-doctest> test crates/linnet/src/permutation.rs - permutation::Permutation::from_disjoint_cycles (line 978) ... ok
749.57 s
gammaloop-workspace-doctest> test crates/linnet/src/permutation.rs - permutation::Permutation::apply_slice (line 451) ... ok
749.78 s
gammaloop-workspace-doctest> test crates/linnet/src/permutation.rs - permutation::Permutation::apply_slice_in_place_inv (line 510) ... ok
749.82 s
gammaloop-workspace-doctest> test crates/linnet/src/permutation.rs - permutation::Permutation::from_cycles (line 1069) ... ok
749.92 s
gammaloop-workspace-doctest> test crates/linnet/src/permutation.rs - permutation::Permutation::is_identity (line 851) ... ok
749.99 s
gammaloop-workspace-doctest> test crates/linnet/src/permutation.rs - permutation::Permutation::find_cycles (line 680) ... ok
750.05 s
gammaloop-workspace-doctest> test crates/linnet/src/permutation.rs - permutation::Permutation::apply_slice_in_place (line 488) ... ok
750.18 s
gammaloop-workspace-doctest> test crates/linnet/src/permutation.rs - permutation::Permutation::from_map (line 113) ... ok
750.27 s
gammaloop-workspace-doctest> test crates/linnet/src/permutation.rs - permutation::Permutation::id (line 96) ... ok
750.31 s
gammaloop-workspace-doctest> test crates/linnet/src/permutation.rs - permutation::Permutation::apply_slice_inv (line 469) ... ok
750.57 s
gammaloop-workspace-doctest> test crates/linnet/src/permutation.rs - permutation::Permutation::from_prefix_sources (line 266) ... ok
750.60 s
gammaloop-workspace-doctest> test crates/linnet/src/permutation.rs - permutation::Permutation::iter_slice (line 543) ... ok
750.98 s
gammaloop-workspace-doctest> test crates/linnet/src/permutation.rs - permutation::Permutation::cycle_to_transpositions (line 713) ... ok
751.16 s
gammaloop-workspace-doctest> test crates/linnet/src/permutation.rs - permutation::Permutation::inv (line 416) ... ok
751.83 s
gammaloop-workspace-doctest> test crates/linnet/src/permutation.rs - permutation::Permutation::iter_slice_inv (line 562) ... ok
752.20 s
gammaloop-workspace-doctest> test crates/linnet/src/permutation.rs - permutation::Permutation::map (line 402) ... ok
752.35 s
gammaloop-workspace-doctest> test crates/linnet/src/permutation.rs - permutation::Permutation::inverse (line 434) ... ok
752.96 s
gammaloop-workspace-doctest> test crates/linnet/src/permutation.rs - permutation::Permutation::iter_slice_mut (line 588) ... ok
753.25 s
gammaloop-workspace-doctest> test crates/linnet/src/permutation.rs - permutation::Permutation::myrvold_ruskey_unrank1 (line 782) ... ok
753.35 s
gammaloop-workspace-doctest> test crates/linnet/src/permutation.rs - permutation::Permutation::myrvold_ruskey_rank2 (line 805) ... ok
753.40 s
gammaloop-workspace-doctest> test crates/linnet/src/permutation.rs - permutation::Permutation::sort (line 640) ... ok
753.45 s
gammaloop-workspace-doctest> test crates/linnet/src/permutation.rs - permutation::Permutation::sign (line 869) ... ok
753.57 s
gammaloop-workspace-doctest> test crates/linnet/src/permutation.rs - permutation::Permutation::myrvold_ruskey_rank1 (line 760) ... ok
753.66 s
gammaloop-workspace-doctest> test crates/linnet/src/permutation.rs - permutation::Permutation::pow (line 896) ... ok
753.69 s
gammaloop-workspace-doctest> test crates/linnet/src/permutation.rs - permutation::Permutation::transpositions (line 733) ... ok
753.70 s
gammaloop-workspace-doctest> test crates/linnet/src/permutation.rs - permutation::Permutation::myrvold_ruskey_unrank2 (line 828) ... ok
753.84 s
gammaloop-workspace-doctest> test crates/linnet/src/permutation.rs - permutation::Permutation::iter_slice_inv_mut (line 615) ... ok
753.84 s
gammaloop-workspace-doctest>
753.84 s
gammaloop-workspace-doctest> test result: ok. 43 passed; 0 failed; 3 ignored; 0 measured; 0 filtered out; finished in 12.78s
753.84 s
gammaloop-workspace-doctest>
753.85 s
gammaloop-workspace-doctest> Doc-tests linnet_py
754.73 s
gammaloop-workspace-doctest>
754.73 s
gammaloop-workspace-doctest> running 0 tests
754.73 s
gammaloop-workspace-doctest>
754.73 s
gammaloop-workspace-doctest> test result: ok. 0 passed; 0 failed; 0 ignored; 0 measured; 0 filtered out; finished in 0.00s
754.73 s
gammaloop-workspace-doctest>
754.74 s
gammaloop-workspace-doctest> Doc-tests spenso
759.44 s
gammaloop-workspace-doctest>
759.44 s
gammaloop-workspace-doctest> running 9 tests
759.44 s
gammaloop-workspace-doctest> test crates/spenso/src/shadowing/macros.rs - shadowing::macros::antisym (line 337) ... ignored
759.44 s
gammaloop-workspace-doctest> test crates/spenso/src/shadowing/macros.rs - shadowing::macros::chain (line 387) ... ignored
759.44 s
gammaloop-workspace-doctest> test crates/spenso/src/shadowing/macros.rs - shadowing::macros::cyclic (line 361) ... ignored
759.44 s
gammaloop-workspace-doctest> test crates/spenso/src/shadowing/macros.rs - shadowing::macros::slot (line 24) ... ignored
759.44 s
gammaloop-workspace-doctest> test crates/spenso/src/shadowing/macros.rs - shadowing::macros::sym (line 313) ... ignored
759.44 s
gammaloop-workspace-doctest> test crates/spenso/src/shadowing/macros.rs - shadowing::macros::tensor (line 110) ... ignored
759.44 s
gammaloop-workspace-doctest> test crates/spenso/src/shadowing/macros.rs - shadowing::macros::trace (line 444) ... ignored
759.44 s
gammaloop-workspace-doctest> test crates/spenso/src/shadowing/macros.rs - shadowing::macros::trace_sym (line 496) ... ignored
759.58 s
gammaloop-workspace-doctest> test crates/spenso/src/network/mod.rs - network::Network (line 1693) ... FAILED
759.58 s
gammaloop-workspace-doctest>
759.58 s
gammaloop-workspace-doctest> failures:
759.58 s
gammaloop-workspace-doctest>
759.58 s
gammaloop-workspace-doctest> ---- crates/spenso/src/network/mod.rs - network::Network (line 1693) stdout ----
759.58 s
gammaloop-workspace-doctest> Test executable failed (terminated by signal).
759.58 s
gammaloop-workspace-doctest>
759.58 s
gammaloop-workspace-doctest> stdout:
759.58 s
gammaloop-workspace-doctest> ┌────────────────────────────────────────────────────────┐
759.58 s
gammaloop-workspace-doctest> │ You are running a restricted Symbolica instance. │
759.58 s
gammaloop-workspace-doctest> │ │
759.58 s
gammaloop-workspace-doctest> │ For non-commercial use only, limited to one │
759.58 s
gammaloop-workspace-doctest> │ Symbolica thread per user. │
759.58 s
gammaloop-workspace-doctest> │ │
759.58 s
gammaloop-workspace-doctest> ├─ Unlock all cores ─────────────────────────────────────┤
759.58 s
gammaloop-workspace-doctest> │ │
759.58 s
gammaloop-workspace-doctest> │ Hobbyists and students: free annual key │
759.58 s
gammaloop-workspace-doctest> │ https://symbolica.io/license/#get-hobbyist-license │
759.58 s
gammaloop-workspace-doctest> │ │
759.58 s
gammaloop-workspace-doctest> │ Free 30-day professional trial: │
759.58 s
gammaloop-workspace-doctest> │ https://symbolica.io/license/#get-trial-license │
759.58 s
gammaloop-workspace-doctest> │ │
759.58 s
gammaloop-workspace-doctest> └────────────────────────────────────────────────────────┘
759.58 s
gammaloop-workspace-doctest> ┌──────────────────────────────────────────────────────────────────────────────────────────────────┐
759.58 s
gammaloop-workspace-doctest> │ Cannot start another restricted Symbolica thread while this user's thread allowance is in use. │
759.58 s
gammaloop-workspace-doctest> └──────────────────────────────────────────────────────────────────────────────────────────────────┘
759.58 s
gammaloop-workspace-doctest>
759.58 s
gammaloop-workspace-doctest> stderr:
759.58 s
gammaloop-workspace-doctest> ┌────────────────────────────────────────────────────────┐
759.58 s
gammaloop-workspace-doctest> │ The Symbolica license key format is outdated. │
759.58 s
gammaloop-workspace-doctest> │ Renew your key at https://symbolica.io/license/ │
759.58 s
gammaloop-workspace-doctest> └────────────────────────────────────────────────────────┘
759.58 s
gammaloop-workspace-doctest> Could not acquire Symbolica thread permit: Permission denied (os error 13)
759.58 s
gammaloop-workspace-doctest>
759.58 s
gammaloop-workspace-doctest>
759.58 s
gammaloop-workspace-doctest>
759.58 s
gammaloop-workspace-doctest> failures:
759.58 s
gammaloop-workspace-doctest> crates/spenso/src/network/mod.rs - network::Network (line 1693)
759.58 s
gammaloop-workspace-doctest>
759.58 s
gammaloop-workspace-doctest> test result: FAILED. 0 passed; 1 failed; 8 ignored; 0 measured; 0 filtered out; finished in 0.14s
759.58 s
gammaloop-workspace-doctest>
759.62 s
gammaloop-workspace-doctest> all doctests ran in 4.23s; merged doctests compilation took 4.04s
759.63 s
gammaloop-workspace-doctest> error : doctest failed, to rerun pass `-p spenso --doc`
760.24 s
error: Cannot build '/nix/store/xmf37jpb1f2ls6mvj35zs9jzr5fjsgnv-gammaloop-workspace-doctest-0.1.0.drv '.
760.24 s
Reason: builder failed with exit code 101 .
760.24 s
Output paths:
760.24 s
/nix/store/9sq7gdzb4npvy9phnd5lwja1mgqsd04q-gammaloop-workspace-doctest-0.1.0
760.24 s
Last 316 log lines:
760.24 s
> Running phase: unpackPhase
760.24 s
> unpacking source archive /nix/store/0b6y73sx10i7jc9h7gv2p4wq7jn4fbkv-source
760.24 s
> source root is source
760.24 s
> Running phase: patchPhase
760.24 s
> Executing configureCargoCommonVars
760.24 s
> decompressing cargo artifacts from /nix/store/8zs9bds37a34fqlhv8z320b7lfv0rp55-gammaloop-workspace-deps-deps-0.1.0/target.tar.zst to target
760.24 s
> Running phase: updateAutotoolsGnuConfigScriptsPhase
760.24 s
> Running phase: configurePhase
760.24 s
> will append /build/source/.cargo-home/config.toml with contents of /nix/store/9rqk4093qnvgswmdk1pbxk9najcrjn7a-vendor-cargo-deps/config.toml
760.24 s
> default configurePhase, nothing to do
760.24 s
> Running phase: buildPhase
760.24 s
> +++ command cargo --version
760.24 s
> cargo 1.98.1 (797e8a9bc 2026-08-05)
760.24 s
> +++ command cargo test --profile ci-optim --doc --locked --workspace --features gammaloop-api/cli,gammaloop-tracing-filter/clap,gammaloop-tracing-filter/symbolica,idenso/bincode,idenso/native,idenso/reference-cases,linnet/bincode,linnet/drawing,linnet/nodestore-vec,linnet/rkyv,linnet/serde,linnet/symbolica,spenso-macros/native,spenso-macros/shadowing,spenso/native,spenso/native-code-generation,spenso/shadowing,symbolica-utils/native,symbolica/tracing_max_level_info --exclude alphal00p-docs-python-exporter
760.24 s
> Compiling pyo3-build-config v0.28.3
760.24 s
> Compiling const-random-macro v0.1.16
760.24 s
> Compiling phf_generator v0.11.3
760.24 s
> Compiling rustpython-ast v0.4.0
760.24 s
> Compiling similar v2.7.0
760.24 s
> Compiling symbolica v2.2.0 (https://github.com/symbolica-dev/symbolica?rev=4f1323185fe5e0c0f8c864ab89edd1905e7adef1#4f132318)
760.24 s
> Compiling derive_more-impl v2.1.1
760.24 s
> Compiling gammaloop-tracing-filter-macros v0.1.0 (/build/source/crates/gammaloop-tracing-filter-macros)
760.24 s
> Compiling vakint v0.1.2 (/build/source/crates/vakint)
760.24 s
> Compiling gammalooprs v0.3.4 (/build/source/crates/gammalooprs)
760.24 s
> Compiling gammaloop-api v0.1.0 (/build/source/crates/gammaloop-api)
760.24 s
> Compiling alphal00p-docs-macros v0.1.0 (/build/source/crates/alphal00p-docs-macros)
760.24 s
> Compiling proc-macro-error-attr2 v2.0.0
760.24 s
> Compiling alphal00p-docs-schema v0.1.0 (/build/source/crates/alphal00p-docs-schema)
760.24 s
> Compiling rustc_version v0.4.1
760.24 s
> Compiling phf_codegen v0.11.3
760.24 s
> Compiling figment v0.10.19
760.24 s
> Compiling unicode_names2_generator v1.3.0
760.24 s
> Compiling bincode v1.3.3
760.24 s
> Compiling rustpython-parser v0.4.0
760.24 s
> Compiling target-triple v1.0.1
760.24 s
> Compiling gungraun-runner v0.18.2
760.24 s
> Compiling iai-callgrind-runner v0.14.2
760.24 s
> Compiling const-random v0.1.18
760.24 s
> Compiling insta v1.47.2
760.24 s
> Compiling ahash v0.8.12
760.24 s
> Compiling kurvst v0.1.0 (/build/source/crates/kurvst)
760.24 s
> Compiling gungraun-macros v0.8.0
760.24 s
> Compiling symjit v2.25.6
760.24 s
> Compiling numerica v3.0.0 (https://github.com/symbolica-dev/symbolica?rev=4f1323185fe5e0c0f8c864ab89edd1905e7adef1#4f132318)
760.24 s
> Compiling momtrop v0.3.0
760.24 s
> Compiling proc-macro-error2 v2.0.1
760.24 s
> Compiling alphal00p-docs-catalogs v0.1.0 (/build/source/crates/alphal00p-docs-catalogs)
760.24 s
> Compiling gammaloop-integration-tests v0.1.0 (/build/source/tests)
760.24 s
> Compiling wait-timeout v0.2.1
760.24 s
> Compiling test-log-core v0.2.20
760.24 s
> Compiling iai-callgrind v0.14.2
760.24 s
> Compiling bit-vec v0.8.0
760.24 s
> Compiling quick-error v1.2.3
760.24 s
> Compiling rusty-fork v0.3.1
760.24 s
> Compiling bit-set v0.8.0
760.24 s
> Compiling unicode_names2 v1.3.0
760.24 s
> Compiling rand_xorshift v0.4.0
760.24 s
> Compiling console v0.15.11
760.24 s
> Compiling termcolor v1.4.1
760.24 s
> Compiling test-log-macros v0.2.20
760.24 s
> Compiling base64 v0.21.7
760.24 s
> Compiling glob v0.3.4
760.24 s
> Compiling unarray v0.1.4
760.24 s
> Compiling clinnet v0.1.8 (/build/source/crates/clinnet)
760.24 s
> Compiling trybuild v1.0.120
760.24 s
> Compiling proptest v1.11.0
760.24 s
> Compiling alphal00p-docs-examples v0.1.0 (/build/source/crates/alphal00p-docs-examples)
760.24 s
> Compiling ron v0.8.1
760.24 s
> Compiling pyo3-macros-backend v0.28.3
760.24 s
> Compiling numpy v0.28.0
760.24 s
> Compiling pyo3-ffi v0.28.3
760.24 s
> Compiling pyo3 v0.28.3
760.24 s
> Compiling graphica v3.0.0 (https://github.com/symbolica-dev/symbolica?rev=4f1323185fe5e0c0f8c864ab89edd1905e7adef1#4f132318)
760.24 s
> Compiling linnet-py v0.1.0 (/build/source/crates/linnet-py)
760.24 s
> Compiling test-log v0.2.20
760.24 s
> Compiling alphal00p-docs-builder v0.1.0 (/build/source/crates/alphal00p-docs-builder)
760.24 s
> Compiling similar-asserts v1.7.0
760.24 s
> Compiling derive_more v2.1.1
760.24 s
> Compiling crossterm v0.29.0
760.24 s
> Compiling ratatui-crossterm v0.1.0
760.24 s
> Compiling ratatui v0.30.0
760.24 s
> Compiling iai-callgrind-macros v0.5.1
760.24 s
> Compiling pyo3-stub-gen-derive v0.17.2
760.24 s
> Compiling gungraun v0.18.2
760.24 s
> Compiling pyo3-macros v0.28.3
760.24 s
> Compiling pyo3-stub-gen v0.17.2
760.24 s
> Compiling symbolica-utils v0.1.0 (/build/source/crates/symbolica-utils)
760.24 s
> Compiling tymbolica-atom-payload v0.1.0 (https://github.com/lcnbr/tymbolica?rev=32ae00483b4845161401afac8be755cc336cb2bb#32ae0048)
760.24 s
> Compiling gammaloop-workspace-hack v0.1.0 (/build/source/crates/gammaloop-workspace-hack)
760.24 s
> Compiling spenso-macros v0.3.2 (/build/source/crates/spenso-macros)
760.24 s
> Compiling linnet v0.17.0 (/build/source/crates/linnet)
760.24 s
> Compiling spenso v0.6.0 (/build/source/crates/spenso)
760.24 s
> Compiling idenso v0.3.0 (/build/source/crates/idenso)
760.24 s
> Compiling gammaloop-tracing-filter v0.1.0 (/build/source/crates/gammaloop-tracing-filter)
760.24 s
> Compiling spenso-hep-lib v0.1.7 (/build/source/crates/spenso-hep-lib)
760.24 s
> Compiling spynso3 v0.1.2 (/build/source/crates/spynso3)
760.24 s
> Compiling linnest v0.1.0 (/build/source/crates/linnest)
760.24 s
> Finished `ci-optim` profile [optimized] target(s) in 11m 37s
760.24 s
> warning : the following packages contain code that will be rejected by a future version of Rust: proc-macro-error2 v2.0.1
760.24 s
> note : to see what the problems were, use the option `--future-incompat-report`, or run `cargo report future-incompatibilities --id 1`
760.24 s
> Doc-tests alphal00p_docs_builder
760.24 s
>
760.24 s
> running 0 tests
760.24 s
>
760.24 s
> test result: ok. 0 passed; 0 failed; 0 ignored; 0 measured; 0 filtered out; finished in 0.00s
760.24 s
>
760.24 s
> Doc-tests alphal00p_docs_catalogs
760.24 s
>
760.24 s
> running 0 tests
760.24 s
>
760.24 s
> test result: ok. 0 passed; 0 failed; 0 ignored; 0 measured; 0 filtered out; finished in 0.00s
760.24 s
>
760.24 s
> Doc-tests alphal00p_docs_examples
760.24 s
>
760.24 s
> running 0 tests
760.24 s
>
760.24 s
> test result: ok. 0 passed; 0 failed; 0 ignored; 0 measured; 0 filtered out; finished in 0.00s
760.24 s
>
760.24 s
> Doc-tests alphal00p_docs
760.24 s
>
760.24 s
> running 0 tests
760.24 s
>
760.24 s
> test result: ok. 0 passed; 0 failed; 0 ignored; 0 measured; 0 filtered out; finished in 0.00s
760.24 s
>
760.24 s
> Doc-tests alphal00p_docs_schema
760.24 s
>
760.24 s
> running 0 tests
760.24 s
>
760.24 s
> test result: ok. 0 passed; 0 failed; 0 ignored; 0 measured; 0 filtered out; finished in 0.00s
760.24 s
>
760.24 s
> Doc-tests clinnet
760.24 s
>
760.24 s
> running 0 tests
760.24 s
>
760.24 s
> test result: ok. 0 passed; 0 failed; 0 ignored; 0 measured; 0 filtered out; finished in 0.00s
760.24 s
>
760.24 s
> Doc-tests gammaloop_api
760.24 s
>
760.24 s
> running 2 tests
760.24 s
> test crates/gammaloop-api/src/lib.rs - (line 18) - compile ... ok
760.24 s
> test crates/gammaloop-api/src/commands/evaluate_samples.rs - commands::evaluate_samples::EvaluateSamples (line 49) ... ok
760.24 s
>
760.24 s
> test result: ok. 2 passed; 0 failed; 0 ignored; 0 measured; 0 filtered out; finished in 3.09s
760.24 s
>
760.24 s
> Doc-tests gammaloop_integration_tests
760.24 s
>
760.24 s
> running 0 tests
760.24 s
>
760.24 s
> test result: ok. 0 passed; 0 failed; 0 ignored; 0 measured; 0 filtered out; finished in 0.00s
760.24 s
>
760.24 s
> Doc-tests gammaloop_tracing_filter
760.24 s
>
760.24 s
> running 0 tests
760.24 s
>
760.24 s
> test result: ok. 0 passed; 0 failed; 0 ignored; 0 measured; 0 filtered out; finished in 0.00s
760.24 s
>
760.24 s
> Doc-tests gammaloop_tracing_filter_macros
760.24 s
>
760.24 s
> running 2 tests
760.24 s
> test crates/gammaloop-tracing-filter-macros/src/lib.rs - debug_instrument (line 14) ... ignored
760.24 s
> test crates/gammaloop-tracing-filter-macros/src/lib.rs - debug_instrument (line 8) ... ignored
760.24 s
>
760.24 s
> test result: ok. 0 passed; 0 failed; 2 ignored; 0 measured; 0 filtered out; finished in 0.00s
760.24 s
>
760.24 s
> all doctests ran in 0.36s; merged doctests compilation took 0.36s
760.24 s
> Doc-tests gammaloop_workspace_hack
760.24 s
>
760.24 s
> running 0 tests
760.24 s
>
760.24 s
> test result: ok. 0 passed; 0 failed; 0 ignored; 0 measured; 0 filtered out; finished in 0.00s
760.24 s
>
760.24 s
> Doc-tests gammalooprs
760.24 s
>
760.24 s
> running 2 tests
760.24 s
> test crates/gammalooprs/src/integrands/process/mod.rs - integrands::process::ProcessIntegrandImpl::signal_external_momenta_changed (line 2381) ... ignored
760.24 s
> test crates/gammalooprs/src/utils/linnet_ext.rs - utils::linnet_ext::Permutation::from_mappings (line 27) ... ok
760.24 s
>
760.24 s
> test result: ok. 1 passed; 0 failed; 1 ignored; 0 measured; 0 filtered out; finished in 0.01s
760.24 s
>
760.24 s
> all doctests ran in 1.81s; merged doctests compilation took 1.78s
760.24 s
> Doc-tests idenso
760.24 s
>
760.24 s
> running 5 tests
760.24 s
> test crates/idenso/src/color/macros.rs - color::macros::color_f (line 109) ... ignored
760.24 s
> test crates/idenso/src/color/macros.rs - color::macros::color_t (line 18) ... ignored
760.24 s
> test crates/idenso/src/dirac/macros.rs - dirac::macros::gamma (line 28) ... ignored
760.24 s
> test crates/idenso/src/dirac/macros.rs - dirac::macros::gamma0 (line 259) ... ignored
760.24 s
> test crates/idenso/src/dirac/macros.rs - dirac::macros::u (line 155) ... ignored
760.24 s
>
760.24 s
> test result: ok. 0 passed; 0 failed; 5 ignored; 0 measured; 0 filtered out; finished in 0.00s
760.24 s
>
760.24 s
> all doctests ran in 0.36s; merged doctests compilation took 0.35s
760.24 s
> Doc-tests kurvst
760.24 s
>
760.24 s
> running 0 tests
760.24 s
>
760.24 s
> test result: ok. 0 passed; 0 failed; 0 ignored; 0 measured; 0 filtered out; finished in 0.00s
760.24 s
>
760.24 s
> Doc-tests linnest
760.24 s
>
760.24 s
> running 0 tests
760.24 s
>
760.24 s
> test result: ok. 0 passed; 0 failed; 0 ignored; 0 measured; 0 filtered out; finished in 0.00s
760.24 s
>
760.24 s
> Doc-tests linnet
760.24 s
>
760.24 s
> running 46 tests
760.24 s
> test crates/linnet/src/half_edge/algorithms/transitive_ops.rs - half_edge::algorithms::transitive_ops::HedgeGraph<E,V,H,N>::transitive_closure (line 164) ... ignored
760.24 s
> test crates/linnet/src/half_edge/algorithms/transitive_ops.rs - half_edge::algorithms::transitive_ops::HedgeGraph<E,V,H,N>::transitive_reduction (line 300) ... ignored
760.24 s
> test crates/linnet/src/half_edge/builder.rs - half_edge::builder::HedgeGraphBuilder (line 108) ... ignored
760.24 s
> test crates/linnet/src/half_edge/algorithms/trace_unfold.rs - half_edge::algorithms::trace_unfold::TraceKeyView (line 872) ... ok
760.24 s
> test crates/linnet/src/half_edge/algorithms/trace_unfold.rs - half_edge::algorithms::trace_unfold::TraceKey<O,D>::from_levels (line 1089) ... ok
760.24 s
> test crates/linnet/src/permutation.rs - permutation::Permutation (line 61) ... ok
760.24 s
> test crates/linnet/src/half_edge/algorithms/trace_unfold.rs - half_edge::algorithms::trace_unfold::TraceKey<O,D>::view (line 1110) ... ok
760.24 s
> test crates/linnet/src/half_edge/algorithms/trace_unfold.rs - half_edge::algorithms::trace_unfold::TraceKey<O,D>::empty (line 1071) ... ok
760.24 s
> test crates/linnet/src/half_edge/algorithms/trace_unfold.rs - half_edge::algorithms::trace_unfold::TraceKey<O,D>::push (line 1253) ... ok
760.24 s
> test crates/linnet/src/half_edge/algorithms/trace_unfold.rs - half_edge::algorithms::trace_unfold::TraceKey<O,D>::iter_leaf_ops (line 1222) ... ok
760.24 s
> test crates/linnet/src/half_edge/algorithms/trace_unfold.rs - half_edge::algorithms::trace_unfold::TraceKey<O,D>::is_empty (line 1136) ... ok
760.24 s
> test crates/linnet/src/half_edge/algorithms/trace_unfold.rs - half_edge::algorithms::trace_unfold::TraceKey<O,D>::iter_levels_top_down (line 1164) ... ok
760.24 s
> test crates/linnet/src/half_edge/algorithms/trace_unfold.rs - half_edge::algorithms::trace_unfold::TraceKey (line 1029) ... ok
760.24 s
> test crates/linnet/src/half_edge/algorithms/trace_unfold.rs - half_edge::algorithms::trace_unfold::TraceKey<O,D>::iter_levels_bottom_up (line 1194) ... ok
760.24 s
> test crates/linnet/src/half_edge/algorithms/trace_unfold.rs - half_edge::algorithms::trace_unfold::TraceUnfold::realizations_for_op (line 213) ... ok
760.24 s
> test crates/linnet/src/half_edge/algorithms/trace_unfold.rs - half_edge::algorithms::trace_unfold::TraceUnfold (line 127) ... ok
760.24 s
> test crates/linnet/src/parser/mod.rs - parser (line 17) ... ok
760.24 s
> test crates/linnet/src/half_edge/algorithms/trace_unfold.rs - half_edge::algorithms::trace_unfold::TraceKeyView<'a,O,D>::to_owned (line 979) ... ok
760.24 s
> test crates/linnet/src/half_edge/algorithms/trace_unfold.rs - half_edge::algorithms::trace_unfold::TraceKey<O,D>::write_foata_like (line 1356) ... ok
760.24 s
> test crates/linnet/src/permutation.rs - permutation::Permutation::from_disjoint_cycles (line 978) ... ok
760.24 s
> test crates/linnet/src/permutation.rs - permutation::Permutation::apply_slice (line 451) ... ok
760.24 s
> test crates/linnet/src/permutation.rs - permutation::Permutation::apply_slice_in_place_inv (line 510) ... ok
760.24 s
> test crates/linnet/src/permutation.rs - permutation::Permutation::from_cycles (line 1069) ... ok
760.24 s
> test crates/linnet/src/permutation.rs - permutation::Permutation::is_identity (line 851) ... ok
760.24 s
> test crates/linnet/src/permutation.rs - permutation::Permutation::find_cycles (line 680) ... ok
760.24 s
> test crates/linnet/src/permutation.rs - permutation::Permutation::apply_slice_in_place (line 488) ... ok
760.24 s
> test crates/linnet/src/permutation.rs - permutation::Permutation::from_map (line 113) ... ok
760.24 s
> test crates/linnet/src/permutation.rs - permutation::Permutation::id (line 96) ... ok
760.24 s
> test crates/linnet/src/permutation.rs - permutation::Permutation::apply_slice_inv (line 469) ... ok
760.24 s
> test crates/linnet/src/permutation.rs - permutation::Permutation::from_prefix_sources (line 266) ... ok
760.24 s
> test crates/linnet/src/permutation.rs - permutation::Permutation::iter_slice (line 543) ... ok
760.24 s
> test crates/linnet/src/permutation.rs - permutation::Permutation::cycle_to_transpositions (line 713) ... ok
760.24 s
> test crates/linnet/src/permutation.rs - permutation::Permutation::inv (line 416) ... ok
760.24 s
> test crates/linnet/src/permutation.rs - permutation::Permutation::iter_slice_inv (line 562) ... ok
760.24 s
> test crates/linnet/src/permutation.rs - permutation::Permutation::map (line 402) ... ok
760.24 s
> test crates/linnet/src/permutation.rs - permutation::Permutation::inverse (line 434) ... ok
760.24 s
> test crates/linnet/src/permutation.rs - permutation::Permutation::iter_slice_mut (line 588) ... ok
760.24 s
> test crates/linnet/src/permutation.rs - permutation::Permutation::myrvold_ruskey_unrank1 (line 782) ... ok
760.24 s
> test crates/linnet/src/permutation.rs - permutation::Permutation::myrvold_ruskey_rank2 (line 805) ... ok
760.24 s
> test crates/linnet/src/permutation.rs - permutation::Permutation::sort (line 640) ... ok
760.24 s
> test crates/linnet/src/permutation.rs - permutation::Permutation::sign (line 869) ... ok
760.24 s
> test crates/linnet/src/permutation.rs - permutation::Permutation::myrvold_ruskey_rank1 (line 760) ... ok
760.24 s
> test crates/linnet/src/permutation.rs - permutation::Permutation::pow (line 896) ... ok
760.24 s
> test crates/linnet/src/permutation.rs - permutation::Permutation::transpositions (line 733) ... ok
760.24 s
> test crates/linnet/src/permutation.rs - permutation::Permutation::myrvold_ruskey_unrank2 (line 828) ... ok
760.24 s
> test crates/linnet/src/permutation.rs - permutation::Permutation::iter_slice_inv_mut (line 615) ... ok
760.24 s
>
760.24 s
> test result: ok. 43 passed; 0 failed; 3 ignored; 0 measured; 0 filtered out; finished in 12.78s
760.24 s
>
760.24 s
> Doc-tests linnet_py
760.24 s
>
760.24 s
> running 0 tests
760.24 s
>
760.24 s
> test result: ok. 0 passed; 0 failed; 0 ignored; 0 measured; 0 filtered out; finished in 0.00s
760.24 s
>
760.24 s
> Doc-tests spenso
760.24 s
>
760.24 s
> running 9 tests
760.24 s
> test crates/spenso/src/shadowing/macros.rs - shadowing::macros::antisym (line 337) ... ignored
760.24 s
> test crates/spenso/src/shadowing/macros.rs - shadowing::macros::chain (line 387) ... ignored
760.24 s
> test crates/spenso/src/shadowing/macros.rs - shadowing::macros::cyclic (line 361) ... ignored
760.24 s
> test crates/spenso/src/shadowing/macros.rs - shadowing::macros::slot (line 24) ... ignored
760.24 s
> test crates/spenso/src/shadowing/macros.rs - shadowing::macros::sym (line 313) ... ignored
760.24 s
> test crates/spenso/src/shadowing/macros.rs - shadowing::macros::tensor (line 110) ... ignored
760.24 s
> test crates/spenso/src/shadowing/macros.rs - shadowing::macros::trace (line 444) ... ignored
760.24 s
> test crates/spenso/src/shadowing/macros.rs - shadowing::macros::trace_sym (line 496) ... ignored
760.24 s
> test crates/spenso/src/network/mod.rs - network::Network (line 1693) ... FAILED
760.24 s
>
760.24 s
> failures:
760.24 s
>
760.24 s
> ---- crates/spenso/src/network/mod.rs - network::Network (line 1693) stdout ----
760.24 s
> Test executable failed (terminated by signal).
760.24 s
>
760.24 s
> stdout:
760.24 s
> ┌────────────────────────────────────────────────────────┐
760.24 s
> │ You are running a restricted Symbolica instance. │
760.24 s
> │ │
760.24 s
> │ For non-commercial use only, limited to one │
760.24 s
> │ Symbolica thread per user. │
760.24 s
> │ │
760.24 s
> ├─ Unlock all cores ─────────────────────────────────────┤
760.24 s
> │ │
760.24 s
> │ Hobbyists and students: free annual key │
760.24 s
> │ https://symbolica.io/license/#get-hobbyist-license │
760.24 s
> │ │
760.24 s
> │ Free 30-day professional trial: │
760.24 s
> │ https://symbolica.io/license/#get-trial-license │
760.24 s
> │ │
760.24 s
> └────────────────────────────────────────────────────────┘
760.24 s
> ┌──────────────────────────────────────────────────────────────────────────────────────────────────┐
760.24 s
> │ Cannot start another restricted Symbolica thread while this user's thread allowance is in use. │
760.24 s
> └──────────────────────────────────────────────────────────────────────────────────────────────────┘
760.24 s
>
760.24 s
> stderr:
760.24 s
> ┌────────────────────────────────────────────────────────┐
760.24 s
> │ The Symbolica license key format is outdated. │
760.24 s
> │ Renew your key at https://symbolica.io/license/ │
760.24 s
> └────────────────────────────────────────────────────────┘
760.24 s
> Could not acquire Symbolica thread permit: Permission denied (os error 13)
760.24 s
>
760.24 s
>
760.24 s
>
760.24 s
> failures:
760.24 s
> crates/spenso/src/network/mod.rs - network::Network (line 1693)
760.24 s
>
760.24 s
> test result: FAILED. 0 passed; 1 failed; 8 ignored; 0 measured; 0 filtered out; finished in 0.14s
760.24 s
>
760.24 s
> all doctests ran in 4.23s; merged doctests compilation took 4.04s
760.24 s
> error : doctest failed, to rerun pass `-p spenso --doc`
760.24 s
For full logs, run:
760.24 s
nix log /nix/store/xmf37jpb1f2ls6mvj35zs9jzr5fjsgnv-gammaloop-workspace-doctest-0.1.0.drv
760.36 s
[0 built (1 failed ), 0.0 Run failed.