1. 0.00 s $ /nix/store/9ypz3flqsrl5xl495mm8h645gadjsxi1-coreutils-9.11/bin/timeout --kill-after=15s 7200s /nix/store/23zk8sgzamrbmj1fday15szf7f2279s8-nix-2.34.7/bin/nix --extra-experimental-features nix-command --extra-experimental-features flakes flake clone git+https://github.com/alphal00p/gammaloop --dest /tmp/nix-ci-worker/stable-pwd/repo/
  2. 0.08 s Cloning into '/tmp/nix-ci-worker/stable-pwd/repo'...
  3. 1.01 s remote: Enumerating objects: 93444, done.
  4. 1.26 s remote: Counting objects: 0% (1/8881) remote: Counting objects: 1% (89/8881) remote: Counting objects: 2% (178/8881) remote: Counting objects: 3% (267/8881) remote: Counting objects: 4% (356/8881) remote: Counting objects: 5% (445/8881) remote: Counting objects: 6% (533/8881) remote: Counting objects: 7% (622/8881) remote: Counting objects: 8% (711/8881) remote: Counting objects: 9% (800/8881) remote: Counting objects: 10% (889/8881) remote: Counting objects: 11% (977/8881) remote: Counting objects: 12% (1066/8881) remote: Counting objects: 13% (1155/8881) remote: Counting objects: 14% (1244/8881) remote: Counting objects: 15% (1333/8881) remote: Counting objects: 16% (1421/8881) remote: Counting objects: 17% (1510/8881) remote: Counting objects: 18% (1599/8881) remote: Counting objects: 19% (1688/8881) remote: Counting objects: 20% (1777/8881) remote: Counting objects: 21% (1866/8881) remote: Counting objects: 22% (1954/8881) remote: Counting objects: 23% (2043/8881) remote: Counting objects: 24% (2132/8881) remote: Counting objects: 25% (2221/8881) remote: Counting objects: 26% (2310/8881) remote: Counting objects: 27% (2398/8881) remote: Counting objects: 28% (2487/8881) remote: Counting objects: 29% (2576/8881) remote: Counting objects: 30% (2665/8881) remote: Counting objects: 31% (2754/8881) remote: Counting objects: 32% (2842/8881) remote: Counting objects: 33% (2931/8881) remote: Counting objects: 34% (3020/8881) remote: Counting objects: 35% (3109/8881) remote: Counting objects: 36% (3198/8881) remote: Counting objects: 37% (3286/8881) remote: Counting objects: 38% (3375/8881) remote: Counting objects: 39% (3464/8881) remote: Counting objects: 40% (3553/8881) remote: Counting objects: 41% (3642/8881) remote: Counting objects: 42% (3731/8881) remote: Counting objects: 43% (3819/8881) remote: Counting objects: 44% (3908/8881) remote: Counting objects: 45% (3997/8881) remote: Counting objects: 46% (4086/8881) remote: Counting objects: 47% (4175/8881) remote: Counting objects: 48% (4263/8881) remote: Counting objects: 49% (4352/8881) remote: Counting objects: 50% (4441/8881) remote: Counting objects: 51% (4530/8881) remote: Counting objects: 52% (4619/8881) remote: Counting objects: 53% (4707/8881) remote: Counting objects: 54% (4796/8881) remote: Counting objects: 55% (4885/8881) remote: Counting objects: 56% (4974/8881) remote: Counting objects: 57% (5063/8881) remote: Counting objects: 58% (5151/8881) remote: Counting objects: 59% (5240/8881) remote: Counting objects: 60% (5329/8881) remote: Counting objects: 61% (5418/8881) remote: Counting objects: 62% (5507/8881) remote: Counting objects: 63% (5596/8881) remote: Counting objects: 64% (5684/8881) remote: Counting objects: 65% (5773/8881) remote: Counting objects: 66% (5862/8881) remote: Counting objects: 67% (5951/8881) remote: Counting objects: 68% (6040/8881) remote: Counting objects: 69% (6128/8881) remote: Counting objects: 70% (6217/8881) remote: Counting objects: 71% (6306/8881) remote: Counting objects: 72% (6395/8881) remote: Counting objects: 73% (6484/8881) remote: Counting objects: 74% (6572/8881) remote: Counting objects: 75% (6661/8881) remote: Counting objects: 76% (6750/8881) remote: Counting objects: 77% (6839/8881) remote: Counting objects: 78% (6928/8881) remote: Counting objects: 79% (7016/8881) remote: Counting objects: 80% (7105/8881) remote: Counting objects: 81% (7194/8881) remote: Counting objects: 82% (7283/8881) remote: Counting objects: 83% (7372/8881) remote: Counting objects: 84% (7461/8881) remote: Counting objects: 85% (7549/8881) remote: Counting objects: 86% (7638/8881) remote: Counting objects: 87% (7727/8881) remote: Counting objects: 88% (7816/8881) remote: Counting objects: 89% (7905/8881) remote: Counting objects: 90% (7993/8881) remote: Counting objects: 91% (8082/8881) remote: Counting objects: 92% (8171/8881) remote: Counting objects: 93% (8260/8881) remote: Counting objects: 94% (8349/8881) remote: Counting objects: 95% (8437/8881) remote: Counting objects: 96% (8526/8881) remote: Counting objects: 97% (8615/8881) remote: Counting objects: 98% (8704/8881) remote: Counting objects: 99% (8793/8881) remote: Counting objects: 100% (8881/8881) remote: Counting objects: 100% (8881/8881), done.
  5. 4.24 s remote: Compressing objects: 0% (1/1810) remote: Compressing objects: 1% (19/1810) remote: Compressing objects: 2% (37/1810) remote: Compressing objects: 3% (55/1810) remote: Compressing objects: 4% (73/1810) remote: Compressing objects: 5% (91/1810) remote: Compressing objects: 5% (107/1810) remote: Compressing objects: 6% (109/1810) remote: Compressing objects: 7% (127/1810) remote: Compressing objects: 8% (145/1810) remote: Compressing objects: 9% (163/1810) remote: Compressing objects: 10% (181/1810) remote: Compressing objects: 11% (200/1810) remote: Compressing objects: 12% (218/1810) remote: Compressing objects: 13% (236/1810) remote: Compressing objects: 13% (238/1810) remote: Compressing objects: 14% (254/1810) remote: Compressing objects: 15% (272/1810) remote: Compressing objects: 16% (290/1810) remote: Compressing objects: 17% (308/1810) remote: Compressing objects: 18% (326/1810) remote: Compressing objects: 19% (344/1810) remote: Compressing objects: 20% (362/1810) remote: Compressing objects: 21% (381/1810) remote: Compressing objects: 22% (399/1810) remote: Compressing objects: 23% (417/1810) remote: Compressing objects: 24% (435/1810) remote: Compressing objects: 25% (453/1810) remote: Compressing objects: 26% (471/1810) remote: Compressing objects: 27% (489/1810) remote: Compressing objects: 28% (507/1810) remote: Compressing objects: 29% (525/1810) remote: Compressing objects: 30% (543/1810) remote: Compressing objects: 31% (562/1810) remote: Compressing objects: 32% (580/1810) remote: Compressing objects: 33% (598/1810) remote: Compressing objects: 34% (616/1810) remote: Compressing objects: 34% (631/1810) remote: Compressing objects: 35% (634/1810) remote: Compressing objects: 36% (652/1810) remote: Compressing objects: 37% (670/1810) remote: Compressing objects: 38% (688/1810) remote: Compressing objects: 39% (706/1810) remote: Compressing objects: 40% (724/1810) remote: Compressing objects: 41% (743/1810) remote: Compressing objects: 42% (761/1810) remote: Compressing objects: 43% (779/1810) remote: Compressing objects: 44% (797/1810) remote: Compressing objects: 45% (815/1810) remote: Compressing objects: 46% (833/1810) remote: Compressing objects: 47% (851/1810) remote: Compressing objects: 48% (869/1810) remote: Compressing objects: 49% (887/1810) remote: Compressing objects: 50% (905/1810) remote: Compressing objects: 51% (924/1810) remote: Compressing objects: 52% (942/1810) remote: Compressing objects: 53% (960/1810) remote: Compressing objects: 54% (978/1810) remote: Compressing objects: 55% (996/1810) remote: Compressing objects: 56% (1014/1810) remote: Compressing objects: 57% (1032/1810) remote: Compressing objects: 58% (1050/1810) remote: Compressing objects: 59% (1068/1810) remote: Compressing objects: 60% (1086/1810) remote: Compressing objects: 61% (1105/1810) remote: Compressing objects: 62% (1123/1810) remote: Compressing objects: 63% (1141/1810) remote: Compressing objects: 64% (1159/1810) remote: Compressing objects: 65% (1177/1810) remote: Compressing objects: 66% (1195/1810) remote: Compressing objects: 67% (1213/1810) remote: Compressing objects: 68% (1231/1810) remote: Compressing objects: 69% (1249/1810) remote: Compressing objects: 70% (1267/1810) remote: Compressing objects: 71% (1286/1810) remote: Compressing objects: 72% (1304/1810) remote: Compressing objects: 73% (1322/1810) remote: Compressing objects: 74% (1340/1810) remote: Compressing objects: 75% (1358/1810) remote: Compressing objects: 76% (1376/1810) remote: Compressing objects: 77% (1394/1810) remote: Compressing objects: 78% (1412/1810) remote: Compressing objects: 79% (1430/1810) remote: Compressing objects: 80% (1448/1810) remote: Compressing objects: 81% (1467/1810) remote: Compressing objects: 82% (1485/1810) remote: Compressing objects: 83% (1503/1810) remote: Compressing objects: 84% (1521/1810) remote: Compressing objects: 85% (1539/1810) remote: Compressing objects: 86% (1557/1810) remote: Compressing objects: 87% (1575/1810) remote: Compressing objects: 88% (1593/1810) remote: Compressing objects: 89% (1611/1810) remote: Compressing objects: 90% (1629/1810) remote: Compressing objects: 91% (1648/1810) remote: Compressing objects: 92% (1666/1810) remote: Compressing objects: 93% (1684/1810) remote: Compressing objects: 94% (1702/1810) remote: Compressing objects: 95% (1720/1810) remote: Compressing objects: 96% (1738/1810) remote: Compressing objects: 97% (1756/1810) remote: Compressing objects: 98% (1774/1810) remote: Compressing objects: 99% (1792/1810) remote: Compressing objects: 100% (1810/1810) remote: Compressing objects: 100% (1810/1810), done.
  6. 13.72 s Receiving objects: 0% (1/93444) Receiving objects: 1% (935/93444) Receiving objects: 2% (1869/93444) Receiving objects: 3% (2804/93444) Receiving objects: 4% (3738/93444) Receiving objects: 5% (4673/93444) Receiving objects: 6% (5607/93444), 9.51 MiB | 19.01 MiB/s Receiving objects: 7% (6542/93444), 9.51 MiB | 19.01 MiB/s Receiving objects: 8% (7476/93444), 9.51 MiB | 19.01 MiB/s Receiving objects: 9% (8410/93444), 9.51 MiB | 19.01 MiB/s Receiving objects: 10% (9345/93444), 9.51 MiB | 19.01 MiB/s Receiving objects: 11% (10279/93444), 9.51 MiB | 19.01 MiB/s Receiving objects: 12% (11214/93444), 9.51 MiB | 19.01 MiB/s Receiving objects: 13% (12148/93444), 9.51 MiB | 19.01 MiB/s Receiving objects: 14% (13083/93444), 9.51 MiB | 19.01 MiB/s Receiving objects: 15% (14017/93444), 9.51 MiB | 19.01 MiB/s Receiving objects: 16% (14952/93444), 9.51 MiB | 19.01 MiB/s Receiving objects: 17% (15886/93444), 9.51 MiB | 19.01 MiB/s Receiving objects: 18% (16820/93444), 9.51 MiB | 19.01 MiB/s Receiving objects: 19% (17755/93444), 9.51 MiB | 19.01 MiB/s Receiving objects: 20% (18689/93444), 9.51 MiB | 19.01 MiB/s Receiving objects: 21% (19624/93444), 9.51 MiB | 19.01 MiB/s Receiving objects: 22% (20558/93444), 9.51 MiB | 19.01 MiB/s Receiving objects: 23% (21493/93444), 9.51 MiB | 19.01 MiB/s Receiving objects: 24% (22427/93444), 9.51 MiB | 19.01 MiB/s Receiving objects: 25% (23361/93444), 9.51 MiB | 19.01 MiB/s Receiving objects: 26% (24296/93444), 9.51 MiB | 19.01 MiB/s Receiving objects: 27% (25230/93444), 9.51 MiB | 19.01 MiB/s Receiving objects: 28% (26165/93444), 9.51 MiB | 19.01 MiB/s Receiving objects: 29% (27099/93444), 9.51 MiB | 19.01 MiB/s Receiving objects: 30% (28034/93444), 9.51 MiB | 19.01 MiB/s Receiving objects: 31% (28968/93444), 9.51 MiB | 19.01 MiB/s Receiving objects: 32% (29903/93444), 9.51 MiB | 19.01 MiB/s Receiving objects: 33% (30837/93444), 9.51 MiB | 19.01 MiB/s Receiving objects: 33% (31164/93444), 9.51 MiB | 19.01 MiB/s Receiving objects: 34% (31771/93444), 27.55 MiB | 27.57 MiB/s Receiving objects: 35% (32706/93444), 27.55 MiB | 27.57 MiB/s Receiving objects: 36% (33640/93444), 27.55 MiB | 27.57 MiB/s Receiving objects: 37% (34575/93444), 27.55 MiB | 27.57 MiB/s Receiving objects: 38% (35509/93444), 27.55 MiB | 27.57 MiB/s Receiving objects: 39% (36444/93444), 27.55 MiB | 27.57 MiB/s Receiving objects: 40% (37378/93444), 27.55 MiB | 27.57 MiB/s Receiving objects: 41% (38313/93444), 42.01 MiB | 28.02 MiB/s Receiving objects: 42% (39247/93444), 42.01 MiB | 28.02 MiB/s Receiving objects: 43% (40181/93444), 42.01 MiB | 28.02 MiB/s Receiving objects: 44% (41116/93444), 42.01 MiB | 28.02 MiB/s Receiving objects: 45% (42050/93444), 42.01 MiB | 28.02 MiB/s Receiving objects: 46% (42985/93444), 42.01 MiB | 28.02 MiB/s Receiving objects: 47% (43919/93444), 42.01 MiB | 28.02 MiB/s Receiving objects: 48% (44854/93444), 42.01 MiB | 28.02 MiB/s Receiving objects: 49% (45788/93444), 42.01 MiB | 28.02 MiB/s Receiving objects: 49% (46430/93444), 42.01 MiB | 28.02 MiB/s Receiving objects: 50% (46722/93444), 57.21 MiB | 28.62 MiB/s Receiving objects: 51% (47657/93444), 57.21 MiB | 28.62 MiB/s Receiving objects: 52% (48591/93444), 57.21 MiB | 28.62 MiB/s Receiving objects: 53% (49526/93444), 57.21 MiB | 28.62 MiB/s Receiving objects: 54% (50460/93444), 57.21 MiB | 28.62 MiB/s Receiving objects: 55% (51395/93444), 72.14 MiB | 28.83 MiB/s Receiving objects: 56% (52329/93444), 72.14 MiB | 28.83 MiB/s Receiving objects: 57% (53264/93444), 72.14 MiB | 28.83 MiB/s Receiving objects: 58% (54198/93444), 72.14 MiB | 28.83 MiB/s Receiving objects: 59% (55132/93444), 72.14 MiB | 28.83 MiB/s Receiving objects: 60% (56067/93444), 72.14 MiB | 28.83 MiB/s Receiving objects: 61% (57001/93444), 72.14 MiB | 28.83 MiB/s Receiving objects: 61% (57076/93444), 87.60 MiB | 29.16 MiB/s Receiving objects: 61% (57123/93444), 117.92 MiB | 29.43 MiB/s Receiving objects: 61% (57248/93444), 148.44 MiB | 30.70 MiB/s Receiving objects: 61% (57650/93444), 178.76 MiB | 30.21 MiB/s Receiving objects: 62% (57936/93444), 178.76 MiB | 30.21 MiB/s Receiving objects: 63% (58870/93444), 178.76 MiB | 30.21 MiB/s Receiving objects: 64% (59805/93444), 178.76 MiB | 30.21 MiB/s Receiving objects: 65% (60739/93444), 178.76 MiB | 30.21 MiB/s Receiving objects: 66% (61674/93444), 178.76 MiB | 30.21 MiB/s Receiving objects: 67% (62608/93444), 178.76 MiB | 30.21 MiB/s Receiving objects: 68% (63542/93444), 194.03 MiB | 30.22 MiB/s Receiving objects: 69% (64477/93444), 194.03 MiB | 30.22 MiB/s Receiving objects: 69% (64701/93444), 194.03 MiB | 30.22 MiB/s Receiving objects: 70% (65411/93444), 209.36 MiB | 30.33 MiB/s Receiving objects: 71% (66346/93444), 209.36 MiB | 30.33 MiB/s Receiving objects: 72% (67280/93444), 209.36 MiB | 30.33 MiB/s Receiving objects: 73% (68215/93444), 209.36 MiB | 30.33 MiB/s Receiving objects: 74% (69149/93444), 209.36 MiB | 30.33 MiB/s Receiving objects: 75% (70083/93444), 209.36 MiB | 30.33 MiB/s Receiving objects: 76% (71018/93444), 209.36 MiB | 30.33 MiB/s Receiving objects: 77% (71952/93444), 209.36 MiB | 30.33 MiB/s Receiving objects: 78% (72887/93444), 209.36 MiB | 30.33 MiB/s Receiving objects: 79% (73821/93444), 209.36 MiB | 30.33 MiB/s Receiving objects: 80% (74756/93444), 209.36 MiB | 30.33 MiB/s Receiving objects: 81% (75690/93444), 209.36 MiB | 30.33 MiB/s Receiving objects: 82% (76625/93444), 224.67 MiB | 30.31 MiB/s Receiving objects: 82% (77001/93444), 224.67 MiB | 30.31 MiB/s Receiving objects: 83% (77559/93444), 240.12 MiB | 30.41 MiB/s Receiving objects: 84% (78493/93444), 240.12 MiB | 30.41 MiB/s Receiving objects: 85% (79428/93444), 240.12 MiB | 30.41 MiB/s Receiving objects: 86% (80362/93444), 255.28 MiB | 30.40 MiB/s Receiving objects: 87% (81297/93444), 255.28 MiB | 30.40 MiB/s Receiving objects: 88% (82231/93444), 255.28 MiB | 30.40 MiB/s Receiving objects: 89% (83166/93444), 255.28 MiB | 30.40 MiB/s Receiving objects: 89% (84038/93444), 255.28 MiB | 30.40 MiB/s Receiving objects: 90% (84100/93444), 270.45 MiB | 30.51 MiB/s Receiving objects: 91% (85035/93444), 270.45 MiB | 30.51 MiB/s Receiving objects: 92% (85969/93444), 270.45 MiB | 30.51 MiB/s Receiving objects: 93% (86903/93444), 270.45 MiB | 30.51 MiB/s Receiving objects: 94% (87838/93444), 270.45 MiB | 30.51 MiB/s Receiving objects: 95% (88772/93444), 270.45 MiB | 30.51 MiB/s Receiving objects: 96% (89707/93444), 270.45 MiB | 30.51 MiB/s Receiving objects: 97% (90641/93444), 270.45 MiB | 30.51 MiB/s Receiving objects: 98% (91576/93444), 270.45 MiB | 30.51 MiB/s Receiving objects: 99% (92510/93444), 270.45 MiB | 30.51 MiB/s remote: Total 93444 (delta 7742), reused 7083 (delta 7067), pack-reused 84563 (from 2)
  7. 13.72 s Receiving objects: 100% (93444/93444), 270.45 MiB | 30.51 MiB/s Receiving objects: 100% (93444/93444), 284.29 MiB | 29.98 MiB/s, done.
  8. 16.34 s Resolving deltas: 0% (0/63027) Resolving deltas: 1% (631/63027) Resolving deltas: 2% (1261/63027) Resolving deltas: 3% (1891/63027) Resolving deltas: 4% (2523/63027) Resolving deltas: 5% (3152/63027) Resolving deltas: 6% (3782/63027) Resolving deltas: 7% (4412/63027) Resolving deltas: 8% (5043/63027) Resolving deltas: 9% (5673/63027) Resolving deltas: 10% (6303/63027) Resolving deltas: 11% (6933/63027) Resolving deltas: 12% (7565/63027) Resolving deltas: 13% (8194/63027) Resolving deltas: 14% (8824/63027) Resolving deltas: 15% (9455/63027) Resolving deltas: 16% (10085/63027) Resolving deltas: 17% (10715/63027) Resolving deltas: 18% (11347/63027) Resolving deltas: 19% (11976/63027) Resolving deltas: 20% (12606/63027) Resolving deltas: 21% (13236/63027) Resolving deltas: 22% (13866/63027) Resolving deltas: 23% (14499/63027) Resolving deltas: 24% (15127/63027) Resolving deltas: 25% (15757/63027) Resolving deltas: 26% (16388/63027) Resolving deltas: 27% (17018/63027) Resolving deltas: 28% (17648/63027) Resolving deltas: 29% (18278/63027) Resolving deltas: 30% (18909/63027) Resolving deltas: 31% (19539/63027) Resolving deltas: 32% (20169/63027) Resolving deltas: 33% (20799/63027) Resolving deltas: 34% (21430/63027) Resolving deltas: 35% (22060/63027) Resolving deltas: 36% (22690/63027) Resolving deltas: 37% (23320/63027) Resolving deltas: 38% (23951/63027) Resolving deltas: 39% (24581/63027) Resolving deltas: 40% (25211/63027) Resolving deltas: 41% (25842/63027) Resolving deltas: 42% (26472/63027) Resolving deltas: 43% (27102/63027) Resolving deltas: 44% (27733/63027) Resolving deltas: 45% (28363/63027) Resolving deltas: 46% (28993/63027) Resolving deltas: 47% (29623/63027) Resolving deltas: 48% (30253/63027) Resolving deltas: 49% (30884/63027) Resolving deltas: 50% (31514/63027) Resolving deltas: 50% (31708/63027) Resolving deltas: 51% (32144/63027) Resolving deltas: 52% (32775/63027) Resolving deltas: 53% (33405/63027) Resolving deltas: 54% (34035/63027) Resolving deltas: 55% (34665/63027) Resolving deltas: 56% (35296/63027) Resolving deltas: 57% (35926/63027) Resolving deltas: 58% (36556/63027) Resolving deltas: 59% (37186/63027) Resolving deltas: 60% (37817/63027) Resolving deltas: 61% (38447/63027) Resolving deltas: 62% (39077/63027) Resolving deltas: 63% (39708/63027) Resolving deltas: 64% (40338/63027) Resolving deltas: 65% (40968/63027) Resolving deltas: 66% (41598/63027) Resolving deltas: 67% (42230/63027) Resolving deltas: 68% (42859/63027) Resolving deltas: 69% (43490/63027) Resolving deltas: 70% (44119/63027) Resolving deltas: 71% (44750/63027) Resolving deltas: 72% (45380/63027) Resolving deltas: 73% (46010/63027) Resolving deltas: 74% (46640/63027) Resolving deltas: 75% (47272/63027) Resolving deltas: 76% (47901/63027) Resolving deltas: 77% (48531/63027) Resolving deltas: 78% (49162/63027) Resolving deltas: 78% (49165/63027) Resolving deltas: 79% (49793/63027) Resolving deltas: 80% (50422/63027) Resolving deltas: 81% (51052/63027) Resolving deltas: 82% (51683/63027) Resolving deltas: 83% (52313/63027) Resolving deltas: 84% (52943/63027) Resolving deltas: 85% (53573/63027) Resolving deltas: 86% (54204/63027) Resolving deltas: 87% (54835/63027) Resolving deltas: 88% (55464/63027) Resolving deltas: 89% (56095/63027) Resolving deltas: 90% (56725/63027) Resolving deltas: 91% (57355/63027) Resolving deltas: 92% (57985/63027) Resolving deltas: 93% (58616/63027) Resolving deltas: 94% (59246/63027) Resolving deltas: 95% (59876/63027) Resolving deltas: 96% (60506/63027) Resolving deltas: 97% (61137/63027) Resolving deltas: 98% (61767/63027) Resolving deltas: 99% (62397/63027) Resolving deltas: 100% (63027/63027) Resolving deltas: 100% (63027/63027), done.
  9. 17.03 s Fetching commit 43649e2ed5bc140b6fa2364e5e528f13134be9f5 for simplify-spenso-api ...
  10. 17.03 s $ /nix/store/bcnisk3ydfgv26v2gw3zlky24g00yww2-git-2.54.0/bin/git fetch origin 43649e2ed5bc140b6fa2364e5e528f13134be9f5
  11. 17.70 s From https://github.com/alphal00p/gammaloop
  12. 17.70 s * branch 43649e2ed5bc140b6fa2364e5e528f13134be9f5 -> FETCH_HEAD
  13. 17.76 s $ /nix/store/9ypz3flqsrl5xl495mm8h645gadjsxi1-coreutils-9.11/bin/timeout --kill-after=15s 7200s /nix/store/bcnisk3ydfgv26v2gw3zlky24g00yww2-git-2.54.0/bin/git -c advice.detachedHead=false checkout 43649e2ed5bc140b6fa2364e5e528f13134be9f5
  14. 18.09 s HEAD is now at 43649e2ed align Tymbolica interop with fixed Symbolica main
  15. 18.10 s $ /nix/store/9ypz3flqsrl5xl495mm8h645gadjsxi1-coreutils-9.11/bin/timeout --kill-after=15s 7200s /nix/store/23zk8sgzamrbmj1fday15szf7f2279s8-nix-2.34.7/bin/nix --extra-experimental-features nix-command --extra-experimental-features flakes --log-format internal-json run .#packages.x86_64-linux.nix-ci-check-gammaloop-doctest --print-build-logs
  16. 18.35 s error (ignored): SQLite database '/var/cache/nix-ci-worker/eval-cache-v6/2ef55e31c7679bc9dd52fde4aebc77f8b510a24ff6ac7b70e836ab2f59e93e35.sqlite' is busy
  17. 18.54 s
  18. 23.27 s evaluating derivation 'g copying '/nix/store/iccx [0/1 built] [1/0/1 built] building ggammaloop-workspace-doctest> Running phase: unpackPhase
  19. 23.27 s gammaloop-workspace-doctest> unpacking source archive /nix/store/0b6y73sx10i7jc9h7gv2p4wq7jn4fbkv-source
  20. 23.47 s gammaloop-workspace-doctest> source root is source
  21. 23.50 s gammaloop-workspace-doctest> Running phase: patchPhase
  22. 23.50 s gammaloop-workspace-doctest> Executing configureCargoCommonVars
  23. 23.50 s gammaloop-workspace-doctest> decompressing cargo artifacts from /nix/store/8zs9bds37a34fqlhv8z320b7lfv0rp55-gammaloop-workspace-deps-deps-0.1.0/target.tar.zst to target
  24. 27.90 s gammaloop-workspace-doctest> Running phase: updateAutotoolsGnuConfigScriptsPhase
  25. 27.97 s gammaloop-workspace-doctest> Running phase: configurePhase
  26. 27.98 s gammaloop-workspace-doctest> will append /build/source/.cargo-home/config.toml with contents of /nix/store/9rqk4093qnvgswmdk1pbxk9najcrjn7a-vendor-cargo-deps/config.toml
  27. 27.99 s gammaloop-workspace-doctest> default configurePhase, nothing to do
  28. 28.00 s gammaloop-workspace-doctest> Running phase: buildPhase
  29. 28.02 s gammaloop-workspace-doctest> +++ command cargo --version
  30. 28.02 s gammaloop-workspace-doctest> cargo 1.98.1 (797e8a9bc 2026-08-05)
  31. 28.08 s gammaloop-workspace-doctest> +++ command cargo test --profile ci-optim --doc --locked --workspace --features gammaloop-api/cli,gammaloop-tracing-filter/clap,gammaloop-tracing-filter/symbolica,idenso/bincode,idenso/native,idenso/reference-cases,linnet/bincode,linnet/drawing,linnet/nodestore-vec,linnet/rkyv,linnet/serde,linnet/symbolica,spenso-macros/native,spenso-macros/shadowing,spenso/native,spenso/native-code-generation,spenso/shadowing,symbolica-utils/native,symbolica/tracing_max_level_info --exclude alphal00p-docs-python-exporter
  32. 28.68 s gammaloop-workspace-doctest> Compiling pyo3-build-config v0.28.3
  33. 28.68 s gammaloop-workspace-doctest> Compiling const-random-macro v0.1.16
  34. 28.69 s gammaloop-workspace-doctest> Compiling phf_generator v0.11.3
  35. 28.70 s gammaloop-workspace-doctest> Compiling rustpython-ast v0.4.0
  36. 28.71 s gammaloop-workspace-doctest> Compiling similar v2.7.0
  37. 28.71 s gammaloop-workspace-doctest> Compiling symbolica v2.2.0 (https://github.com/symbolica-dev/symbolica?rev=4f1323185fe5e0c0f8c864ab89edd1905e7adef1#4f132318)
  38. 28.73 s gammaloop-workspace-doctest> Compiling derive_more-impl v2.1.1
  39. 28.74 s gammaloop-workspace-doctest> Compiling gammaloop-tracing-filter-macros v0.1.0 (/build/source/crates/gammaloop-tracing-filter-macros)
  40. 28.74 s gammaloop-workspace-doctest> Compiling vakint v0.1.2 (/build/source/crates/vakint)
  41. 28.74 s gammaloop-workspace-doctest> Compiling gammalooprs v0.3.4 (/build/source/crates/gammalooprs)
  42. 28.76 s gammaloop-workspace-doctest> Compiling gammaloop-api v0.1.0 (/build/source/crates/gammaloop-api)
  43. 28.76 s gammaloop-workspace-doctest> Compiling alphal00p-docs-macros v0.1.0 (/build/source/crates/alphal00p-docs-macros)
  44. 28.76 s gammaloop-workspace-doctest> Compiling proc-macro-error-attr2 v2.0.0
  45. 28.77 s gammaloop-workspace-doctest> Compiling alphal00p-docs-schema v0.1.0 (/build/source/crates/alphal00p-docs-schema)
  46. 28.77 s gammaloop-workspace-doctest> Compiling phf_codegen v0.11.3
  47. 28.77 s gammaloop-workspace-doctest> Compiling rustc_version v0.4.1
  48. 28.94 s gammaloop-workspace-doctest> Compiling unicode_names2_generator v1.3.0
  49. 29.21 s gammaloop-workspace-doctest> Compiling figment v0.10.19
  50. 29.26 s gammaloop-workspace-doctest> Compiling bincode v1.3.3
  51. 29.30 s gammaloop-workspace-doctest> Compiling const-random v0.1.18
  52. 29.39 s gammaloop-workspace-doctest> Compiling ahash v0.8.12
  53. 29.39 s gammaloop-workspace-doctest> Compiling gungraun-runner v0.18.2
  54. 29.40 s gammaloop-workspace-doctest> Compiling iai-callgrind-runner v0.14.2
  55. 29.43 s gammaloop-workspace-doctest> Compiling rustpython-parser v0.4.0
  56. 29.56 s gammaloop-workspace-doctest> Compiling target-triple v1.0.1
  57. 29.73 s gammaloop-workspace-doctest> Compiling symjit v2.25.6
  58. 29.77 s gammaloop-workspace-doctest> Compiling numerica v3.0.0 (https://github.com/symbolica-dev/symbolica?rev=4f1323185fe5e0c0f8c864ab89edd1905e7adef1#4f132318)
  59. 29.83 s gammaloop-workspace-doctest> Compiling momtrop v0.3.0
  60. 29.87 s gammaloop-workspace-doctest> Compiling gungraun-macros v0.8.0
  61. 30.27 s gammaloop-workspace-doctest> Compiling insta v1.47.2
  62. 30.49 s gammaloop-workspace-doctest> Compiling kurvst v0.1.0 (/build/source/crates/kurvst)
  63. 30.52 s gammaloop-workspace-doctest> Compiling proc-macro-error2 v2.0.1
  64. 30.56 s gammaloop-workspace-doctest> Compiling gammaloop-integration-tests v0.1.0 (/build/source/tests)
  65. 31.17 s gammaloop-workspace-doctest> Compiling test-log-core v0.2.20
  66. 31.39 s gammaloop-workspace-doctest> Compiling alphal00p-docs-catalogs v0.1.0 (/build/source/crates/alphal00p-docs-catalogs)
  67. 31.50 s gammaloop-workspace-doctest> Compiling wait-timeout v0.2.1
  68. 31.83 s gammaloop-workspace-doctest> Compiling bit-vec v0.8.0
  69. 32.24 s gammaloop-workspace-doctest> Compiling iai-callgrind v0.14.2
  70. 32.36 s gammaloop-workspace-doctest> Compiling quick-error v1.2.3
  71. 32.47 s gammaloop-workspace-doctest> Compiling rusty-fork v0.3.1
  72. 32.63 s gammaloop-workspace-doctest> Compiling bit-set v0.8.0
  73. 34.66 s gammaloop-workspace-doctest> Compiling rand_xorshift v0.4.0
  74. 34.81 s gammaloop-workspace-doctest> Compiling console v0.15.11
  75. 35.08 s gammaloop-workspace-doctest> Compiling test-log-macros v0.2.20
  76. 36.04 s gammaloop-workspace-doctest> Compiling unicode_names2 v1.3.0
  77. 36.21 s gammaloop-workspace-doctest> Compiling termcolor v1.4.1
  78. 36.75 s gammaloop-workspace-doctest> Compiling glob v0.3.4
  79. 37.09 s gammaloop-workspace-doctest> Compiling unarray v0.1.4
  80. 37.17 s gammaloop-workspace-doctest> Compiling base64 v0.21.7
  81. 37.20 s gammaloop-workspace-doctest> Compiling proptest v1.11.0
  82. 37.45 s gammaloop-workspace-doctest> Compiling alphal00p-docs-builder v0.1.0 (/build/source/crates/alphal00p-docs-builder)
  83. 38.01 s gammaloop-workspace-doctest> Compiling ron v0.8.1
  84. 38.43 s gammaloop-workspace-doctest> Compiling trybuild v1.0.120
  85. 38.56 s gammaloop-workspace-doctest> Compiling test-log v0.2.20
  86. 38.63 s gammaloop-workspace-doctest> Compiling clinnet v0.1.8 (/build/source/crates/clinnet)
  87. 39.20 s gammaloop-workspace-doctest> Compiling pyo3-macros-backend v0.28.3
  88. 39.35 s gammaloop-workspace-doctest> Compiling numpy v0.28.0
  89. 39.71 s gammaloop-workspace-doctest> Compiling pyo3-ffi v0.28.3
  90. 40.20 s gammaloop-workspace-doctest> Compiling pyo3 v0.28.3
  91. 41.37 s gammaloop-workspace-doctest> Compiling alphal00p-docs-examples v0.1.0 (/build/source/crates/alphal00p-docs-examples)
  92. 41.85 s gammaloop-workspace-doctest> Compiling graphica v3.0.0 (https://github.com/symbolica-dev/symbolica?rev=4f1323185fe5e0c0f8c864ab89edd1905e7adef1#4f132318)
  93. 42.10 s gammaloop-workspace-doctest> Compiling linnet-py v0.1.0 (/build/source/crates/linnet-py)
  94. 42.37 s gammaloop-workspace-doctest> Compiling similar-asserts v1.7.0
  95. 51.12 s gammaloop-workspace-doctest> Compiling derive_more v2.1.1
  96. 51.22 s gammaloop-workspace-doctest> Compiling crossterm v0.29.0
  97. 53.47 s gammaloop-workspace-doctest> Compiling ratatui-crossterm v0.1.0
  98. 53.86 s gammaloop-workspace-doctest> Compiling ratatui v0.30.0
  99. 54.73 s gammaloop-workspace-doctest> Compiling iai-callgrind-macros v0.5.1
  100. 61.47 s gammaloop-workspace-doctest> Compiling pyo3-stub-gen-derive v0.17.2
  101. 65.27 s gammaloop-workspace-doctest> Compiling gungraun v0.18.2
  102. 66.32 s gammaloop-workspace-doctest> Compiling pyo3-macros v0.28.3
  103. 72.88 s gammaloop-workspace-doctest> Compiling pyo3-stub-gen v0.17.2
  104. 85.03 s gammaloop-workspace-doctest> Compiling symbolica-utils v0.1.0 (/build/source/crates/symbolica-utils)
  105. 129.97 s gammaloop-workspace-doctest> Compiling tymbolica-atom-payload v0.1.0 (https://github.com/lcnbr/tymbolica?rev=32ae00483b4845161401afac8be755cc336cb2bb#32ae0048)
  106. 512.01 s gammaloop-workspace-doctest> Compiling gammaloop-workspace-hack v0.1.0 (/build/source/crates/gammaloop-workspace-hack)
  107. 512.01 s gammaloop-workspace-doctest> Compiling spenso-macros v0.3.2 (/build/source/crates/spenso-macros)
  108. 512.37 s gammaloop-workspace-doctest> Compiling linnet v0.17.0 (/build/source/crates/linnet)
  109. 517.23 s gammaloop-workspace-doctest> Compiling spenso v0.6.0 (/build/source/crates/spenso)
  110. 531.08 s gammaloop-workspace-doctest> Compiling idenso v0.3.0 (/build/source/crates/idenso)
  111. 531.08 s gammaloop-workspace-doctest> Compiling gammaloop-tracing-filter v0.1.0 (/build/source/crates/gammaloop-tracing-filter)
  112. 539.17 s gammaloop-workspace-doctest> Compiling spenso-hep-lib v0.1.7 (/build/source/crates/spenso-hep-lib)
  113. 539.45 s gammaloop-workspace-doctest> Compiling spynso3 v0.1.2 (/build/source/crates/spynso3)
  114. 591.81 s gammaloop-workspace-doctest> Compiling linnest v0.1.0 (/build/source/crates/linnest)
  115. 875.05 s gammaloop-workspace-doctest> Finished `ci-optim` profile [optimized] target(s) in 14m 06s
  116. 875.22 s gammaloop-workspace-doctest> warning: the following packages contain code that will be rejected by a future version of Rust: proc-macro-error2 v2.0.1
  117. 875.22 s gammaloop-workspace-doctest> note: to see what the problems were, use the option `--future-incompat-report`, or run `cargo report future-incompatibilities --id 1`
  118. 875.26 s gammaloop-workspace-doctest> Doc-tests alphal00p_docs_builder
  119. 875.45 s gammaloop-workspace-doctest>
  120. 875.45 s gammaloop-workspace-doctest> running 0 tests
  121. 875.45 s gammaloop-workspace-doctest>
  122. 875.45 s gammaloop-workspace-doctest> test result: ok. 0 passed; 0 failed; 0 ignored; 0 measured; 0 filtered out; finished in 0.00s
  123. 875.45 s gammaloop-workspace-doctest>
  124. 875.45 s gammaloop-workspace-doctest> Doc-tests alphal00p_docs_catalogs
  125. 876.68 s gammaloop-workspace-doctest>
  126. 876.68 s gammaloop-workspace-doctest> running 0 tests
  127. 876.68 s gammaloop-workspace-doctest>
  128. 876.68 s gammaloop-workspace-doctest> test result: ok. 0 passed; 0 failed; 0 ignored; 0 measured; 0 filtered out; finished in 0.00s
  129. 876.68 s gammaloop-workspace-doctest>
  130. 876.68 s gammaloop-workspace-doctest> Doc-tests alphal00p_docs_examples
  131. 876.70 s gammaloop-workspace-doctest>
  132. 876.70 s gammaloop-workspace-doctest> running 0 tests
  133. 876.70 s gammaloop-workspace-doctest>
  134. 876.70 s gammaloop-workspace-doctest> test result: ok. 0 passed; 0 failed; 0 ignored; 0 measured; 0 filtered out; finished in 0.00s
  135. 876.70 s gammaloop-workspace-doctest>
  136. 876.70 s gammaloop-workspace-doctest> Doc-tests alphal00p_docs
  137. 876.75 s gammaloop-workspace-doctest>
  138. 876.75 s gammaloop-workspace-doctest> running 0 tests
  139. 876.75 s gammaloop-workspace-doctest>
  140. 876.75 s gammaloop-workspace-doctest> test result: ok. 0 passed; 0 failed; 0 ignored; 0 measured; 0 filtered out; finished in 0.00s
  141. 876.75 s gammaloop-workspace-doctest>
  142. 876.75 s gammaloop-workspace-doctest> Doc-tests alphal00p_docs_schema
  143. 876.83 s gammaloop-workspace-doctest>
  144. 876.83 s gammaloop-workspace-doctest> running 0 tests
  145. 876.83 s gammaloop-workspace-doctest>
  146. 876.83 s gammaloop-workspace-doctest> test result: ok. 0 passed; 0 failed; 0 ignored; 0 measured; 0 filtered out; finished in 0.00s
  147. 876.83 s gammaloop-workspace-doctest>
  148. 876.83 s gammaloop-workspace-doctest> Doc-tests clinnet
  149. 876.87 s gammaloop-workspace-doctest>
  150. 876.87 s gammaloop-workspace-doctest> running 0 tests
  151. 876.87 s gammaloop-workspace-doctest>
  152. 876.87 s gammaloop-workspace-doctest> test result: ok. 0 passed; 0 failed; 0 ignored; 0 measured; 0 filtered out; finished in 0.00s
  153. 876.87 s gammaloop-workspace-doctest>
  154. 876.87 s gammaloop-workspace-doctest> Doc-tests gammaloop_api
  155. 877.58 s gammaloop-workspace-doctest>
  156. 877.58 s gammaloop-workspace-doctest> running 2 tests
  157. 877.64 s gammaloop-workspace-doctest> test crates/gammaloop-api/src/lib.rs - (line 18) - compile ... ok
  158. 879.71 s gammaloop-workspace-doctest> test crates/gammaloop-api/src/commands/evaluate_samples.rs - commands::evaluate_samples::EvaluateSamples (line 49) ... ok
  159. 879.71 s gammaloop-workspace-doctest>
  160. 879.71 s gammaloop-workspace-doctest> test result: ok. 2 passed; 0 failed; 0 ignored; 0 measured; 0 filtered out; finished in 2.13s
  161. 879.71 s gammaloop-workspace-doctest>
  162. 879.71 s gammaloop-workspace-doctest> Doc-tests gammaloop_integration_tests
  163. 879.76 s gammaloop-workspace-doctest>
  164. 879.76 s gammaloop-workspace-doctest> running 0 tests
  165. 879.76 s gammaloop-workspace-doctest>
  166. 879.76 s gammaloop-workspace-doctest> test result: ok. 0 passed; 0 failed; 0 ignored; 0 measured; 0 filtered out; finished in 0.00s
  167. 879.76 s gammaloop-workspace-doctest>
  168. 879.76 s gammaloop-workspace-doctest> Doc-tests gammaloop_tracing_filter
  169. 879.81 s gammaloop-workspace-doctest>
  170. 879.81 s gammaloop-workspace-doctest> running 0 tests
  171. 879.81 s gammaloop-workspace-doctest>
  172. 879.81 s gammaloop-workspace-doctest> test result: ok. 0 passed; 0 failed; 0 ignored; 0 measured; 0 filtered out; finished in 0.00s
  173. 879.81 s gammaloop-workspace-doctest>
  174. 879.81 s gammaloop-workspace-doctest> Doc-tests gammaloop_tracing_filter_macros
  175. 880.05 s gammaloop-workspace-doctest>
  176. 880.05 s gammaloop-workspace-doctest> running 2 tests
  177. 880.05 s gammaloop-workspace-doctest> test crates/gammaloop-tracing-filter-macros/src/lib.rs - debug_instrument (line 14) ... ignored
  178. 880.05 s gammaloop-workspace-doctest> test crates/gammaloop-tracing-filter-macros/src/lib.rs - debug_instrument (line 8) ... ignored
  179. 880.05 s gammaloop-workspace-doctest>
  180. 880.05 s gammaloop-workspace-doctest> test result: ok. 0 passed; 0 failed; 2 ignored; 0 measured; 0 filtered out; finished in 0.00s
  181. 880.05 s gammaloop-workspace-doctest>
  182. 880.05 s gammaloop-workspace-doctest> all doctests ran in 0.22s; merged doctests compilation took 0.21s
  183. 880.05 s gammaloop-workspace-doctest> Doc-tests gammaloop_workspace_hack
  184. 880.07 s gammaloop-workspace-doctest>
  185. 880.07 s gammaloop-workspace-doctest> running 0 tests
  186. 880.07 s gammaloop-workspace-doctest>
  187. 880.07 s gammaloop-workspace-doctest> test result: ok. 0 passed; 0 failed; 0 ignored; 0 measured; 0 filtered out; finished in 0.00s
  188. 880.07 s gammaloop-workspace-doctest>
  189. 880.07 s gammaloop-workspace-doctest> Doc-tests gammalooprs
  190. 883.59 s gammaloop-workspace-doctest>
  191. 883.59 s gammaloop-workspace-doctest> running 2 tests
  192. 883.59 s gammaloop-workspace-doctest> test crates/gammalooprs/src/integrands/process/mod.rs - integrands::process::ProcessIntegrandImpl::signal_external_momenta_changed (line 2381) ... ignored
  193. 883.59 s gammaloop-workspace-doctest> test crates/gammalooprs/src/utils/linnet_ext.rs - utils::linnet_ext::Permutation::from_mappings (line 27) ... ok
  194. 883.59 s gammaloop-workspace-doctest>
  195. 883.59 s gammaloop-workspace-doctest> test result: ok. 1 passed; 0 failed; 1 ignored; 0 measured; 0 filtered out; finished in 0.00s
  196. 883.59 s gammaloop-workspace-doctest>
  197. 883.60 s gammaloop-workspace-doctest> all doctests ran in 1.25s; merged doctests compilation took 1.24s
  198. 883.60 s gammaloop-workspace-doctest> Doc-tests idenso
  199. 884.07 s gammaloop-workspace-doctest>
  200. 884.07 s gammaloop-workspace-doctest> running 5 tests
  201. 884.07 s gammaloop-workspace-doctest> test crates/idenso/src/color/macros.rs - color::macros::color_f (line 109) ... ignored
  202. 884.07 s gammaloop-workspace-doctest> test crates/idenso/src/color/macros.rs - color::macros::color_t (line 18) ... ignored
  203. 884.07 s gammaloop-workspace-doctest> test crates/idenso/src/dirac/macros.rs - dirac::macros::gamma (line 28) ... ignored
  204. 884.07 s gammaloop-workspace-doctest> test crates/idenso/src/dirac/macros.rs - dirac::macros::gamma0 (line 259) ... ignored
  205. 884.07 s gammaloop-workspace-doctest> test crates/idenso/src/dirac/macros.rs - dirac::macros::u (line 155) ... ignored
  206. 884.07 s gammaloop-workspace-doctest>
  207. 884.07 s gammaloop-workspace-doctest> test result: ok. 0 passed; 0 failed; 5 ignored; 0 measured; 0 filtered out; finished in 0.00s
  208. 884.07 s gammaloop-workspace-doctest>
  209. 884.07 s gammaloop-workspace-doctest> all doctests ran in 0.22s; merged doctests compilation took 0.21s
  210. 884.07 s gammaloop-workspace-doctest> Doc-tests kurvst
  211. 884.14 s gammaloop-workspace-doctest>
  212. 884.14 s gammaloop-workspace-doctest> running 0 tests
  213. 884.14 s gammaloop-workspace-doctest>
  214. 884.14 s gammaloop-workspace-doctest> test result: ok. 0 passed; 0 failed; 0 ignored; 0 measured; 0 filtered out; finished in 0.00s
  215. 884.14 s gammaloop-workspace-doctest>
  216. 884.14 s gammaloop-workspace-doctest> Doc-tests linnest
  217. 884.38 s gammaloop-workspace-doctest>
  218. 884.38 s gammaloop-workspace-doctest> running 0 tests
  219. 884.38 s gammaloop-workspace-doctest>
  220. 884.38 s gammaloop-workspace-doctest> test result: ok. 0 passed; 0 failed; 0 ignored; 0 measured; 0 filtered out; finished in 0.00s
  221. 884.38 s gammaloop-workspace-doctest>
  222. 884.39 s gammaloop-workspace-doctest> Doc-tests linnet
  223. 884.83 s gammaloop-workspace-doctest>
  224. 884.83 s gammaloop-workspace-doctest> running 46 tests
  225. 884.83 s gammaloop-workspace-doctest> test crates/linnet/src/half_edge/algorithms/transitive_ops.rs - half_edge::algorithms::transitive_ops::HedgeGraph<E,V,H,N>::transitive_closure (line 164) ... ignored
  226. 884.83 s gammaloop-workspace-doctest> test crates/linnet/src/half_edge/algorithms/transitive_ops.rs - half_edge::algorithms::transitive_ops::HedgeGraph<E,V,H,N>::transitive_reduction (line 300) ... ignored
  227. 884.83 s gammaloop-workspace-doctest> test crates/linnet/src/half_edge/builder.rs - half_edge::builder::HedgeGraphBuilder (line 108) ... ignored
  228. 887.18 s gammaloop-workspace-doctest> test crates/linnet/src/half_edge/algorithms/trace_unfold.rs - half_edge::algorithms::trace_unfold::TraceKey<O,D>::write_foata_like (line 1356) ... ok
  229. 887.21 s gammaloop-workspace-doctest> test crates/linnet/src/half_edge/algorithms/trace_unfold.rs - half_edge::algorithms::trace_unfold::TraceKey<O,D>::view (line 1110) ... ok
  230. 887.24 s gammaloop-workspace-doctest> test crates/linnet/src/half_edge/algorithms/trace_unfold.rs - half_edge::algorithms::trace_unfold::TraceKeyView (line 872) ... ok
  231. 887.27 s gammaloop-workspace-doctest> test crates/linnet/src/half_edge/algorithms/trace_unfold.rs - half_edge::algorithms::trace_unfold::TraceKey<O,D>::iter_leaf_ops (line 1222) ... ok
  232. 887.30 s gammaloop-workspace-doctest> test crates/linnet/src/permutation.rs - permutation::Permutation (line 61) ... ok
  233. 887.31 s gammaloop-workspace-doctest> test crates/linnet/src/half_edge/algorithms/trace_unfold.rs - half_edge::algorithms::trace_unfold::TraceKey<O,D>::push (line 1253) ... ok
  234. 887.31 s gammaloop-workspace-doctest> test crates/linnet/src/half_edge/algorithms/trace_unfold.rs - half_edge::algorithms::trace_unfold::TraceKey<O,D>::empty (line 1071) ... ok
  235. 887.31 s gammaloop-workspace-doctest> test crates/linnet/src/half_edge/algorithms/trace_unfold.rs - half_edge::algorithms::trace_unfold::TraceKey<O,D>::iter_levels_bottom_up (line 1194) ... ok
  236. 887.31 s gammaloop-workspace-doctest> test crates/linnet/src/half_edge/algorithms/trace_unfold.rs - half_edge::algorithms::trace_unfold::TraceKey<O,D>::iter_levels_top_down (line 1164) ... ok
  237. 887.32 s gammaloop-workspace-doctest> test crates/linnet/src/half_edge/algorithms/trace_unfold.rs - half_edge::algorithms::trace_unfold::TraceKey<O,D>::from_levels (line 1089) ... ok
  238. 887.38 s gammaloop-workspace-doctest> test crates/linnet/src/half_edge/algorithms/trace_unfold.rs - half_edge::algorithms::trace_unfold::TraceKey<O,D>::is_empty (line 1136) ... ok
  239. 887.51 s gammaloop-workspace-doctest> test crates/linnet/src/half_edge/algorithms/trace_unfold.rs - half_edge::algorithms::trace_unfold::TraceKeyView<'a,O,D>::to_owned (line 979) ... ok
  240. 887.52 s gammaloop-workspace-doctest> test crates/linnet/src/half_edge/algorithms/trace_unfold.rs - half_edge::algorithms::trace_unfold::TraceUnfold (line 127) ... ok
  241. 887.53 s gammaloop-workspace-doctest> test crates/linnet/src/half_edge/algorithms/trace_unfold.rs - half_edge::algorithms::trace_unfold::TraceKey (line 1029) ... ok
  242. 887.57 s gammaloop-workspace-doctest> test crates/linnet/src/half_edge/algorithms/trace_unfold.rs - half_edge::algorithms::trace_unfold::TraceUnfold::realizations_for_op (line 213) ... ok
  243. 887.72 s gammaloop-workspace-doctest> test crates/linnet/src/parser/mod.rs - parser (line 17) ... ok
  244. 889.60 s gammaloop-workspace-doctest> test crates/linnet/src/permutation.rs - permutation::Permutation::apply_slice (line 451) ... ok
  245. 889.63 s gammaloop-workspace-doctest> test crates/linnet/src/permutation.rs - permutation::Permutation::apply_slice_in_place (line 488) ... ok
  246. 889.64 s gammaloop-workspace-doctest> test crates/linnet/src/permutation.rs - permutation::Permutation::from_disjoint_cycles (line 978) ... ok
  247. 889.65 s gammaloop-workspace-doctest> test crates/linnet/src/permutation.rs - permutation::Permutation::cycle_to_transpositions (line 713) ... ok
  248. 889.68 s gammaloop-workspace-doctest> test crates/linnet/src/permutation.rs - permutation::Permutation::from_cycles (line 1069) ... ok
  249. 889.68 s gammaloop-workspace-doctest> test crates/linnet/src/permutation.rs - permutation::Permutation::apply_slice_in_place_inv (line 510) ... ok
  250. 889.69 s gammaloop-workspace-doctest> test crates/linnet/src/permutation.rs - permutation::Permutation::from_map (line 113) ... ok
  251. 889.73 s gammaloop-workspace-doctest> test crates/linnet/src/permutation.rs - permutation::Permutation::from_prefix_sources (line 266) ... ok
  252. 889.79 s gammaloop-workspace-doctest> test crates/linnet/src/permutation.rs - permutation::Permutation::id (line 96) ... ok
  253. 889.85 s gammaloop-workspace-doctest> test crates/linnet/src/permutation.rs - permutation::Permutation::find_cycles (line 680) ... ok
  254. 889.87 s gammaloop-workspace-doctest> test crates/linnet/src/permutation.rs - permutation::Permutation::is_identity (line 851) ... ok
  255. 889.87 s gammaloop-workspace-doctest> test crates/linnet/src/permutation.rs - permutation::Permutation::apply_slice_inv (line 469) ... ok
  256. 889.88 s gammaloop-workspace-doctest> test crates/linnet/src/permutation.rs - permutation::Permutation::inv (line 416) ... ok
  257. 889.95 s gammaloop-workspace-doctest> test crates/linnet/src/permutation.rs - permutation::Permutation::iter_slice_inv (line 562) ... ok
  258. 889.98 s gammaloop-workspace-doctest> test crates/linnet/src/permutation.rs - permutation::Permutation::iter_slice (line 543) ... ok
  259. 890.02 s gammaloop-workspace-doctest> test crates/linnet/src/permutation.rs - permutation::Permutation::inverse (line 434) ... ok
  260. 892.05 s gammaloop-workspace-doctest> test crates/linnet/src/permutation.rs - permutation::Permutation::pow (line 896) ... ok
  261. 892.23 s gammaloop-workspace-doctest> test crates/linnet/src/permutation.rs - permutation::Permutation::myrvold_ruskey_rank1 (line 760) ... ok
  262. 892.27 s gammaloop-workspace-doctest> test crates/linnet/src/permutation.rs - permutation::Permutation::iter_slice_inv_mut (line 615) ... ok
  263. 892.30 s gammaloop-workspace-doctest> test crates/linnet/src/permutation.rs - permutation::Permutation::myrvold_ruskey_rank2 (line 805) ... ok
  264. 892.32 s gammaloop-workspace-doctest> test crates/linnet/src/permutation.rs - permutation::Permutation::iter_slice_mut (line 588) ... ok
  265. 892.32 s gammaloop-workspace-doctest> test crates/linnet/src/permutation.rs - permutation::Permutation::map (line 402) ... ok
  266. 892.32 s gammaloop-workspace-doctest> test crates/linnet/src/permutation.rs - permutation::Permutation::myrvold_ruskey_unrank2 (line 828) ... ok
  267. 892.34 s gammaloop-workspace-doctest> test crates/linnet/src/permutation.rs - permutation::Permutation::myrvold_ruskey_unrank1 (line 782) ... ok
  268. 892.39 s gammaloop-workspace-doctest> test crates/linnet/src/permutation.rs - permutation::Permutation::sign (line 869) ... ok
  269. 892.42 s gammaloop-workspace-doctest> test crates/linnet/src/permutation.rs - permutation::Permutation::sort (line 640) ... ok
  270. 892.46 s gammaloop-workspace-doctest> test crates/linnet/src/permutation.rs - permutation::Permutation::transpositions (line 733) ... ok
  271. 892.46 s gammaloop-workspace-doctest>
  272. 892.46 s gammaloop-workspace-doctest> test result: ok. 43 passed; 0 failed; 3 ignored; 0 measured; 0 filtered out; finished in 7.63s
  273. 892.46 s gammaloop-workspace-doctest>
  274. 892.47 s gammaloop-workspace-doctest> Doc-tests linnet_py
  275. 893.36 s gammaloop-workspace-doctest>
  276. 893.36 s gammaloop-workspace-doctest> running 0 tests
  277. 893.36 s gammaloop-workspace-doctest>
  278. 893.36 s gammaloop-workspace-doctest> test result: ok. 0 passed; 0 failed; 0 ignored; 0 measured; 0 filtered out; finished in 0.00s
  279. 893.36 s gammaloop-workspace-doctest>
  280. 893.36 s gammaloop-workspace-doctest> Doc-tests spenso
  281. 897.74 s gammaloop-workspace-doctest>
  282. 897.74 s gammaloop-workspace-doctest> running 9 tests
  283. 897.74 s gammaloop-workspace-doctest> test crates/spenso/src/shadowing/macros.rs - shadowing::macros::antisym (line 337) ... ignored
  284. 897.74 s gammaloop-workspace-doctest> test crates/spenso/src/shadowing/macros.rs - shadowing::macros::chain (line 387) ... ignored
  285. 897.74 s gammaloop-workspace-doctest> test crates/spenso/src/shadowing/macros.rs - shadowing::macros::cyclic (line 361) ... ignored
  286. 897.74 s gammaloop-workspace-doctest> test crates/spenso/src/shadowing/macros.rs - shadowing::macros::slot (line 24) ... ignored
  287. 897.74 s gammaloop-workspace-doctest> test crates/spenso/src/shadowing/macros.rs - shadowing::macros::sym (line 313) ... ignored
  288. 897.74 s gammaloop-workspace-doctest> test crates/spenso/src/shadowing/macros.rs - shadowing::macros::tensor (line 110) ... ignored
  289. 897.74 s gammaloop-workspace-doctest> test crates/spenso/src/shadowing/macros.rs - shadowing::macros::trace (line 444) ... ignored
  290. 897.74 s gammaloop-workspace-doctest> test crates/spenso/src/shadowing/macros.rs - shadowing::macros::trace_sym (line 496) ... ignored
  291. 897.84 s gammaloop-workspace-doctest> test crates/spenso/src/network/mod.rs - network::Network (line 1693) ... FAILED
  292. 897.84 s gammaloop-workspace-doctest>
  293. 897.84 s gammaloop-workspace-doctest> failures:
  294. 897.84 s gammaloop-workspace-doctest>
  295. 897.84 s gammaloop-workspace-doctest> ---- crates/spenso/src/network/mod.rs - network::Network (line 1693) stdout ----
  296. 897.84 s gammaloop-workspace-doctest> Test executable failed (terminated by signal).
  297. 897.84 s gammaloop-workspace-doctest>
  298. 897.84 s gammaloop-workspace-doctest> stdout:
  299. 897.84 s gammaloop-workspace-doctest> ┌────────────────────────────────────────────────────────┐
  300. 897.84 s gammaloop-workspace-doctest> │ You are running a restricted Symbolica instance. │
  301. 897.84 s gammaloop-workspace-doctest> │ │
  302. 897.84 s gammaloop-workspace-doctest> │ For non-commercial use only, limited to one │
  303. 897.84 s gammaloop-workspace-doctest> │ Symbolica thread per user. │
  304. 897.84 s gammaloop-workspace-doctest> │ │
  305. 897.84 s gammaloop-workspace-doctest> ├─ Unlock all cores ─────────────────────────────────────┤
  306. 897.84 s gammaloop-workspace-doctest> │ │
  307. 897.84 s gammaloop-workspace-doctest> │ Hobbyists and students: free annual key │
  308. 897.84 s gammaloop-workspace-doctest> │ https://symbolica.io/license/#get-hobbyist-license │
  309. 897.84 s gammaloop-workspace-doctest> │ │
  310. 897.84 s gammaloop-workspace-doctest> │ Free 30-day professional trial: │
  311. 897.84 s gammaloop-workspace-doctest> │ https://symbolica.io/license/#get-trial-license │
  312. 897.84 s gammaloop-workspace-doctest> │ │
  313. 897.84 s gammaloop-workspace-doctest> └────────────────────────────────────────────────────────┘
  314. 897.84 s gammaloop-workspace-doctest> ┌──────────────────────────────────────────────────────────────────────────────────────────────────┐
  315. 897.84 s gammaloop-workspace-doctest> │ Cannot start another restricted Symbolica thread while this user's thread allowance is in use. │
  316. 897.84 s gammaloop-workspace-doctest> └──────────────────────────────────────────────────────────────────────────────────────────────────┘
  317. 897.84 s gammaloop-workspace-doctest>
  318. 897.84 s gammaloop-workspace-doctest> stderr:
  319. 897.84 s gammaloop-workspace-doctest> ┌────────────────────────────────────────────────────────┐
  320. 897.84 s gammaloop-workspace-doctest> │ The Symbolica license key format is outdated. │
  321. 897.84 s gammaloop-workspace-doctest> │ Renew your key at https://symbolica.io/license/ │
  322. 897.84 s gammaloop-workspace-doctest> └────────────────────────────────────────────────────────┘
  323. 897.84 s gammaloop-workspace-doctest> Could not acquire Symbolica thread permit: Permission denied (os error 13)
  324. 897.84 s gammaloop-workspace-doctest>
  325. 897.84 s gammaloop-workspace-doctest>
  326. 897.84 s gammaloop-workspace-doctest>
  327. 897.84 s gammaloop-workspace-doctest> failures:
  328. 897.84 s gammaloop-workspace-doctest> crates/spenso/src/network/mod.rs - network::Network (line 1693)
  329. 897.84 s gammaloop-workspace-doctest>
  330. 897.84 s gammaloop-workspace-doctest> test result: FAILED. 0 passed; 1 failed; 8 ignored; 0 measured; 0 filtered out; finished in 0.09s
  331. 897.84 s gammaloop-workspace-doctest>
  332. 897.85 s gammaloop-workspace-doctest> all doctests ran in 3.61s; merged doctests compilation took 3.50s
  333. 897.86 s gammaloop-workspace-doctest> error: doctest failed, to rerun pass `-p spenso --doc`
  334. 898.54 s error: Cannot build '/nix/store/xmf37jpb1f2ls6mvj35zs9jzr5fjsgnv-gammaloop-workspace-doctest-0.1.0.drv'.
  335. 898.54 s Reason: builder failed with exit code 101.
  336. 898.54 s Output paths:
  337. 898.54 s /nix/store/9sq7gdzb4npvy9phnd5lwja1mgqsd04q-gammaloop-workspace-doctest-0.1.0
  338. 898.54 s Last 316 log lines:
  339. 898.54 s > Running phase: unpackPhase
  340. 898.54 s > unpacking source archive /nix/store/0b6y73sx10i7jc9h7gv2p4wq7jn4fbkv-source
  341. 898.54 s > source root is source
  342. 898.54 s > Running phase: patchPhase
  343. 898.54 s > Executing configureCargoCommonVars
  344. 898.54 s > decompressing cargo artifacts from /nix/store/8zs9bds37a34fqlhv8z320b7lfv0rp55-gammaloop-workspace-deps-deps-0.1.0/target.tar.zst to target
  345. 898.54 s > Running phase: updateAutotoolsGnuConfigScriptsPhase
  346. 898.54 s > Running phase: configurePhase
  347. 898.54 s > will append /build/source/.cargo-home/config.toml with contents of /nix/store/9rqk4093qnvgswmdk1pbxk9najcrjn7a-vendor-cargo-deps/config.toml
  348. 898.54 s > default configurePhase, nothing to do
  349. 898.54 s > Running phase: buildPhase
  350. 898.54 s > +++ command cargo --version
  351. 898.54 s > cargo 1.98.1 (797e8a9bc 2026-08-05)
  352. 898.54 s > +++ command cargo test --profile ci-optim --doc --locked --workspace --features gammaloop-api/cli,gammaloop-tracing-filter/clap,gammaloop-tracing-filter/symbolica,idenso/bincode,idenso/native,idenso/reference-cases,linnet/bincode,linnet/drawing,linnet/nodestore-vec,linnet/rkyv,linnet/serde,linnet/symbolica,spenso-macros/native,spenso-macros/shadowing,spenso/native,spenso/native-code-generation,spenso/shadowing,symbolica-utils/native,symbolica/tracing_max_level_info --exclude alphal00p-docs-python-exporter
  353. 898.54 s > Compiling pyo3-build-config v0.28.3
  354. 898.54 s > Compiling const-random-macro v0.1.16
  355. 898.54 s > Compiling phf_generator v0.11.3
  356. 898.54 s > Compiling rustpython-ast v0.4.0
  357. 898.54 s > Compiling similar v2.7.0
  358. 898.54 s > Compiling symbolica v2.2.0 (https://github.com/symbolica-dev/symbolica?rev=4f1323185fe5e0c0f8c864ab89edd1905e7adef1#4f132318)
  359. 898.54 s > Compiling derive_more-impl v2.1.1
  360. 898.54 s > Compiling gammaloop-tracing-filter-macros v0.1.0 (/build/source/crates/gammaloop-tracing-filter-macros)
  361. 898.54 s > Compiling vakint v0.1.2 (/build/source/crates/vakint)
  362. 898.54 s > Compiling gammalooprs v0.3.4 (/build/source/crates/gammalooprs)
  363. 898.54 s > Compiling gammaloop-api v0.1.0 (/build/source/crates/gammaloop-api)
  364. 898.54 s > Compiling alphal00p-docs-macros v0.1.0 (/build/source/crates/alphal00p-docs-macros)
  365. 898.54 s > Compiling proc-macro-error-attr2 v2.0.0
  366. 898.54 s > Compiling alphal00p-docs-schema v0.1.0 (/build/source/crates/alphal00p-docs-schema)
  367. 898.54 s > Compiling phf_codegen v0.11.3
  368. 898.54 s > Compiling rustc_version v0.4.1
  369. 898.54 s > Compiling unicode_names2_generator v1.3.0
  370. 898.54 s > Compiling figment v0.10.19
  371. 898.54 s > Compiling bincode v1.3.3
  372. 898.54 s > Compiling const-random v0.1.18
  373. 898.54 s > Compiling ahash v0.8.12
  374. 898.54 s > Compiling gungraun-runner v0.18.2
  375. 898.54 s > Compiling iai-callgrind-runner v0.14.2
  376. 898.54 s > Compiling rustpython-parser v0.4.0
  377. 898.54 s > Compiling target-triple v1.0.1
  378. 898.54 s > Compiling symjit v2.25.6
  379. 898.54 s > Compiling numerica v3.0.0 (https://github.com/symbolica-dev/symbolica?rev=4f1323185fe5e0c0f8c864ab89edd1905e7adef1#4f132318)
  380. 898.54 s > Compiling momtrop v0.3.0
  381. 898.54 s > Compiling gungraun-macros v0.8.0
  382. 898.54 s > Compiling insta v1.47.2
  383. 898.54 s > Compiling kurvst v0.1.0 (/build/source/crates/kurvst)
  384. 898.54 s > Compiling proc-macro-error2 v2.0.1
  385. 898.54 s > Compiling gammaloop-integration-tests v0.1.0 (/build/source/tests)
  386. 898.54 s > Compiling test-log-core v0.2.20
  387. 898.54 s > Compiling alphal00p-docs-catalogs v0.1.0 (/build/source/crates/alphal00p-docs-catalogs)
  388. 898.54 s > Compiling wait-timeout v0.2.1
  389. 898.54 s > Compiling bit-vec v0.8.0
  390. 898.54 s > Compiling iai-callgrind v0.14.2
  391. 898.54 s > Compiling quick-error v1.2.3
  392. 898.54 s > Compiling rusty-fork v0.3.1
  393. 898.54 s > Compiling bit-set v0.8.0
  394. 898.54 s > Compiling rand_xorshift v0.4.0
  395. 898.54 s > Compiling console v0.15.11
  396. 898.54 s > Compiling test-log-macros v0.2.20
  397. 898.54 s > Compiling unicode_names2 v1.3.0
  398. 898.54 s > Compiling termcolor v1.4.1
  399. 898.54 s > Compiling glob v0.3.4
  400. 898.54 s > Compiling unarray v0.1.4
  401. 898.54 s > Compiling base64 v0.21.7
  402. 898.54 s > Compiling proptest v1.11.0
  403. 898.54 s > Compiling alphal00p-docs-builder v0.1.0 (/build/source/crates/alphal00p-docs-builder)
  404. 898.54 s > Compiling ron v0.8.1
  405. 898.54 s > Compiling trybuild v1.0.120
  406. 898.54 s > Compiling test-log v0.2.20
  407. 898.54 s > Compiling clinnet v0.1.8 (/build/source/crates/clinnet)
  408. 898.54 s > Compiling pyo3-macros-backend v0.28.3
  409. 898.54 s > Compiling numpy v0.28.0
  410. 898.54 s > Compiling pyo3-ffi v0.28.3
  411. 898.54 s > Compiling pyo3 v0.28.3
  412. 898.54 s > Compiling alphal00p-docs-examples v0.1.0 (/build/source/crates/alphal00p-docs-examples)
  413. 898.54 s > Compiling graphica v3.0.0 (https://github.com/symbolica-dev/symbolica?rev=4f1323185fe5e0c0f8c864ab89edd1905e7adef1#4f132318)
  414. 898.54 s > Compiling linnet-py v0.1.0 (/build/source/crates/linnet-py)
  415. 898.54 s > Compiling similar-asserts v1.7.0
  416. 898.54 s > Compiling derive_more v2.1.1
  417. 898.54 s > Compiling crossterm v0.29.0
  418. 898.54 s > Compiling ratatui-crossterm v0.1.0
  419. 898.54 s > Compiling ratatui v0.30.0
  420. 898.54 s > Compiling iai-callgrind-macros v0.5.1
  421. 898.54 s > Compiling pyo3-stub-gen-derive v0.17.2
  422. 898.54 s > Compiling gungraun v0.18.2
  423. 898.54 s > Compiling pyo3-macros v0.28.3
  424. 898.54 s > Compiling pyo3-stub-gen v0.17.2
  425. 898.54 s > Compiling symbolica-utils v0.1.0 (/build/source/crates/symbolica-utils)
  426. 898.54 s > Compiling tymbolica-atom-payload v0.1.0 (https://github.com/lcnbr/tymbolica?rev=32ae00483b4845161401afac8be755cc336cb2bb#32ae0048)
  427. 898.54 s > Compiling gammaloop-workspace-hack v0.1.0 (/build/source/crates/gammaloop-workspace-hack)
  428. 898.54 s > Compiling spenso-macros v0.3.2 (/build/source/crates/spenso-macros)
  429. 898.54 s > Compiling linnet v0.17.0 (/build/source/crates/linnet)
  430. 898.54 s > Compiling spenso v0.6.0 (/build/source/crates/spenso)
  431. 898.54 s > Compiling idenso v0.3.0 (/build/source/crates/idenso)
  432. 898.54 s > Compiling gammaloop-tracing-filter v0.1.0 (/build/source/crates/gammaloop-tracing-filter)
  433. 898.54 s > Compiling spenso-hep-lib v0.1.7 (/build/source/crates/spenso-hep-lib)
  434. 898.54 s > Compiling spynso3 v0.1.2 (/build/source/crates/spynso3)
  435. 898.54 s > Compiling linnest v0.1.0 (/build/source/crates/linnest)
  436. 898.54 s > Finished `ci-optim` profile [optimized] target(s) in 14m 06s
  437. 898.54 s > warning: the following packages contain code that will be rejected by a future version of Rust: proc-macro-error2 v2.0.1
  438. 898.54 s > note: to see what the problems were, use the option `--future-incompat-report`, or run `cargo report future-incompatibilities --id 1`
  439. 898.54 s > Doc-tests alphal00p_docs_builder
  440. 898.54 s >
  441. 898.54 s > running 0 tests
  442. 898.54 s >
  443. 898.54 s > test result: ok. 0 passed; 0 failed; 0 ignored; 0 measured; 0 filtered out; finished in 0.00s
  444. 898.54 s >
  445. 898.54 s > Doc-tests alphal00p_docs_catalogs
  446. 898.54 s >
  447. 898.54 s > running 0 tests
  448. 898.54 s >
  449. 898.54 s > test result: ok. 0 passed; 0 failed; 0 ignored; 0 measured; 0 filtered out; finished in 0.00s
  450. 898.54 s >
  451. 898.54 s > Doc-tests alphal00p_docs_examples
  452. 898.54 s >
  453. 898.54 s > running 0 tests
  454. 898.54 s >
  455. 898.54 s > test result: ok. 0 passed; 0 failed; 0 ignored; 0 measured; 0 filtered out; finished in 0.00s
  456. 898.54 s >
  457. 898.54 s > Doc-tests alphal00p_docs
  458. 898.54 s >
  459. 898.54 s > running 0 tests
  460. 898.54 s >
  461. 898.54 s > test result: ok. 0 passed; 0 failed; 0 ignored; 0 measured; 0 filtered out; finished in 0.00s
  462. 898.54 s >
  463. 898.54 s > Doc-tests alphal00p_docs_schema
  464. 898.54 s >
  465. 898.54 s > running 0 tests
  466. 898.54 s >
  467. 898.54 s > test result: ok. 0 passed; 0 failed; 0 ignored; 0 measured; 0 filtered out; finished in 0.00s
  468. 898.54 s >
  469. 898.54 s > Doc-tests clinnet
  470. 898.54 s >
  471. 898.54 s > running 0 tests
  472. 898.54 s >
  473. 898.54 s > test result: ok. 0 passed; 0 failed; 0 ignored; 0 measured; 0 filtered out; finished in 0.00s
  474. 898.54 s >
  475. 898.54 s > Doc-tests gammaloop_api
  476. 898.54 s >
  477. 898.54 s > running 2 tests
  478. 898.54 s > test crates/gammaloop-api/src/lib.rs - (line 18) - compile ... ok
  479. 898.54 s > test crates/gammaloop-api/src/commands/evaluate_samples.rs - commands::evaluate_samples::EvaluateSamples (line 49) ... ok
  480. 898.54 s >
  481. 898.54 s > test result: ok. 2 passed; 0 failed; 0 ignored; 0 measured; 0 filtered out; finished in 2.13s
  482. 898.54 s >
  483. 898.54 s > Doc-tests gammaloop_integration_tests
  484. 898.54 s >
  485. 898.54 s > running 0 tests
  486. 898.54 s >
  487. 898.54 s > test result: ok. 0 passed; 0 failed; 0 ignored; 0 measured; 0 filtered out; finished in 0.00s
  488. 898.54 s >
  489. 898.54 s > Doc-tests gammaloop_tracing_filter
  490. 898.54 s >
  491. 898.54 s > running 0 tests
  492. 898.54 s >
  493. 898.54 s > test result: ok. 0 passed; 0 failed; 0 ignored; 0 measured; 0 filtered out; finished in 0.00s
  494. 898.54 s >
  495. 898.54 s > Doc-tests gammaloop_tracing_filter_macros
  496. 898.54 s >
  497. 898.54 s > running 2 tests
  498. 898.54 s > test crates/gammaloop-tracing-filter-macros/src/lib.rs - debug_instrument (line 14) ... ignored
  499. 898.54 s > test crates/gammaloop-tracing-filter-macros/src/lib.rs - debug_instrument (line 8) ... ignored
  500. 898.54 s >
  501. 898.54 s > test result: ok. 0 passed; 0 failed; 2 ignored; 0 measured; 0 filtered out; finished in 0.00s
  502. 898.54 s >
  503. 898.54 s > all doctests ran in 0.22s; merged doctests compilation took 0.21s
  504. 898.54 s > Doc-tests gammaloop_workspace_hack
  505. 898.54 s >
  506. 898.54 s > running 0 tests
  507. 898.54 s >
  508. 898.54 s > test result: ok. 0 passed; 0 failed; 0 ignored; 0 measured; 0 filtered out; finished in 0.00s
  509. 898.54 s >
  510. 898.54 s > Doc-tests gammalooprs
  511. 898.54 s >
  512. 898.54 s > running 2 tests
  513. 898.54 s > test crates/gammalooprs/src/integrands/process/mod.rs - integrands::process::ProcessIntegrandImpl::signal_external_momenta_changed (line 2381) ... ignored
  514. 898.54 s > test crates/gammalooprs/src/utils/linnet_ext.rs - utils::linnet_ext::Permutation::from_mappings (line 27) ... ok
  515. 898.54 s >
  516. 898.54 s > test result: ok. 1 passed; 0 failed; 1 ignored; 0 measured; 0 filtered out; finished in 0.00s
  517. 898.54 s >
  518. 898.54 s > all doctests ran in 1.25s; merged doctests compilation took 1.24s
  519. 898.54 s > Doc-tests idenso
  520. 898.54 s >
  521. 898.54 s > running 5 tests
  522. 898.54 s > test crates/idenso/src/color/macros.rs - color::macros::color_f (line 109) ... ignored
  523. 898.54 s > test crates/idenso/src/color/macros.rs - color::macros::color_t (line 18) ... ignored
  524. 898.54 s > test crates/idenso/src/dirac/macros.rs - dirac::macros::gamma (line 28) ... ignored
  525. 898.54 s > test crates/idenso/src/dirac/macros.rs - dirac::macros::gamma0 (line 259) ... ignored
  526. 898.54 s > test crates/idenso/src/dirac/macros.rs - dirac::macros::u (line 155) ... ignored
  527. 898.54 s >
  528. 898.54 s > test result: ok. 0 passed; 0 failed; 5 ignored; 0 measured; 0 filtered out; finished in 0.00s
  529. 898.54 s >
  530. 898.54 s > all doctests ran in 0.22s; merged doctests compilation took 0.21s
  531. 898.55 s > Doc-tests kurvst
  532. 898.55 s >
  533. 898.55 s > running 0 tests
  534. 898.55 s >
  535. 898.55 s > test result: ok. 0 passed; 0 failed; 0 ignored; 0 measured; 0 filtered out; finished in 0.00s
  536. 898.55 s >
  537. 898.55 s > Doc-tests linnest
  538. 898.55 s >
  539. 898.55 s > running 0 tests
  540. 898.55 s >
  541. 898.55 s > test result: ok. 0 passed; 0 failed; 0 ignored; 0 measured; 0 filtered out; finished in 0.00s
  542. 898.55 s >
  543. 898.55 s > Doc-tests linnet
  544. 898.55 s >
  545. 898.55 s > running 46 tests
  546. 898.55 s > test crates/linnet/src/half_edge/algorithms/transitive_ops.rs - half_edge::algorithms::transitive_ops::HedgeGraph<E,V,H,N>::transitive_closure (line 164) ... ignored
  547. 898.55 s > test crates/linnet/src/half_edge/algorithms/transitive_ops.rs - half_edge::algorithms::transitive_ops::HedgeGraph<E,V,H,N>::transitive_reduction (line 300) ... ignored
  548. 898.55 s > test crates/linnet/src/half_edge/builder.rs - half_edge::builder::HedgeGraphBuilder (line 108) ... ignored
  549. 898.55 s > test crates/linnet/src/half_edge/algorithms/trace_unfold.rs - half_edge::algorithms::trace_unfold::TraceKey<O,D>::write_foata_like (line 1356) ... ok
  550. 898.55 s > test crates/linnet/src/half_edge/algorithms/trace_unfold.rs - half_edge::algorithms::trace_unfold::TraceKey<O,D>::view (line 1110) ... ok
  551. 898.55 s > test crates/linnet/src/half_edge/algorithms/trace_unfold.rs - half_edge::algorithms::trace_unfold::TraceKeyView (line 872) ... ok
  552. 898.55 s > test crates/linnet/src/half_edge/algorithms/trace_unfold.rs - half_edge::algorithms::trace_unfold::TraceKey<O,D>::iter_leaf_ops (line 1222) ... ok
  553. 898.55 s > test crates/linnet/src/permutation.rs - permutation::Permutation (line 61) ... ok
  554. 898.55 s > test crates/linnet/src/half_edge/algorithms/trace_unfold.rs - half_edge::algorithms::trace_unfold::TraceKey<O,D>::push (line 1253) ... ok
  555. 898.55 s > test crates/linnet/src/half_edge/algorithms/trace_unfold.rs - half_edge::algorithms::trace_unfold::TraceKey<O,D>::empty (line 1071) ... ok
  556. 898.55 s > test crates/linnet/src/half_edge/algorithms/trace_unfold.rs - half_edge::algorithms::trace_unfold::TraceKey<O,D>::iter_levels_bottom_up (line 1194) ... ok
  557. 898.55 s > test crates/linnet/src/half_edge/algorithms/trace_unfold.rs - half_edge::algorithms::trace_unfold::TraceKey<O,D>::iter_levels_top_down (line 1164) ... ok
  558. 898.55 s > test crates/linnet/src/half_edge/algorithms/trace_unfold.rs - half_edge::algorithms::trace_unfold::TraceKey<O,D>::from_levels (line 1089) ... ok
  559. 898.55 s > test crates/linnet/src/half_edge/algorithms/trace_unfold.rs - half_edge::algorithms::trace_unfold::TraceKey<O,D>::is_empty (line 1136) ... ok
  560. 898.55 s > test crates/linnet/src/half_edge/algorithms/trace_unfold.rs - half_edge::algorithms::trace_unfold::TraceKeyView<'a,O,D>::to_owned (line 979) ... ok
  561. 898.55 s > test crates/linnet/src/half_edge/algorithms/trace_unfold.rs - half_edge::algorithms::trace_unfold::TraceUnfold (line 127) ... ok
  562. 898.55 s > test crates/linnet/src/half_edge/algorithms/trace_unfold.rs - half_edge::algorithms::trace_unfold::TraceKey (line 1029) ... ok
  563. 898.55 s > test crates/linnet/src/half_edge/algorithms/trace_unfold.rs - half_edge::algorithms::trace_unfold::TraceUnfold::realizations_for_op (line 213) ... ok
  564. 898.55 s > test crates/linnet/src/parser/mod.rs - parser (line 17) ... ok
  565. 898.55 s > test crates/linnet/src/permutation.rs - permutation::Permutation::apply_slice (line 451) ... ok
  566. 898.55 s > test crates/linnet/src/permutation.rs - permutation::Permutation::apply_slice_in_place (line 488) ... ok
  567. 898.55 s > test crates/linnet/src/permutation.rs - permutation::Permutation::from_disjoint_cycles (line 978) ... ok
  568. 898.55 s > test crates/linnet/src/permutation.rs - permutation::Permutation::cycle_to_transpositions (line 713) ... ok
  569. 898.55 s > test crates/linnet/src/permutation.rs - permutation::Permutation::from_cycles (line 1069) ... ok
  570. 898.55 s > test crates/linnet/src/permutation.rs - permutation::Permutation::apply_slice_in_place_inv (line 510) ... ok
  571. 898.55 s > test crates/linnet/src/permutation.rs - permutation::Permutation::from_map (line 113) ... ok
  572. 898.55 s > test crates/linnet/src/permutation.rs - permutation::Permutation::from_prefix_sources (line 266) ... ok
  573. 898.55 s > test crates/linnet/src/permutation.rs - permutation::Permutation::id (line 96) ... ok
  574. 898.55 s > test crates/linnet/src/permutation.rs - permutation::Permutation::find_cycles (line 680) ... ok
  575. 898.55 s > test crates/linnet/src/permutation.rs - permutation::Permutation::is_identity (line 851) ... ok
  576. 898.55 s > test crates/linnet/src/permutation.rs - permutation::Permutation::apply_slice_inv (line 469) ... ok
  577. 898.55 s > test crates/linnet/src/permutation.rs - permutation::Permutation::inv (line 416) ... ok
  578. 898.55 s > test crates/linnet/src/permutation.rs - permutation::Permutation::iter_slice_inv (line 562) ... ok
  579. 898.55 s > test crates/linnet/src/permutation.rs - permutation::Permutation::iter_slice (line 543) ... ok
  580. 898.55 s > test crates/linnet/src/permutation.rs - permutation::Permutation::inverse (line 434) ... ok
  581. 898.55 s > test crates/linnet/src/permutation.rs - permutation::Permutation::pow (line 896) ... ok
  582. 898.55 s > test crates/linnet/src/permutation.rs - permutation::Permutation::myrvold_ruskey_rank1 (line 760) ... ok
  583. 898.55 s > test crates/linnet/src/permutation.rs - permutation::Permutation::iter_slice_inv_mut (line 615) ... ok
  584. 898.55 s > test crates/linnet/src/permutation.rs - permutation::Permutation::myrvold_ruskey_rank2 (line 805) ... ok
  585. 898.55 s > test crates/linnet/src/permutation.rs - permutation::Permutation::iter_slice_mut (line 588) ... ok
  586. 898.55 s > test crates/linnet/src/permutation.rs - permutation::Permutation::map (line 402) ... ok
  587. 898.55 s > test crates/linnet/src/permutation.rs - permutation::Permutation::myrvold_ruskey_unrank2 (line 828) ... ok
  588. 898.55 s > test crates/linnet/src/permutation.rs - permutation::Permutation::myrvold_ruskey_unrank1 (line 782) ... ok
  589. 898.55 s > test crates/linnet/src/permutation.rs - permutation::Permutation::sign (line 869) ... ok
  590. 898.55 s > test crates/linnet/src/permutation.rs - permutation::Permutation::sort (line 640) ... ok
  591. 898.55 s > test crates/linnet/src/permutation.rs - permutation::Permutation::transpositions (line 733) ... ok
  592. 898.55 s >
  593. 898.55 s > test result: ok. 43 passed; 0 failed; 3 ignored; 0 measured; 0 filtered out; finished in 7.63s
  594. 898.55 s >
  595. 898.55 s > Doc-tests linnet_py
  596. 898.55 s >
  597. 898.55 s > running 0 tests
  598. 898.55 s >
  599. 898.55 s > test result: ok. 0 passed; 0 failed; 0 ignored; 0 measured; 0 filtered out; finished in 0.00s
  600. 898.55 s >
  601. 898.55 s > Doc-tests spenso
  602. 898.55 s >
  603. 898.55 s > running 9 tests
  604. 898.55 s > test crates/spenso/src/shadowing/macros.rs - shadowing::macros::antisym (line 337) ... ignored
  605. 898.55 s > test crates/spenso/src/shadowing/macros.rs - shadowing::macros::chain (line 387) ... ignored
  606. 898.55 s > test crates/spenso/src/shadowing/macros.rs - shadowing::macros::cyclic (line 361) ... ignored
  607. 898.55 s > test crates/spenso/src/shadowing/macros.rs - shadowing::macros::slot (line 24) ... ignored
  608. 898.55 s > test crates/spenso/src/shadowing/macros.rs - shadowing::macros::sym (line 313) ... ignored
  609. 898.55 s > test crates/spenso/src/shadowing/macros.rs - shadowing::macros::tensor (line 110) ... ignored
  610. 898.55 s > test crates/spenso/src/shadowing/macros.rs - shadowing::macros::trace (line 444) ... ignored
  611. 898.55 s > test crates/spenso/src/shadowing/macros.rs - shadowing::macros::trace_sym (line 496) ... ignored
  612. 898.55 s > test crates/spenso/src/network/mod.rs - network::Network (line 1693) ... FAILED
  613. 898.55 s >
  614. 898.55 s > failures:
  615. 898.55 s >
  616. 898.55 s > ---- crates/spenso/src/network/mod.rs - network::Network (line 1693) stdout ----
  617. 898.55 s > Test executable failed (terminated by signal).
  618. 898.55 s >
  619. 898.55 s > stdout:
  620. 898.55 s > ┌────────────────────────────────────────────────────────┐
  621. 898.55 s > │ You are running a restricted Symbolica instance. │
  622. 898.55 s > │ │
  623. 898.55 s > │ For non-commercial use only, limited to one │
  624. 898.55 s > │ Symbolica thread per user. │
  625. 898.55 s > │ │
  626. 898.55 s > ├─ Unlock all cores ─────────────────────────────────────┤
  627. 898.55 s > │ │
  628. 898.55 s > │ Hobbyists and students: free annual key │
  629. 898.55 s > │ https://symbolica.io/license/#get-hobbyist-license │
  630. 898.55 s > │ │
  631. 898.55 s > │ Free 30-day professional trial: │
  632. 898.55 s > │ https://symbolica.io/license/#get-trial-license │
  633. 898.55 s > │ │
  634. 898.55 s > └────────────────────────────────────────────────────────┘
  635. 898.55 s > ┌──────────────────────────────────────────────────────────────────────────────────────────────────┐
  636. 898.55 s > │ Cannot start another restricted Symbolica thread while this user's thread allowance is in use. │
  637. 898.55 s > └──────────────────────────────────────────────────────────────────────────────────────────────────┘
  638. 898.55 s >
  639. 898.55 s > stderr:
  640. 898.55 s > ┌────────────────────────────────────────────────────────┐
  641. 898.55 s > │ The Symbolica license key format is outdated. │
  642. 898.55 s > │ Renew your key at https://symbolica.io/license/ │
  643. 898.55 s > └────────────────────────────────────────────────────────┘
  644. 898.55 s > Could not acquire Symbolica thread permit: Permission denied (os error 13)
  645. 898.55 s >
  646. 898.55 s >
  647. 898.55 s >
  648. 898.55 s > failures:
  649. 898.55 s > crates/spenso/src/network/mod.rs - network::Network (line 1693)
  650. 898.55 s >
  651. 898.55 s > test result: FAILED. 0 passed; 1 failed; 8 ignored; 0 measured; 0 filtered out; finished in 0.09s
  652. 898.55 s >
  653. 898.55 s > all doctests ran in 3.61s; merged doctests compilation took 3.50s
  654. 898.55 s > error: doctest failed, to rerun pass `-p spenso --doc`
  655. 898.55 s For full logs, run:
  656. 898.55 s nix log /nix/store/xmf37jpb1f2ls6mvj35zs9jzr5fjsgnv-gammaloop-workspace-doctest-0.1.0.drv
  657. 898.66 s [0 built (1 failed)]Run failed.