1. 0.00 s $ /nix/store/9ypz3flqsrl5xl495mm8h645gadjsxi1-coreutils-9.11/bin/timeout --kill-after=15s 7200s /nix/store/23zk8sgzamrbmj1fday15szf7f2279s8-nix-2.34.7/bin/nix --extra-experimental-features nix-command --extra-experimental-features flakes flake clone git+https://github.com/alphal00p/gammaloop --dest /tmp/nix-ci-worker/stable-pwd/repo/
  2. 0.07 s Cloning into '/tmp/nix-ci-worker/stable-pwd/repo'...
  3. 0.76 s remote: Enumerating objects: 93647, done.
  4. 0.86 s remote: Counting objects: 0% (1/9230) remote: Counting objects: 1% (93/9230) remote: Counting objects: 2% (185/9230) remote: Counting objects: 3% (277/9230) remote: Counting objects: 4% (370/9230) remote: Counting objects: 5% (462/9230) remote: Counting objects: 6% (554/9230) remote: Counting objects: 7% (647/9230) remote: Counting objects: 8% (739/9230) remote: Counting objects: 9% (831/9230) remote: Counting objects: 10% (923/9230) remote: Counting objects: 11% (1016/9230) remote: Counting objects: 12% (1108/9230) remote: Counting objects: 13% (1200/9230) remote: Counting objects: 14% (1293/9230) remote: Counting objects: 15% (1385/9230) remote: Counting objects: 16% (1477/9230) remote: Counting objects: 17% (1570/9230) remote: Counting objects: 18% (1662/9230) remote: Counting objects: 19% (1754/9230) remote: Counting objects: 20% (1846/9230) remote: Counting objects: 21% (1939/9230) remote: Counting objects: 22% (2031/9230) remote: Counting objects: 23% (2123/9230) remote: Counting objects: 24% (2216/9230) remote: Counting objects: 25% (2308/9230) remote: Counting objects: 26% (2400/9230) remote: Counting objects: 27% (2493/9230) remote: Counting objects: 28% (2585/9230) remote: Counting objects: 29% (2677/9230) remote: Counting objects: 30% (2769/9230) remote: Counting objects: 31% (2862/9230) remote: Counting objects: 32% (2954/9230) remote: Counting objects: 33% (3046/9230) remote: Counting objects: 34% (3139/9230) remote: Counting objects: 35% (3231/9230) remote: Counting objects: 36% (3323/9230) remote: Counting objects: 37% (3416/9230) remote: Counting objects: 38% (3508/9230) remote: Counting objects: 39% (3600/9230) remote: Counting objects: 40% (3692/9230) remote: Counting objects: 41% (3785/9230) remote: Counting objects: 42% (3877/9230) remote: Counting objects: 43% (3969/9230) remote: Counting objects: 44% (4062/9230) remote: Counting objects: 45% (4154/9230) remote: Counting objects: 46% (4246/9230) remote: Counting objects: 47% (4339/9230) remote: Counting objects: 48% (4431/9230) remote: Counting objects: 49% (4523/9230) remote: Counting objects: 50% (4615/9230) remote: Counting objects: 51% (4708/9230) remote: Counting objects: 52% (4800/9230) remote: Counting objects: 53% (4892/9230) remote: Counting objects: 54% (4985/9230) remote: Counting objects: 55% (5077/9230) remote: Counting objects: 56% (5169/9230) remote: Counting objects: 57% (5262/9230) remote: Counting objects: 58% (5354/9230) remote: Counting objects: 59% (5446/9230) remote: Counting objects: 60% (5538/9230) remote: Counting objects: 61% (5631/9230) remote: Counting objects: 62% (5723/9230) remote: Counting objects: 63% (5815/9230) remote: Counting objects: 64% (5908/9230) remote: Counting objects: 65% (6000/9230) remote: Counting objects: 66% (6092/9230) remote: Counting objects: 67% (6185/9230) remote: Counting objects: 68% (6277/9230) remote: Counting objects: 69% (6369/9230) remote: Counting objects: 70% (6461/9230) remote: Counting objects: 71% (6554/9230) remote: Counting objects: 72% (6646/9230) remote: Counting objects: 73% (6738/9230) remote: Counting objects: 74% (6831/9230) remote: Counting objects: 75% (6923/9230) remote: Counting objects: 76% (7015/9230) remote: Counting objects: 77% (7108/9230) remote: Counting objects: 78% (7200/9230) remote: Counting objects: 79% (7292/9230) remote: Counting objects: 80% (7384/9230) remote: Counting objects: 81% (7477/9230) remote: Counting objects: 82% (7569/9230) remote: Counting objects: 83% (7661/9230) remote: Counting objects: 84% (7754/9230) remote: Counting objects: 85% (7846/9230) remote: Counting objects: 86% (7938/9230) remote: Counting objects: 87% (8031/9230) remote: Counting objects: 88% (8123/9230) remote: Counting objects: 89% (8215/9230) remote: Counting objects: 90% (8307/9230) remote: Counting objects: 91% (8400/9230) remote: Counting objects: 92% (8492/9230) remote: Counting objects: 93% (8584/9230) remote: Counting objects: 94% (8677/9230) remote: Counting objects: 95% (8769/9230) remote: Counting objects: 96% (8861/9230) remote: Counting objects: 97% (8954/9230) remote: Counting objects: 98% (9046/9230) remote: Counting objects: 99% (9138/9230) remote: Counting objects: 100% (9230/9230) remote: Counting objects: 100% (9230/9230), done.
  5. 3.32 s remote: Compressing objects: 0% (1/1997) remote: Compressing objects: 1% (20/1997) remote: Compressing objects: 2% (40/1997) remote: Compressing objects: 3% (60/1997) remote: Compressing objects: 4% (80/1997) remote: Compressing objects: 5% (100/1997) remote: Compressing objects: 6% (120/1997) remote: Compressing objects: 7% (140/1997) remote: Compressing objects: 8% (160/1997) remote: Compressing objects: 9% (180/1997) remote: Compressing objects: 10% (200/1997) remote: Compressing objects: 10% (215/1997) remote: Compressing objects: 11% (220/1997) remote: Compressing objects: 12% (240/1997) remote: Compressing objects: 13% (260/1997) remote: Compressing objects: 14% (280/1997) remote: Compressing objects: 15% (300/1997) remote: Compressing objects: 16% (320/1997) remote: Compressing objects: 17% (340/1997) remote: Compressing objects: 18% (360/1997) remote: Compressing objects: 19% (380/1997) remote: Compressing objects: 19% (397/1997) remote: Compressing objects: 20% (400/1997) remote: Compressing objects: 21% (420/1997) remote: Compressing objects: 22% (440/1997) remote: Compressing objects: 23% (460/1997) remote: Compressing objects: 24% (480/1997) remote: Compressing objects: 25% (500/1997) remote: Compressing objects: 26% (520/1997) remote: Compressing objects: 27% (540/1997) remote: Compressing objects: 28% (560/1997) remote: Compressing objects: 29% (580/1997) remote: Compressing objects: 30% (600/1997) remote: Compressing objects: 31% (620/1997) remote: Compressing objects: 32% (640/1997) remote: Compressing objects: 33% (660/1997) remote: Compressing objects: 34% (679/1997) remote: Compressing objects: 35% (699/1997) remote: Compressing objects: 36% (719/1997) remote: Compressing objects: 37% (739/1997) remote: Compressing objects: 38% (759/1997) remote: Compressing objects: 39% (779/1997) remote: Compressing objects: 40% (799/1997) remote: Compressing objects: 41% (819/1997) remote: Compressing objects: 42% (839/1997) remote: Compressing objects: 43% (859/1997) remote: Compressing objects: 44% (879/1997) remote: Compressing objects: 45% (899/1997) remote: Compressing objects: 46% (919/1997) remote: Compressing objects: 47% (939/1997) remote: Compressing objects: 48% (959/1997) remote: Compressing objects: 49% (979/1997) remote: Compressing objects: 50% (999/1997) remote: Compressing objects: 51% (1019/1997) remote: Compressing objects: 52% (1039/1997) remote: Compressing objects: 53% (1059/1997) remote: Compressing objects: 54% (1079/1997) remote: Compressing objects: 55% (1099/1997) remote: Compressing objects: 56% (1119/1997) remote: Compressing objects: 57% (1139/1997) remote: Compressing objects: 58% (1159/1997) remote: Compressing objects: 59% (1179/1997) remote: Compressing objects: 60% (1199/1997) remote: Compressing objects: 61% (1219/1997) remote: Compressing objects: 62% (1239/1997) remote: Compressing objects: 63% (1259/1997) remote: Compressing objects: 64% (1279/1997) remote: Compressing objects: 65% (1299/1997) remote: Compressing objects: 66% (1319/1997) remote: Compressing objects: 67% (1338/1997) remote: Compressing objects: 68% (1358/1997) remote: Compressing objects: 69% (1378/1997) remote: Compressing objects: 70% (1398/1997) remote: Compressing objects: 71% (1418/1997) remote: Compressing objects: 72% (1438/1997) remote: Compressing objects: 73% (1458/1997) remote: Compressing objects: 74% (1478/1997) remote: Compressing objects: 75% (1498/1997) remote: Compressing objects: 76% (1518/1997) remote: Compressing objects: 77% (1538/1997) remote: Compressing objects: 78% (1558/1997) remote: Compressing objects: 79% (1578/1997) remote: Compressing objects: 80% (1598/1997) remote: Compressing objects: 81% (1618/1997) remote: Compressing objects: 82% (1638/1997) remote: Compressing objects: 83% (1658/1997) remote: Compressing objects: 84% (1678/1997) remote: Compressing objects: 85% (1698/1997) remote: Compressing objects: 86% (1718/1997) remote: Compressing objects: 87% (1738/1997) remote: Compressing objects: 88% (1758/1997) remote: Compressing objects: 89% (1778/1997) remote: Compressing objects: 90% (1798/1997) remote: Compressing objects: 91% (1818/1997) remote: Compressing objects: 92% (1838/1997) remote: Compressing objects: 93% (1858/1997) remote: Compressing objects: 94% (1878/1997) remote: Compressing objects: 95% (1898/1997) remote: Compressing objects: 96% (1918/1997) remote: Compressing objects: 97% (1938/1997) remote: Compressing objects: 98% (1958/1997) remote: Compressing objects: 99% (1978/1997) remote: Compressing objects: 100% (1997/1997) remote: Compressing objects: 100% (1997/1997), done.
  6. 11.79 s Receiving objects: 0% (1/93647) Receiving objects: 1% (937/93647) Receiving objects: 2% (1873/93647) Receiving objects: 3% (2810/93647) Receiving objects: 4% (3746/93647) Receiving objects: 5% (4683/93647) Receiving objects: 6% (5619/93647) Receiving objects: 7% (6556/93647) Receiving objects: 8% (7492/93647), 16.33 MiB | 32.65 MiB/s Receiving objects: 9% (8429/93647), 16.33 MiB | 32.65 MiB/s Receiving objects: 10% (9365/93647), 16.33 MiB | 32.65 MiB/s Receiving objects: 11% (10302/93647), 16.33 MiB | 32.65 MiB/s Receiving objects: 12% (11238/93647), 16.33 MiB | 32.65 MiB/s Receiving objects: 13% (12175/93647), 16.33 MiB | 32.65 MiB/s Receiving objects: 14% (13111/93647), 16.33 MiB | 32.65 MiB/s Receiving objects: 15% (14048/93647), 16.33 MiB | 32.65 MiB/s Receiving objects: 16% (14984/93647), 16.33 MiB | 32.65 MiB/s Receiving objects: 17% (15920/93647), 16.33 MiB | 32.65 MiB/s Receiving objects: 18% (16857/93647), 16.33 MiB | 32.65 MiB/s Receiving objects: 19% (17793/93647), 16.33 MiB | 32.65 MiB/s Receiving objects: 20% (18730/93647), 16.33 MiB | 32.65 MiB/s Receiving objects: 21% (19666/93647), 16.33 MiB | 32.65 MiB/s Receiving objects: 22% (20603/93647), 16.33 MiB | 32.65 MiB/s Receiving objects: 23% (21539/93647), 16.33 MiB | 32.65 MiB/s Receiving objects: 24% (22476/93647), 16.33 MiB | 32.65 MiB/s Receiving objects: 25% (23412/93647), 16.33 MiB | 32.65 MiB/s Receiving objects: 26% (24349/93647), 16.33 MiB | 32.65 MiB/s Receiving objects: 27% (25285/93647), 16.33 MiB | 32.65 MiB/s Receiving objects: 28% (26222/93647), 16.33 MiB | 32.65 MiB/s Receiving objects: 29% (27158/93647), 16.33 MiB | 32.65 MiB/s Receiving objects: 30% (28095/93647), 16.33 MiB | 32.65 MiB/s Receiving objects: 31% (29031/93647), 16.33 MiB | 32.65 MiB/s Receiving objects: 32% (29968/93647), 16.33 MiB | 32.65 MiB/s Receiving objects: 33% (30904/93647), 16.33 MiB | 32.65 MiB/s Receiving objects: 34% (31840/93647), 16.33 MiB | 32.65 MiB/s Receiving objects: 35% (32777/93647), 16.33 MiB | 32.65 MiB/s Receiving objects: 36% (33713/93647), 16.33 MiB | 32.65 MiB/s Receiving objects: 37% (34650/93647), 16.33 MiB | 32.65 MiB/s Receiving objects: 37% (35088/93647), 16.33 MiB | 32.65 MiB/s Receiving objects: 38% (35586/93647), 36.67 MiB | 36.66 MiB/s Receiving objects: 39% (36523/93647), 36.67 MiB | 36.66 MiB/s Receiving objects: 40% (37459/93647), 36.67 MiB | 36.66 MiB/s Receiving objects: 41% (38396/93647), 36.67 MiB | 36.66 MiB/s Receiving objects: 42% (39332/93647), 36.67 MiB | 36.66 MiB/s Receiving objects: 43% (40269/93647), 36.67 MiB | 36.66 MiB/s Receiving objects: 44% (41205/93647), 36.67 MiB | 36.66 MiB/s Receiving objects: 45% (42142/93647), 36.67 MiB | 36.66 MiB/s Receiving objects: 46% (43078/93647), 36.67 MiB | 36.66 MiB/s Receiving objects: 47% (44015/93647), 36.67 MiB | 36.66 MiB/s Receiving objects: 48% (44951/93647), 36.67 MiB | 36.66 MiB/s Receiving objects: 49% (45888/93647), 54.61 MiB | 36.28 MiB/s Receiving objects: 50% (46824/93647), 54.61 MiB | 36.28 MiB/s Receiving objects: 51% (47760/93647), 54.61 MiB | 36.28 MiB/s Receiving objects: 52% (48697/93647), 54.61 MiB | 36.28 MiB/s Receiving objects: 53% (49633/93647), 54.61 MiB | 36.28 MiB/s Receiving objects: 54% (50570/93647), 54.61 MiB | 36.28 MiB/s Receiving objects: 54% (51384/93647), 54.61 MiB | 36.28 MiB/s Receiving objects: 55% (51506/93647), 73.84 MiB | 36.82 MiB/s Receiving objects: 56% (52443/93647), 73.84 MiB | 36.82 MiB/s Receiving objects: 57% (53379/93647), 73.84 MiB | 36.82 MiB/s Receiving objects: 58% (54316/93647), 73.84 MiB | 36.82 MiB/s Receiving objects: 59% (55252/93647), 73.84 MiB | 36.82 MiB/s Receiving objects: 60% (56189/93647), 73.84 MiB | 36.82 MiB/s Receiving objects: 60% (57089/93647), 108.81 MiB | 36.08 MiB/s Receiving objects: 61% (57125/93647), 108.81 MiB | 36.08 MiB/s Receiving objects: 61% (57240/93647), 128.14 MiB | 36.45 MiB/s Receiving objects: 61% (57654/93647), 163.36 MiB | 36.10 MiB/s Receiving objects: 62% (58062/93647), 181.54 MiB | 36.50 MiB/s Receiving objects: 63% (58998/93647), 181.54 MiB | 36.50 MiB/s Receiving objects: 64% (59935/93647), 181.54 MiB | 36.50 MiB/s Receiving objects: 65% (60871/93647), 181.54 MiB | 36.50 MiB/s Receiving objects: 66% (61808/93647), 181.54 MiB | 36.50 MiB/s Receiving objects: 67% (62744/93647), 181.54 MiB | 36.50 MiB/s Receiving objects: 68% (63680/93647), 199.44 MiB | 35.97 MiB/s Receiving objects: 69% (64617/93647), 199.44 MiB | 35.97 MiB/s Receiving objects: 70% (65553/93647), 199.44 MiB | 35.97 MiB/s Receiving objects: 71% (66490/93647), 199.44 MiB | 35.97 MiB/s Receiving objects: 72% (67426/93647), 199.44 MiB | 35.97 MiB/s Receiving objects: 73% (68363/93647), 199.44 MiB | 35.97 MiB/s Receiving objects: 74% (69299/93647), 199.44 MiB | 35.97 MiB/s Receiving objects: 75% (70236/93647), 199.44 MiB | 35.97 MiB/s Receiving objects: 76% (71172/93647), 199.44 MiB | 35.97 MiB/s Receiving objects: 77% (72109/93647), 199.44 MiB | 35.97 MiB/s Receiving objects: 78% (73045/93647), 199.44 MiB | 35.97 MiB/s Receiving objects: 78% (73542/93647), 199.44 MiB | 35.97 MiB/s Receiving objects: 79% (73982/93647), 217.85 MiB | 36.03 MiB/s Receiving objects: 80% (74918/93647), 217.85 MiB | 36.03 MiB/s Receiving objects: 81% (75855/93647), 217.85 MiB | 36.03 MiB/s Receiving objects: 82% (76791/93647), 217.85 MiB | 36.03 MiB/s Receiving objects: 82% (77409/93647), 236.66 MiB | 35.93 MiB/s Receiving objects: 83% (77728/93647), 236.66 MiB | 35.93 MiB/s Receiving objects: 84% (78664/93647), 236.66 MiB | 35.93 MiB/s Receiving objects: 85% (79600/93647), 253.91 MiB | 36.04 MiB/s Receiving objects: 86% (80537/93647), 253.91 MiB | 36.04 MiB/s Receiving objects: 87% (81473/93647), 253.91 MiB | 36.04 MiB/s Receiving objects: 88% (82410/93647), 253.91 MiB | 36.04 MiB/s Receiving objects: 89% (83346/93647), 253.91 MiB | 36.04 MiB/s Receiving objects: 90% (84283/93647), 272.00 MiB | 36.01 MiB/s Receiving objects: 91% (85219/93647), 272.00 MiB | 36.01 MiB/s Receiving objects: 92% (86156/93647), 272.00 MiB | 36.01 MiB/s Receiving objects: 93% (87092/93647), 272.00 MiB | 36.01 MiB/s Receiving objects: 94% (88029/93647), 272.00 MiB | 36.01 MiB/s Receiving objects: 95% (88965/93647), 272.00 MiB | 36.01 MiB/s Receiving objects: 96% (89902/93647), 272.00 MiB | 36.01 MiB/s Receiving objects: 97% (90838/93647), 272.00 MiB | 36.01 MiB/s Receiving objects: 98% (91775/93647), 272.00 MiB | 36.01 MiB/s Receiving objects: 99% (92711/93647), 272.00 MiB | 36.01 MiB/s Receiving objects: 99% (93397/93647), 291.03 MiB | 35.95 MiB/s remote: Total 93647 (delta 7918), reused 7373 (delta 7224), pack-reused 84417 (from 2)
  7. 11.79 s Receiving objects: 100% (93647/93647), 291.03 MiB | 35.95 MiB/s Receiving objects: 100% (93647/93647), 305.41 MiB | 36.10 MiB/s, done.
  8. 12.85 s Resolving deltas: 0% (0/63082) Resolving deltas: 1% (631/63082) Resolving deltas: 2% (1262/63082) Resolving deltas: 3% (1896/63082) Resolving deltas: 4% (2524/63082) Resolving deltas: 5% (3155/63082) Resolving deltas: 6% (3785/63082) Resolving deltas: 7% (4419/63082) Resolving deltas: 8% (5047/63082) Resolving deltas: 9% (5679/63082) Resolving deltas: 10% (6310/63082) Resolving deltas: 11% (6940/63082) Resolving deltas: 12% (7570/63082) Resolving deltas: 13% (8201/63082) Resolving deltas: 14% (8832/63082) Resolving deltas: 15% (9464/63082) Resolving deltas: 16% (10094/63082) Resolving deltas: 17% (10725/63082) Resolving deltas: 18% (11355/63082) Resolving deltas: 19% (11986/63082) Resolving deltas: 20% (12617/63082) Resolving deltas: 21% (13250/63082) Resolving deltas: 22% (13879/63082) Resolving deltas: 23% (14509/63082) Resolving deltas: 24% (15141/63082) Resolving deltas: 25% (15771/63082) Resolving deltas: 26% (16402/63082) Resolving deltas: 27% (17033/63082) Resolving deltas: 28% (17663/63082) Resolving deltas: 29% (18294/63082) Resolving deltas: 30% (18925/63082) Resolving deltas: 31% (19556/63082) Resolving deltas: 32% (20188/63082) Resolving deltas: 33% (20819/63082) Resolving deltas: 34% (21448/63082) Resolving deltas: 35% (22079/63082) Resolving deltas: 36% (22711/63082) Resolving deltas: 37% (23342/63082) Resolving deltas: 38% (23972/63082) Resolving deltas: 39% (24602/63082) Resolving deltas: 40% (25233/63082) Resolving deltas: 41% (25864/63082) Resolving deltas: 42% (26495/63082) Resolving deltas: 43% (27126/63082) Resolving deltas: 44% (27757/63082) Resolving deltas: 45% (28388/63082) Resolving deltas: 46% (29018/63082) Resolving deltas: 47% (29649/63082) Resolving deltas: 48% (30280/63082) Resolving deltas: 49% (30911/63082) Resolving deltas: 50% (31541/63082) Resolving deltas: 51% (32172/63082) Resolving deltas: 52% (32803/63082) Resolving deltas: 53% (33436/63082) Resolving deltas: 54% (34065/63082) Resolving deltas: 55% (34696/63082) Resolving deltas: 56% (35326/63082) Resolving deltas: 57% (35959/63082) Resolving deltas: 58% (36590/63082) Resolving deltas: 59% (37219/63082) Resolving deltas: 60% (37850/63082) Resolving deltas: 61% (38481/63082) Resolving deltas: 62% (39111/63082) Resolving deltas: 63% (39743/63082) Resolving deltas: 64% (40373/63082) Resolving deltas: 65% (41004/63082) Resolving deltas: 66% (41635/63082) Resolving deltas: 67% (42265/63082) Resolving deltas: 68% (42896/63082) Resolving deltas: 69% (43527/63082) Resolving deltas: 70% (44158/63082) Resolving deltas: 71% (44789/63082) Resolving deltas: 72% (45421/63082) Resolving deltas: 73% (46051/63082) Resolving deltas: 74% (46681/63082) Resolving deltas: 75% (47312/63082) Resolving deltas: 76% (47944/63082) Resolving deltas: 77% (48574/63082) Resolving deltas: 78% (49204/63082) Resolving deltas: 79% (49836/63082) Resolving deltas: 80% (50466/63082) Resolving deltas: 81% (51097/63082) Resolving deltas: 82% (51729/63082) Resolving deltas: 83% (52359/63082) Resolving deltas: 84% (52989/63082) Resolving deltas: 85% (53620/63082) Resolving deltas: 86% (54251/63082) Resolving deltas: 87% (54882/63082) Resolving deltas: 88% (55513/63082) Resolving deltas: 89% (56143/63082) Resolving deltas: 90% (56774/63082) Resolving deltas: 91% (57405/63082) Resolving deltas: 92% (58036/63082) Resolving deltas: 93% (58667/63082) Resolving deltas: 94% (59298/63082) Resolving deltas: 94% (59388/63082) Resolving deltas: 95% (59928/63082) Resolving deltas: 96% (60559/63082) Resolving deltas: 97% (61190/63082) Resolving deltas: 98% (61821/63082) Resolving deltas: 99% (62453/63082) Resolving deltas: 100% (63082/63082) Resolving deltas: 100% (63082/63082), done.
  9. 13.39 s Fetching commit 436f9ff52587582686db6aefd4ecd715b5693f90 for simplify-spenso-api ...
  10. 13.39 s $ /nix/store/bcnisk3ydfgv26v2gw3zlky24g00yww2-git-2.54.0/bin/git fetch origin 436f9ff52587582686db6aefd4ecd715b5693f90
  11. 13.83 s From https://github.com/alphal00p/gammaloop
  12. 13.83 s * branch 436f9ff52587582686db6aefd4ecd715b5693f90 -> FETCH_HEAD
  13. 13.84 s $ /nix/store/9ypz3flqsrl5xl495mm8h645gadjsxi1-coreutils-9.11/bin/timeout --kill-after=15s 7200s /nix/store/bcnisk3ydfgv26v2gw3zlky24g00yww2-git-2.54.0/bin/git -c advice.detachedHead=false checkout 436f9ff52587582686db6aefd4ecd715b5693f90
  14. 14.05 s HEAD is now at 436f9ff52 align Tymbolica interop with fixed Symbolica main
  15. 14.06 s $ /nix/store/9ypz3flqsrl5xl495mm8h645gadjsxi1-coreutils-9.11/bin/timeout --kill-after=15s 7200s /nix/store/23zk8sgzamrbmj1fday15szf7f2279s8-nix-2.34.7/bin/nix --extra-experimental-features nix-command --extra-experimental-features flakes --log-format internal-json run .#packages.x86_64-linux.nix-ci-check-gammaloop-nextest-python-api --print-build-logs
  16. 21.97 s
  17. 22.02 s Downloading cached gammaloop-nextest-binaries-python-api-gammaloop-integration-tests from https://cache.nix-ci.com
  18. 22.23 s Downloaded cached gammaloop-nextest-binaries-python-api-gammaloop-integration-tests (36.9 MiB) in 216ms
  19. 22.23 s Progress: 0 of 1 built, 1 of 3 downloaded from cache
  20. 22.23 s Downloading cached gammaloop-nextest-binaries-python-api from https://cache.nix-ci.com
  21. 22.24 s Downloaded cached gammaloop-nextest-binaries-python-api (520 B) in 3ms
  22. 22.24 s Progress: 0 of 1 built, 2 of 3 downloaded from cache
  23. 22.24 s Downloading cached nix-ci-check-gammaloop-nextest-python-api from https://cache.nix-ci.com
  24. 22.24 s Downloaded cached nix-ci-check-gammaloop-nextest-python-api (1104 B) in 4ms
  25. 22.24 s Progress: 0 of 1 built, 3 of 3 downloaded from cache
  26. 30.68 s evaluating derivation 'g copying '/nix/store/9x93 evaluating derivation 'g copying '/nix/store/9x93 evaluating derivation 'g copying '/nix/store/9x93 evaluating derivation 'g copying '/nix/store/9x93 evaluating derivation 'g copying '/nix/store/9x93 evaluating derivation 'g copying '/nix/store/9x93 evaluating derivation 'g copying '/nix/store/9x93 evaluating derivation 'g copying '/nix/store/9x93 evaluating derivation 'g copying '/nix/store/9x93 evaluating derivation 'g querying gammaloop-nexte [0.0 KiB DL] [0/1 built, 0.0 KiB DL] [1/0/1 built, 0.0 KiB DLgammaloop-nextest-python-api> Extracting 3 binaries (including 2 non-test binaries), 1 build script output directory, and 3 linked paths to /build/source
  27. 30.94 s gammaloop-nextest-python-api> Extracted 22 files to /build/source in 0.25s
  28. 30.95 s gammaloop-nextest-python-api> ------------
  29. 30.95 s gammaloop-nextest-python-api> Nextest run ID 7d7ed21a-540e-4631-976d-35037d4f84a1 with nextest profile: ci_gammaloop
  30. 30.95 s gammaloop-nextest-python-api> Starting 5 tests across 1 binary
  31. 31.18 s gammaloop-nextest-python-api> FAIL [ 0.227s] (1/5) gammaloop-integration-tests::test_python_api python_evaluate_samples_batch_and_momentum_space_have_expected_shape
  32. 31.18 s gammaloop-nextest-python-api> stdout ---
  33. 31.18 s gammaloop-nextest-python-api>
  34. 31.18 s gammaloop-nextest-python-api> running 1 test
  35. 31.18 s gammaloop-nextest-python-api> test python_evaluate_samples_batch_and_momentum_space_have_expected_shape ... FAILED
  36. 31.18 s gammaloop-nextest-python-api>
  37. 31.18 s gammaloop-nextest-python-api> failures:
  38. 31.18 s gammaloop-nextest-python-api>
  39. 31.18 s gammaloop-nextest-python-api> failures:
  40. 31.18 s gammaloop-nextest-python-api> python_evaluate_samples_batch_and_momentum_space_have_expected_shape
  41. 31.18 s gammaloop-nextest-python-api>
  42. 31.18 s gammaloop-nextest-python-api> test result: FAILED. 0 passed; 1 failed; 0 ignored; 0 measured; 4 filtered out; finished in 0.21s
  43. 31.18 s gammaloop-nextest-python-api>
  44. 31.18 s gammaloop-nextest-python-api> stderr ---
  45. 31.18 s gammaloop-nextest-python-api> Error: Python API test subprocess failed.
  46. 31.18 s gammaloop-nextest-python-api> stdout:
  47. 31.18 s gammaloop-nextest-python-api> ┌────────────────────────────────────────────────────────┐
  48. 31.18 s gammaloop-nextest-python-api> │ You are running a restricted Symbolica instance. │
  49. 31.18 s gammaloop-nextest-python-api> │ │
  50. 31.18 s gammaloop-nextest-python-api> │ For non-commercial use only, limited to one │
  51. 31.18 s gammaloop-nextest-python-api> │ Symbolica thread per user. │
  52. 31.18 s gammaloop-nextest-python-api> │ │
  53. 31.18 s gammaloop-nextest-python-api> ├─ Unlock all cores ─────────────────────────────────────┤
  54. 31.18 s gammaloop-nextest-python-api> │ │
  55. 31.18 s gammaloop-nextest-python-api> │ Hobbyists and students: free annual key │
  56. 31.18 s gammaloop-nextest-python-api> │ https://symbolica.io/license/#get-hobbyist-license │
  57. 31.18 s gammaloop-nextest-python-api> │ │
  58. 31.18 s gammaloop-nextest-python-api> │ Free 30-day professional trial: │
  59. 31.18 s gammaloop-nextest-python-api> │ https://symbolica.io/license/#get-trial-license │
  60. 31.18 s gammaloop-nextest-python-api> │ │
  61. 31.18 s gammaloop-nextest-python-api> └────────────────────────────────────────────────────────┘
  62. 31.18 s gammaloop-nextest-python-api> ┌──────────────────────────────────────────────────────────────────────────────────────────────────┐
  63. 31.18 s gammaloop-nextest-python-api> │ Cannot start another restricted Symbolica thread while this user's thread allowance is in use. │
  64. 31.18 s gammaloop-nextest-python-api> └──────────────────────────────────────────────────────────────────────────────────────────────────┘
  65. 31.18 s gammaloop-nextest-python-api>
  66. 31.18 s gammaloop-nextest-python-api> stderr:
  67. 31.18 s gammaloop-nextest-python-api> ┌────────────────────────────────────────────────────────┐
  68. 31.18 s gammaloop-nextest-python-api> │ The Symbolica license key format is outdated. │
  69. 31.18 s gammaloop-nextest-python-api> │ Renew your key at https://symbolica.io/license/ │
  70. 31.18 s gammaloop-nextest-python-api> └────────────────────────────────────────────────────────┘
  71. 31.18 s gammaloop-nextest-python-api> Could not acquire Symbolica thread permit: Permission denied (os error 13)
  72. 31.18 s gammaloop-nextest-python-api>
  73. 31.18 s gammaloop-nextest-python-api>
  74. 31.18 s gammaloop-nextest-python-api> Location:
  75. 31.18 s gammaloop-nextest-python-api> tests/tests/test_python_api.rs:156:20
  76. 31.18 s gammaloop-nextest-python-api>
  77. 31.18 s gammaloop-nextest-python-api> FAIL [ 0.228s] (2/5) gammaloop-integration-tests::test_python_api python_session_getters_return_live_toml_and_command_blocks
  78. 31.18 s gammaloop-nextest-python-api> stdout ---
  79. 31.18 s gammaloop-nextest-python-api>
  80. 31.18 s gammaloop-nextest-python-api> running 1 test
  81. 31.18 s gammaloop-nextest-python-api> test python_session_getters_return_live_toml_and_command_blocks ... FAILED
  82. 31.18 s gammaloop-nextest-python-api>
  83. 31.18 s gammaloop-nextest-python-api> failures:
  84. 31.18 s gammaloop-nextest-python-api>
  85. 31.18 s gammaloop-nextest-python-api> failures:
  86. 31.18 s gammaloop-nextest-python-api> python_session_getters_return_live_toml_and_command_blocks
  87. 31.18 s gammaloop-nextest-python-api>
  88. 31.18 s gammaloop-nextest-python-api> test result: FAILED. 0 passed; 1 failed; 0 ignored; 0 measured; 4 filtered out; finished in 0.22s
  89. 31.18 s gammaloop-nextest-python-api>
  90. 31.18 s gammaloop-nextest-python-api> stderr ---
  91. 31.18 s gammaloop-nextest-python-api> Error: Python API test subprocess failed.
  92. 31.18 s gammaloop-nextest-python-api> stdout:
  93. 31.18 s gammaloop-nextest-python-api> ┌────────────────────────────────────────────────────────┐
  94. 31.18 s gammaloop-nextest-python-api> │ You are running a restricted Symbolica instance. │
  95. 31.18 s gammaloop-nextest-python-api> │ │
  96. 31.18 s gammaloop-nextest-python-api> │ For non-commercial use only, limited to one │
  97. 31.18 s gammaloop-nextest-python-api> │ Symbolica thread per user. │
  98. 31.18 s gammaloop-nextest-python-api> │ │
  99. 31.18 s gammaloop-nextest-python-api> ├─ Unlock all cores ─────────────────────────────────────┤
  100. 31.18 s gammaloop-nextest-python-api> │ │
  101. 31.18 s gammaloop-nextest-python-api> │ Hobbyists and students: free annual key │
  102. 31.18 s gammaloop-nextest-python-api> │ https://symbolica.io/license/#get-hobbyist-license │
  103. 31.18 s gammaloop-nextest-python-api> │ │
  104. 31.18 s gammaloop-nextest-python-api> │ Free 30-day professional trial: │
  105. 31.18 s gammaloop-nextest-python-api> │ https://symbolica.io/license/#get-trial-license │
  106. 31.18 s gammaloop-nextest-python-api> │ │
  107. 31.18 s gammaloop-nextest-python-api> └────────────────────────────────────────────────────────┘
  108. 31.18 s gammaloop-nextest-python-api> ┌──────────────────────────────────────────────────────────────────────────────────────────────────┐
  109. 31.18 s gammaloop-nextest-python-api> │ Cannot start another restricted Symbolica thread while this user's thread allowance is in use. │
  110. 31.18 s gammaloop-nextest-python-api> └──────────────────────────────────────────────────────────────────────────────────────────────────┘
  111. 31.18 s gammaloop-nextest-python-api>
  112. 31.18 s gammaloop-nextest-python-api> stderr:
  113. 31.18 s gammaloop-nextest-python-api> ┌────────────────────────────────────────────────────────┐
  114. 31.18 s gammaloop-nextest-python-api> │ The Symbolica license key format is outdated. │
  115. 31.18 s gammaloop-nextest-python-api> │ Renew your key at https://symbolica.io/license/ │
  116. 31.18 s gammaloop-nextest-python-api> └────────────────────────────────────────────────────────┘
  117. 31.18 s gammaloop-nextest-python-api> Could not acquire Symbolica thread permit: Permission denied (os error 13)
  118. 31.18 s gammaloop-nextest-python-api>
  119. 31.18 s gammaloop-nextest-python-api>
  120. 31.18 s gammaloop-nextest-python-api> Location:
  121. 31.18 s gammaloop-nextest-python-api> tests/tests/test_python_api.rs:156:20
  122. 31.18 s gammaloop-nextest-python-api>
  123. 31.18 s gammaloop-nextest-python-api> FAIL [ 0.233s] (3/5) gammaloop-integration-tests::test_python_api python_evaluate_sample_honors_generate_events_and_observable_snapshots
  124. 31.18 s gammaloop-nextest-python-api> stdout ---
  125. 31.18 s gammaloop-nextest-python-api>
  126. 31.18 s gammaloop-nextest-python-api> running 1 test
  127. 31.18 s gammaloop-nextest-python-api> test python_evaluate_sample_honors_generate_events_and_observable_snapshots ... FAILED
  128. 31.18 s gammaloop-nextest-python-api>
  129. 31.18 s gammaloop-nextest-python-api> failures:
  130. 31.18 s gammaloop-nextest-python-api>
  131. 31.18 s gammaloop-nextest-python-api> failures:
  132. 31.18 s gammaloop-nextest-python-api> python_evaluate_sample_honors_generate_events_and_observable_snapshots
  133. 31.18 s gammaloop-nextest-python-api>
  134. 31.18 s gammaloop-nextest-python-api> test result: FAILED. 0 passed; 1 failed; 0 ignored; 0 measured; 4 filtered out; finished in 0.23s
  135. 31.18 s gammaloop-nextest-python-api>
  136. 31.18 s gammaloop-nextest-python-api> stderr ---
  137. 31.18 s gammaloop-nextest-python-api> Error: Python API test subprocess failed.
  138. 31.18 s gammaloop-nextest-python-api> stdout:
  139. 31.18 s gammaloop-nextest-python-api> ┌────────────────────────────────────────────────────────┐
  140. 31.18 s gammaloop-nextest-python-api> │ You are running a restricted Symbolica instance. │
  141. 31.18 s gammaloop-nextest-python-api> │ │
  142. 31.18 s gammaloop-nextest-python-api> │ For non-commercial use only, limited to one │
  143. 31.18 s gammaloop-nextest-python-api> │ Symbolica thread per user. │
  144. 31.18 s gammaloop-nextest-python-api> │ │
  145. 31.18 s gammaloop-nextest-python-api> ├─ Unlock all cores ─────────────────────────────────────┤
  146. 31.18 s gammaloop-nextest-python-api> │ │
  147. 31.18 s gammaloop-nextest-python-api> │ Hobbyists and students: free annual key │
  148. 31.18 s gammaloop-nextest-python-api> │ https://symbolica.io/license/#get-hobbyist-license │
  149. 31.18 s gammaloop-nextest-python-api> │ │
  150. 31.18 s gammaloop-nextest-python-api> │ Free 30-day professional trial: │
  151. 31.18 s gammaloop-nextest-python-api> │ https://symbolica.io/license/#get-trial-license │
  152. 31.18 s gammaloop-nextest-python-api> │ │
  153. 31.18 s gammaloop-nextest-python-api> └────────────────────────────────────────────────────────┘
  154. 31.18 s gammaloop-nextest-python-api> ┌──────────────────────────────────────────────────────────────────────────────────────────────────┐
  155. 31.18 s gammaloop-nextest-python-api> │ Cannot start another restricted Symbolica thread while this user's thread allowance is in use. │
  156. 31.18 s gammaloop-nextest-python-api> └──────────────────────────────────────────────────────────────────────────────────────────────────┘
  157. 31.18 s gammaloop-nextest-python-api>
  158. 31.18 s gammaloop-nextest-python-api> stderr:
  159. 31.18 s gammaloop-nextest-python-api> ┌────────────────────────────────────────────────────────┐
  160. 31.18 s gammaloop-nextest-python-api> │ The Symbolica license key format is outdated. │
  161. 31.18 s gammaloop-nextest-python-api> │ Renew your key at https://symbolica.io/license/ │
  162. 31.18 s gammaloop-nextest-python-api> └────────────────────────────────────────────────────────┘
  163. 31.18 s gammaloop-nextest-python-api> Could not acquire Symbolica thread permit: Permission denied (os error 13)
  164. 31.18 s gammaloop-nextest-python-api>
  165. 31.18 s gammaloop-nextest-python-api>
  166. 31.18 s gammaloop-nextest-python-api> Location:
  167. 31.18 s gammaloop-nextest-python-api> tests/tests/test_python_api.rs:156:20
  168. 31.18 s gammaloop-nextest-python-api>
  169. 31.18 s gammaloop-nextest-python-api> FAIL [ 0.234s] (4/5) gammaloop-integration-tests::test_python_api python_evaluate_sample_preserves_graph_grouping_and_incoming_pdgs
  170. 31.18 s gammaloop-nextest-python-api> stdout ---
  171. 31.18 s gammaloop-nextest-python-api>
  172. 31.18 s gammaloop-nextest-python-api> running 1 test
  173. 31.18 s gammaloop-nextest-python-api> test python_evaluate_sample_preserves_graph_grouping_and_incoming_pdgs ... FAILED
  174. 31.18 s gammaloop-nextest-python-api>
  175. 31.18 s gammaloop-nextest-python-api> failures:
  176. 31.18 s gammaloop-nextest-python-api>
  177. 31.18 s gammaloop-nextest-python-api> failures:
  178. 31.18 s gammaloop-nextest-python-api> python_evaluate_sample_preserves_graph_grouping_and_incoming_pdgs
  179. 31.18 s gammaloop-nextest-python-api>
  180. 31.18 s gammaloop-nextest-python-api> test result: FAILED. 0 passed; 1 failed; 0 ignored; 0 measured; 4 filtered out; finished in 0.23s
  181. 31.18 s gammaloop-nextest-python-api>
  182. 31.18 s gammaloop-nextest-python-api> stderr ---
  183. 31.18 s gammaloop-nextest-python-api> Error: Python API test subprocess failed.
  184. 31.18 s gammaloop-nextest-python-api> stdout:
  185. 31.18 s gammaloop-nextest-python-api> ┌────────────────────────────────────────────────────────┐
  186. 31.18 s gammaloop-nextest-python-api> │ You are running a restricted Symbolica instance. │
  187. 31.18 s gammaloop-nextest-python-api> │ │
  188. 31.18 s gammaloop-nextest-python-api> │ For non-commercial use only, limited to one │
  189. 31.18 s gammaloop-nextest-python-api> │ Symbolica thread per user. │
  190. 31.18 s gammaloop-nextest-python-api> │ │
  191. 31.18 s gammaloop-nextest-python-api> ├─ Unlock all cores ─────────────────────────────────────┤
  192. 31.18 s gammaloop-nextest-python-api> │ │
  193. 31.18 s gammaloop-nextest-python-api> │ Hobbyists and students: free annual key │
  194. 31.18 s gammaloop-nextest-python-api> │ https://symbolica.io/license/#get-hobbyist-license │
  195. 31.18 s gammaloop-nextest-python-api> │ │
  196. 31.18 s gammaloop-nextest-python-api> │ Free 30-day professional trial: │
  197. 31.18 s gammaloop-nextest-python-api> │ https://symbolica.io/license/#get-trial-license │
  198. 31.18 s gammaloop-nextest-python-api> │ │
  199. 31.18 s gammaloop-nextest-python-api> └────────────────────────────────────────────────────────┘
  200. 31.18 s gammaloop-nextest-python-api> ┌──────────────────────────────────────────────────────────────────────────────────────────────────┐
  201. 31.18 s gammaloop-nextest-python-api> │ Cannot start another restricted Symbolica thread while this user's thread allowance is in use. │
  202. 31.18 s gammaloop-nextest-python-api> └──────────────────────────────────────────────────────────────────────────────────────────────────┘
  203. 31.18 s gammaloop-nextest-python-api>
  204. 31.18 s gammaloop-nextest-python-api> stderr:
  205. 31.18 s gammaloop-nextest-python-api> ┌────────────────────────────────────────────────────────┐
  206. 31.18 s gammaloop-nextest-python-api> │ The Symbolica license key format is outdated. │
  207. 31.18 s gammaloop-nextest-python-api> │ Renew your key at https://symbolica.io/license/ │
  208. 31.18 s gammaloop-nextest-python-api> └────────────────────────────────────────────────────────┘
  209. 31.18 s gammaloop-nextest-python-api> Could not acquire Symbolica thread permit: Permission denied (os error 13)
  210. 31.18 s gammaloop-nextest-python-api>
  211. 31.18 s gammaloop-nextest-python-api>
  212. 31.18 s gammaloop-nextest-python-api> Location:
  213. 31.18 s gammaloop-nextest-python-api> tests/tests/test_python_api.rs:156:20
  214. 31.18 s gammaloop-nextest-python-api>
  215. 31.18 s gammaloop-nextest-python-api> FAIL [ 0.235s] (5/5) gammaloop-integration-tests::test_python_api python_settings_wrappers_expose_nested_runtime_and_global_settings
  216. 31.18 s gammaloop-nextest-python-api> stdout ---
  217. 31.18 s gammaloop-nextest-python-api>
  218. 31.18 s gammaloop-nextest-python-api> running 1 test
  219. 31.18 s gammaloop-nextest-python-api> test python_settings_wrappers_expose_nested_runtime_and_global_settings ... FAILED
  220. 31.18 s gammaloop-nextest-python-api>
  221. 31.18 s gammaloop-nextest-python-api> failures:
  222. 31.18 s gammaloop-nextest-python-api>
  223. 31.18 s gammaloop-nextest-python-api> failures:
  224. 31.18 s gammaloop-nextest-python-api> python_settings_wrappers_expose_nested_runtime_and_global_settings
  225. 31.18 s gammaloop-nextest-python-api>
  226. 31.18 s gammaloop-nextest-python-api> test result: FAILED. 0 passed; 1 failed; 0 ignored; 0 measured; 4 filtered out; finished in 0.23s
  227. 31.18 s gammaloop-nextest-python-api>
  228. 31.18 s gammaloop-nextest-python-api> stderr ---
  229. 31.18 s gammaloop-nextest-python-api> Error: Python API test subprocess failed.
  230. 31.18 s gammaloop-nextest-python-api> stdout:
  231. 31.18 s gammaloop-nextest-python-api> ┌────────────────────────────────────────────────────────┐
  232. 31.18 s gammaloop-nextest-python-api> │ You are running a restricted Symbolica instance. │
  233. 31.18 s gammaloop-nextest-python-api> │ │
  234. 31.18 s gammaloop-nextest-python-api> │ For non-commercial use only, limited to one │
  235. 31.18 s gammaloop-nextest-python-api> │ Symbolica thread per user. │
  236. 31.18 s gammaloop-nextest-python-api> │ │
  237. 31.18 s gammaloop-nextest-python-api> ├─ Unlock all cores ─────────────────────────────────────┤
  238. 31.18 s gammaloop-nextest-python-api> │ │
  239. 31.18 s gammaloop-nextest-python-api> │ Hobbyists and students: free annual key │
  240. 31.18 s gammaloop-nextest-python-api> │ https://symbolica.io/license/#get-hobbyist-license │
  241. 31.18 s gammaloop-nextest-python-api> │ │
  242. 31.18 s gammaloop-nextest-python-api> │ Free 30-day professional trial: │
  243. 31.18 s gammaloop-nextest-python-api> │ https://symbolica.io/license/#get-trial-license │
  244. 31.18 s gammaloop-nextest-python-api> │ │
  245. 31.18 s gammaloop-nextest-python-api> └────────────────────────────────────────────────────────┘
  246. 31.18 s gammaloop-nextest-python-api> ┌──────────────────────────────────────────────────────────────────────────────────────────────────┐
  247. 31.18 s gammaloop-nextest-python-api> │ Cannot start another restricted Symbolica thread while this user's thread allowance is in use. │
  248. 31.18 s gammaloop-nextest-python-api> └──────────────────────────────────────────────────────────────────────────────────────────────────┘
  249. 31.18 s gammaloop-nextest-python-api>
  250. 31.18 s gammaloop-nextest-python-api> stderr:
  251. 31.18 s gammaloop-nextest-python-api> ┌────────────────────────────────────────────────────────┐
  252. 31.18 s gammaloop-nextest-python-api> │ The Symbolica license key format is outdated. │
  253. 31.18 s gammaloop-nextest-python-api> │ Renew your key at https://symbolica.io/license/ │
  254. 31.18 s gammaloop-nextest-python-api> └────────────────────────────────────────────────────────┘
  255. 31.18 s gammaloop-nextest-python-api> Could not acquire Symbolica thread permit: Permission denied (os error 13)
  256. 31.18 s gammaloop-nextest-python-api>
  257. 31.18 s gammaloop-nextest-python-api>
  258. 31.18 s gammaloop-nextest-python-api> Location:
  259. 31.18 s gammaloop-nextest-python-api> tests/tests/test_python_api.rs:156:20
  260. 31.18 s gammaloop-nextest-python-api>
  261. 31.18 s gammaloop-nextest-python-api> ------------
  262. 31.18 s gammaloop-nextest-python-api> Summary [ 0.235s] 5 tests run: 0 passed, 5 failed, 0 skipped
  263. 31.18 s gammaloop-nextest-python-api> FAIL [ 0.227s] (1/5) gammaloop-integration-tests::test_python_api python_evaluate_samples_batch_and_momentum_space_have_expected_shape
  264. 31.18 s gammaloop-nextest-python-api> stdout ---
  265. 31.18 s gammaloop-nextest-python-api>
  266. 31.18 s gammaloop-nextest-python-api> running 1 test
  267. 31.18 s gammaloop-nextest-python-api> test python_evaluate_samples_batch_and_momentum_space_have_expected_shape ... FAILED
  268. 31.18 s gammaloop-nextest-python-api>
  269. 31.18 s gammaloop-nextest-python-api> failures:
  270. 31.18 s gammaloop-nextest-python-api>
  271. 31.18 s gammaloop-nextest-python-api> failures:
  272. 31.18 s gammaloop-nextest-python-api> python_evaluate_samples_batch_and_momentum_space_have_expected_shape
  273. 31.18 s gammaloop-nextest-python-api>
  274. 31.18 s gammaloop-nextest-python-api> test result: FAILED. 0 passed; 1 failed; 0 ignored; 0 measured; 4 filtered out; finished in 0.21s
  275. 31.18 s gammaloop-nextest-python-api>
  276. 31.18 s gammaloop-nextest-python-api> stderr ---
  277. 31.18 s gammaloop-nextest-python-api> Error: Python API test subprocess failed.
  278. 31.18 s gammaloop-nextest-python-api> stdout:
  279. 31.18 s gammaloop-nextest-python-api> ┌────────────────────────────────────────────────────────┐
  280. 31.18 s gammaloop-nextest-python-api> │ You are running a restricted Symbolica instance. │
  281. 31.18 s gammaloop-nextest-python-api> │ │
  282. 31.18 s gammaloop-nextest-python-api> │ For non-commercial use only, limited to one │
  283. 31.18 s gammaloop-nextest-python-api> │ Symbolica thread per user. │
  284. 31.18 s gammaloop-nextest-python-api> │ │
  285. 31.18 s gammaloop-nextest-python-api> ├─ Unlock all cores ─────────────────────────────────────┤
  286. 31.18 s gammaloop-nextest-python-api> │ │
  287. 31.18 s gammaloop-nextest-python-api> │ Hobbyists and students: free annual key │
  288. 31.18 s gammaloop-nextest-python-api> │ https://symbolica.io/license/#get-hobbyist-license │
  289. 31.18 s gammaloop-nextest-python-api> │ │
  290. 31.18 s gammaloop-nextest-python-api> │ Free 30-day professional trial: │
  291. 31.18 s gammaloop-nextest-python-api> │ https://symbolica.io/license/#get-trial-license │
  292. 31.18 s gammaloop-nextest-python-api> │ │
  293. 31.18 s gammaloop-nextest-python-api> └────────────────────────────────────────────────────────┘
  294. 31.18 s gammaloop-nextest-python-api> ┌──────────────────────────────────────────────────────────────────────────────────────────────────┐
  295. 31.18 s gammaloop-nextest-python-api> │ Cannot start another restricted Symbolica thread while this user's thread allowance is in use. │
  296. 31.18 s gammaloop-nextest-python-api> └──────────────────────────────────────────────────────────────────────────────────────────────────┘
  297. 31.18 s gammaloop-nextest-python-api>
  298. 31.18 s gammaloop-nextest-python-api> stderr:
  299. 31.18 s gammaloop-nextest-python-api> ┌────────────────────────────────────────────────────────┐
  300. 31.18 s gammaloop-nextest-python-api> │ The Symbolica license key format is outdated. │
  301. 31.18 s gammaloop-nextest-python-api> │ Renew your key at https://symbolica.io/license/ │
  302. 31.18 s gammaloop-nextest-python-api> └────────────────────────────────────────────────────────┘
  303. 31.18 s gammaloop-nextest-python-api> Could not acquire Symbolica thread permit: Permission denied (os error 13)
  304. 31.18 s gammaloop-nextest-python-api>
  305. 31.18 s gammaloop-nextest-python-api>
  306. 31.18 s gammaloop-nextest-python-api> Location:
  307. 31.18 s gammaloop-nextest-python-api> tests/tests/test_python_api.rs:156:20
  308. 31.18 s gammaloop-nextest-python-api>
  309. 31.18 s gammaloop-nextest-python-api> FAIL [ 0.228s] (2/5) gammaloop-integration-tests::test_python_api python_session_getters_return_live_toml_and_command_blocks
  310. 31.18 s gammaloop-nextest-python-api> stdout ---
  311. 31.18 s gammaloop-nextest-python-api>
  312. 31.18 s gammaloop-nextest-python-api> running 1 test
  313. 31.18 s gammaloop-nextest-python-api> test python_session_getters_return_live_toml_and_command_blocks ... FAILED
  314. 31.18 s gammaloop-nextest-python-api>
  315. 31.18 s gammaloop-nextest-python-api> failures:
  316. 31.18 s gammaloop-nextest-python-api>
  317. 31.18 s gammaloop-nextest-python-api> failures:
  318. 31.18 s gammaloop-nextest-python-api> python_session_getters_return_live_toml_and_command_blocks
  319. 31.18 s gammaloop-nextest-python-api>
  320. 31.18 s gammaloop-nextest-python-api> test result: FAILED. 0 passed; 1 failed; 0 ignored; 0 measured; 4 filtered out; finished in 0.22s
  321. 31.18 s gammaloop-nextest-python-api>
  322. 31.18 s gammaloop-nextest-python-api> stderr ---
  323. 31.18 s gammaloop-nextest-python-api> Error: Python API test subprocess failed.
  324. 31.18 s gammaloop-nextest-python-api> stdout:
  325. 31.18 s gammaloop-nextest-python-api> ┌────────────────────────────────────────────────────────┐
  326. 31.18 s gammaloop-nextest-python-api> │ You are running a restricted Symbolica instance. │
  327. 31.18 s gammaloop-nextest-python-api> │ │
  328. 31.18 s gammaloop-nextest-python-api> │ For non-commercial use only, limited to one │
  329. 31.18 s gammaloop-nextest-python-api> │ Symbolica thread per user. │
  330. 31.18 s gammaloop-nextest-python-api> │ │
  331. 31.18 s gammaloop-nextest-python-api> ├─ Unlock all cores ─────────────────────────────────────┤
  332. 31.18 s gammaloop-nextest-python-api> │ │
  333. 31.18 s gammaloop-nextest-python-api> │ Hobbyists and students: free annual key │
  334. 31.18 s gammaloop-nextest-python-api> │ https://symbolica.io/license/#get-hobbyist-license │
  335. 31.18 s gammaloop-nextest-python-api> │ │
  336. 31.18 s gammaloop-nextest-python-api> │ Free 30-day professional trial: │
  337. 31.18 s gammaloop-nextest-python-api> │ https://symbolica.io/license/#get-trial-license │
  338. 31.18 s gammaloop-nextest-python-api> │ │
  339. 31.18 s gammaloop-nextest-python-api> └────────────────────────────────────────────────────────┘
  340. 31.18 s gammaloop-nextest-python-api> ┌──────────────────────────────────────────────────────────────────────────────────────────────────┐
  341. 31.18 s gammaloop-nextest-python-api> │ Cannot start another restricted Symbolica thread while this user's thread allowance is in use. │
  342. 31.18 s gammaloop-nextest-python-api> └──────────────────────────────────────────────────────────────────────────────────────────────────┘
  343. 31.18 s gammaloop-nextest-python-api>
  344. 31.18 s gammaloop-nextest-python-api> stderr:
  345. 31.18 s gammaloop-nextest-python-api> ┌────────────────────────────────────────────────────────┐
  346. 31.18 s gammaloop-nextest-python-api> │ The Symbolica license key format is outdated. │
  347. 31.18 s gammaloop-nextest-python-api> │ Renew your key at https://symbolica.io/license/ │
  348. 31.18 s gammaloop-nextest-python-api> └────────────────────────────────────────────────────────┘
  349. 31.18 s gammaloop-nextest-python-api> Could not acquire Symbolica thread permit: Permission denied (os error 13)
  350. 31.18 s gammaloop-nextest-python-api>
  351. 31.18 s gammaloop-nextest-python-api>
  352. 31.18 s gammaloop-nextest-python-api> Location:
  353. 31.18 s gammaloop-nextest-python-api> tests/tests/test_python_api.rs:156:20
  354. 31.18 s gammaloop-nextest-python-api>
  355. 31.18 s gammaloop-nextest-python-api> FAIL [ 0.233s] (3/5) gammaloop-integration-tests::test_python_api python_evaluate_sample_honors_generate_events_and_observable_snapshots
  356. 31.18 s gammaloop-nextest-python-api> stdout ---
  357. 31.18 s gammaloop-nextest-python-api>
  358. 31.18 s gammaloop-nextest-python-api> running 1 test
  359. 31.18 s gammaloop-nextest-python-api> test python_evaluate_sample_honors_generate_events_and_observable_snapshots ... FAILED
  360. 31.18 s gammaloop-nextest-python-api>
  361. 31.18 s gammaloop-nextest-python-api> failures:
  362. 31.18 s gammaloop-nextest-python-api>
  363. 31.18 s gammaloop-nextest-python-api> failures:
  364. 31.18 s gammaloop-nextest-python-api> python_evaluate_sample_honors_generate_events_and_observable_snapshots
  365. 31.18 s gammaloop-nextest-python-api>
  366. 31.18 s gammaloop-nextest-python-api> test result: FAILED. 0 passed; 1 failed; 0 ignored; 0 measured; 4 filtered out; finished in 0.23s
  367. 31.18 s gammaloop-nextest-python-api>
  368. 31.18 s gammaloop-nextest-python-api> stderr ---
  369. 31.18 s gammaloop-nextest-python-api> Error: Python API test subprocess failed.
  370. 31.18 s gammaloop-nextest-python-api> stdout:
  371. 31.18 s gammaloop-nextest-python-api> ┌────────────────────────────────────────────────────────┐
  372. 31.18 s gammaloop-nextest-python-api> │ You are running a restricted Symbolica instance. │
  373. 31.18 s gammaloop-nextest-python-api> │ │
  374. 31.18 s gammaloop-nextest-python-api> │ For non-commercial use only, limited to one │
  375. 31.18 s gammaloop-nextest-python-api> │ Symbolica thread per user. │
  376. 31.18 s gammaloop-nextest-python-api> │ │
  377. 31.18 s gammaloop-nextest-python-api> ├─ Unlock all cores ─────────────────────────────────────┤
  378. 31.18 s gammaloop-nextest-python-api> │ │
  379. 31.18 s gammaloop-nextest-python-api> │ Hobbyists and students: free annual key │
  380. 31.18 s gammaloop-nextest-python-api> │ https://symbolica.io/license/#get-hobbyist-license │
  381. 31.18 s gammaloop-nextest-python-api> │ │
  382. 31.18 s gammaloop-nextest-python-api> │ Free 30-day professional trial: │
  383. 31.18 s gammaloop-nextest-python-api> │ https://symbolica.io/license/#get-trial-license │
  384. 31.18 s gammaloop-nextest-python-api> │ │
  385. 31.18 s gammaloop-nextest-python-api> └────────────────────────────────────────────────────────┘
  386. 31.18 s gammaloop-nextest-python-api> ┌──────────────────────────────────────────────────────────────────────────────────────────────────┐
  387. 31.18 s gammaloop-nextest-python-api> │ Cannot start another restricted Symbolica thread while this user's thread allowance is in use. │
  388. 31.18 s gammaloop-nextest-python-api> └──────────────────────────────────────────────────────────────────────────────────────────────────┘
  389. 31.18 s gammaloop-nextest-python-api>
  390. 31.18 s gammaloop-nextest-python-api> stderr:
  391. 31.18 s gammaloop-nextest-python-api> ┌────────────────────────────────────────────────────────┐
  392. 31.18 s gammaloop-nextest-python-api> │ The Symbolica license key format is outdated. │
  393. 31.18 s gammaloop-nextest-python-api> │ Renew your key at https://symbolica.io/license/ │
  394. 31.18 s gammaloop-nextest-python-api> └────────────────────────────────────────────────────────┘
  395. 31.18 s gammaloop-nextest-python-api> Could not acquire Symbolica thread permit: Permission denied (os error 13)
  396. 31.18 s gammaloop-nextest-python-api>
  397. 31.18 s gammaloop-nextest-python-api>
  398. 31.18 s gammaloop-nextest-python-api> Location:
  399. 31.18 s gammaloop-nextest-python-api> tests/tests/test_python_api.rs:156:20
  400. 31.18 s gammaloop-nextest-python-api>
  401. 31.18 s gammaloop-nextest-python-api> FAIL [ 0.234s] (4/5) gammaloop-integration-tests::test_python_api python_evaluate_sample_preserves_graph_grouping_and_incoming_pdgs
  402. 31.18 s gammaloop-nextest-python-api> stdout ---
  403. 31.18 s gammaloop-nextest-python-api>
  404. 31.18 s gammaloop-nextest-python-api> running 1 test
  405. 31.18 s gammaloop-nextest-python-api> test python_evaluate_sample_preserves_graph_grouping_and_incoming_pdgs ... FAILED
  406. 31.18 s gammaloop-nextest-python-api>
  407. 31.18 s gammaloop-nextest-python-api> failures:
  408. 31.18 s gammaloop-nextest-python-api>
  409. 31.18 s gammaloop-nextest-python-api> failures:
  410. 31.18 s gammaloop-nextest-python-api> python_evaluate_sample_preserves_graph_grouping_and_incoming_pdgs
  411. 31.18 s gammaloop-nextest-python-api>
  412. 31.18 s gammaloop-nextest-python-api> test result: FAILED. 0 passed; 1 failed; 0 ignored; 0 measured; 4 filtered out; finished in 0.23s
  413. 31.18 s gammaloop-nextest-python-api>
  414. 31.18 s gammaloop-nextest-python-api> stderr ---
  415. 31.18 s gammaloop-nextest-python-api> Error: Python API test subprocess failed.
  416. 31.18 s gammaloop-nextest-python-api> stdout:
  417. 31.18 s gammaloop-nextest-python-api> ┌────────────────────────────────────────────────────────┐
  418. 31.18 s gammaloop-nextest-python-api> │ You are running a restricted Symbolica instance. │
  419. 31.18 s gammaloop-nextest-python-api> │ │
  420. 31.18 s gammaloop-nextest-python-api> │ For non-commercial use only, limited to one │
  421. 31.18 s gammaloop-nextest-python-api> │ Symbolica thread per user. │
  422. 31.18 s gammaloop-nextest-python-api> │ │
  423. 31.18 s gammaloop-nextest-python-api> ├─ Unlock all cores ─────────────────────────────────────┤
  424. 31.18 s gammaloop-nextest-python-api> │ │
  425. 31.18 s gammaloop-nextest-python-api> │ Hobbyists and students: free annual key │
  426. 31.18 s gammaloop-nextest-python-api> │ https://symbolica.io/license/#get-hobbyist-license │
  427. 31.18 s gammaloop-nextest-python-api> │ │
  428. 31.18 s gammaloop-nextest-python-api> │ Free 30-day professional trial: │
  429. 31.18 s gammaloop-nextest-python-api> │ https://symbolica.io/license/#get-trial-license │
  430. 31.18 s gammaloop-nextest-python-api> │ │
  431. 31.18 s gammaloop-nextest-python-api> └────────────────────────────────────────────────────────┘
  432. 31.18 s gammaloop-nextest-python-api> ┌──────────────────────────────────────────────────────────────────────────────────────────────────┐
  433. 31.18 s gammaloop-nextest-python-api> │ Cannot start another restricted Symbolica thread while this user's thread allowance is in use. │
  434. 31.18 s gammaloop-nextest-python-api> └──────────────────────────────────────────────────────────────────────────────────────────────────┘
  435. 31.18 s gammaloop-nextest-python-api>
  436. 31.18 s gammaloop-nextest-python-api> stderr:
  437. 31.18 s gammaloop-nextest-python-api> ┌────────────────────────────────────────────────────────┐
  438. 31.18 s gammaloop-nextest-python-api> │ The Symbolica license key format is outdated. │
  439. 31.18 s gammaloop-nextest-python-api> │ Renew your key at https://symbolica.io/license/ │
  440. 31.18 s gammaloop-nextest-python-api> └────────────────────────────────────────────────────────┘
  441. 31.18 s gammaloop-nextest-python-api> Could not acquire Symbolica thread permit: Permission denied (os error 13)
  442. 31.18 s gammaloop-nextest-python-api>
  443. 31.18 s gammaloop-nextest-python-api>
  444. 31.18 s gammaloop-nextest-python-api> Location:
  445. 31.18 s gammaloop-nextest-python-api> tests/tests/test_python_api.rs:156:20
  446. 31.18 s gammaloop-nextest-python-api>
  447. 31.18 s gammaloop-nextest-python-api> FAIL [ 0.235s] (5/5) gammaloop-integration-tests::test_python_api python_settings_wrappers_expose_nested_runtime_and_global_settings
  448. 31.18 s gammaloop-nextest-python-api> stdout ---
  449. 31.18 s gammaloop-nextest-python-api>
  450. 31.18 s gammaloop-nextest-python-api> running 1 test
  451. 31.18 s gammaloop-nextest-python-api> test python_settings_wrappers_expose_nested_runtime_and_global_settings ... FAILED
  452. 31.18 s gammaloop-nextest-python-api>
  453. 31.18 s gammaloop-nextest-python-api> failures:
  454. 31.18 s gammaloop-nextest-python-api>
  455. 31.18 s gammaloop-nextest-python-api> failures:
  456. 31.19 s gammaloop-nextest-python-api> python_settings_wrappers_expose_nested_runtime_and_global_settings
  457. 31.19 s gammaloop-nextest-python-api>
  458. 31.19 s gammaloop-nextest-python-api> test result: FAILED. 0 passed; 1 failed; 0 ignored; 0 measured; 4 filtered out; finished in 0.23s
  459. 31.19 s gammaloop-nextest-python-api>
  460. 31.19 s gammaloop-nextest-python-api> stderr ---
  461. 31.19 s gammaloop-nextest-python-api> Error: Python API test subprocess failed.
  462. 31.19 s gammaloop-nextest-python-api> stdout:
  463. 31.19 s gammaloop-nextest-python-api> ┌────────────────────────────────────────────────────────┐
  464. 31.19 s gammaloop-nextest-python-api> │ You are running a restricted Symbolica instance. │
  465. 31.19 s gammaloop-nextest-python-api> │ │
  466. 31.19 s gammaloop-nextest-python-api> │ For non-commercial use only, limited to one │
  467. 31.19 s gammaloop-nextest-python-api> │ Symbolica thread per user. │
  468. 31.19 s gammaloop-nextest-python-api> │ │
  469. 31.19 s gammaloop-nextest-python-api> ├─ Unlock all cores ─────────────────────────────────────┤
  470. 31.19 s gammaloop-nextest-python-api> │ │
  471. 31.19 s gammaloop-nextest-python-api> │ Hobbyists and students: free annual key │
  472. 31.19 s gammaloop-nextest-python-api> │ https://symbolica.io/license/#get-hobbyist-license │
  473. 31.19 s gammaloop-nextest-python-api> │ │
  474. 31.19 s gammaloop-nextest-python-api> │ Free 30-day professional trial: │
  475. 31.19 s gammaloop-nextest-python-api> │ https://symbolica.io/license/#get-trial-license │
  476. 31.19 s gammaloop-nextest-python-api> │ │
  477. 31.19 s gammaloop-nextest-python-api> └────────────────────────────────────────────────────────┘
  478. 31.19 s gammaloop-nextest-python-api> ┌──────────────────────────────────────────────────────────────────────────────────────────────────┐
  479. 31.19 s gammaloop-nextest-python-api> │ Cannot start another restricted Symbolica thread while this user's thread allowance is in use. │
  480. 31.19 s gammaloop-nextest-python-api> └──────────────────────────────────────────────────────────────────────────────────────────────────┘
  481. 31.19 s gammaloop-nextest-python-api>
  482. 31.19 s gammaloop-nextest-python-api> stderr:
  483. 31.19 s gammaloop-nextest-python-api> ┌────────────────────────────────────────────────────────┐
  484. 31.19 s gammaloop-nextest-python-api> │ The Symbolica license key format is outdated. │
  485. 31.19 s gammaloop-nextest-python-api> │ Renew your key at https://symbolica.io/license/ │
  486. 31.19 s gammaloop-nextest-python-api> └────────────────────────────────────────────────────────┘
  487. 31.19 s gammaloop-nextest-python-api> Could not acquire Symbolica thread permit: Permission denied (os error 13)
  488. 31.19 s gammaloop-nextest-python-api>
  489. 31.19 s gammaloop-nextest-python-api>
  490. 31.19 s gammaloop-nextest-python-api> Location:
  491. 31.19 s gammaloop-nextest-python-api> tests/tests/test_python_api.rs:156:20
  492. 31.19 s gammaloop-nextest-python-api>
  493. 31.19 s gammaloop-nextest-python-api> error: test run failed
  494. 31.23 s gammaloop-nextest-python-api>
  495. 31.23 s gammaloop-nextest-python-api> ========== nextest test summary ==========
  496. 31.23 s gammaloop-nextest-python-api> report: target/nextest/ci_gammaloop/junit.xml
  497. 31.23 s gammaloop-nextest-python-api> tests: 5, failures: 5, errors: 0
  498. 31.23 s gammaloop-nextest-python-api>
  499. 31.23 s gammaloop-nextest-python-api> 1. gammaloop-integration-tests::test_python_api::python_evaluate_samples_batch_and_momentum_space_have_expected_shape
  500. 31.23 s gammaloop-nextest-python-api> failure: test failure with exit code 101
  501. 31.23 s gammaloop-nextest-python-api> Error: Python API test subprocess failed.
  502. 31.23 s gammaloop-nextest-python-api> stdout:
  503. 31.23 s gammaloop-nextest-python-api> ┌────────────────────────────────────────────────────────┐
  504. 31.23 s gammaloop-nextest-python-api> │ You are running a restricted Symbolica instance. │
  505. 31.23 s gammaloop-nextest-python-api> │ │
  506. 31.23 s gammaloop-nextest-python-api> │ For non-commercial use only, limited to one │
  507. 31.23 s gammaloop-nextest-python-api> │ Symbolica thread per user. │
  508. 31.23 s gammaloop-nextest-python-api> │ │
  509. 31.23 s gammaloop-nextest-python-api> ├─ Unlock all cores ─────────────────────────────────────┤
  510. 31.23 s gammaloop-nextest-python-api> │ │
  511. 31.23 s gammaloop-nextest-python-api> │ Hobbyists and students: free annual key │
  512. 31.23 s gammaloop-nextest-python-api> │ https://symbolica.io/license/#get-hobbyist-license │
  513. 31.23 s gammaloop-nextest-python-api> │ │
  514. 31.23 s gammaloop-nextest-python-api> │ Free 30-day professional trial: │
  515. 31.23 s gammaloop-nextest-python-api> │ https://symbolica.io/license/#get-trial-license │
  516. 31.23 s gammaloop-nextest-python-api> │ │
  517. 31.23 s gammaloop-nextest-python-api> └────────────────────────────────────────────────────────┘
  518. 31.23 s gammaloop-nextest-python-api> ┌──────────────────────────────────────────────────────────────────────────────────────────────────┐
  519. 31.23 s gammaloop-nextest-python-api> │ Cannot start another restricted Symbolica thread while this user's thread allowance is in use. │
  520. 31.23 s gammaloop-nextest-python-api> └──────────────────────────────────────────────────────────────────────────────────────────────────┘
  521. 31.23 s gammaloop-nextest-python-api>
  522. 31.23 s gammaloop-nextest-python-api> stderr:
  523. 31.23 s gammaloop-nextest-python-api> ┌────────────────────────────────────────────────────────┐
  524. 31.23 s gammaloop-nextest-python-api> │ The Symbolica license key format is outdated. │
  525. 31.23 s gammaloop-nextest-python-api> │ Renew your key at https://symbolica.io/license/ │
  526. 31.23 s gammaloop-nextest-python-api> └────────────────────────────────────────────────────────┘
  527. 31.23 s gammaloop-nextest-python-api> Could not acquire Symbolica thread permit: Permission denied (os error 13)
  528. 31.23 s gammaloop-nextest-python-api>
  529. 31.23 s gammaloop-nextest-python-api>
  530. 31.23 s gammaloop-nextest-python-api> Location:
  531. 31.23 s gammaloop-nextest-python-api> tests/tests/test_python_api.rs:156:20
  532. 31.23 s gammaloop-nextest-python-api> system-out
  533. 31.23 s gammaloop-nextest-python-api> running 1 test
  534. 31.23 s gammaloop-nextest-python-api> test python_evaluate_samples_batch_and_momentum_space_have_expected_shape ... FAILED
  535. 31.23 s gammaloop-nextest-python-api>
  536. 31.23 s gammaloop-nextest-python-api> failures:
  537. 31.23 s gammaloop-nextest-python-api>
  538. 31.23 s gammaloop-nextest-python-api> failures:
  539. 31.23 s gammaloop-nextest-python-api> python_evaluate_samples_batch_and_momentum_space_have_expected_shape
  540. 31.23 s gammaloop-nextest-python-api>
  541. 31.23 s gammaloop-nextest-python-api> test result: FAILED. 0 passed; 1 failed; 0 ignored; 0 measured; 4 filtered out; finished in 0.21s
  542. 31.23 s gammaloop-nextest-python-api> system-err
  543. 31.23 s gammaloop-nextest-python-api> Error: Python API test subprocess failed.
  544. 31.23 s gammaloop-nextest-python-api> stdout:
  545. 31.23 s gammaloop-nextest-python-api> ┌────────────────────────────────────────────────────────┐
  546. 31.23 s gammaloop-nextest-python-api> │ You are running a restricted Symbolica instance. │
  547. 31.23 s gammaloop-nextest-python-api> │ │
  548. 31.23 s gammaloop-nextest-python-api> │ For non-commercial use only, limited to one │
  549. 31.23 s gammaloop-nextest-python-api> │ Symbolica thread per user. │
  550. 31.23 s gammaloop-nextest-python-api> │ │
  551. 31.23 s gammaloop-nextest-python-api> ├─ Unlock all cores ─────────────────────────────────────┤
  552. 31.23 s gammaloop-nextest-python-api> │ │
  553. 31.23 s gammaloop-nextest-python-api> │ Hobbyists and students: free annual key │
  554. 31.23 s gammaloop-nextest-python-api> │ https://symbolica.io/license/#get-hobbyist-license │
  555. 31.23 s gammaloop-nextest-python-api> │ │
  556. 31.23 s gammaloop-nextest-python-api> │ Free 30-day professional trial: │
  557. 31.23 s gammaloop-nextest-python-api> │ https://symbolica.io/license/#get-trial-license │
  558. 31.23 s gammaloop-nextest-python-api> │ │
  559. 31.23 s gammaloop-nextest-python-api> └────────────────────────────────────────────────────────┘
  560. 31.23 s gammaloop-nextest-python-api> ┌──────────────────────────────────────────────────────────────────────────────────────────────────┐
  561. 31.23 s gammaloop-nextest-python-api> │ Cannot start another restricted Symbolica thread while this user's thread allowance is in use. │
  562. 31.23 s gammaloop-nextest-python-api> └──────────────────────────────────────────────────────────────────────────────────────────────────┘
  563. 31.23 s gammaloop-nextest-python-api>
  564. 31.23 s gammaloop-nextest-python-api> stderr:
  565. 31.23 s gammaloop-nextest-python-api> ┌────────────────────────────────────────────────────────┐
  566. 31.23 s gammaloop-nextest-python-api> │ The Symbolica license key format is outdated. │
  567. 31.23 s gammaloop-nextest-python-api> │ Renew your key at https://symbolica.io/license/ │
  568. 31.23 s gammaloop-nextest-python-api> └────────────────────────────────────────────────────────┘
  569. 31.23 s gammaloop-nextest-python-api> Could not acquire Symbolica thread permit: Permission denied (os error 13)
  570. 31.23 s gammaloop-nextest-python-api>
  571. 31.23 s gammaloop-nextest-python-api>
  572. 31.23 s gammaloop-nextest-python-api> Location:
  573. 31.23 s gammaloop-nextest-python-api> tests/tests/test_python_api.rs:156:20
  574. 31.23 s gammaloop-nextest-python-api>
  575. 31.23 s gammaloop-nextest-python-api> 2. gammaloop-integration-tests::test_python_api::python_session_getters_return_live_toml_and_command_blocks
  576. 31.23 s gammaloop-nextest-python-api> failure: test failure with exit code 101
  577. 31.23 s gammaloop-nextest-python-api> Error: Python API test subprocess failed.
  578. 31.23 s gammaloop-nextest-python-api> stdout:
  579. 31.23 s gammaloop-nextest-python-api> ┌────────────────────────────────────────────────────────┐
  580. 31.23 s gammaloop-nextest-python-api> │ You are running a restricted Symbolica instance. │
  581. 31.23 s gammaloop-nextest-python-api> │ │
  582. 31.23 s gammaloop-nextest-python-api> │ For non-commercial use only, limited to one │
  583. 31.23 s gammaloop-nextest-python-api> │ Symbolica thread per user. │
  584. 31.23 s gammaloop-nextest-python-api> │ │
  585. 31.23 s gammaloop-nextest-python-api> ├─ Unlock all cores ─────────────────────────────────────┤
  586. 31.23 s gammaloop-nextest-python-api> │ │
  587. 31.23 s gammaloop-nextest-python-api> │ Hobbyists and students: free annual key │
  588. 31.23 s gammaloop-nextest-python-api> │ https://symbolica.io/license/#get-hobbyist-license │
  589. 31.23 s gammaloop-nextest-python-api> │ │
  590. 31.23 s gammaloop-nextest-python-api> │ Free 30-day professional trial: │
  591. 31.23 s gammaloop-nextest-python-api> │ https://symbolica.io/license/#get-trial-license │
  592. 31.23 s gammaloop-nextest-python-api> │ │
  593. 31.23 s gammaloop-nextest-python-api> └────────────────────────────────────────────────────────┘
  594. 31.23 s gammaloop-nextest-python-api> ┌──────────────────────────────────────────────────────────────────────────────────────────────────┐
  595. 31.23 s gammaloop-nextest-python-api> │ Cannot start another restricted Symbolica thread while this user's thread allowance is in use. │
  596. 31.23 s gammaloop-nextest-python-api> └──────────────────────────────────────────────────────────────────────────────────────────────────┘
  597. 31.23 s gammaloop-nextest-python-api>
  598. 31.23 s gammaloop-nextest-python-api> stderr:
  599. 31.23 s gammaloop-nextest-python-api> ┌────────────────────────────────────────────────────────┐
  600. 31.23 s gammaloop-nextest-python-api> │ The Symbolica license key format is outdated. │
  601. 31.23 s gammaloop-nextest-python-api> │ Renew your key at https://symbolica.io/license/ │
  602. 31.23 s gammaloop-nextest-python-api> └────────────────────────────────────────────────────────┘
  603. 31.23 s gammaloop-nextest-python-api> Could not acquire Symbolica thread permit: Permission denied (os error 13)
  604. 31.23 s gammaloop-nextest-python-api>
  605. 31.23 s gammaloop-nextest-python-api>
  606. 31.23 s gammaloop-nextest-python-api> Location:
  607. 31.23 s gammaloop-nextest-python-api> tests/tests/test_python_api.rs:156:20
  608. 31.23 s gammaloop-nextest-python-api> system-out
  609. 31.23 s gammaloop-nextest-python-api> running 1 test
  610. 31.23 s gammaloop-nextest-python-api> test python_session_getters_return_live_toml_and_command_blocks ... FAILED
  611. 31.23 s gammaloop-nextest-python-api>
  612. 31.23 s gammaloop-nextest-python-api> failures:
  613. 31.23 s gammaloop-nextest-python-api>
  614. 31.23 s gammaloop-nextest-python-api> failures:
  615. 31.23 s gammaloop-nextest-python-api> python_session_getters_return_live_toml_and_command_blocks
  616. 31.23 s gammaloop-nextest-python-api>
  617. 31.23 s gammaloop-nextest-python-api> test result: FAILED. 0 passed; 1 failed; 0 ignored; 0 measured; 4 filtered out; finished in 0.22s
  618. 31.23 s gammaloop-nextest-python-api> system-err
  619. 31.23 s gammaloop-nextest-python-api> Error: Python API test subprocess failed.
  620. 31.23 s gammaloop-nextest-python-api> stdout:
  621. 31.23 s gammaloop-nextest-python-api> ┌────────────────────────────────────────────────────────┐
  622. 31.23 s gammaloop-nextest-python-api> │ You are running a restricted Symbolica instance. │
  623. 31.23 s gammaloop-nextest-python-api> │ │
  624. 31.23 s gammaloop-nextest-python-api> │ For non-commercial use only, limited to one │
  625. 31.23 s gammaloop-nextest-python-api> │ Symbolica thread per user. │
  626. 31.23 s gammaloop-nextest-python-api> │ │
  627. 31.23 s gammaloop-nextest-python-api> ├─ Unlock all cores ─────────────────────────────────────┤
  628. 31.23 s gammaloop-nextest-python-api> │ │
  629. 31.23 s gammaloop-nextest-python-api> │ Hobbyists and students: free annual key │
  630. 31.23 s gammaloop-nextest-python-api> │ https://symbolica.io/license/#get-hobbyist-license │
  631. 31.23 s gammaloop-nextest-python-api> │ │
  632. 31.23 s gammaloop-nextest-python-api> │ Free 30-day professional trial: │
  633. 31.23 s gammaloop-nextest-python-api> │ https://symbolica.io/license/#get-trial-license │
  634. 31.23 s gammaloop-nextest-python-api> │ │
  635. 31.23 s gammaloop-nextest-python-api> └────────────────────────────────────────────────────────┘
  636. 31.23 s gammaloop-nextest-python-api> ┌──────────────────────────────────────────────────────────────────────────────────────────────────┐
  637. 31.23 s gammaloop-nextest-python-api> │ Cannot start another restricted Symbolica thread while this user's thread allowance is in use. │
  638. 31.23 s gammaloop-nextest-python-api> └──────────────────────────────────────────────────────────────────────────────────────────────────┘
  639. 31.23 s gammaloop-nextest-python-api>
  640. 31.23 s gammaloop-nextest-python-api> stderr:
  641. 31.23 s gammaloop-nextest-python-api> ┌────────────────────────────────────────────────────────┐
  642. 31.23 s gammaloop-nextest-python-api> │ The Symbolica license key format is outdated. │
  643. 31.23 s gammaloop-nextest-python-api> │ Renew your key at https://symbolica.io/license/ │
  644. 31.23 s gammaloop-nextest-python-api> └────────────────────────────────────────────────────────┘
  645. 31.23 s gammaloop-nextest-python-api> Could not acquire Symbolica thread permit: Permission denied (os error 13)
  646. 31.23 s gammaloop-nextest-python-api>
  647. 31.23 s gammaloop-nextest-python-api>
  648. 31.23 s gammaloop-nextest-python-api> Location:
  649. 31.23 s gammaloop-nextest-python-api> tests/tests/test_python_api.rs:156:20
  650. 31.23 s gammaloop-nextest-python-api>
  651. 31.23 s gammaloop-nextest-python-api> 3. gammaloop-integration-tests::test_python_api::python_evaluate_sample_honors_generate_events_and_observable_snapshots
  652. 31.23 s gammaloop-nextest-python-api> failure: test failure with exit code 101
  653. 31.23 s gammaloop-nextest-python-api> Error: Python API test subprocess failed.
  654. 31.23 s gammaloop-nextest-python-api> stdout:
  655. 31.23 s gammaloop-nextest-python-api> ┌────────────────────────────────────────────────────────┐
  656. 31.23 s gammaloop-nextest-python-api> │ You are running a restricted Symbolica instance. │
  657. 31.23 s gammaloop-nextest-python-api> │ │
  658. 31.23 s gammaloop-nextest-python-api> │ For non-commercial use only, limited to one │
  659. 31.23 s gammaloop-nextest-python-api> │ Symbolica thread per user. │
  660. 31.23 s gammaloop-nextest-python-api> │ │
  661. 31.23 s gammaloop-nextest-python-api> ├─ Unlock all cores ─────────────────────────────────────┤
  662. 31.23 s gammaloop-nextest-python-api> │ │
  663. 31.23 s gammaloop-nextest-python-api> │ Hobbyists and students: free annual key │
  664. 31.23 s gammaloop-nextest-python-api> │ https://symbolica.io/license/#get-hobbyist-license │
  665. 31.23 s gammaloop-nextest-python-api> │ │
  666. 31.23 s gammaloop-nextest-python-api> │ Free 30-day professional trial: │
  667. 31.23 s gammaloop-nextest-python-api> │ https://symbolica.io/license/#get-trial-license │
  668. 31.23 s gammaloop-nextest-python-api> │ │
  669. 31.23 s gammaloop-nextest-python-api> └────────────────────────────────────────────────────────┘
  670. 31.23 s gammaloop-nextest-python-api> ┌──────────────────────────────────────────────────────────────────────────────────────────────────┐
  671. 31.23 s gammaloop-nextest-python-api> │ Cannot start another restricted Symbolica thread while this user's thread allowance is in use. │
  672. 31.23 s gammaloop-nextest-python-api> └──────────────────────────────────────────────────────────────────────────────────────────────────┘
  673. 31.23 s gammaloop-nextest-python-api>
  674. 31.23 s gammaloop-nextest-python-api> stderr:
  675. 31.23 s gammaloop-nextest-python-api> ┌────────────────────────────────────────────────────────┐
  676. 31.23 s gammaloop-nextest-python-api> │ The Symbolica license key format is outdated. │
  677. 31.23 s gammaloop-nextest-python-api> │ Renew your key at https://symbolica.io/license/ │
  678. 31.23 s gammaloop-nextest-python-api> └────────────────────────────────────────────────────────┘
  679. 31.23 s gammaloop-nextest-python-api> Could not acquire Symbolica thread permit: Permission denied (os error 13)
  680. 31.23 s gammaloop-nextest-python-api>
  681. 31.23 s gammaloop-nextest-python-api>
  682. 31.23 s gammaloop-nextest-python-api> Location:
  683. 31.23 s gammaloop-nextest-python-api> tests/tests/test_python_api.rs:156:20
  684. 31.23 s gammaloop-nextest-python-api> system-out
  685. 31.23 s gammaloop-nextest-python-api> running 1 test
  686. 31.23 s gammaloop-nextest-python-api> test python_evaluate_sample_honors_generate_events_and_observable_snapshots ... FAILED
  687. 31.23 s gammaloop-nextest-python-api>
  688. 31.23 s gammaloop-nextest-python-api> failures:
  689. 31.23 s gammaloop-nextest-python-api>
  690. 31.23 s gammaloop-nextest-python-api> failures:
  691. 31.23 s gammaloop-nextest-python-api> python_evaluate_sample_honors_generate_events_and_observable_snapshots
  692. 31.23 s gammaloop-nextest-python-api>
  693. 31.23 s gammaloop-nextest-python-api> test result: FAILED. 0 passed; 1 failed; 0 ignored; 0 measured; 4 filtered out; finished in 0.23s
  694. 31.23 s gammaloop-nextest-python-api> system-err
  695. 31.23 s gammaloop-nextest-python-api> Error: Python API test subprocess failed.
  696. 31.23 s gammaloop-nextest-python-api> stdout:
  697. 31.23 s gammaloop-nextest-python-api> ┌────────────────────────────────────────────────────────┐
  698. 31.23 s gammaloop-nextest-python-api> │ You are running a restricted Symbolica instance. │
  699. 31.23 s gammaloop-nextest-python-api> │ │
  700. 31.23 s gammaloop-nextest-python-api> │ For non-commercial use only, limited to one │
  701. 31.23 s gammaloop-nextest-python-api> │ Symbolica thread per user. │
  702. 31.23 s gammaloop-nextest-python-api> │ │
  703. 31.23 s gammaloop-nextest-python-api> ├─ Unlock all cores ─────────────────────────────────────┤
  704. 31.23 s gammaloop-nextest-python-api> │ │
  705. 31.23 s gammaloop-nextest-python-api> │ Hobbyists and students: free annual key │
  706. 31.23 s gammaloop-nextest-python-api> │ https://symbolica.io/license/#get-hobbyist-license │
  707. 31.23 s gammaloop-nextest-python-api> │ │
  708. 31.23 s gammaloop-nextest-python-api> │ Free 30-day professional trial: │
  709. 31.23 s gammaloop-nextest-python-api> │ https://symbolica.io/license/#get-trial-license │
  710. 31.23 s gammaloop-nextest-python-api> │ │
  711. 31.23 s gammaloop-nextest-python-api> └────────────────────────────────────────────────────────┘
  712. 31.23 s gammaloop-nextest-python-api> ┌──────────────────────────────────────────────────────────────────────────────────────────────────┐
  713. 31.23 s gammaloop-nextest-python-api> │ Cannot start another restricted Symbolica thread while this user's thread allowance is in use. │
  714. 31.23 s gammaloop-nextest-python-api> └──────────────────────────────────────────────────────────────────────────────────────────────────┘
  715. 31.23 s gammaloop-nextest-python-api>
  716. 31.23 s gammaloop-nextest-python-api> stderr:
  717. 31.23 s gammaloop-nextest-python-api> ┌────────────────────────────────────────────────────────┐
  718. 31.23 s gammaloop-nextest-python-api> │ The Symbolica license key format is outdated. │
  719. 31.23 s gammaloop-nextest-python-api> │ Renew your key at https://symbolica.io/license/ │
  720. 31.23 s gammaloop-nextest-python-api> └────────────────────────────────────────────────────────┘
  721. 31.23 s gammaloop-nextest-python-api> Could not acquire Symbolica thread permit: Permission denied (os error 13)
  722. 31.23 s gammaloop-nextest-python-api>
  723. 31.23 s gammaloop-nextest-python-api>
  724. 31.23 s gammaloop-nextest-python-api> Location:
  725. 31.23 s gammaloop-nextest-python-api> tests/tests/test_python_api.rs:156:20
  726. 31.23 s gammaloop-nextest-python-api>
  727. 31.23 s gammaloop-nextest-python-api> 4. gammaloop-integration-tests::test_python_api::python_evaluate_sample_preserves_graph_grouping_and_incoming_pdgs
  728. 31.23 s gammaloop-nextest-python-api> failure: test failure with exit code 101
  729. 31.23 s gammaloop-nextest-python-api> Error: Python API test subprocess failed.
  730. 31.23 s gammaloop-nextest-python-api> stdout:
  731. 31.23 s gammaloop-nextest-python-api> ┌────────────────────────────────────────────────────────┐
  732. 31.23 s gammaloop-nextest-python-api> │ You are running a restricted Symbolica instance. │
  733. 31.23 s gammaloop-nextest-python-api> │ │
  734. 31.23 s gammaloop-nextest-python-api> │ For non-commercial use only, limited to one │
  735. 31.23 s gammaloop-nextest-python-api> │ Symbolica thread per user. │
  736. 31.23 s gammaloop-nextest-python-api> │ │
  737. 31.23 s gammaloop-nextest-python-api> ├─ Unlock all cores ─────────────────────────────────────┤
  738. 31.23 s gammaloop-nextest-python-api> │ │
  739. 31.23 s gammaloop-nextest-python-api> │ Hobbyists and students: free annual key │
  740. 31.23 s gammaloop-nextest-python-api> │ https://symbolica.io/license/#get-hobbyist-license │
  741. 31.23 s gammaloop-nextest-python-api> │ │
  742. 31.23 s gammaloop-nextest-python-api> │ Free 30-day professional trial: │
  743. 31.23 s gammaloop-nextest-python-api> │ https://symbolica.io/license/#get-trial-license │
  744. 31.23 s gammaloop-nextest-python-api> │ │
  745. 31.23 s gammaloop-nextest-python-api> └────────────────────────────────────────────────────────┘
  746. 31.23 s gammaloop-nextest-python-api> ┌──────────────────────────────────────────────────────────────────────────────────────────────────┐
  747. 31.23 s gammaloop-nextest-python-api> │ Cannot start another restricted Symbolica thread while this user's thread allowance is in use. │
  748. 31.23 s gammaloop-nextest-python-api> └──────────────────────────────────────────────────────────────────────────────────────────────────┘
  749. 31.23 s gammaloop-nextest-python-api>
  750. 31.23 s gammaloop-nextest-python-api> stderr:
  751. 31.23 s gammaloop-nextest-python-api> ┌────────────────────────────────────────────────────────┐
  752. 31.23 s gammaloop-nextest-python-api> │ The Symbolica license key format is outdated. │
  753. 31.23 s gammaloop-nextest-python-api> │ Renew your key at https://symbolica.io/license/ │
  754. 31.23 s gammaloop-nextest-python-api> └────────────────────────────────────────────────────────┘
  755. 31.23 s gammaloop-nextest-python-api> Could not acquire Symbolica thread permit: Permission denied (os error 13)
  756. 31.23 s gammaloop-nextest-python-api>
  757. 31.23 s gammaloop-nextest-python-api>
  758. 31.23 s gammaloop-nextest-python-api> Location:
  759. 31.23 s gammaloop-nextest-python-api> tests/tests/test_python_api.rs:156:20
  760. 31.23 s gammaloop-nextest-python-api> system-out
  761. 31.23 s gammaloop-nextest-python-api> running 1 test
  762. 31.23 s gammaloop-nextest-python-api> test python_evaluate_sample_preserves_graph_grouping_and_incoming_pdgs ... FAILED
  763. 31.23 s gammaloop-nextest-python-api>
  764. 31.23 s gammaloop-nextest-python-api> failures:
  765. 31.23 s gammaloop-nextest-python-api>
  766. 31.23 s gammaloop-nextest-python-api> failures:
  767. 31.23 s gammaloop-nextest-python-api> python_evaluate_sample_preserves_graph_grouping_and_incoming_pdgs
  768. 31.23 s gammaloop-nextest-python-api>
  769. 31.23 s gammaloop-nextest-python-api> test result: FAILED. 0 passed; 1 failed; 0 ignored; 0 measured; 4 filtered out; finished in 0.23s
  770. 31.23 s gammaloop-nextest-python-api> system-err
  771. 31.23 s gammaloop-nextest-python-api> Error: Python API test subprocess failed.
  772. 31.23 s gammaloop-nextest-python-api> stdout:
  773. 31.23 s gammaloop-nextest-python-api> ┌────────────────────────────────────────────────────────┐
  774. 31.23 s gammaloop-nextest-python-api> │ You are running a restricted Symbolica instance. │
  775. 31.23 s gammaloop-nextest-python-api> │ │
  776. 31.23 s gammaloop-nextest-python-api> │ For non-commercial use only, limited to one │
  777. 31.23 s gammaloop-nextest-python-api> │ Symbolica thread per user. │
  778. 31.23 s gammaloop-nextest-python-api> │ │
  779. 31.23 s gammaloop-nextest-python-api> ├─ Unlock all cores ─────────────────────────────────────┤
  780. 31.23 s gammaloop-nextest-python-api> │ │
  781. 31.23 s gammaloop-nextest-python-api> │ Hobbyists and students: free annual key │
  782. 31.23 s gammaloop-nextest-python-api> │ https://symbolica.io/license/#get-hobbyist-license │
  783. 31.23 s gammaloop-nextest-python-api> │ │
  784. 31.23 s gammaloop-nextest-python-api> │ Free 30-day professional trial: │
  785. 31.23 s gammaloop-nextest-python-api> │ https://symbolica.io/license/#get-trial-license │
  786. 31.23 s gammaloop-nextest-python-api> │ │
  787. 31.23 s gammaloop-nextest-python-api> └────────────────────────────────────────────────────────┘
  788. 31.23 s gammaloop-nextest-python-api> ┌──────────────────────────────────────────────────────────────────────────────────────────────────┐
  789. 31.23 s gammaloop-nextest-python-api> │ Cannot start another restricted Symbolica thread while this user's thread allowance is in use. │
  790. 31.23 s gammaloop-nextest-python-api> └──────────────────────────────────────────────────────────────────────────────────────────────────┘
  791. 31.23 s gammaloop-nextest-python-api>
  792. 31.23 s gammaloop-nextest-python-api> stderr:
  793. 31.23 s gammaloop-nextest-python-api> ┌────────────────────────────────────────────────────────┐
  794. 31.23 s gammaloop-nextest-python-api> │ The Symbolica license key format is outdated. │
  795. 31.23 s gammaloop-nextest-python-api> │ Renew your key at https://symbolica.io/license/ │
  796. 31.23 s gammaloop-nextest-python-api> └────────────────────────────────────────────────────────┘
  797. 31.23 s gammaloop-nextest-python-api> Could not acquire Symbolica thread permit: Permission denied (os error 13)
  798. 31.23 s gammaloop-nextest-python-api>
  799. 31.23 s gammaloop-nextest-python-api>
  800. 31.23 s gammaloop-nextest-python-api> Location:
  801. 31.23 s gammaloop-nextest-python-api> tests/tests/test_python_api.rs:156:20
  802. 31.23 s gammaloop-nextest-python-api>
  803. 31.23 s gammaloop-nextest-python-api> 5. gammaloop-integration-tests::test_python_api::python_settings_wrappers_expose_nested_runtime_and_global_settings
  804. 31.23 s gammaloop-nextest-python-api> failure: test failure with exit code 101
  805. 31.23 s gammaloop-nextest-python-api> Error: Python API test subprocess failed.
  806. 31.23 s gammaloop-nextest-python-api> stdout:
  807. 31.23 s gammaloop-nextest-python-api> ┌────────────────────────────────────────────────────────┐
  808. 31.23 s gammaloop-nextest-python-api> │ You are running a restricted Symbolica instance. │
  809. 31.23 s gammaloop-nextest-python-api> │ │
  810. 31.23 s gammaloop-nextest-python-api> │ For non-commercial use only, limited to one │
  811. 31.23 s gammaloop-nextest-python-api> │ Symbolica thread per user. │
  812. 31.23 s gammaloop-nextest-python-api> │ │
  813. 31.23 s gammaloop-nextest-python-api> ├─ Unlock all cores ─────────────────────────────────────┤
  814. 31.23 s gammaloop-nextest-python-api> │ │
  815. 31.23 s gammaloop-nextest-python-api> │ Hobbyists and students: free annual key │
  816. 31.23 s gammaloop-nextest-python-api> │ https://symbolica.io/license/#get-hobbyist-license │
  817. 31.23 s gammaloop-nextest-python-api> │ │
  818. 31.23 s gammaloop-nextest-python-api> │ Free 30-day professional trial: │
  819. 31.23 s gammaloop-nextest-python-api> │ https://symbolica.io/license/#get-trial-license │
  820. 31.23 s gammaloop-nextest-python-api> │ │
  821. 31.23 s gammaloop-nextest-python-api> └────────────────────────────────────────────────────────┘
  822. 31.23 s gammaloop-nextest-python-api> ┌──────────────────────────────────────────────────────────────────────────────────────────────────┐
  823. 31.23 s gammaloop-nextest-python-api> │ Cannot start another restricted Symbolica thread while this user's thread allowance is in use. │
  824. 31.23 s gammaloop-nextest-python-api> └──────────────────────────────────────────────────────────────────────────────────────────────────┘
  825. 31.23 s gammaloop-nextest-python-api>
  826. 31.23 s gammaloop-nextest-python-api> stderr:
  827. 31.23 s gammaloop-nextest-python-api> ┌────────────────────────────────────────────────────────┐
  828. 31.23 s gammaloop-nextest-python-api> │ The Symbolica license key format is outdated. │
  829. 31.23 s gammaloop-nextest-python-api> │ Renew your key at https://symbolica.io/license/ │
  830. 31.23 s gammaloop-nextest-python-api> └────────────────────────────────────────────────────────┘
  831. 31.23 s gammaloop-nextest-python-api> Could not acquire Symbolica thread permit: Permission denied (os error 13)
  832. 31.23 s gammaloop-nextest-python-api>
  833. 31.23 s gammaloop-nextest-python-api>
  834. 31.23 s gammaloop-nextest-python-api> Location:
  835. 31.23 s gammaloop-nextest-python-api> tests/tests/test_python_api.rs:156:20
  836. 31.23 s gammaloop-nextest-python-api> system-out
  837. 31.23 s gammaloop-nextest-python-api> running 1 test
  838. 31.23 s gammaloop-nextest-python-api> test python_settings_wrappers_expose_nested_runtime_and_global_settings ... FAILED
  839. 31.23 s gammaloop-nextest-python-api>
  840. 31.23 s gammaloop-nextest-python-api> failures:
  841. 31.23 s gammaloop-nextest-python-api>
  842. 31.23 s gammaloop-nextest-python-api> failures:
  843. 31.23 s gammaloop-nextest-python-api> python_settings_wrappers_expose_nested_runtime_and_global_settings
  844. 31.23 s gammaloop-nextest-python-api>
  845. 31.23 s gammaloop-nextest-python-api> test result: FAILED. 0 passed; 1 failed; 0 ignored; 0 measured; 4 filtered out; finished in 0.23s
  846. 31.23 s gammaloop-nextest-python-api> system-err
  847. 31.23 s gammaloop-nextest-python-api> Error: Python API test subprocess failed.
  848. 31.23 s gammaloop-nextest-python-api> stdout:
  849. 31.23 s gammaloop-nextest-python-api> ┌────────────────────────────────────────────────────────┐
  850. 31.23 s gammaloop-nextest-python-api> │ You are running a restricted Symbolica instance. │
  851. 31.23 s gammaloop-nextest-python-api> │ │
  852. 31.23 s gammaloop-nextest-python-api> │ For non-commercial use only, limited to one │
  853. 31.23 s gammaloop-nextest-python-api> │ Symbolica thread per user. │
  854. 31.23 s gammaloop-nextest-python-api> │ │
  855. 31.23 s gammaloop-nextest-python-api> ├─ Unlock all cores ─────────────────────────────────────┤
  856. 31.23 s gammaloop-nextest-python-api> │ │
  857. 31.23 s gammaloop-nextest-python-api> │ Hobbyists and students: free annual key │
  858. 31.23 s gammaloop-nextest-python-api> │ https://symbolica.io/license/#get-hobbyist-license │
  859. 31.23 s gammaloop-nextest-python-api> │ │
  860. 31.23 s gammaloop-nextest-python-api> │ Free 30-day professional trial: │
  861. 31.23 s gammaloop-nextest-python-api> │ https://symbolica.io/license/#get-trial-license │
  862. 31.23 s gammaloop-nextest-python-api> │ │
  863. 31.23 s gammaloop-nextest-python-api> └────────────────────────────────────────────────────────┘
  864. 31.23 s gammaloop-nextest-python-api> ┌──────────────────────────────────────────────────────────────────────────────────────────────────┐
  865. 31.23 s gammaloop-nextest-python-api> │ Cannot start another restricted Symbolica thread while this user's thread allowance is in use. │
  866. 31.23 s gammaloop-nextest-python-api> └──────────────────────────────────────────────────────────────────────────────────────────────────┘
  867. 31.23 s gammaloop-nextest-python-api>
  868. 31.23 s gammaloop-nextest-python-api> stderr:
  869. 31.23 s gammaloop-nextest-python-api> ┌────────────────────────────────────────────────────────┐
  870. 31.23 s gammaloop-nextest-python-api> │ The Symbolica license key format is outdated. │
  871. 31.23 s gammaloop-nextest-python-api> │ Renew your key at https://symbolica.io/license/ │
  872. 31.23 s gammaloop-nextest-python-api> └────────────────────────────────────────────────────────┘
  873. 31.23 s gammaloop-nextest-python-api> Could not acquire Symbolica thread permit: Permission denied (os error 13)
  874. 31.23 s gammaloop-nextest-python-api>
  875. 31.23 s gammaloop-nextest-python-api>
  876. 31.23 s gammaloop-nextest-python-api> Location:
  877. 31.23 s gammaloop-nextest-python-api> tests/tests/test_python_api.rs:156:20
  878. 31.23 s gammaloop-nextest-python-api> =========================================
  879. 31.35 s error: Cannot build '/nix/store/0yp6rnk546sqdif2snfpaz9n62n7pczx-gammaloop-nextest-python-api.drv'.
  880. 31.35 s Reason: builder failed with exit code 100.
  881. 31.35 s Output paths:
  882. 31.35 s /nix/store/y7cr6qdsp6prpykmg0qgky1552gqq1q8-gammaloop-nextest-python-api
  883. 31.35 s Last 853 log lines:
  884. 31.35 s > Extracting 3 binaries (including 2 non-test binaries), 1 build script output directory, and 3 linked paths to /build/source
  885. 31.35 s > Extracted 22 files to /build/source in 0.25s
  886. 31.35 s > ------------
  887. 31.35 s > Nextest run ID 7d7ed21a-540e-4631-976d-35037d4f84a1 with nextest profile: ci_gammaloop
  888. 31.35 s > Starting 5 tests across 1 binary
  889. 31.35 s > FAIL [ 0.227s] (1/5) gammaloop-integration-tests::test_python_api python_evaluate_samples_batch_and_momentum_space_have_expected_shape
  890. 31.35 s > stdout ---
  891. 31.35 s >
  892. 31.35 s > running 1 test
  893. 31.35 s > test python_evaluate_samples_batch_and_momentum_space_have_expected_shape ... FAILED
  894. 31.35 s >
  895. 31.35 s > failures:
  896. 31.35 s >
  897. 31.35 s > failures:
  898. 31.35 s > python_evaluate_samples_batch_and_momentum_space_have_expected_shape
  899. 31.35 s >
  900. 31.35 s > test result: FAILED. 0 passed; 1 failed; 0 ignored; 0 measured; 4 filtered out; finished in 0.21s
  901. 31.35 s >
  902. 31.35 s > stderr ---
  903. 31.35 s > Error: Python API test subprocess failed.
  904. 31.35 s > stdout:
  905. 31.35 s > ┌────────────────────────────────────────────────────────┐
  906. 31.35 s > │ You are running a restricted Symbolica instance. │
  907. 31.35 s > │ │
  908. 31.35 s > │ For non-commercial use only, limited to one │
  909. 31.35 s > │ Symbolica thread per user. │
  910. 31.35 s > │ │
  911. 31.35 s > ├─ Unlock all cores ─────────────────────────────────────┤
  912. 31.35 s > │ │
  913. 31.35 s > │ Hobbyists and students: free annual key │
  914. 31.35 s > │ https://symbolica.io/license/#get-hobbyist-license │
  915. 31.35 s > │ │
  916. 31.35 s > │ Free 30-day professional trial: │
  917. 31.35 s > │ https://symbolica.io/license/#get-trial-license │
  918. 31.35 s > │ │
  919. 31.35 s > └────────────────────────────────────────────────────────┘
  920. 31.35 s > ┌──────────────────────────────────────────────────────────────────────────────────────────────────┐
  921. 31.35 s > │ Cannot start another restricted Symbolica thread while this user's thread allowance is in use. │
  922. 31.35 s > └──────────────────────────────────────────────────────────────────────────────────────────────────┘
  923. 31.35 s >
  924. 31.35 s > stderr:
  925. 31.35 s > ┌────────────────────────────────────────────────────────┐
  926. 31.35 s > │ The Symbolica license key format is outdated. │
  927. 31.35 s > │ Renew your key at https://symbolica.io/license/ │
  928. 31.35 s > └────────────────────────────────────────────────────────┘
  929. 31.35 s > Could not acquire Symbolica thread permit: Permission denied (os error 13)
  930. 31.35 s >
  931. 31.35 s >
  932. 31.35 s > Location:
  933. 31.35 s > tests/tests/test_python_api.rs:156:20
  934. 31.35 s >
  935. 31.35 s > FAIL [ 0.228s] (2/5) gammaloop-integration-tests::test_python_api python_session_getters_return_live_toml_and_command_blocks
  936. 31.35 s > stdout ---
  937. 31.35 s >
  938. 31.35 s > running 1 test
  939. 31.35 s > test python_session_getters_return_live_toml_and_command_blocks ... FAILED
  940. 31.35 s >
  941. 31.35 s > failures:
  942. 31.35 s >
  943. 31.35 s > failures:
  944. 31.35 s > python_session_getters_return_live_toml_and_command_blocks
  945. 31.35 s >
  946. 31.35 s > test result: FAILED. 0 passed; 1 failed; 0 ignored; 0 measured; 4 filtered out; finished in 0.22s
  947. 31.35 s >
  948. 31.35 s > stderr ---
  949. 31.35 s > Error: Python API test subprocess failed.
  950. 31.35 s > stdout:
  951. 31.35 s > ┌────────────────────────────────────────────────────────┐
  952. 31.35 s > │ You are running a restricted Symbolica instance. │
  953. 31.35 s > │ │
  954. 31.35 s > │ For non-commercial use only, limited to one │
  955. 31.35 s > │ Symbolica thread per user. │
  956. 31.35 s > │ │
  957. 31.35 s > ├─ Unlock all cores ─────────────────────────────────────┤
  958. 31.35 s > │ │
  959. 31.35 s > │ Hobbyists and students: free annual key │
  960. 31.35 s > │ https://symbolica.io/license/#get-hobbyist-license │
  961. 31.35 s > │ │
  962. 31.35 s > │ Free 30-day professional trial: │
  963. 31.35 s > │ https://symbolica.io/license/#get-trial-license │
  964. 31.35 s > │ │
  965. 31.35 s > └────────────────────────────────────────────────────────┘
  966. 31.35 s > ┌──────────────────────────────────────────────────────────────────────────────────────────────────┐
  967. 31.35 s > │ Cannot start another restricted Symbolica thread while this user's thread allowance is in use. │
  968. 31.35 s > └──────────────────────────────────────────────────────────────────────────────────────────────────┘
  969. 31.35 s >
  970. 31.35 s > stderr:
  971. 31.35 s > ┌────────────────────────────────────────────────────────┐
  972. 31.35 s > │ The Symbolica license key format is outdated. │
  973. 31.35 s > │ Renew your key at https://symbolica.io/license/ │
  974. 31.35 s > └────────────────────────────────────────────────────────┘
  975. 31.35 s > Could not acquire Symbolica thread permit: Permission denied (os error 13)
  976. 31.35 s >
  977. 31.35 s >
  978. 31.35 s > Location:
  979. 31.35 s > tests/tests/test_python_api.rs:156:20
  980. 31.35 s >
  981. 31.35 s > FAIL [ 0.233s] (3/5) gammaloop-integration-tests::test_python_api python_evaluate_sample_honors_generate_events_and_observable_snapshots
  982. 31.35 s > stdout ---
  983. 31.35 s >
  984. 31.35 s > running 1 test
  985. 31.35 s > test python_evaluate_sample_honors_generate_events_and_observable_snapshots ... FAILED
  986. 31.35 s >
  987. 31.35 s > failures:
  988. 31.35 s >
  989. 31.35 s > failures:
  990. 31.35 s > python_evaluate_sample_honors_generate_events_and_observable_snapshots
  991. 31.35 s >
  992. 31.35 s > test result: FAILED. 0 passed; 1 failed; 0 ignored; 0 measured; 4 filtered out; finished in 0.23s
  993. 31.35 s >
  994. 31.35 s > stderr ---
  995. 31.35 s > Error: Python API test subprocess failed.
  996. 31.35 s > stdout:
  997. 31.35 s > ┌────────────────────────────────────────────────────────┐
  998. 31.35 s > │ You are running a restricted Symbolica instance. │
  999. 31.35 s > │ │
  1000. 31.35 s > │ For non-commercial use only, limited to one │
  1001. 31.35 s > │ Symbolica thread per user. │
  1002. 31.35 s > │ │
  1003. 31.35 s > ├─ Unlock all cores ─────────────────────────────────────┤
  1004. 31.35 s > │ │
  1005. 31.35 s > │ Hobbyists and students: free annual key │
  1006. 31.35 s > │ https://symbolica.io/license/#get-hobbyist-license │
  1007. 31.35 s > │ │
  1008. 31.35 s > │ Free 30-day professional trial: │
  1009. 31.35 s > │ https://symbolica.io/license/#get-trial-license │
  1010. 31.35 s > │ │
  1011. 31.35 s > └────────────────────────────────────────────────────────┘
  1012. 31.35 s > ┌──────────────────────────────────────────────────────────────────────────────────────────────────┐
  1013. 31.35 s > │ Cannot start another restricted Symbolica thread while this user's thread allowance is in use. │
  1014. 31.35 s > └──────────────────────────────────────────────────────────────────────────────────────────────────┘
  1015. 31.35 s >
  1016. 31.35 s > stderr:
  1017. 31.35 s > ┌────────────────────────────────────────────────────────┐
  1018. 31.35 s > │ The Symbolica license key format is outdated. │
  1019. 31.35 s > │ Renew your key at https://symbolica.io/license/ │
  1020. 31.35 s > └────────────────────────────────────────────────────────┘
  1021. 31.35 s > Could not acquire Symbolica thread permit: Permission denied (os error 13)
  1022. 31.35 s >
  1023. 31.35 s >
  1024. 31.35 s > Location:
  1025. 31.35 s > tests/tests/test_python_api.rs:156:20
  1026. 31.35 s >
  1027. 31.35 s > FAIL [ 0.234s] (4/5) gammaloop-integration-tests::test_python_api python_evaluate_sample_preserves_graph_grouping_and_incoming_pdgs
  1028. 31.35 s > stdout ---
  1029. 31.35 s >
  1030. 31.35 s > running 1 test
  1031. 31.35 s > test python_evaluate_sample_preserves_graph_grouping_and_incoming_pdgs ... FAILED
  1032. 31.35 s >
  1033. 31.35 s > failures:
  1034. 31.35 s >
  1035. 31.35 s > failures:
  1036. 31.35 s > python_evaluate_sample_preserves_graph_grouping_and_incoming_pdgs
  1037. 31.35 s >
  1038. 31.35 s > test result: FAILED. 0 passed; 1 failed; 0 ignored; 0 measured; 4 filtered out; finished in 0.23s
  1039. 31.35 s >
  1040. 31.35 s > stderr ---
  1041. 31.35 s > Error: Python API test subprocess failed.
  1042. 31.35 s > stdout:
  1043. 31.35 s > ┌────────────────────────────────────────────────────────┐
  1044. 31.35 s > │ You are running a restricted Symbolica instance. │
  1045. 31.35 s > │ │
  1046. 31.35 s > │ For non-commercial use only, limited to one │
  1047. 31.35 s > │ Symbolica thread per user. │
  1048. 31.35 s > │ │
  1049. 31.35 s > ├─ Unlock all cores ─────────────────────────────────────┤
  1050. 31.35 s > │ │
  1051. 31.35 s > │ Hobbyists and students: free annual key │
  1052. 31.35 s > │ https://symbolica.io/license/#get-hobbyist-license │
  1053. 31.35 s > │ │
  1054. 31.35 s > │ Free 30-day professional trial: │
  1055. 31.35 s > │ https://symbolica.io/license/#get-trial-license │
  1056. 31.35 s > │ │
  1057. 31.35 s > └────────────────────────────────────────────────────────┘
  1058. 31.35 s > ┌──────────────────────────────────────────────────────────────────────────────────────────────────┐
  1059. 31.35 s > │ Cannot start another restricted Symbolica thread while this user's thread allowance is in use. │
  1060. 31.35 s > └──────────────────────────────────────────────────────────────────────────────────────────────────┘
  1061. 31.35 s >
  1062. 31.35 s > stderr:
  1063. 31.35 s > ┌────────────────────────────────────────────────────────┐
  1064. 31.35 s > │ The Symbolica license key format is outdated. │
  1065. 31.35 s > │ Renew your key at https://symbolica.io/license/ │
  1066. 31.35 s > └────────────────────────────────────────────────────────┘
  1067. 31.35 s > Could not acquire Symbolica thread permit: Permission denied (os error 13)
  1068. 31.35 s >
  1069. 31.35 s >
  1070. 31.35 s > Location:
  1071. 31.35 s > tests/tests/test_python_api.rs:156:20
  1072. 31.35 s >
  1073. 31.35 s > FAIL [ 0.235s] (5/5) gammaloop-integration-tests::test_python_api python_settings_wrappers_expose_nested_runtime_and_global_settings
  1074. 31.35 s > stdout ---
  1075. 31.35 s >
  1076. 31.35 s > running 1 test
  1077. 31.35 s > test python_settings_wrappers_expose_nested_runtime_and_global_settings ... FAILED
  1078. 31.35 s >
  1079. 31.35 s > failures:
  1080. 31.35 s >
  1081. 31.35 s > failures:
  1082. 31.35 s > python_settings_wrappers_expose_nested_runtime_and_global_settings
  1083. 31.35 s >
  1084. 31.35 s > test result: FAILED. 0 passed; 1 failed; 0 ignored; 0 measured; 4 filtered out; finished in 0.23s
  1085. 31.35 s >
  1086. 31.35 s > stderr ---
  1087. 31.35 s > Error: Python API test subprocess failed.
  1088. 31.35 s > stdout:
  1089. 31.35 s > ┌────────────────────────────────────────────────────────┐
  1090. 31.35 s > │ You are running a restricted Symbolica instance. │
  1091. 31.35 s > │ │
  1092. 31.35 s > │ For non-commercial use only, limited to one │
  1093. 31.35 s > │ Symbolica thread per user. │
  1094. 31.35 s > │ │
  1095. 31.35 s > ├─ Unlock all cores ─────────────────────────────────────┤
  1096. 31.35 s > │ │
  1097. 31.35 s > │ Hobbyists and students: free annual key │
  1098. 31.35 s > │ https://symbolica.io/license/#get-hobbyist-license │
  1099. 31.35 s > │ │
  1100. 31.35 s > │ Free 30-day professional trial: │
  1101. 31.35 s > │ https://symbolica.io/license/#get-trial-license │
  1102. 31.35 s > │ │
  1103. 31.35 s > └────────────────────────────────────────────────────────┘
  1104. 31.35 s > ┌──────────────────────────────────────────────────────────────────────────────────────────────────┐
  1105. 31.35 s > │ Cannot start another restricted Symbolica thread while this user's thread allowance is in use. │
  1106. 31.35 s > └──────────────────────────────────────────────────────────────────────────────────────────────────┘
  1107. 31.35 s >
  1108. 31.35 s > stderr:
  1109. 31.35 s > ┌────────────────────────────────────────────────────────┐
  1110. 31.35 s > │ The Symbolica license key format is outdated. │
  1111. 31.35 s > │ Renew your key at https://symbolica.io/license/ │
  1112. 31.35 s > └────────────────────────────────────────────────────────┘
  1113. 31.35 s > Could not acquire Symbolica thread permit: Permission denied (os error 13)
  1114. 31.35 s >
  1115. 31.35 s >
  1116. 31.35 s > Location:
  1117. 31.35 s > tests/tests/test_python_api.rs:156:20
  1118. 31.35 s >
  1119. 31.35 s > ------------
  1120. 31.35 s > Summary [ 0.235s] 5 tests run: 0 passed, 5 failed, 0 skipped
  1121. 31.35 s > FAIL [ 0.227s] (1/5) gammaloop-integration-tests::test_python_api python_evaluate_samples_batch_and_momentum_space_have_expected_shape
  1122. 31.35 s > stdout ---
  1123. 31.35 s >
  1124. 31.35 s > running 1 test
  1125. 31.35 s > test python_evaluate_samples_batch_and_momentum_space_have_expected_shape ... FAILED
  1126. 31.35 s >
  1127. 31.35 s > failures:
  1128. 31.35 s >
  1129. 31.35 s > failures:
  1130. 31.35 s > python_evaluate_samples_batch_and_momentum_space_have_expected_shape
  1131. 31.35 s >
  1132. 31.35 s > test result: FAILED. 0 passed; 1 failed; 0 ignored; 0 measured; 4 filtered out; finished in 0.21s
  1133. 31.35 s >
  1134. 31.35 s > stderr ---
  1135. 31.35 s > Error: Python API test subprocess failed.
  1136. 31.35 s > stdout:
  1137. 31.35 s > ┌────────────────────────────────────────────────────────┐
  1138. 31.35 s > │ You are running a restricted Symbolica instance. │
  1139. 31.35 s > │ │
  1140. 31.35 s > │ For non-commercial use only, limited to one │
  1141. 31.35 s > │ Symbolica thread per user. │
  1142. 31.35 s > │ │
  1143. 31.35 s > ├─ Unlock all cores ─────────────────────────────────────┤
  1144. 31.35 s > │ │
  1145. 31.35 s > │ Hobbyists and students: free annual key │
  1146. 31.35 s > │ https://symbolica.io/license/#get-hobbyist-license │
  1147. 31.35 s > │ │
  1148. 31.35 s > │ Free 30-day professional trial: │
  1149. 31.35 s > │ https://symbolica.io/license/#get-trial-license │
  1150. 31.35 s > │ │
  1151. 31.35 s > └────────────────────────────────────────────────────────┘
  1152. 31.35 s > ┌──────────────────────────────────────────────────────────────────────────────────────────────────┐
  1153. 31.35 s > │ Cannot start another restricted Symbolica thread while this user's thread allowance is in use. │
  1154. 31.35 s > └──────────────────────────────────────────────────────────────────────────────────────────────────┘
  1155. 31.35 s >
  1156. 31.35 s > stderr:
  1157. 31.35 s > ┌────────────────────────────────────────────────────────┐
  1158. 31.35 s > │ The Symbolica license key format is outdated. │
  1159. 31.35 s > │ Renew your key at https://symbolica.io/license/ │
  1160. 31.35 s > └────────────────────────────────────────────────────────┘
  1161. 31.35 s > Could not acquire Symbolica thread permit: Permission denied (os error 13)
  1162. 31.35 s >
  1163. 31.35 s >
  1164. 31.35 s > Location:
  1165. 31.35 s > tests/tests/test_python_api.rs:156:20
  1166. 31.35 s >
  1167. 31.35 s > FAIL [ 0.228s] (2/5) gammaloop-integration-tests::test_python_api python_session_getters_return_live_toml_and_command_blocks
  1168. 31.35 s > stdout ---
  1169. 31.35 s >
  1170. 31.35 s > running 1 test
  1171. 31.35 s > test python_session_getters_return_live_toml_and_command_blocks ... FAILED
  1172. 31.35 s >
  1173. 31.35 s > failures:
  1174. 31.35 s >
  1175. 31.35 s > failures:
  1176. 31.35 s > python_session_getters_return_live_toml_and_command_blocks
  1177. 31.35 s >
  1178. 31.35 s > test result: FAILED. 0 passed; 1 failed; 0 ignored; 0 measured; 4 filtered out; finished in 0.22s
  1179. 31.35 s >
  1180. 31.35 s > stderr ---
  1181. 31.35 s > Error: Python API test subprocess failed.
  1182. 31.35 s > stdout:
  1183. 31.35 s > ┌────────────────────────────────────────────────────────┐
  1184. 31.35 s > │ You are running a restricted Symbolica instance. │
  1185. 31.35 s > │ │
  1186. 31.35 s > │ For non-commercial use only, limited to one │
  1187. 31.35 s > │ Symbolica thread per user. │
  1188. 31.35 s > │ │
  1189. 31.35 s > ├─ Unlock all cores ─────────────────────────────────────┤
  1190. 31.35 s > │ │
  1191. 31.35 s > │ Hobbyists and students: free annual key │
  1192. 31.35 s > │ https://symbolica.io/license/#get-hobbyist-license │
  1193. 31.35 s > │ │
  1194. 31.35 s > │ Free 30-day professional trial: │
  1195. 31.35 s > │ https://symbolica.io/license/#get-trial-license │
  1196. 31.35 s > │ │
  1197. 31.35 s > └────────────────────────────────────────────────────────┘
  1198. 31.35 s > ┌──────────────────────────────────────────────────────────────────────────────────────────────────┐
  1199. 31.35 s > │ Cannot start another restricted Symbolica thread while this user's thread allowance is in use. │
  1200. 31.35 s > └──────────────────────────────────────────────────────────────────────────────────────────────────┘
  1201. 31.35 s >
  1202. 31.35 s > stderr:
  1203. 31.35 s > ┌────────────────────────────────────────────────────────┐
  1204. 31.35 s > │ The Symbolica license key format is outdated. │
  1205. 31.35 s > │ Renew your key at https://symbolica.io/license/ │
  1206. 31.35 s > └────────────────────────────────────────────────────────┘
  1207. 31.35 s > Could not acquire Symbolica thread permit: Permission denied (os error 13)
  1208. 31.35 s >
  1209. 31.35 s >
  1210. 31.35 s > Location:
  1211. 31.35 s > tests/tests/test_python_api.rs:156:20
  1212. 31.35 s >
  1213. 31.35 s > FAIL [ 0.233s] (3/5) gammaloop-integration-tests::test_python_api python_evaluate_sample_honors_generate_events_and_observable_snapshots
  1214. 31.35 s > stdout ---
  1215. 31.35 s >
  1216. 31.35 s > running 1 test
  1217. 31.35 s > test python_evaluate_sample_honors_generate_events_and_observable_snapshots ... FAILED
  1218. 31.35 s >
  1219. 31.35 s > failures:
  1220. 31.35 s >
  1221. 31.35 s > failures:
  1222. 31.35 s > python_evaluate_sample_honors_generate_events_and_observable_snapshots
  1223. 31.35 s >
  1224. 31.35 s > test result: FAILED. 0 passed; 1 failed; 0 ignored; 0 measured; 4 filtered out; finished in 0.23s
  1225. 31.35 s >
  1226. 31.35 s > stderr ---
  1227. 31.35 s > Error: Python API test subprocess failed.
  1228. 31.35 s > stdout:
  1229. 31.35 s > ┌────────────────────────────────────────────────────────┐
  1230. 31.35 s > │ You are running a restricted Symbolica instance. │
  1231. 31.35 s > │ │
  1232. 31.35 s > │ For non-commercial use only, limited to one │
  1233. 31.35 s > │ Symbolica thread per user. │
  1234. 31.35 s > │ │
  1235. 31.35 s > ├─ Unlock all cores ─────────────────────────────────────┤
  1236. 31.35 s > │ │
  1237. 31.35 s > │ Hobbyists and students: free annual key │
  1238. 31.35 s > │ https://symbolica.io/license/#get-hobbyist-license │
  1239. 31.35 s > │ │
  1240. 31.35 s > │ Free 30-day professional trial: │
  1241. 31.35 s > │ https://symbolica.io/license/#get-trial-license │
  1242. 31.35 s > │ │
  1243. 31.35 s > └────────────────────────────────────────────────────────┘
  1244. 31.35 s > ┌──────────────────────────────────────────────────────────────────────────────────────────────────┐
  1245. 31.35 s > │ Cannot start another restricted Symbolica thread while this user's thread allowance is in use. │
  1246. 31.35 s > └──────────────────────────────────────────────────────────────────────────────────────────────────┘
  1247. 31.35 s >
  1248. 31.35 s > stderr:
  1249. 31.35 s > ┌────────────────────────────────────────────────────────┐
  1250. 31.35 s > │ The Symbolica license key format is outdated. │
  1251. 31.35 s > │ Renew your key at https://symbolica.io/license/ │
  1252. 31.35 s > └────────────────────────────────────────────────────────┘
  1253. 31.35 s > Could not acquire Symbolica thread permit: Permission denied (os error 13)
  1254. 31.35 s >
  1255. 31.35 s >
  1256. 31.35 s > Location:
  1257. 31.35 s > tests/tests/test_python_api.rs:156:20
  1258. 31.35 s >
  1259. 31.35 s > FAIL [ 0.234s] (4/5) gammaloop-integration-tests::test_python_api python_evaluate_sample_preserves_graph_grouping_and_incoming_pdgs
  1260. 31.35 s > stdout ---
  1261. 31.35 s >
  1262. 31.35 s > running 1 test
  1263. 31.35 s > test python_evaluate_sample_preserves_graph_grouping_and_incoming_pdgs ... FAILED
  1264. 31.35 s >
  1265. 31.35 s > failures:
  1266. 31.35 s >
  1267. 31.35 s > failures:
  1268. 31.35 s > python_evaluate_sample_preserves_graph_grouping_and_incoming_pdgs
  1269. 31.35 s >
  1270. 31.35 s > test result: FAILED. 0 passed; 1 failed; 0 ignored; 0 measured; 4 filtered out; finished in 0.23s
  1271. 31.35 s >
  1272. 31.35 s > stderr ---
  1273. 31.35 s > Error: Python API test subprocess failed.
  1274. 31.35 s > stdout:
  1275. 31.35 s > ┌────────────────────────────────────────────────────────┐
  1276. 31.35 s > │ You are running a restricted Symbolica instance. │
  1277. 31.35 s > │ │
  1278. 31.35 s > │ For non-commercial use only, limited to one │
  1279. 31.35 s > │ Symbolica thread per user. │
  1280. 31.35 s > │ │
  1281. 31.35 s > ├─ Unlock all cores ─────────────────────────────────────┤
  1282. 31.35 s > │ │
  1283. 31.35 s > │ Hobbyists and students: free annual key │
  1284. 31.35 s > │ https://symbolica.io/license/#get-hobbyist-license │
  1285. 31.35 s > │ │
  1286. 31.35 s > │ Free 30-day professional trial: │
  1287. 31.35 s > │ https://symbolica.io/license/#get-trial-license │
  1288. 31.35 s > │ │
  1289. 31.35 s > └────────────────────────────────────────────────────────┘
  1290. 31.35 s > ┌──────────────────────────────────────────────────────────────────────────────────────────────────┐
  1291. 31.35 s > │ Cannot start another restricted Symbolica thread while this user's thread allowance is in use. │
  1292. 31.35 s > └──────────────────────────────────────────────────────────────────────────────────────────────────┘
  1293. 31.35 s >
  1294. 31.35 s > stderr:
  1295. 31.35 s > ┌────────────────────────────────────────────────────────┐
  1296. 31.35 s > │ The Symbolica license key format is outdated. │
  1297. 31.35 s > │ Renew your key at https://symbolica.io/license/ │
  1298. 31.35 s > └────────────────────────────────────────────────────────┘
  1299. 31.35 s > Could not acquire Symbolica thread permit: Permission denied (os error 13)
  1300. 31.35 s >
  1301. 31.35 s >
  1302. 31.35 s > Location:
  1303. 31.35 s > tests/tests/test_python_api.rs:156:20
  1304. 31.35 s >
  1305. 31.35 s > FAIL [ 0.235s] (5/5) gammaloop-integration-tests::test_python_api python_settings_wrappers_expose_nested_runtime_and_global_settings
  1306. 31.35 s > stdout ---
  1307. 31.35 s >
  1308. 31.35 s > running 1 test
  1309. 31.35 s > test python_settings_wrappers_expose_nested_runtime_and_global_settings ... FAILED
  1310. 31.35 s >
  1311. 31.35 s > failures:
  1312. 31.35 s >
  1313. 31.35 s > failures:
  1314. 31.35 s > python_settings_wrappers_expose_nested_runtime_and_global_settings
  1315. 31.35 s >
  1316. 31.35 s > test result: FAILED. 0 passed; 1 failed; 0 ignored; 0 measured; 4 filtered out; finished in 0.23s
  1317. 31.35 s >
  1318. 31.35 s > stderr ---
  1319. 31.35 s > Error: Python API test subprocess failed.
  1320. 31.35 s > stdout:
  1321. 31.35 s > ┌────────────────────────────────────────────────────────┐
  1322. 31.35 s > │ You are running a restricted Symbolica instance. │
  1323. 31.35 s > │ │
  1324. 31.35 s > │ For non-commercial use only, limited to one │
  1325. 31.35 s > │ Symbolica thread per user. │
  1326. 31.35 s > │ │
  1327. 31.35 s > ├─ Unlock all cores ─────────────────────────────────────┤
  1328. 31.35 s > │ │
  1329. 31.35 s > │ Hobbyists and students: free annual key │
  1330. 31.35 s > │ https://symbolica.io/license/#get-hobbyist-license │
  1331. 31.35 s > │ │
  1332. 31.35 s > │ Free 30-day professional trial: │
  1333. 31.35 s > │ https://symbolica.io/license/#get-trial-license │
  1334. 31.35 s > │ │
  1335. 31.35 s > └────────────────────────────────────────────────────────┘
  1336. 31.35 s > ┌──────────────────────────────────────────────────────────────────────────────────────────────────┐
  1337. 31.35 s > │ Cannot start another restricted Symbolica thread while this user's thread allowance is in use. │
  1338. 31.35 s > └──────────────────────────────────────────────────────────────────────────────────────────────────┘
  1339. 31.35 s >
  1340. 31.35 s > stderr:
  1341. 31.35 s > ┌────────────────────────────────────────────────────────┐
  1342. 31.35 s > │ The Symbolica license key format is outdated. │
  1343. 31.35 s > │ Renew your key at https://symbolica.io/license/ │
  1344. 31.35 s > └────────────────────────────────────────────────────────┘
  1345. 31.35 s > Could not acquire Symbolica thread permit: Permission denied (os error 13)
  1346. 31.35 s >
  1347. 31.35 s >
  1348. 31.35 s > Location:
  1349. 31.35 s > tests/tests/test_python_api.rs:156:20
  1350. 31.35 s >
  1351. 31.35 s > error: test run failed
  1352. 31.35 s >
  1353. 31.35 s > ========== nextest test summary ==========
  1354. 31.35 s > report: target/nextest/ci_gammaloop/junit.xml
  1355. 31.35 s > tests: 5, failures: 5, errors: 0
  1356. 31.35 s >
  1357. 31.35 s > 1. gammaloop-integration-tests::test_python_api::python_evaluate_samples_batch_and_momentum_space_have_expected_shape
  1358. 31.35 s > failure: test failure with exit code 101
  1359. 31.35 s > Error: Python API test subprocess failed.
  1360. 31.35 s > stdout:
  1361. 31.35 s > ┌────────────────────────────────────────────────────────┐
  1362. 31.35 s > │ You are running a restricted Symbolica instance. │
  1363. 31.35 s > │ │
  1364. 31.35 s > │ For non-commercial use only, limited to one │
  1365. 31.35 s > │ Symbolica thread per user. │
  1366. 31.35 s > │ │
  1367. 31.35 s > ├─ Unlock all cores ─────────────────────────────────────┤
  1368. 31.35 s > │ │
  1369. 31.35 s > │ Hobbyists and students: free annual key │
  1370. 31.35 s > │ https://symbolica.io/license/#get-hobbyist-license │
  1371. 31.35 s > │ │
  1372. 31.35 s > │ Free 30-day professional trial: │
  1373. 31.35 s > │ https://symbolica.io/license/#get-trial-license │
  1374. 31.35 s > │ │
  1375. 31.35 s > └────────────────────────────────────────────────────────┘
  1376. 31.35 s > ┌──────────────────────────────────────────────────────────────────────────────────────────────────┐
  1377. 31.35 s > │ Cannot start another restricted Symbolica thread while this user's thread allowance is in use. │
  1378. 31.35 s > └──────────────────────────────────────────────────────────────────────────────────────────────────┘
  1379. 31.35 s >
  1380. 31.35 s > stderr:
  1381. 31.35 s > ┌────────────────────────────────────────────────────────┐
  1382. 31.35 s > │ The Symbolica license key format is outdated. │
  1383. 31.35 s > │ Renew your key at https://symbolica.io/license/ │
  1384. 31.35 s > └────────────────────────────────────────────────────────┘
  1385. 31.35 s > Could not acquire Symbolica thread permit: Permission denied (os error 13)
  1386. 31.35 s >
  1387. 31.35 s >
  1388. 31.35 s > Location:
  1389. 31.35 s > tests/tests/test_python_api.rs:156:20
  1390. 31.35 s > system-out
  1391. 31.35 s > running 1 test
  1392. 31.35 s > test python_evaluate_samples_batch_and_momentum_space_have_expected_shape ... FAILED
  1393. 31.35 s >
  1394. 31.35 s > failures:
  1395. 31.35 s >
  1396. 31.35 s > failures:
  1397. 31.35 s > python_evaluate_samples_batch_and_momentum_space_have_expected_shape
  1398. 31.35 s >
  1399. 31.35 s > test result: FAILED. 0 passed; 1 failed; 0 ignored; 0 measured; 4 filtered out; finished in 0.21s
  1400. 31.35 s > system-err
  1401. 31.35 s > Error: Python API test subprocess failed.
  1402. 31.35 s > stdout:
  1403. 31.35 s > ┌────────────────────────────────────────────────────────┐
  1404. 31.35 s > │ You are running a restricted Symbolica instance. │
  1405. 31.35 s > │ │
  1406. 31.35 s > │ For non-commercial use only, limited to one │
  1407. 31.35 s > │ Symbolica thread per user. │
  1408. 31.35 s > │ │
  1409. 31.35 s > ├─ Unlock all cores ─────────────────────────────────────┤
  1410. 31.35 s > │ │
  1411. 31.35 s > │ Hobbyists and students: free annual key │
  1412. 31.35 s > │ https://symbolica.io/license/#get-hobbyist-license │
  1413. 31.35 s > │ │
  1414. 31.35 s > │ Free 30-day professional trial: │
  1415. 31.35 s > │ https://symbolica.io/license/#get-trial-license │
  1416. 31.35 s > │ │
  1417. 31.35 s > └────────────────────────────────────────────────────────┘
  1418. 31.35 s > ┌──────────────────────────────────────────────────────────────────────────────────────────────────┐
  1419. 31.35 s > │ Cannot start another restricted Symbolica thread while this user's thread allowance is in use. │
  1420. 31.35 s > └──────────────────────────────────────────────────────────────────────────────────────────────────┘
  1421. 31.35 s >
  1422. 31.35 s > stderr:
  1423. 31.35 s > ┌────────────────────────────────────────────────────────┐
  1424. 31.35 s > │ The Symbolica license key format is outdated. │
  1425. 31.35 s > │ Renew your key at https://symbolica.io/license/ │
  1426. 31.35 s > └────────────────────────────────────────────────────────┘
  1427. 31.35 s > Could not acquire Symbolica thread permit: Permission denied (os error 13)
  1428. 31.35 s >
  1429. 31.35 s >
  1430. 31.35 s > Location:
  1431. 31.35 s > tests/tests/test_python_api.rs:156:20
  1432. 31.35 s >
  1433. 31.35 s > 2. gammaloop-integration-tests::test_python_api::python_session_getters_return_live_toml_and_command_blocks
  1434. 31.35 s > failure: test failure with exit code 101
  1435. 31.35 s > Error: Python API test subprocess failed.
  1436. 31.35 s > stdout:
  1437. 31.35 s > ┌────────────────────────────────────────────────────────┐
  1438. 31.35 s > │ You are running a restricted Symbolica instance. │
  1439. 31.35 s > │ │
  1440. 31.35 s > │ For non-commercial use only, limited to one │
  1441. 31.35 s > │ Symbolica thread per user. │
  1442. 31.35 s > │ │
  1443. 31.35 s > ├─ Unlock all cores ─────────────────────────────────────┤
  1444. 31.35 s > │ │
  1445. 31.35 s > │ Hobbyists and students: free annual key │
  1446. 31.35 s > │ https://symbolica.io/license/#get-hobbyist-license │
  1447. 31.35 s > │ │
  1448. 31.35 s > │ Free 30-day professional trial: │
  1449. 31.35 s > │ https://symbolica.io/license/#get-trial-license │
  1450. 31.35 s > │ │
  1451. 31.35 s > └────────────────────────────────────────────────────────┘
  1452. 31.35 s > ┌──────────────────────────────────────────────────────────────────────────────────────────────────┐
  1453. 31.35 s > │ Cannot start another restricted Symbolica thread while this user's thread allowance is in use. │
  1454. 31.35 s > └──────────────────────────────────────────────────────────────────────────────────────────────────┘
  1455. 31.35 s >
  1456. 31.35 s > stderr:
  1457. 31.35 s > ┌────────────────────────────────────────────────────────┐
  1458. 31.35 s > │ The Symbolica license key format is outdated. │
  1459. 31.35 s > │ Renew your key at https://symbolica.io/license/ │
  1460. 31.35 s > └────────────────────────────────────────────────────────┘
  1461. 31.35 s > Could not acquire Symbolica thread permit: Permission denied (os error 13)
  1462. 31.35 s >
  1463. 31.35 s >
  1464. 31.35 s > Location:
  1465. 31.35 s > tests/tests/test_python_api.rs:156:20
  1466. 31.35 s > system-out
  1467. 31.35 s > running 1 test
  1468. 31.35 s > test python_session_getters_return_live_toml_and_command_blocks ... FAILED
  1469. 31.35 s >
  1470. 31.35 s > failures:
  1471. 31.35 s >
  1472. 31.35 s > failures:
  1473. 31.35 s > python_session_getters_return_live_toml_and_command_blocks
  1474. 31.35 s >
  1475. 31.35 s > test result: FAILED. 0 passed; 1 failed; 0 ignored; 0 measured; 4 filtered out; finished in 0.22s
  1476. 31.35 s > system-err
  1477. 31.35 s > Error: Python API test subprocess failed.
  1478. 31.35 s > stdout:
  1479. 31.35 s > ┌────────────────────────────────────────────────────────┐
  1480. 31.35 s > │ You are running a restricted Symbolica instance. │
  1481. 31.35 s > │ │
  1482. 31.35 s > │ For non-commercial use only, limited to one │
  1483. 31.35 s > │ Symbolica thread per user. │
  1484. 31.35 s > │ │
  1485. 31.35 s > ├─ Unlock all cores ─────────────────────────────────────┤
  1486. 31.35 s > │ │
  1487. 31.35 s > │ Hobbyists and students: free annual key │
  1488. 31.35 s > │ https://symbolica.io/license/#get-hobbyist-license │
  1489. 31.35 s > │ │
  1490. 31.35 s > │ Free 30-day professional trial: │
  1491. 31.35 s > │ https://symbolica.io/license/#get-trial-license │
  1492. 31.35 s > │ │
  1493. 31.35 s > └────────────────────────────────────────────────────────┘
  1494. 31.35 s > ┌──────────────────────────────────────────────────────────────────────────────────────────────────┐
  1495. 31.35 s > │ Cannot start another restricted Symbolica thread while this user's thread allowance is in use. │
  1496. 31.35 s > └──────────────────────────────────────────────────────────────────────────────────────────────────┘
  1497. 31.35 s >
  1498. 31.35 s > stderr:
  1499. 31.35 s > ┌────────────────────────────────────────────────────────┐
  1500. 31.35 s > │ The Symbolica license key format is outdated. │
  1501. 31.35 s > │ Renew your key at https://symbolica.io/license/ │
  1502. 31.35 s > └────────────────────────────────────────────────────────┘
  1503. 31.35 s > Could not acquire Symbolica thread permit: Permission denied (os error 13)
  1504. 31.35 s >
  1505. 31.35 s >
  1506. 31.35 s > Location:
  1507. 31.35 s > tests/tests/test_python_api.rs:156:20
  1508. 31.35 s >
  1509. 31.35 s > 3. gammaloop-integration-tests::test_python_api::python_evaluate_sample_honors_generate_events_and_observable_snapshots
  1510. 31.35 s > failure: test failure with exit code 101
  1511. 31.35 s > Error: Python API test subprocess failed.
  1512. 31.35 s > stdout:
  1513. 31.35 s > ┌────────────────────────────────────────────────────────┐
  1514. 31.35 s > │ You are running a restricted Symbolica instance. │
  1515. 31.35 s > │ │
  1516. 31.35 s > │ For non-commercial use only, limited to one │
  1517. 31.35 s > │ Symbolica thread per user. │
  1518. 31.35 s > │ │
  1519. 31.35 s > ├─ Unlock all cores ─────────────────────────────────────┤
  1520. 31.35 s > │ │
  1521. 31.35 s > │ Hobbyists and students: free annual key │
  1522. 31.35 s > │ https://symbolica.io/license/#get-hobbyist-license │
  1523. 31.35 s > │ │
  1524. 31.35 s > │ Free 30-day professional trial: │
  1525. 31.35 s > │ https://symbolica.io/license/#get-trial-license │
  1526. 31.35 s > │ │
  1527. 31.35 s > └────────────────────────────────────────────────────────┘
  1528. 31.35 s > ┌──────────────────────────────────────────────────────────────────────────────────────────────────┐
  1529. 31.35 s > │ Cannot start another restricted Symbolica thread while this user's thread allowance is in use. │
  1530. 31.35 s > └──────────────────────────────────────────────────────────────────────────────────────────────────┘
  1531. 31.35 s >
  1532. 31.35 s > stderr:
  1533. 31.35 s > ┌────────────────────────────────────────────────────────┐
  1534. 31.35 s > │ The Symbolica license key format is outdated. │
  1535. 31.35 s > │ Renew your key at https://symbolica.io/license/ │
  1536. 31.35 s > └────────────────────────────────────────────────────────┘
  1537. 31.35 s > Could not acquire Symbolica thread permit: Permission denied (os error 13)
  1538. 31.35 s >
  1539. 31.35 s >
  1540. 31.35 s > Location:
  1541. 31.35 s > tests/tests/test_python_api.rs:156:20
  1542. 31.35 s > system-out
  1543. 31.35 s > running 1 test
  1544. 31.35 s > test python_evaluate_sample_honors_generate_events_and_observable_snapshots ... FAILED
  1545. 31.35 s >
  1546. 31.35 s > failures:
  1547. 31.35 s >
  1548. 31.35 s > failures:
  1549. 31.35 s > python_evaluate_sample_honors_generate_events_and_observable_snapshots
  1550. 31.35 s >
  1551. 31.35 s > test result: FAILED. 0 passed; 1 failed; 0 ignored; 0 measured; 4 filtered out; finished in 0.23s
  1552. 31.35 s > system-err
  1553. 31.35 s > Error: Python API test subprocess failed.
  1554. 31.35 s > stdout:
  1555. 31.35 s > ┌────────────────────────────────────────────────────────┐
  1556. 31.35 s > │ You are running a restricted Symbolica instance. │
  1557. 31.35 s > │ │
  1558. 31.35 s > │ For non-commercial use only, limited to one │
  1559. 31.35 s > │ Symbolica thread per user. │
  1560. 31.35 s > │ │
  1561. 31.35 s > ├─ Unlock all cores ─────────────────────────────────────┤
  1562. 31.35 s > │ │
  1563. 31.35 s > │ Hobbyists and students: free annual key │
  1564. 31.35 s > │ https://symbolica.io/license/#get-hobbyist-license │
  1565. 31.35 s > │ │
  1566. 31.35 s > │ Free 30-day professional trial: │
  1567. 31.35 s > │ https://symbolica.io/license/#get-trial-license │
  1568. 31.35 s > │ │
  1569. 31.35 s > └────────────────────────────────────────────────────────┘
  1570. 31.35 s > ┌──────────────────────────────────────────────────────────────────────────────────────────────────┐
  1571. 31.35 s > │ Cannot start another restricted Symbolica thread while this user's thread allowance is in use. │
  1572. 31.35 s > └──────────────────────────────────────────────────────────────────────────────────────────────────┘
  1573. 31.35 s >
  1574. 31.35 s > stderr:
  1575. 31.35 s > ┌────────────────────────────────────────────────────────┐
  1576. 31.35 s > │ The Symbolica license key format is outdated. │
  1577. 31.35 s > │ Renew your key at https://symbolica.io/license/ │
  1578. 31.35 s > └────────────────────────────────────────────────────────┘
  1579. 31.35 s > Could not acquire Symbolica thread permit: Permission denied (os error 13)
  1580. 31.35 s >
  1581. 31.35 s >
  1582. 31.35 s > Location:
  1583. 31.35 s > tests/tests/test_python_api.rs:156:20
  1584. 31.35 s >
  1585. 31.35 s > 4. gammaloop-integration-tests::test_python_api::python_evaluate_sample_preserves_graph_grouping_and_incoming_pdgs
  1586. 31.35 s > failure: test failure with exit code 101
  1587. 31.35 s > Error: Python API test subprocess failed.
  1588. 31.35 s > stdout:
  1589. 31.35 s > ┌────────────────────────────────────────────────────────┐
  1590. 31.35 s > │ You are running a restricted Symbolica instance. │
  1591. 31.35 s > │ │
  1592. 31.35 s > │ For non-commercial use only, limited to one │
  1593. 31.35 s > │ Symbolica thread per user. │
  1594. 31.35 s > │ │
  1595. 31.35 s > ├─ Unlock all cores ─────────────────────────────────────┤
  1596. 31.35 s > │ │
  1597. 31.35 s > │ Hobbyists and students: free annual key │
  1598. 31.35 s > │ https://symbolica.io/license/#get-hobbyist-license │
  1599. 31.35 s > │ │
  1600. 31.35 s > │ Free 30-day professional trial: │
  1601. 31.35 s > │ https://symbolica.io/license/#get-trial-license │
  1602. 31.35 s > │ │
  1603. 31.35 s > └────────────────────────────────────────────────────────┘
  1604. 31.35 s > ┌──────────────────────────────────────────────────────────────────────────────────────────────────┐
  1605. 31.35 s > │ Cannot start another restricted Symbolica thread while this user's thread allowance is in use. │
  1606. 31.35 s > └──────────────────────────────────────────────────────────────────────────────────────────────────┘
  1607. 31.35 s >
  1608. 31.35 s > stderr:
  1609. 31.35 s > ┌────────────────────────────────────────────────────────┐
  1610. 31.35 s > │ The Symbolica license key format is outdated. │
  1611. 31.35 s > │ Renew your key at https://symbolica.io/license/ │
  1612. 31.35 s > └────────────────────────────────────────────────────────┘
  1613. 31.35 s > Could not acquire Symbolica thread permit: Permission denied (os error 13)
  1614. 31.35 s >
  1615. 31.35 s >
  1616. 31.35 s > Location:
  1617. 31.35 s > tests/tests/test_python_api.rs:156:20
  1618. 31.35 s > system-out
  1619. 31.35 s > running 1 test
  1620. 31.35 s > test python_evaluate_sample_preserves_graph_grouping_and_incoming_pdgs ... FAILED
  1621. 31.35 s >
  1622. 31.35 s > failures:
  1623. 31.35 s >
  1624. 31.35 s > failures:
  1625. 31.35 s > python_evaluate_sample_preserves_graph_grouping_and_incoming_pdgs
  1626. 31.35 s >
  1627. 31.35 s > test result: FAILED. 0 passed; 1 failed; 0 ignored; 0 measured; 4 filtered out; finished in 0.23s
  1628. 31.35 s > system-err
  1629. 31.35 s > Error: Python API test subprocess failed.
  1630. 31.35 s > stdout:
  1631. 31.35 s > ┌────────────────────────────────────────────────────────┐
  1632. 31.35 s > │ You are running a restricted Symbolica instance. │
  1633. 31.35 s > │ │
  1634. 31.35 s > │ For non-commercial use only, limited to one │
  1635. 31.35 s > │ Symbolica thread per user. │
  1636. 31.35 s > │ │
  1637. 31.35 s > ├─ Unlock all cores ─────────────────────────────────────┤
  1638. 31.35 s > │ │
  1639. 31.35 s > │ Hobbyists and students: free annual key │
  1640. 31.35 s > │ https://symbolica.io/license/#get-hobbyist-license │
  1641. 31.35 s > │ │
  1642. 31.35 s > │ Free 30-day professional trial: │
  1643. 31.35 s > │ https://symbolica.io/license/#get-trial-license │
  1644. 31.35 s > │ │
  1645. 31.35 s > └────────────────────────────────────────────────────────┘
  1646. 31.35 s > ┌──────────────────────────────────────────────────────────────────────────────────────────────────┐
  1647. 31.35 s > │ Cannot start another restricted Symbolica thread while this user's thread allowance is in use. │
  1648. 31.35 s > └──────────────────────────────────────────────────────────────────────────────────────────────────┘
  1649. 31.35 s >
  1650. 31.35 s > stderr:
  1651. 31.35 s > ┌────────────────────────────────────────────────────────┐
  1652. 31.35 s > │ The Symbolica license key format is outdated. │
  1653. 31.35 s > │ Renew your key at https://symbolica.io/license/ │
  1654. 31.35 s > └────────────────────────────────────────────────────────┘
  1655. 31.35 s > Could not acquire Symbolica thread permit: Permission denied (os error 13)
  1656. 31.35 s >
  1657. 31.35 s >
  1658. 31.35 s > Location:
  1659. 31.35 s > tests/tests/test_python_api.rs:156:20
  1660. 31.35 s >
  1661. 31.35 s > 5. gammaloop-integration-tests::test_python_api::python_settings_wrappers_expose_nested_runtime_and_global_settings
  1662. 31.35 s > failure: test failure with exit code 101
  1663. 31.35 s > Error: Python API test subprocess failed.
  1664. 31.35 s > stdout:
  1665. 31.35 s > ┌────────────────────────────────────────────────────────┐
  1666. 31.35 s > │ You are running a restricted Symbolica instance. │
  1667. 31.35 s > │ │
  1668. 31.35 s > │ For non-commercial use only, limited to one │
  1669. 31.35 s > │ Symbolica thread per user. │
  1670. 31.35 s > │ │
  1671. 31.35 s > ├─ Unlock all cores ─────────────────────────────────────┤
  1672. 31.35 s > │ │
  1673. 31.35 s > │ Hobbyists and students: free annual key │
  1674. 31.35 s > │ https://symbolica.io/license/#get-hobbyist-license │
  1675. 31.35 s > │ │
  1676. 31.35 s > │ Free 30-day professional trial: │
  1677. 31.35 s > │ https://symbolica.io/license/#get-trial-license │
  1678. 31.35 s > │ │
  1679. 31.35 s > └────────────────────────────────────────────────────────┘
  1680. 31.35 s > ┌──────────────────────────────────────────────────────────────────────────────────────────────────┐
  1681. 31.35 s > │ Cannot start another restricted Symbolica thread while this user's thread allowance is in use. │
  1682. 31.35 s > └──────────────────────────────────────────────────────────────────────────────────────────────────┘
  1683. 31.35 s >
  1684. 31.35 s > stderr:
  1685. 31.35 s > ┌────────────────────────────────────────────────────────┐
  1686. 31.35 s > │ The Symbolica license key format is outdated. │
  1687. 31.35 s > │ Renew your key at https://symbolica.io/license/ │
  1688. 31.35 s > └────────────────────────────────────────────────────────┘
  1689. 31.35 s > Could not acquire Symbolica thread permit: Permission denied (os error 13)
  1690. 31.35 s >
  1691. 31.35 s >
  1692. 31.35 s > Location:
  1693. 31.35 s > tests/tests/test_python_api.rs:156:20
  1694. 31.35 s > system-out
  1695. 31.35 s > running 1 test
  1696. 31.35 s > test python_settings_wrappers_expose_nested_runtime_and_global_settings ... FAILED
  1697. 31.35 s >
  1698. 31.35 s > failures:
  1699. 31.35 s >
  1700. 31.35 s > failures:
  1701. 31.35 s > python_settings_wrappers_expose_nested_runtime_and_global_settings
  1702. 31.35 s >
  1703. 31.35 s > test result: FAILED. 0 passed; 1 failed; 0 ignored; 0 measured; 4 filtered out; finished in 0.23s
  1704. 31.35 s > system-err
  1705. 31.35 s > Error: Python API test subprocess failed.
  1706. 31.35 s > stdout:
  1707. 31.35 s > ┌────────────────────────────────────────────────────────┐
  1708. 31.35 s > │ You are running a restricted Symbolica instance. │
  1709. 31.35 s > │ │
  1710. 31.35 s > │ For non-commercial use only, limited to one │
  1711. 31.35 s > │ Symbolica thread per user. │
  1712. 31.35 s > │ │
  1713. 31.35 s > ├─ Unlock all cores ─────────────────────────────────────┤
  1714. 31.35 s > │ │
  1715. 31.35 s > │ Hobbyists and students: free annual key │
  1716. 31.35 s > │ https://symbolica.io/license/#get-hobbyist-license │
  1717. 31.35 s > │ │
  1718. 31.35 s > │ Free 30-day professional trial: │
  1719. 31.35 s > │ https://symbolica.io/license/#get-trial-license │
  1720. 31.35 s > │ │
  1721. 31.35 s > └────────────────────────────────────────────────────────┘
  1722. 31.35 s > ┌──────────────────────────────────────────────────────────────────────────────────────────────────┐
  1723. 31.35 s > │ Cannot start another restricted Symbolica thread while this user's thread allowance is in use. │
  1724. 31.35 s > └──────────────────────────────────────────────────────────────────────────────────────────────────┘
  1725. 31.35 s >
  1726. 31.35 s > stderr:
  1727. 31.35 s > ┌────────────────────────────────────────────────────────┐
  1728. 31.35 s > │ The Symbolica license key format is outdated. │
  1729. 31.35 s > │ Renew your key at https://symbolica.io/license/ │
  1730. 31.35 s > └────────────────────────────────────────────────────────┘
  1731. 31.35 s > Could not acquire Symbolica thread permit: Permission denied (os error 13)
  1732. 31.35 s >
  1733. 31.35 s >
  1734. 31.35 s > Location:
  1735. 31.35 s > tests/tests/test_python_api.rs:156:20
  1736. 31.35 s > =========================================
  1737. 31.35 s For full logs, run:
  1738. 31.35 s nix log /nix/store/0yp6rnk546sqdif2snfpaz9n62n7pczx-gammaloop-nextest-python-api.drv
  1739. 31.51 s [0 built (1 failed), 0.0Run failed.