0.01 s
$ /nix/store/9ypz3flqsrl5xl495mm8h645gadjsxi1-coreutils-9.11/bin/timeout --kill-after=15s 7200s /nix/store/23zk8sgzamrbmj1fday15szf7f2279s8-nix-2.34.7/bin/nix --extra-experimental-features nix-command --extra-experimental-features flakes flake clone git+https://github.com/alphal00p/gammaloop --dest /tmp/nix-ci-worker/stable-pwd/repo/
0.16 s
Cloning into '/tmp/nix-ci-worker/stable-pwd/repo'...
1.34 s
remote: Enumerating objects: 93536, done.
1.90 s
remote: Counting objects: 0% (1/9149)
remote: Counting objects: 1% (92/9149)
remote: Counting objects: 2% (183/9149)
remote: Counting objects: 3% (275/9149)
remote: Counting objects: 4% (366/9149)
remote: Counting objects: 5% (458/9149)
remote: Counting objects: 6% (549/9149)
remote: Counting objects: 7% (641/9149)
remote: Counting objects: 8% (732/9149)
remote: Counting objects: 9% (824/9149)
remote: Counting objects: 10% (915/9149)
remote: Counting objects: 11% (1007/9149)
remote: Counting objects: 12% (1098/9149)
remote: Counting objects: 13% (1190/9149)
remote: Counting objects: 14% (1281/9149)
remote: Counting objects: 15% (1373/9149)
remote: Counting objects: 16% (1464/9149)
remote: Counting objects: 17% (1556/9149)
remote: Counting objects: 18% (1647/9149)
remote: Counting objects: 19% (1739/9149)
remote: Counting objects: 20% (1830/9149)
remote: Counting objects: 21% (1922/9149)
remote: Counting objects: 22% (2013/9149)
remote: Counting objects: 23% (2105/9149)
remote: Counting objects: 24% (2196/9149)
remote: Counting objects: 25% (2288/9149)
remote: Counting objects: 26% (2379/9149)
remote: Counting objects: 27% (2471/9149)
remote: Counting objects: 28% (2562/9149)
remote: Counting objects: 29% (2654/9149)
remote: Counting objects: 30% (2745/9149)
remote: Counting objects: 31% (2837/9149)
remote: Counting objects: 32% (2928/9149)
remote: Counting objects: 33% (3020/9149)
remote: Counting objects: 34% (3111/9149)
remote: Counting objects: 35% (3203/9149)
remote: Counting objects: 36% (3294/9149)
remote: Counting objects: 37% (3386/9149)
remote: Counting objects: 38% (3477/9149)
remote: Counting objects: 39% (3569/9149)
remote: Counting objects: 40% (3660/9149)
remote: Counting objects: 41% (3752/9149)
remote: Counting objects: 42% (3843/9149)
remote: Counting objects: 43% (3935/9149)
remote: Counting objects: 44% (4026/9149)
remote: Counting objects: 45% (4118/9149)
remote: Counting objects: 46% (4209/9149)
remote: Counting objects: 47% (4301/9149)
remote: Counting objects: 48% (4392/9149)
remote: Counting objects: 49% (4484/9149)
remote: Counting objects: 50% (4575/9149)
remote: Counting objects: 51% (4666/9149)
remote: Counting objects: 52% (4758/9149)
remote: Counting objects: 53% (4849/9149)
remote: Counting objects: 54% (4941/9149)
remote: Counting objects: 55% (5032/9149)
remote: Counting objects: 56% (5124/9149)
remote: Counting objects: 57% (5215/9149)
remote: Counting objects: 58% (5307/9149)
remote: Counting objects: 59% (5398/9149)
remote: Counting objects: 60% (5490/9149)
remote: Counting objects: 61% (5581/9149)
remote: Counting objects: 62% (5673/9149)
remote: Counting objects: 63% (5764/9149)
remote: Counting objects: 64% (5856/9149)
remote: Counting objects: 65% (5947/9149)
remote: Counting objects: 66% (6039/9149)
remote: Counting objects: 67% (6130/9149)
remote: Counting objects: 68% (6222/9149)
remote: Counting objects: 69% (6313/9149)
remote: Counting objects: 70% (6405/9149)
remote: Counting objects: 71% (6496/9149)
remote: Counting objects: 72% (6588/9149)
remote: Counting objects: 73% (6679/9149)
remote: Counting objects: 74% (6771/9149)
remote: Counting objects: 75% (6862/9149)
remote: Counting objects: 76% (6954/9149)
remote: Counting objects: 77% (7045/9149)
remote: Counting objects: 78% (7137/9149)
remote: Counting objects: 79% (7228/9149)
remote: Counting objects: 80% (7320/9149)
remote: Counting objects: 81% (7411/9149)
remote: Counting objects: 82% (7503/9149)
remote: Counting objects: 83% (7594/9149)
remote: Counting objects: 84% (7686/9149)
remote: Counting objects: 85% (7777/9149)
remote: Counting objects: 86% (7869/9149)
remote: Counting objects: 87% (7960/9149)
remote: Counting objects: 88% (8052/9149)
remote: Counting objects: 89% (8143/9149)
remote: Counting objects: 90% (8235/9149)
remote: Counting objects: 91% (8326/9149)
remote: Counting objects: 92% (8418/9149)
remote: Counting objects: 93% (8509/9149)
remote: Counting objects: 94% (8601/9149)
remote: Counting objects: 95% (8692/9149)
remote: Counting objects: 96% (8784/9149)
remote: Counting objects: 97% (8875/9149)
remote: Counting objects: 98% (8967/9149)
remote: Counting objects: 99% (9058/9149)
remote: Counting objects: 100% (9149/9149)
remote: Counting objects: 100% (9149/9149), done.
3.73 s
remote: Compressing objects: 0% (1/1949)
remote: Compressing objects: 1% (20/1949)
remote: Compressing objects: 2% (39/1949)
remote: Compressing objects: 3% (59/1949)
remote: Compressing objects: 4% (78/1949)
remote: Compressing objects: 5% (98/1949)
remote: Compressing objects: 6% (117/1949)
remote: Compressing objects: 7% (137/1949)
remote: Compressing objects: 8% (156/1949)
remote: Compressing objects: 9% (176/1949)
remote: Compressing objects: 10% (195/1949)
remote: Compressing objects: 11% (215/1949)
remote: Compressing objects: 11% (217/1949)
remote: Compressing objects: 12% (234/1949)
remote: Compressing objects: 13% (254/1949)
remote: Compressing objects: 14% (273/1949)
remote: Compressing objects: 15% (293/1949)
remote: Compressing objects: 16% (312/1949)
remote: Compressing objects: 17% (332/1949)
remote: Compressing objects: 18% (351/1949)
remote: Compressing objects: 19% (371/1949)
remote: Compressing objects: 20% (390/1949)
remote: Compressing objects: 21% (410/1949)
remote: Compressing objects: 22% (429/1949)
remote: Compressing objects: 23% (449/1949)
remote: Compressing objects: 23% (456/1949)
remote: Compressing objects: 24% (468/1949)
remote: Compressing objects: 25% (488/1949)
remote: Compressing objects: 26% (507/1949)
remote: Compressing objects: 27% (527/1949)
remote: Compressing objects: 28% (546/1949)
remote: Compressing objects: 29% (566/1949)
remote: Compressing objects: 30% (585/1949)
remote: Compressing objects: 31% (605/1949)
remote: Compressing objects: 32% (624/1949)
remote: Compressing objects: 33% (644/1949)
remote: Compressing objects: 34% (663/1949)
remote: Compressing objects: 35% (683/1949)
remote: Compressing objects: 36% (702/1949)
remote: Compressing objects: 37% (722/1949)
remote: Compressing objects: 38% (741/1949)
remote: Compressing objects: 39% (761/1949)
remote: Compressing objects: 40% (780/1949)
remote: Compressing objects: 41% (800/1949)
remote: Compressing objects: 42% (819/1949)
remote: Compressing objects: 43% (839/1949)
remote: Compressing objects: 44% (858/1949)
remote: Compressing objects: 45% (878/1949)
remote: Compressing objects: 46% (897/1949)
remote: Compressing objects: 47% (917/1949)
remote: Compressing objects: 48% (936/1949)
remote: Compressing objects: 49% (956/1949)
remote: Compressing objects: 50% (975/1949)
remote: Compressing objects: 51% (994/1949)
remote: Compressing objects: 52% (1014/1949)
remote: Compressing objects: 53% (1033/1949)
remote: Compressing objects: 54% (1053/1949)
remote: Compressing objects: 55% (1072/1949)
remote: Compressing objects: 56% (1092/1949)
remote: Compressing objects: 57% (1111/1949)
remote: Compressing objects: 58% (1131/1949)
remote: Compressing objects: 59% (1150/1949)
remote: Compressing objects: 60% (1170/1949)
remote: Compressing objects: 61% (1189/1949)
remote: Compressing objects: 62% (1209/1949)
remote: Compressing objects: 63% (1228/1949)
remote: Compressing objects: 64% (1248/1949)
remote: Compressing objects: 65% (1267/1949)
remote: Compressing objects: 66% (1287/1949)
remote: Compressing objects: 67% (1306/1949)
remote: Compressing objects: 68% (1326/1949)
remote: Compressing objects: 69% (1345/1949)
remote: Compressing objects: 70% (1365/1949)
remote: Compressing objects: 71% (1384/1949)
remote: Compressing objects: 72% (1404/1949)
remote: Compressing objects: 73% (1423/1949)
remote: Compressing objects: 74% (1443/1949)
remote: Compressing objects: 75% (1462/1949)
remote: Compressing objects: 76% (1482/1949)
remote: Compressing objects: 77% (1501/1949)
remote: Compressing objects: 78% (1521/1949)
remote: Compressing objects: 79% (1540/1949)
remote: Compressing objects: 80% (1560/1949)
remote: Compressing objects: 81% (1579/1949)
remote: Compressing objects: 82% (1599/1949)
remote: Compressing objects: 83% (1618/1949)
remote: Compressing objects: 84% (1638/1949)
remote: Compressing objects: 85% (1657/1949)
remote: Compressing objects: 86% (1677/1949)
remote: Compressing objects: 87% (1696/1949)
remote: Compressing objects: 88% (1716/1949)
remote: Compressing objects: 89% (1735/1949)
remote: Compressing objects: 90% (1755/1949)
remote: Compressing objects: 91% (1774/1949)
remote: Compressing objects: 92% (1794/1949)
remote: Compressing objects: 93% (1813/1949)
remote: Compressing objects: 94% (1833/1949)
remote: Compressing objects: 95% (1852/1949)
remote: Compressing objects: 96% (1872/1949)
remote: Compressing objects: 97% (1891/1949)
remote: Compressing objects: 98% (1911/1949)
remote: Compressing objects: 99% (1930/1949)
remote: Compressing objects: 100% (1949/1949)
remote: Compressing objects: 100% (1949/1949), done.
12.88 s
Receiving objects: 0% (1/93536)
Receiving objects: 1% (936/93536)
Receiving objects: 2% (1871/93536)
Receiving objects: 3% (2807/93536)
Receiving objects: 4% (3742/93536)
Receiving objects: 5% (4677/93536)
Receiving objects: 6% (5613/93536)
Receiving objects: 7% (6548/93536)
Receiving objects: 8% (7483/93536), 12.37 MiB | 24.73 MiB/s
Receiving objects: 9% (8419/93536), 12.37 MiB | 24.73 MiB/s
Receiving objects: 10% (9354/93536), 12.37 MiB | 24.73 MiB/s
Receiving objects: 11% (10289/93536), 12.37 MiB | 24.73 MiB/s
Receiving objects: 12% (11225/93536), 12.37 MiB | 24.73 MiB/s
Receiving objects: 13% (12160/93536), 12.37 MiB | 24.73 MiB/s
Receiving objects: 14% (13096/93536), 12.37 MiB | 24.73 MiB/s
Receiving objects: 15% (14031/93536), 12.37 MiB | 24.73 MiB/s
Receiving objects: 16% (14966/93536), 12.37 MiB | 24.73 MiB/s
Receiving objects: 17% (15902/93536), 12.37 MiB | 24.73 MiB/s
Receiving objects: 18% (16837/93536), 12.37 MiB | 24.73 MiB/s
Receiving objects: 19% (17772/93536), 12.37 MiB | 24.73 MiB/s
Receiving objects: 20% (18708/93536), 12.37 MiB | 24.73 MiB/s
Receiving objects: 21% (19643/93536), 12.37 MiB | 24.73 MiB/s
Receiving objects: 22% (20578/93536), 12.37 MiB | 24.73 MiB/s
Receiving objects: 23% (21514/93536), 12.37 MiB | 24.73 MiB/s
Receiving objects: 24% (22449/93536), 12.37 MiB | 24.73 MiB/s
Receiving objects: 25% (23384/93536), 12.37 MiB | 24.73 MiB/s
Receiving objects: 26% (24320/93536), 12.37 MiB | 24.73 MiB/s
Receiving objects: 27% (25255/93536), 12.37 MiB | 24.73 MiB/s
Receiving objects: 28% (26191/93536), 12.37 MiB | 24.73 MiB/s
Receiving objects: 29% (27126/93536), 12.37 MiB | 24.73 MiB/s
Receiving objects: 30% (28061/93536), 12.37 MiB | 24.73 MiB/s
Receiving objects: 31% (28997/93536), 12.37 MiB | 24.73 MiB/s
Receiving objects: 32% (29932/93536), 12.37 MiB | 24.73 MiB/s
Receiving objects: 33% (30867/93536), 12.37 MiB | 24.73 MiB/s
Receiving objects: 34% (31803/93536), 12.37 MiB | 24.73 MiB/s
Receiving objects: 35% (32738/93536), 12.37 MiB | 24.73 MiB/s
Receiving objects: 35% (33546/93536), 12.37 MiB | 24.73 MiB/s
Receiving objects: 36% (33673/93536), 32.26 MiB | 32.25 MiB/s
Receiving objects: 37% (34609/93536), 32.26 MiB | 32.25 MiB/s
Receiving objects: 38% (35544/93536), 32.26 MiB | 32.25 MiB/s
Receiving objects: 39% (36480/93536), 32.26 MiB | 32.25 MiB/s
Receiving objects: 40% (37415/93536), 32.26 MiB | 32.25 MiB/s
Receiving objects: 41% (38350/93536), 32.26 MiB | 32.25 MiB/s
Receiving objects: 42% (39286/93536), 32.26 MiB | 32.25 MiB/s
Receiving objects: 43% (40221/93536), 32.26 MiB | 32.25 MiB/s
Receiving objects: 44% (41156/93536), 48.59 MiB | 32.39 MiB/s
Receiving objects: 45% (42092/93536), 48.59 MiB | 32.39 MiB/s
Receiving objects: 46% (43027/93536), 48.59 MiB | 32.39 MiB/s
Receiving objects: 47% (43962/93536), 48.59 MiB | 32.39 MiB/s
Receiving objects: 48% (44898/93536), 48.59 MiB | 32.39 MiB/s
Receiving objects: 49% (45833/93536), 48.59 MiB | 32.39 MiB/s
Receiving objects: 50% (46768/93536), 48.59 MiB | 32.39 MiB/s
Receiving objects: 51% (47704/93536), 48.59 MiB | 32.39 MiB/s
Receiving objects: 52% (48639/93536), 48.59 MiB | 32.39 MiB/s
Receiving objects: 52% (48725/93536), 65.20 MiB | 32.59 MiB/s
Receiving objects: 53% (49575/93536), 65.20 MiB | 32.59 MiB/s
Receiving objects: 54% (50510/93536), 65.20 MiB | 32.59 MiB/s
Receiving objects: 55% (51445/93536), 65.20 MiB | 32.59 MiB/s
Receiving objects: 56% (52381/93536), 65.20 MiB | 32.59 MiB/s
Receiving objects: 57% (53316/93536), 65.20 MiB | 32.59 MiB/s
Receiving objects: 58% (54251/93536), 65.20 MiB | 32.59 MiB/s
Receiving objects: 59% (55187/93536), 65.20 MiB | 32.59 MiB/s
Receiving objects: 60% (56122/93536), 65.20 MiB | 32.59 MiB/s
Receiving objects: 60% (57045/93536), 99.89 MiB | 33.29 MiB/s
Receiving objects: 61% (57057/93536), 99.89 MiB | 33.29 MiB/s
Receiving objects: 61% (57142/93536), 132.50 MiB | 33.07 MiB/s
Receiving objects: 61% (57617/93536), 166.57 MiB | 34.02 MiB/s
Receiving objects: 62% (57993/93536), 182.54 MiB | 33.16 MiB/s
Receiving objects: 63% (58928/93536), 182.54 MiB | 33.16 MiB/s
Receiving objects: 64% (59864/93536), 182.54 MiB | 33.16 MiB/s
Receiving objects: 65% (60799/93536), 182.54 MiB | 33.16 MiB/s
Receiving objects: 66% (61734/93536), 182.54 MiB | 33.16 MiB/s
Receiving objects: 67% (62670/93536), 182.54 MiB | 33.16 MiB/s
Receiving objects: 67% (63516/93536), 182.54 MiB | 33.16 MiB/s
Receiving objects: 68% (63605/93536), 182.54 MiB | 33.16 MiB/s
Receiving objects: 69% (64540/93536), 200.20 MiB | 33.36 MiB/s
Receiving objects: 70% (65476/93536), 200.20 MiB | 33.36 MiB/s
Receiving objects: 71% (66411/93536), 200.20 MiB | 33.36 MiB/s
Receiving objects: 72% (67346/93536), 200.20 MiB | 33.36 MiB/s
Receiving objects: 73% (68282/93536), 200.20 MiB | 33.36 MiB/s
Receiving objects: 74% (69217/93536), 200.20 MiB | 33.36 MiB/s
Receiving objects: 75% (70152/93536), 200.20 MiB | 33.36 MiB/s
Receiving objects: 76% (71088/93536), 200.20 MiB | 33.36 MiB/s
Receiving objects: 77% (72023/93536), 200.20 MiB | 33.36 MiB/s
Receiving objects: 78% (72959/93536), 200.20 MiB | 33.36 MiB/s
Receiving objects: 79% (73894/93536), 218.30 MiB | 33.68 MiB/s
Receiving objects: 80% (74829/93536), 218.30 MiB | 33.68 MiB/s
Receiving objects: 81% (75765/93536), 218.30 MiB | 33.68 MiB/s
Receiving objects: 82% (76700/93536), 218.30 MiB | 33.68 MiB/s
Receiving objects: 82% (76723/93536), 218.30 MiB | 33.68 MiB/s
Receiving objects: 83% (77635/93536), 251.32 MiB | 33.32 MiB/s
Receiving objects: 84% (78571/93536), 251.32 MiB | 33.32 MiB/s
Receiving objects: 85% (79506/93536), 251.32 MiB | 33.32 MiB/s
Receiving objects: 86% (80441/93536), 251.32 MiB | 33.32 MiB/s
Receiving objects: 87% (81377/93536), 251.32 MiB | 33.32 MiB/s
Receiving objects: 88% (82312/93536), 251.32 MiB | 33.32 MiB/s
Receiving objects: 89% (83248/93536), 251.32 MiB | 33.32 MiB/s
Receiving objects: 89% (83669/93536), 251.32 MiB | 33.32 MiB/s
Receiving objects: 90% (84183/93536), 268.00 MiB | 33.55 MiB/s
Receiving objects: 91% (85118/93536), 268.00 MiB | 33.55 MiB/s
Receiving objects: 92% (86054/93536), 268.00 MiB | 33.55 MiB/s
Receiving objects: 93% (86989/93536), 268.00 MiB | 33.55 MiB/s
Receiving objects: 94% (87924/93536), 268.00 MiB | 33.55 MiB/s
Receiving objects: 95% (88860/93536), 268.00 MiB | 33.55 MiB/s
Receiving objects: 96% (89795/93536), 268.00 MiB | 33.55 MiB/s
Receiving objects: 97% (90730/93536), 268.00 MiB | 33.55 MiB/s
Receiving objects: 98% (91666/93536), 268.00 MiB | 33.55 MiB/s
Receiving objects: 99% (92601/93536), 268.00 MiB | 33.55 MiB/s
Receiving objects: 99% (93459/93536), 285.60 MiB | 33.56 MiB/s
remote: Total 93536 (delta 7878), reused 7306 (delta 7191), pack-reused 84387 (from 2)
12.88 s
Receiving objects: 100% (93536/93536), 302.98 MiB | 33.61 MiB/s
Receiving objects: 100% (93536/93536), 305.32 MiB | 33.39 MiB/s, done.
15.28 s
Resolving deltas: 0% (0/63012)
Resolving deltas: 1% (631/63012)
Resolving deltas: 2% (1261/63012)
Resolving deltas: 3% (1891/63012)
Resolving deltas: 4% (2522/63012)
Resolving deltas: 5% (3151/63012)
Resolving deltas: 6% (3781/63012)
Resolving deltas: 7% (4411/63012)
Resolving deltas: 8% (5041/63012)
Resolving deltas: 9% (5672/63012)
Resolving deltas: 10% (6302/63012)
Resolving deltas: 11% (6933/63012)
Resolving deltas: 12% (7562/63012)
Resolving deltas: 13% (8192/63012)
Resolving deltas: 14% (8823/63012)
Resolving deltas: 15% (9452/63012)
Resolving deltas: 16% (10082/63012)
Resolving deltas: 17% (10713/63012)
Resolving deltas: 18% (11344/63012)
Resolving deltas: 19% (11973/63012)
Resolving deltas: 20% (12603/63012)
Resolving deltas: 21% (13233/63012)
Resolving deltas: 22% (13863/63012)
Resolving deltas: 23% (14493/63012)
Resolving deltas: 24% (15123/63012)
Resolving deltas: 25% (15753/63012)
Resolving deltas: 26% (16384/63012)
Resolving deltas: 27% (17014/63012)
Resolving deltas: 28% (17644/63012)
Resolving deltas: 29% (18274/63012)
Resolving deltas: 30% (18904/63012)
Resolving deltas: 31% (19534/63012)
Resolving deltas: 32% (20164/63012)
Resolving deltas: 33% (20794/63012)
Resolving deltas: 34% (21425/63012)
Resolving deltas: 35% (22055/63012)
Resolving deltas: 36% (22685/63012)
Resolving deltas: 37% (23315/63012)
Resolving deltas: 38% (23945/63012)
Resolving deltas: 39% (24575/63012)
Resolving deltas: 40% (25205/63012)
Resolving deltas: 41% (25836/63012)
Resolving deltas: 42% (26466/63012)
Resolving deltas: 43% (27096/63012)
Resolving deltas: 44% (27726/63012)
Resolving deltas: 45% (28356/63012)
Resolving deltas: 46% (28986/63012)
Resolving deltas: 47% (29616/63012)
Resolving deltas: 48% (30246/63012)
Resolving deltas: 49% (30876/63012)
Resolving deltas: 50% (31506/63012)
Resolving deltas: 51% (32137/63012)
Resolving deltas: 52% (32767/63012)
Resolving deltas: 52% (33142/63012)
Resolving deltas: 53% (33397/63012)
Resolving deltas: 54% (34027/63012)
Resolving deltas: 55% (34657/63012)
Resolving deltas: 56% (35287/63012)
Resolving deltas: 57% (35917/63012)
Resolving deltas: 58% (36547/63012)
Resolving deltas: 59% (37178/63012)
Resolving deltas: 60% (37808/63012)
Resolving deltas: 61% (38438/63012)
Resolving deltas: 62% (39068/63012)
Resolving deltas: 63% (39698/63012)
Resolving deltas: 64% (40328/63012)
Resolving deltas: 65% (40958/63012)
Resolving deltas: 66% (41588/63012)
Resolving deltas: 67% (42219/63012)
Resolving deltas: 68% (42849/63012)
Resolving deltas: 69% (43479/63012)
Resolving deltas: 70% (44109/63012)
Resolving deltas: 71% (44739/63012)
Resolving deltas: 72% (45369/63012)
Resolving deltas: 73% (45999/63012)
Resolving deltas: 74% (46629/63012)
Resolving deltas: 75% (47259/63012)
Resolving deltas: 76% (47890/63012)
Resolving deltas: 77% (48520/63012)
Resolving deltas: 78% (49150/63012)
Resolving deltas: 79% (49780/63012)
Resolving deltas: 80% (50410/63012)
Resolving deltas: 81% (51040/63012)
Resolving deltas: 82% (51670/63012)
Resolving deltas: 82% (51755/63012)
Resolving deltas: 83% (52300/63012)
Resolving deltas: 84% (52931/63012)
Resolving deltas: 85% (53561/63012)
Resolving deltas: 86% (54191/63012)
Resolving deltas: 87% (54821/63012)
Resolving deltas: 88% (55451/63012)
Resolving deltas: 89% (56081/63012)
Resolving deltas: 90% (56711/63012)
Resolving deltas: 91% (57341/63012)
Resolving deltas: 92% (57973/63012)
Resolving deltas: 93% (58602/63012)
Resolving deltas: 94% (59232/63012)
Resolving deltas: 95% (59862/63012)
Resolving deltas: 96% (60492/63012)
Resolving deltas: 97% (61122/63012)
Resolving deltas: 98% (61752/63012)
Resolving deltas: 99% (62382/63012)
Resolving deltas: 100% (63012/63012)
Resolving deltas: 100% (63012/63012), done.
16.03 s
Fetching commit 436f9ff52587582686db6aefd4ecd715b5693f90 for simplify-spenso-api ...
16.03 s
$ /nix/store/bcnisk3ydfgv26v2gw3zlky24g00yww2-git-2.54.0/bin/git fetch origin 436f9ff52587582686db6aefd4ecd715b5693f90
16.59 s
From https://github.com/alphal00p/gammaloop
16.59 s
* branch 436f9ff52587582686db6aefd4ecd715b5693f90 -> FETCH_HEAD
16.65 s
$ /nix/store/9ypz3flqsrl5xl495mm8h645gadjsxi1-coreutils-9.11/bin/timeout --kill-after=15s 7200s /nix/store/bcnisk3ydfgv26v2gw3zlky24g00yww2-git-2.54.0/bin/git -c advice.detachedHead=false checkout 436f9ff52587582686db6aefd4ecd715b5693f90
17.00 s
HEAD is now at 436f9ff52 align Tymbolica interop with fixed Symbolica main
17.02 s
$ /nix/store/9ypz3flqsrl5xl495mm8h645gadjsxi1-coreutils-9.11/bin/timeout --kill-after=15s 7200s /nix/store/23zk8sgzamrbmj1fday15szf7f2279s8-nix-2.34.7/bin/nix --extra-experimental-features nix-command --extra-experimental-features flakes --log-format internal-json run .#packages.x86_64-linux.nix-ci-check-gammaloop-doctest --print-build-logs
24.45 s
24.59 s
Downloading cached boehm-gc from https://cache.nix-ci.com
24.59 s
Downloading cached busybox from https://cache.nix-ci.com
24.59 s
Downloading cached aws-c-common from https://cache.nix-ci.com
24.60 s
Downloading cached editline-1.17.1-unstable-2025-05 from https://cache.nix-ci.com
24.60 s
Downloading cached brotli-1.2.0-lib from https://cache.nix-ci.com
24.60 s
Downloading cached libseccomp-2.6.1-lib from https://cache.nix-ci.com
24.60 s
Downloading cached libsodium-1.0.22-unstable-2026-07 from https://cache.nix-ci.com
24.60 s
Downloading cached lowdown-3.0.1-lib from https://cache.nix-ci.com
24.60 s
Downloading cached libcpuid from https://cache.nix-ci.com
24.60 s
Downloading cached publicsuffix-list-0-unstable-2026-08 from https://cache.nix-ci.com
24.60 s
Downloading cached icu4c from https://cache.nix-ci.com
24.60 s
Downloading cached libssh2 from https://cache.nix-ci.com
24.60 s
Downloading cached libxml2 from https://cache.nix-ci.com
24.60 s
Downloading cached llhttp from https://cache.nix-ci.com
24.60 s
Downloading cached nghttp2-1.70.0-lib from https://cache.nix-ci.com
24.61 s
Downloading cached nghttp3 from https://cache.nix-ci.com
24.65 s
Downloaded cached llhttp (89 KiB) in 55ms
24.65 s
Progress: 0 of 1 built, 1 of 50 downloaded from cache (15 downloading)
24.65 s
Downloading cached hwloc-2.14.0-lib from https://cache.nix-ci.com
24.66 s
Downloaded cached nghttp2-1.70.0-lib (225 KiB) in 60ms
24.66 s
Progress: 0 of 1 built, 2 of 50 downloaded from cache (15 downloading)
24.66 s
Downloading cached keyutils-1.6.3-lib from https://cache.nix-ci.com
24.66 s
Downloaded cached editline-1.17.1-unstable-2025-05 (58 KiB) in 69ms
24.67 s
Progress: 0 of 1 built, 3 of 50 downloaded from cache (15 downloading)
24.67 s
Downloaded cached libseccomp-2.6.1-lib (189 KiB) in 68ms
24.67 s
Downloading cached ngtcp2 from https://cache.nix-ci.com
24.67 s
Progress: 0 of 1 built, 4 of 50 downloaded from cache (15 downloading)
24.67 s
Downloaded cached boehm-gc (312 KiB) in 73ms
24.67 s
Downloading cached s2n-tls from https://cache.nix-ci.com
24.67 s
Progress: 0 of 1 built, 5 of 50 downloaded from cache (15 downloading)
24.67 s
Downloaded cached publicsuffix-list-0-unstable-2026-08 (329 KiB) in 70ms
24.67 s
Downloaded cached nghttp3 (228 KiB) in 61ms
24.67 s
Progress: 0 of 1 built, 6 of 50 downloaded from cache (14 downloading)
24.67 s
Progress: 0 of 1 built, 7 of 50 downloaded from cache (14 downloading)
24.67 s
Downloading cached libpsl from https://cache.nix-ci.com
24.67 s
Downloaded cached libssh2 (330 KiB) in 72ms
24.67 s
Progress: 0 of 1 built, 8 of 50 downloaded from cache (13 downloading)
24.67 s
Downloaded cached libcpuid (326 KiB) in 73ms
24.67 s
Progress: 0 of 1 built, 9 of 50 downloaded from cache (13 downloading)
24.67 s
Downloading cached libgit2-1.9.7-lib from https://cache.nix-ci.com
24.67 s
Downloaded cached busybox (230 KiB) in 81ms
24.67 s
Progress: 0 of 1 built, 10 of 50 downloaded from cache (12 downloading)
24.67 s
Downloaded cached libsodium-1.0.22-unstable-2026-07 (669 KiB) in 77ms
24.67 s
Progress: 0 of 1 built, 11 of 50 downloaded from cache (11 downloading)
24.68 s
Downloaded cached brotli-1.2.0-lib (961 KiB) in 81ms
24.68 s
Progress: 0 of 1 built, 12 of 50 downloaded from cache (10 downloading)
24.68 s
Downloaded cached aws-c-common (1.1 MiB) in 82ms
24.68 s
Progress: 0 of 1 built, 13 of 50 downloaded from cache (9 downloading)
24.68 s
Downloading cached aws-c-cal from https://cache.nix-ci.com
24.68 s
Downloading cached aws-c-compression from https://cache.nix-ci.com
24.68 s
Downloading cached aws-c-sdkutils from https://cache.nix-ci.com
24.68 s
Downloading cached aws-checksums from https://cache.nix-ci.com
24.68 s
Downloaded cached lowdown-3.0.1-lib (341 KiB) in 84ms
24.68 s
Progress: 0 of 1 built, 14 of 50 downloaded from cache (12 downloading)
24.68 s
Downloaded cached libxml2 (1.4 MiB) in 86ms
24.68 s
Progress: 0 of 1 built, 15 of 50 downloaded from cache (11 downloading)
24.68 s
Downloading cached libarchive-3.8.9-lib from https://cache.nix-ci.com
24.69 s
Downloaded cached keyutils-1.6.3-lib (41 KiB) in 27ms
24.69 s
Progress: 0 of 1 built, 16 of 50 downloaded from cache (11 downloading)
24.69 s
Downloading cached krb5-1.22.2-lib from https://cache.nix-ci.com
24.69 s
Downloaded cached hwloc-2.14.0-lib (458 KiB) in 33ms
24.69 s
Progress: 0 of 1 built, 17 of 50 downloaded from cache (11 downloading)
24.69 s
Downloading cached onetbb from https://cache.nix-ci.com
24.69 s
Downloaded cached ngtcp2 (515 KiB) in 28ms
24.69 s
Progress: 0 of 1 built, 18 of 50 downloaded from cache (11 downloading)
24.70 s
Downloaded cached s2n-tls (1.3 MiB) in 35ms
24.70 s
Progress: 0 of 1 built, 19 of 50 downloaded from cache (10 downloading)
24.70 s
Downloaded cached libpsl (114 KiB) in 33ms
24.70 s
Progress: 0 of 1 built, 20 of 50 downloaded from cache (9 downloading)
24.71 s
Downloaded cached aws-checksums (86 KiB) in 29ms
24.71 s
Progress: 0 of 1 built, 21 of 50 downloaded from cache (8 downloading)
24.71 s
Downloaded cached aws-c-sdkutils (155 KiB) in 30ms
24.71 s
Progress: 0 of 1 built, 22 of 50 downloaded from cache (7 downloading)
24.71 s
Downloaded cached aws-c-compression (31 KiB) in 31ms
24.71 s
Progress: 0 of 1 built, 23 of 50 downloaded from cache (6 downloading)
24.71 s
Downloaded cached aws-c-cal (158 KiB) in 32ms
24.71 s
Progress: 0 of 1 built, 24 of 50 downloaded from cache (5 downloading)
24.71 s
Downloading cached aws-c-io from https://cache.nix-ci.com
24.72 s
Downloaded cached libgit2-1.9.7-lib (1.6 MiB) in 52ms
24.72 s
Progress: 0 of 1 built, 25 of 50 downloaded from cache (5 downloading)
24.72 s
Downloaded cached onetbb (626 KiB) in 35ms
24.72 s
Progress: 0 of 1 built, 26 of 50 downloaded from cache (4 downloading)
24.72 s
Downloading cached libblake3 from https://cache.nix-ci.com
24.73 s
Downloaded cached libarchive-3.8.9-lib (961 KiB) in 45ms
24.73 s
Progress: 0 of 1 built, 27 of 50 downloaded from cache (4 downloading)
24.75 s
Downloaded cached aws-c-io (648 KiB) in 34ms
24.75 s
Progress: 0 of 1 built, 28 of 50 downloaded from cache (3 downloading)
24.75 s
Downloading cached aws-c-event-stream from https://cache.nix-ci.com
24.75 s
Downloading cached aws-c-http from https://cache.nix-ci.com
24.75 s
Downloaded cached libblake3 (117 KiB) in 29ms
24.75 s
Progress: 0 of 1 built, 29 of 50 downloaded from cache (4 downloading)
24.75 s
Downloaded cached krb5-1.22.2-lib (2.7 MiB) in 66ms
24.75 s
Progress: 0 of 1 built, 30 of 50 downloaded from cache (3 downloading)
24.75 s
Downloading cached curl from https://cache.nix-ci.com
24.77 s
Downloaded cached aws-c-event-stream (176 KiB) in 20ms
24.77 s
Progress: 0 of 1 built, 31 of 50 downloaded from cache (3 downloading)
24.77 s
Downloaded cached aws-c-http (641 KiB) in 21ms
24.77 s
Progress: 0 of 1 built, 32 of 50 downloaded from cache (2 downloading)
24.77 s
Downloading cached aws-c-auth from https://cache.nix-ci.com
24.77 s
Downloading cached aws-c-mqtt from https://cache.nix-ci.com
24.77 s
Downloaded cached curl (1.2 MiB) in 17ms
24.77 s
Progress: 0 of 1 built, 33 of 50 downloaded from cache (3 downloading)
24.81 s
Downloaded cached aws-c-mqtt (557 KiB) in 37ms
24.81 s
Progress: 0 of 1 built, 34 of 50 downloaded from cache (2 downloading)
24.85 s
Downloaded cached icu4c (39.5 MiB) in 251ms
24.85 s
Progress: 0 of 1 built, 35 of 50 downloaded from cache (1 downloading)
24.85 s
Downloading cached boost from https://cache.nix-ci.com
24.89 s
Downloaded cached aws-c-auth (387 KiB) in 122ms
24.89 s
Progress: 0 of 1 built, 36 of 50 downloaded from cache (1 downloading)
24.89 s
Downloading cached aws-c-s3 from https://cache.nix-ci.com
24.91 s
Downloaded cached aws-c-s3 (384 KiB) in 22ms
24.91 s
Progress: 0 of 1 built, 37 of 50 downloaded from cache (1 downloading)
24.91 s
Downloading cached aws-crt-cpp from https://cache.nix-ci.com
24.93 s
Downloaded cached aws-crt-cpp (979 KiB) in 14ms
24.93 s
Progress: 0 of 1 built, 38 of 50 downloaded from cache (1 downloading)
25.00 s
Downloaded cached boost (14.5 MiB) in 148ms
25.00 s
Progress: 0 of 1 built, 39 of 50 downloaded from cache
25.00 s
Downloading cached nix-util from https://cache.nix-ci.com
25.04 s
Downloaded cached nix-util (2.4 MiB) in 45ms
25.04 s
Progress: 0 of 1 built, 40 of 50 downloaded from cache
25.04 s
Downloading cached nix-nswrapper from https://cache.nix-ci.com
25.04 s
Downloading cached nix-store from https://cache.nix-ci.com
25.08 s
Downloaded cached nix-store (5.8 MiB) in 34ms
25.08 s
Progress: 0 of 1 built, 41 of 50 downloaded from cache (1 downloading)
25.08 s
Downloading cached nix-fetchers from https://cache.nix-ci.com
25.08 s
Downloading cached nix-main from https://cache.nix-ci.com
25.10 s
Downloaded cached nix-main (393 KiB) in 24ms
25.10 s
Progress: 0 of 1 built, 42 of 50 downloaded from cache (2 downloading)
25.10 s
Downloaded cached nix-nswrapper (131 KiB) in 60ms
25.10 s
Progress: 0 of 1 built, 43 of 50 downloaded from cache (1 downloading)
25.11 s
Downloaded cached nix-fetchers (1.5 MiB) in 27ms
25.11 s
Progress: 0 of 1 built, 44 of 50 downloaded from cache
25.11 s
Downloading cached nix-expr from https://cache.nix-ci.com
25.23 s
Downloaded cached nix-expr (3.3 MiB) in 119ms
25.23 s
Progress: 0 of 1 built, 45 of 50 downloaded from cache
25.23 s
Downloading cached nix-flake from https://cache.nix-ci.com
25.26 s
Downloaded cached nix-flake (956 KiB) in 34ms
25.26 s
Progress: 0 of 1 built, 46 of 50 downloaded from cache
25.26 s
Downloading cached nix-cmd from https://cache.nix-ci.com
25.28 s
Downloaded cached nix-cmd (1 MiB) in 17ms
25.28 s
Progress: 0 of 1 built, 47 of 50 downloaded from cache
25.28 s
Downloading cached nix from https://cache.nix-ci.com
25.31 s
Downloaded cached nix (3.9 MiB) in 27ms
25.31 s
Progress: 0 of 1 built, 48 of 50 downloaded from cache
25.31 s
Downloading cached nix from https://cache.nix-ci.com
25.32 s
Downloaded cached nix (8848 B) in 15ms
25.32 s
Progress: 0 of 1 built, 49 of 50 downloaded from cache
25.32 s
Downloading cached nix-ci-check-gammaloop-doctest from https://cache.nix-ci.com
25.33 s
Downloaded cached nix-ci-check-gammaloop-doctest (1008 B) in 7ms
25.33 s
Progress: 0 of 1 built, 50 of 50 downloaded from cache
27.91 s
evaluating derivation 'g
copying '/nix/store/9x93
evaluating derivation 'g
querying gammaloop-works
[0 /9 built, 0.0 KiB DL]
[0 /1 built, 0.0 KiB DL]
[1 /0 /1 built, 0.0 KiB DLgammaloop-workspace-doctest> Running phase: unpackPhase
27.92 s
gammaloop-workspace-doctest> unpacking source archive /nix/store/jkbhll49z1x5ahw24kr1s7hg5j04yi8g-source
28.05 s
gammaloop-workspace-doctest> source root is source
28.08 s
gammaloop-workspace-doctest> Running phase: patchPhase
28.08 s
gammaloop-workspace-doctest> Executing configureCargoCommonVars
28.08 s
gammaloop-workspace-doctest> decompressing cargo artifacts from /nix/store/y3rckwyasbms4vpvjsg4f4zrvibk39ch-gammaloop-workspace-deps-deps-0.1.0/target.tar.zst to target
29.72 s
gammaloop-workspace-doctest> Running phase: updateAutotoolsGnuConfigScriptsPhase
29.76 s
gammaloop-workspace-doctest> Running phase: configurePhase
29.77 s
gammaloop-workspace-doctest> will append /build/source/.cargo-home/config.toml with contents of /nix/store/9rqk4093qnvgswmdk1pbxk9najcrjn7a-vendor-cargo-deps/config.toml
29.77 s
gammaloop-workspace-doctest> default configurePhase, nothing to do
29.77 s
gammaloop-workspace-doctest> Running phase: buildPhase
29.78 s
gammaloop-workspace-doctest> +++ command cargo --version
29.78 s
gammaloop-workspace-doctest> cargo 1.98.1 (797e8a9bc 2026-08-05)
29.82 s
gammaloop-workspace-doctest> +++ command cargo test --profile ci-optim --doc --locked --workspace --features gammaloop-api/cli,gammaloop-tracing-filter/clap,gammaloop-tracing-filter/symbolica,idenso/bincode,idenso/native,idenso/reference-cases,linnet/bincode,linnet/drawing,linnet/nodestore-vec,linnet/rkyv,linnet/serde,linnet/symbolica,spenso-macros/native,spenso-macros/shadowing,spenso/native,spenso/native-code-generation,spenso/shadowing,symbolica-utils/native,symbolica/tracing_max_level_info --exclude alphal00p-docs-python-exporter
30.35 s
gammaloop-workspace-doctest> Compiling target-lexicon v0.13.5
30.36 s
gammaloop-workspace-doctest> Compiling const-random-macro v0.1.16
30.37 s
gammaloop-workspace-doctest> Compiling phf_generator v0.11.3
30.38 s
gammaloop-workspace-doctest> Compiling rustpython-ast v0.4.0
30.38 s
gammaloop-workspace-doctest> Compiling similar v2.7.0
30.38 s
gammaloop-workspace-doctest> Compiling symbolica v2.2.0 (https://github.com/symbolica-dev/symbolica?rev=4f1323185fe5e0c0f8c864ab89edd1905e7adef1#4f132318)
30.39 s
gammaloop-workspace-doctest> Compiling derive_more-impl v2.1.1
30.40 s
gammaloop-workspace-doctest> Compiling gammaloop-tracing-filter-macros v0.1.0 (/build/source/crates/gammaloop-tracing-filter-macros)
30.40 s
gammaloop-workspace-doctest> Compiling vakint v0.1.2 (/build/source/crates/vakint)
30.42 s
gammaloop-workspace-doctest> Compiling gammalooprs v0.3.4 (/build/source/crates/gammalooprs)
30.42 s
gammaloop-workspace-doctest> Compiling gammaloop-api v0.1.0 (/build/source/crates/gammaloop-api)
30.43 s
gammaloop-workspace-doctest> Compiling alphal00p-docs-macros v0.1.0 (/build/source/crates/alphal00p-docs-macros)
30.43 s
gammaloop-workspace-doctest> Compiling proc-macro-error-attr2 v2.0.0
30.44 s
gammaloop-workspace-doctest> Compiling alphal00p-docs-schema v0.1.0 (/build/source/crates/alphal00p-docs-schema)
30.45 s
gammaloop-workspace-doctest> Compiling rustc_version v0.4.1
30.63 s
gammaloop-workspace-doctest> Compiling phf_codegen v0.11.3
30.71 s
gammaloop-workspace-doctest> Compiling unicode_names2_generator v1.3.0
30.75 s
gammaloop-workspace-doctest> Compiling figment v0.10.19
30.76 s
gammaloop-workspace-doctest> Compiling bincode v1.3.3
30.79 s
gammaloop-workspace-doctest> Compiling rustpython-parser v0.4.0
30.84 s
gammaloop-workspace-doctest> Compiling gungraun-runner v0.18.2
30.85 s
gammaloop-workspace-doctest> Compiling target-triple v1.0.1
31.04 s
gammaloop-workspace-doctest> Compiling insta v1.47.2
31.05 s
gammaloop-workspace-doctest> Compiling iai-callgrind-runner v0.14.2
31.06 s
gammaloop-workspace-doctest> Compiling const-random v0.1.18
31.12 s
gammaloop-workspace-doctest> Compiling ahash v0.8.12
31.13 s
gammaloop-workspace-doctest> Compiling proc-macro-error2 v2.0.1
31.31 s
gammaloop-workspace-doctest> Compiling gungraun-macros v0.8.0
31.37 s
gammaloop-workspace-doctest> Compiling symjit v2.25.6
31.38 s
gammaloop-workspace-doctest> Compiling numerica v3.0.0 (https://github.com/symbolica-dev/symbolica?rev=4f1323185fe5e0c0f8c864ab89edd1905e7adef1#4f132318)
31.38 s
gammaloop-workspace-doctest> Compiling momtrop v0.3.0
31.45 s
gammaloop-workspace-doctest> Compiling kurvst v0.1.0 (/build/source/crates/kurvst)
31.79 s
gammaloop-workspace-doctest> Compiling gammaloop-integration-tests v0.1.0 (/build/source/tests)
32.20 s
gammaloop-workspace-doctest> Compiling alphal00p-docs-catalogs v0.1.0 (/build/source/crates/alphal00p-docs-catalogs)
32.26 s
gammaloop-workspace-doctest> Compiling test-log-core v0.2.20
32.52 s
gammaloop-workspace-doctest> Compiling wait-timeout v0.2.1
32.57 s
gammaloop-workspace-doctest> Compiling bit-vec v0.8.0
32.81 s
gammaloop-workspace-doctest> Compiling iai-callgrind v0.14.2
32.91 s
gammaloop-workspace-doctest> Compiling pyo3-build-config v0.28.3
33.03 s
gammaloop-workspace-doctest> Compiling quick-error v1.2.3
33.18 s
gammaloop-workspace-doctest> Compiling rusty-fork v0.3.1
33.23 s
gammaloop-workspace-doctest> Compiling bit-set v0.8.0
35.62 s
gammaloop-workspace-doctest> Compiling rand_xorshift v0.4.0
35.68 s
gammaloop-workspace-doctest> Compiling unicode_names2 v1.3.0
35.81 s
gammaloop-workspace-doctest> Compiling console v0.15.11
35.95 s
gammaloop-workspace-doctest> Compiling base64 v0.21.7
36.50 s
gammaloop-workspace-doctest> Compiling test-log-macros v0.2.20
36.76 s
gammaloop-workspace-doctest> Compiling glob v0.3.4
37.58 s
gammaloop-workspace-doctest> Compiling termcolor v1.4.1
37.77 s
gammaloop-workspace-doctest> Compiling alphal00p-docs-examples v0.1.0 (/build/source/crates/alphal00p-docs-examples)
37.93 s
gammaloop-workspace-doctest> Compiling unarray v0.1.4
38.01 s
gammaloop-workspace-doctest> Compiling clinnet v0.1.8 (/build/source/crates/clinnet)
38.05 s
gammaloop-workspace-doctest> Compiling proptest v1.11.0
38.16 s
gammaloop-workspace-doctest> Compiling alphal00p-docs-builder v0.1.0 (/build/source/crates/alphal00p-docs-builder)
38.43 s
gammaloop-workspace-doctest> Compiling trybuild v1.0.120
38.56 s
gammaloop-workspace-doctest> Compiling ron v0.8.1
40.12 s
gammaloop-workspace-doctest> Compiling graphica v3.0.0 (https://github.com/symbolica-dev/symbolica?rev=4f1323185fe5e0c0f8c864ab89edd1905e7adef1#4f132318)
41.11 s
gammaloop-workspace-doctest> Compiling test-log v0.2.20
41.18 s
gammaloop-workspace-doctest> Compiling similar-asserts v1.7.0
42.53 s
gammaloop-workspace-doctest> Compiling pyo3-macros-backend v0.28.3
42.80 s
gammaloop-workspace-doctest> Compiling pyo3-ffi v0.28.3
43.67 s
gammaloop-workspace-doctest> Compiling pyo3 v0.28.3
44.11 s
gammaloop-workspace-doctest> Compiling numpy v0.28.0
44.14 s
gammaloop-workspace-doctest> Compiling linnet-py v0.1.0 (/build/source/crates/linnet-py)
47.14 s
gammaloop-workspace-doctest> Compiling derive_more v2.1.1
47.24 s
gammaloop-workspace-doctest> Compiling crossterm v0.29.0
49.28 s
gammaloop-workspace-doctest> Compiling ratatui-crossterm v0.1.0
49.74 s
gammaloop-workspace-doctest> Compiling ratatui v0.30.0
50.07 s
gammaloop-workspace-doctest> Compiling iai-callgrind-macros v0.5.1
58.31 s
gammaloop-workspace-doctest> Compiling pyo3-stub-gen-derive v0.17.2
60.53 s
gammaloop-workspace-doctest> Compiling gungraun v0.18.2
67.75 s
gammaloop-workspace-doctest> Compiling pyo3-macros v0.28.3
89.51 s
gammaloop-workspace-doctest> Compiling symbolica-utils v0.1.0 (/build/source/crates/symbolica-utils)
133.96 s
gammaloop-workspace-doctest> Compiling tymbolica-atom-payload v0.1.0 (https://github.com/lcnbr/tymbolica?rev=32ae00483b4845161401afac8be755cc336cb2bb#32ae0048)
403.01 s
gammaloop-workspace-doctest> Compiling gammaloop-workspace-hack v0.1.0 (/build/source/crates/gammaloop-workspace-hack)
403.01 s
gammaloop-workspace-doctest> Compiling spenso-macros v0.3.2 (/build/source/crates/spenso-macros)
403.18 s
gammaloop-workspace-doctest> Compiling linnet v0.17.0 (/build/source/crates/linnet)
406.78 s
gammaloop-workspace-doctest> Compiling spenso v0.6.0 (/build/source/crates/spenso)
415.67 s
gammaloop-workspace-doctest> Compiling idenso v0.3.0 (/build/source/crates/idenso)
415.67 s
gammaloop-workspace-doctest> Compiling gammaloop-tracing-filter v0.1.0 (/build/source/crates/gammaloop-tracing-filter)
421.30 s
gammaloop-workspace-doctest> Compiling spenso-hep-lib v0.1.7 (/build/source/crates/spenso-hep-lib)
421.60 s
gammaloop-workspace-doctest> Compiling spynso3 v0.1.2 (/build/source/crates/spynso3)
477.83 s
gammaloop-workspace-doctest> Compiling linnest v0.1.0 (/build/source/crates/linnest)
703.03 s
gammaloop-workspace-doctest> Finished `ci-optim` profile [optimized] target(s) in 11m 13s
703.23 s
gammaloop-workspace-doctest> warning : the following packages contain code that will be rejected by a future version of Rust: proc-macro-error2 v2.0.1
703.23 s
gammaloop-workspace-doctest> note : to see what the problems were, use the option `--future-incompat-report`, or run `cargo report future-incompatibilities --id 1`
703.28 s
gammaloop-workspace-doctest> Doc-tests alphal00p_docs_builder
703.47 s
gammaloop-workspace-doctest>
703.47 s
gammaloop-workspace-doctest> running 0 tests
703.47 s
gammaloop-workspace-doctest>
703.47 s
gammaloop-workspace-doctest> test result: ok. 0 passed; 0 failed; 0 ignored; 0 measured; 0 filtered out; finished in 0.00s
703.47 s
gammaloop-workspace-doctest>
703.48 s
gammaloop-workspace-doctest> Doc-tests alphal00p_docs_catalogs
705.00 s
gammaloop-workspace-doctest>
705.00 s
gammaloop-workspace-doctest> running 0 tests
705.00 s
gammaloop-workspace-doctest>
705.00 s
gammaloop-workspace-doctest> test result: ok. 0 passed; 0 failed; 0 ignored; 0 measured; 0 filtered out; finished in 0.00s
705.00 s
gammaloop-workspace-doctest>
705.00 s
gammaloop-workspace-doctest> Doc-tests alphal00p_docs_examples
705.03 s
gammaloop-workspace-doctest>
705.03 s
gammaloop-workspace-doctest> running 0 tests
705.03 s
gammaloop-workspace-doctest>
705.03 s
gammaloop-workspace-doctest> test result: ok. 0 passed; 0 failed; 0 ignored; 0 measured; 0 filtered out; finished in 0.00s
705.03 s
gammaloop-workspace-doctest>
705.03 s
gammaloop-workspace-doctest> Doc-tests alphal00p_docs
705.11 s
gammaloop-workspace-doctest>
705.11 s
gammaloop-workspace-doctest> running 0 tests
705.11 s
gammaloop-workspace-doctest>
705.11 s
gammaloop-workspace-doctest> test result: ok. 0 passed; 0 failed; 0 ignored; 0 measured; 0 filtered out; finished in 0.00s
705.11 s
gammaloop-workspace-doctest>
705.11 s
gammaloop-workspace-doctest> Doc-tests alphal00p_docs_schema
705.23 s
gammaloop-workspace-doctest>
705.23 s
gammaloop-workspace-doctest> running 0 tests
705.23 s
gammaloop-workspace-doctest>
705.23 s
gammaloop-workspace-doctest> test result: ok. 0 passed; 0 failed; 0 ignored; 0 measured; 0 filtered out; finished in 0.00s
705.23 s
gammaloop-workspace-doctest>
705.24 s
gammaloop-workspace-doctest> Doc-tests clinnet
705.29 s
gammaloop-workspace-doctest>
705.29 s
gammaloop-workspace-doctest> running 0 tests
705.29 s
gammaloop-workspace-doctest>
705.29 s
gammaloop-workspace-doctest> test result: ok. 0 passed; 0 failed; 0 ignored; 0 measured; 0 filtered out; finished in 0.00s
705.29 s
gammaloop-workspace-doctest>
705.29 s
gammaloop-workspace-doctest> Doc-tests gammaloop_api
706.27 s
gammaloop-workspace-doctest>
706.27 s
gammaloop-workspace-doctest> running 2 tests
706.36 s
gammaloop-workspace-doctest> test crates/gammaloop-api/src/lib.rs - (line 18) - compile ... ok
709.55 s
gammaloop-workspace-doctest> test crates/gammaloop-api/src/commands/evaluate_samples.rs - commands::evaluate_samples::EvaluateSamples (line 49) ... ok
709.55 s
gammaloop-workspace-doctest>
709.55 s
gammaloop-workspace-doctest> test result: ok. 2 passed; 0 failed; 0 ignored; 0 measured; 0 filtered out; finished in 3.28s
709.55 s
gammaloop-workspace-doctest>
709.55 s
gammaloop-workspace-doctest> Doc-tests gammaloop_integration_tests
709.63 s
gammaloop-workspace-doctest>
709.63 s
gammaloop-workspace-doctest> running 0 tests
709.63 s
gammaloop-workspace-doctest>
709.63 s
gammaloop-workspace-doctest> test result: ok. 0 passed; 0 failed; 0 ignored; 0 measured; 0 filtered out; finished in 0.00s
709.63 s
gammaloop-workspace-doctest>
709.64 s
gammaloop-workspace-doctest> Doc-tests gammaloop_tracing_filter
709.72 s
gammaloop-workspace-doctest>
709.72 s
gammaloop-workspace-doctest> running 0 tests
709.72 s
gammaloop-workspace-doctest>
709.72 s
gammaloop-workspace-doctest> test result: ok. 0 passed; 0 failed; 0 ignored; 0 measured; 0 filtered out; finished in 0.00s
709.72 s
gammaloop-workspace-doctest>
709.72 s
gammaloop-workspace-doctest> Doc-tests gammaloop_tracing_filter_macros
710.14 s
gammaloop-workspace-doctest>
710.14 s
gammaloop-workspace-doctest> running 2 tests
710.14 s
gammaloop-workspace-doctest> test crates/gammaloop-tracing-filter-macros/src/lib.rs - debug_instrument (line 14) ... ignored
710.14 s
gammaloop-workspace-doctest> test crates/gammaloop-tracing-filter-macros/src/lib.rs - debug_instrument (line 8) ... ignored
710.14 s
gammaloop-workspace-doctest>
710.14 s
gammaloop-workspace-doctest> test result: ok. 0 passed; 0 failed; 2 ignored; 0 measured; 0 filtered out; finished in 0.00s
710.14 s
gammaloop-workspace-doctest>
710.14 s
gammaloop-workspace-doctest> all doctests ran in 0.40s; merged doctests compilation took 0.39s
710.14 s
gammaloop-workspace-doctest> Doc-tests gammaloop_workspace_hack
710.16 s
gammaloop-workspace-doctest>
710.16 s
gammaloop-workspace-doctest> running 0 tests
710.16 s
gammaloop-workspace-doctest>
710.16 s
gammaloop-workspace-doctest> test result: ok. 0 passed; 0 failed; 0 ignored; 0 measured; 0 filtered out; finished in 0.00s
710.16 s
gammaloop-workspace-doctest>
710.17 s
gammaloop-workspace-doctest> Doc-tests gammalooprs
714.92 s
gammaloop-workspace-doctest>
714.92 s
gammaloop-workspace-doctest> running 2 tests
714.92 s
gammaloop-workspace-doctest> test crates/gammalooprs/src/integrands/process/mod.rs - integrands::process::ProcessIntegrandImpl::signal_external_momenta_changed (line 2381) ... ignored
714.93 s
gammaloop-workspace-doctest> test crates/gammalooprs/src/utils/linnet_ext.rs - utils::linnet_ext::Permutation::from_mappings (line 27) ... ok
714.93 s
gammaloop-workspace-doctest>
714.93 s
gammaloop-workspace-doctest> test result: ok. 1 passed; 0 failed; 1 ignored; 0 measured; 0 filtered out; finished in 0.00s
714.93 s
gammaloop-workspace-doctest>
714.94 s
gammaloop-workspace-doctest> all doctests ran in 1.78s; merged doctests compilation took 1.76s
714.95 s
gammaloop-workspace-doctest> Doc-tests idenso
715.62 s
gammaloop-workspace-doctest>
715.62 s
gammaloop-workspace-doctest> running 5 tests
715.62 s
gammaloop-workspace-doctest> test crates/idenso/src/color/macros.rs - color::macros::color_f (line 109) ... ignored
715.62 s
gammaloop-workspace-doctest> test crates/idenso/src/color/macros.rs - color::macros::color_t (line 18) ... ignored
715.62 s
gammaloop-workspace-doctest> test crates/idenso/src/dirac/macros.rs - dirac::macros::gamma (line 28) ... ignored
715.62 s
gammaloop-workspace-doctest> test crates/idenso/src/dirac/macros.rs - dirac::macros::gamma0 (line 259) ... ignored
715.62 s
gammaloop-workspace-doctest> test crates/idenso/src/dirac/macros.rs - dirac::macros::u (line 155) ... ignored
715.62 s
gammaloop-workspace-doctest>
715.62 s
gammaloop-workspace-doctest> test result: ok. 0 passed; 0 failed; 5 ignored; 0 measured; 0 filtered out; finished in 0.00s
715.62 s
gammaloop-workspace-doctest>
715.63 s
gammaloop-workspace-doctest> all doctests ran in 0.28s; merged doctests compilation took 0.28s
715.63 s
gammaloop-workspace-doctest> Doc-tests kurvst
715.73 s
gammaloop-workspace-doctest>
715.73 s
gammaloop-workspace-doctest> running 0 tests
715.73 s
gammaloop-workspace-doctest>
715.73 s
gammaloop-workspace-doctest> test result: ok. 0 passed; 0 failed; 0 ignored; 0 measured; 0 filtered out; finished in 0.00s
715.73 s
gammaloop-workspace-doctest>
715.74 s
gammaloop-workspace-doctest> Doc-tests linnest
716.02 s
gammaloop-workspace-doctest>
716.03 s
gammaloop-workspace-doctest> running 0 tests
716.03 s
gammaloop-workspace-doctest>
716.03 s
gammaloop-workspace-doctest> test result: ok. 0 passed; 0 failed; 0 ignored; 0 measured; 0 filtered out; finished in 0.00s
716.03 s
gammaloop-workspace-doctest>
716.03 s
gammaloop-workspace-doctest> Doc-tests linnet
716.58 s
gammaloop-workspace-doctest>
716.58 s
gammaloop-workspace-doctest> running 46 tests
716.58 s
gammaloop-workspace-doctest> test crates/linnet/src/half_edge/algorithms/transitive_ops.rs - half_edge::algorithms::transitive_ops::HedgeGraph<E,V,H,N>::transitive_closure (line 164) ... ignored
716.58 s
gammaloop-workspace-doctest> test crates/linnet/src/half_edge/algorithms/transitive_ops.rs - half_edge::algorithms::transitive_ops::HedgeGraph<E,V,H,N>::transitive_reduction (line 300) ... ignored
716.58 s
gammaloop-workspace-doctest> test crates/linnet/src/half_edge/builder.rs - half_edge::builder::HedgeGraphBuilder (line 108) ... ignored
721.01 s
gammaloop-workspace-doctest> test crates/linnet/src/half_edge/algorithms/trace_unfold.rs - half_edge::algorithms::trace_unfold::TraceKey<O,D>::empty (line 1071) ... ok
721.76 s
gammaloop-workspace-doctest> test crates/linnet/src/half_edge/algorithms/trace_unfold.rs - half_edge::algorithms::trace_unfold::TraceKey<O,D>::from_levels (line 1089) ... ok
721.82 s
gammaloop-workspace-doctest> test crates/linnet/src/half_edge/algorithms/trace_unfold.rs - half_edge::algorithms::trace_unfold::TraceKey<O,D>::push (line 1253) ... ok
722.91 s
gammaloop-workspace-doctest> test crates/linnet/src/half_edge/algorithms/trace_unfold.rs - half_edge::algorithms::trace_unfold::TraceKey (line 1029) ... ok
723.24 s
gammaloop-workspace-doctest> test crates/linnet/src/half_edge/algorithms/trace_unfold.rs - half_edge::algorithms::trace_unfold::TraceKey<O,D>::is_empty (line 1136) ... ok
723.35 s
gammaloop-workspace-doctest> test crates/linnet/src/half_edge/algorithms/trace_unfold.rs - half_edge::algorithms::trace_unfold::TraceKey<O,D>::iter_leaf_ops (line 1222) ... ok
723.41 s
gammaloop-workspace-doctest> test crates/linnet/src/half_edge/algorithms/trace_unfold.rs - half_edge::algorithms::trace_unfold::TraceKey<O,D>::view (line 1110) ... ok
723.44 s
gammaloop-workspace-doctest> test crates/linnet/src/half_edge/algorithms/trace_unfold.rs - half_edge::algorithms::trace_unfold::TraceKey<O,D>::iter_levels_bottom_up (line 1194) ... ok
723.56 s
gammaloop-workspace-doctest> test crates/linnet/src/half_edge/algorithms/trace_unfold.rs - half_edge::algorithms::trace_unfold::TraceKeyView (line 872) ... ok
723.80 s
gammaloop-workspace-doctest> test crates/linnet/src/permutation.rs - permutation::Permutation (line 61) ... ok
724.31 s
gammaloop-workspace-doctest> test crates/linnet/src/half_edge/algorithms/trace_unfold.rs - half_edge::algorithms::trace_unfold::TraceKey<O,D>::iter_levels_top_down (line 1164) ... ok
724.47 s
gammaloop-workspace-doctest> test crates/linnet/src/half_edge/algorithms/trace_unfold.rs - half_edge::algorithms::trace_unfold::TraceKey<O,D>::write_foata_like (line 1356) ... ok
724.55 s
gammaloop-workspace-doctest> test crates/linnet/src/parser/mod.rs - parser (line 17) ... ok
725.22 s
gammaloop-workspace-doctest> test crates/linnet/src/half_edge/algorithms/trace_unfold.rs - half_edge::algorithms::trace_unfold::TraceKeyView<'a,O,D>::to_owned (line 979) ... ok
725.64 s
gammaloop-workspace-doctest> test crates/linnet/src/half_edge/algorithms/trace_unfold.rs - half_edge::algorithms::trace_unfold::TraceUnfold (line 127) ... ok
725.66 s
gammaloop-workspace-doctest> test crates/linnet/src/half_edge/algorithms/trace_unfold.rs - half_edge::algorithms::trace_unfold::TraceUnfold::realizations_for_op (line 213) ... ok
726.19 s
gammaloop-workspace-doctest> test crates/linnet/src/permutation.rs - permutation::Permutation::apply_slice (line 451) ... ok
726.26 s
gammaloop-workspace-doctest> test crates/linnet/src/permutation.rs - permutation::Permutation::cycle_to_transpositions (line 713) ... ok
727.07 s
gammaloop-workspace-doctest> test crates/linnet/src/permutation.rs - permutation::Permutation::from_map (line 113) ... ok
728.50 s
gammaloop-workspace-doctest> test crates/linnet/src/permutation.rs - permutation::Permutation::from_cycles (line 1069) ... ok
729.19 s
gammaloop-workspace-doctest> test crates/linnet/src/permutation.rs - permutation::Permutation::apply_slice_in_place_inv (line 510) ... ok
729.65 s
gammaloop-workspace-doctest> test crates/linnet/src/permutation.rs - permutation::Permutation::apply_slice_in_place (line 488) ... ok
729.89 s
gammaloop-workspace-doctest> test crates/linnet/src/permutation.rs - permutation::Permutation::inv (line 416) ... ok
730.36 s
gammaloop-workspace-doctest> test crates/linnet/src/permutation.rs - permutation::Permutation::apply_slice_inv (line 469) ... ok
730.40 s
gammaloop-workspace-doctest> test crates/linnet/src/permutation.rs - permutation::Permutation::find_cycles (line 680) ... ok
730.67 s
gammaloop-workspace-doctest> test crates/linnet/src/permutation.rs - permutation::Permutation::from_prefix_sources (line 266) ... ok
730.81 s
gammaloop-workspace-doctest> test crates/linnet/src/permutation.rs - permutation::Permutation::from_disjoint_cycles (line 978) ... ok
730.86 s
gammaloop-workspace-doctest> test crates/linnet/src/permutation.rs - permutation::Permutation::iter_slice (line 543) ... ok
731.41 s
gammaloop-workspace-doctest> test crates/linnet/src/permutation.rs - permutation::Permutation::map (line 402) ... ok
732.57 s
gammaloop-workspace-doctest> test crates/linnet/src/permutation.rs - permutation::Permutation::inverse (line 434) ... ok
732.62 s
gammaloop-workspace-doctest> test crates/linnet/src/permutation.rs - permutation::Permutation::id (line 96) ... ok
732.66 s
gammaloop-workspace-doctest> test crates/linnet/src/permutation.rs - permutation::Permutation::iter_slice_mut (line 588) ... ok
732.92 s
gammaloop-workspace-doctest> test crates/linnet/src/permutation.rs - permutation::Permutation::myrvold_ruskey_unrank1 (line 782) ... ok
733.15 s
gammaloop-workspace-doctest> test crates/linnet/src/permutation.rs - permutation::Permutation::is_identity (line 851) ... ok
733.29 s
gammaloop-workspace-doctest> test crates/linnet/src/permutation.rs - permutation::Permutation::iter_slice_inv (line 562) ... ok
733.44 s
gammaloop-workspace-doctest> test crates/linnet/src/permutation.rs - permutation::Permutation::iter_slice_inv_mut (line 615) ... ok
734.05 s
gammaloop-workspace-doctest> test crates/linnet/src/permutation.rs - permutation::Permutation::myrvold_ruskey_rank1 (line 760) ... ok
734.16 s
gammaloop-workspace-doctest> test crates/linnet/src/permutation.rs - permutation::Permutation::myrvold_ruskey_rank2 (line 805) ... ok
734.67 s
gammaloop-workspace-doctest> test crates/linnet/src/permutation.rs - permutation::Permutation::myrvold_ruskey_unrank2 (line 828) ... ok
734.75 s
gammaloop-workspace-doctest> test crates/linnet/src/permutation.rs - permutation::Permutation::sign (line 869) ... ok
734.76 s
gammaloop-workspace-doctest> test crates/linnet/src/permutation.rs - permutation::Permutation::transpositions (line 733) ... ok
734.86 s
gammaloop-workspace-doctest> test crates/linnet/src/permutation.rs - permutation::Permutation::sort (line 640) ... ok
734.88 s
gammaloop-workspace-doctest> test crates/linnet/src/permutation.rs - permutation::Permutation::pow (line 896) ... ok
734.88 s
gammaloop-workspace-doctest>
734.88 s
gammaloop-workspace-doctest> test result: ok. 43 passed; 0 failed; 3 ignored; 0 measured; 0 filtered out; finished in 18.31s
734.88 s
gammaloop-workspace-doctest>
734.89 s
gammaloop-workspace-doctest> Doc-tests linnet_py
735.67 s
gammaloop-workspace-doctest>
735.67 s
gammaloop-workspace-doctest> running 0 tests
735.67 s
gammaloop-workspace-doctest>
735.67 s
gammaloop-workspace-doctest> test result: ok. 0 passed; 0 failed; 0 ignored; 0 measured; 0 filtered out; finished in 0.00s
735.67 s
gammaloop-workspace-doctest>
735.67 s
gammaloop-workspace-doctest> Doc-tests spenso
740.20 s
gammaloop-workspace-doctest>
740.20 s
gammaloop-workspace-doctest> running 9 tests
740.20 s
gammaloop-workspace-doctest> test crates/spenso/src/shadowing/macros.rs - shadowing::macros::antisym (line 337) ... ignored
740.20 s
gammaloop-workspace-doctest> test crates/spenso/src/shadowing/macros.rs - shadowing::macros::chain (line 387) ... ignored
740.20 s
gammaloop-workspace-doctest> test crates/spenso/src/shadowing/macros.rs - shadowing::macros::cyclic (line 361) ... ignored
740.20 s
gammaloop-workspace-doctest> test crates/spenso/src/shadowing/macros.rs - shadowing::macros::slot (line 24) ... ignored
740.20 s
gammaloop-workspace-doctest> test crates/spenso/src/shadowing/macros.rs - shadowing::macros::sym (line 313) ... ignored
740.20 s
gammaloop-workspace-doctest> test crates/spenso/src/shadowing/macros.rs - shadowing::macros::tensor (line 110) ... ignored
740.20 s
gammaloop-workspace-doctest> test crates/spenso/src/shadowing/macros.rs - shadowing::macros::trace (line 444) ... ignored
740.20 s
gammaloop-workspace-doctest> test crates/spenso/src/shadowing/macros.rs - shadowing::macros::trace_sym (line 496) ... ignored
740.53 s
gammaloop-workspace-doctest> test crates/spenso/src/network/mod.rs - network::Network (line 1693) ... FAILED
740.53 s
gammaloop-workspace-doctest>
740.53 s
gammaloop-workspace-doctest> failures:
740.53 s
gammaloop-workspace-doctest>
740.53 s
gammaloop-workspace-doctest> ---- crates/spenso/src/network/mod.rs - network::Network (line 1693) stdout ----
740.53 s
gammaloop-workspace-doctest> Test executable failed (terminated by signal).
740.53 s
gammaloop-workspace-doctest>
740.53 s
gammaloop-workspace-doctest> stdout:
740.53 s
gammaloop-workspace-doctest> ┌────────────────────────────────────────────────────────┐
740.53 s
gammaloop-workspace-doctest> │ You are running a restricted Symbolica instance. │
740.53 s
gammaloop-workspace-doctest> │ │
740.53 s
gammaloop-workspace-doctest> │ For non-commercial use only, limited to one │
740.53 s
gammaloop-workspace-doctest> │ Symbolica thread per user. │
740.53 s
gammaloop-workspace-doctest> │ │
740.53 s
gammaloop-workspace-doctest> ├─ Unlock all cores ─────────────────────────────────────┤
740.53 s
gammaloop-workspace-doctest> │ │
740.53 s
gammaloop-workspace-doctest> │ Hobbyists and students: free annual key │
740.53 s
gammaloop-workspace-doctest> │ https://symbolica.io/license/#get-hobbyist-license │
740.53 s
gammaloop-workspace-doctest> │ │
740.53 s
gammaloop-workspace-doctest> │ Free 30-day professional trial: │
740.53 s
gammaloop-workspace-doctest> │ https://symbolica.io/license/#get-trial-license │
740.53 s
gammaloop-workspace-doctest> │ │
740.53 s
gammaloop-workspace-doctest> └────────────────────────────────────────────────────────┘
740.53 s
gammaloop-workspace-doctest> ┌──────────────────────────────────────────────────────────────────────────────────────────────────┐
740.53 s
gammaloop-workspace-doctest> │ Cannot start another restricted Symbolica thread while this user's thread allowance is in use. │
740.53 s
gammaloop-workspace-doctest> └──────────────────────────────────────────────────────────────────────────────────────────────────┘
740.53 s
gammaloop-workspace-doctest>
740.53 s
gammaloop-workspace-doctest> stderr:
740.53 s
gammaloop-workspace-doctest> ┌────────────────────────────────────────────────────────┐
740.53 s
gammaloop-workspace-doctest> │ The Symbolica license key format is outdated. │
740.53 s
gammaloop-workspace-doctest> │ Renew your key at https://symbolica.io/license/ │
740.53 s
gammaloop-workspace-doctest> └────────────────────────────────────────────────────────┘
740.53 s
gammaloop-workspace-doctest> Could not acquire Symbolica thread permit: Permission denied (os error 13)
740.53 s
gammaloop-workspace-doctest>
740.53 s
gammaloop-workspace-doctest>
740.53 s
gammaloop-workspace-doctest>
740.53 s
gammaloop-workspace-doctest> failures:
740.53 s
gammaloop-workspace-doctest> crates/spenso/src/network/mod.rs - network::Network (line 1693)
740.53 s
gammaloop-workspace-doctest>
740.53 s
gammaloop-workspace-doctest> test result: FAILED. 0 passed; 1 failed; 8 ignored; 0 measured; 0 filtered out; finished in 0.33s
740.53 s
gammaloop-workspace-doctest>
740.54 s
gammaloop-workspace-doctest> all doctests ran in 4.18s; merged doctests compilation took 3.83s
740.55 s
gammaloop-workspace-doctest> error : doctest failed, to rerun pass `-p spenso --doc`
741.32 s
[0 built (1 failed ), 0.0 error: Cannot build '/nix/store/qkv16lywvzf7qi552d4ffa1rpqvbynj9-gammaloop-workspace-doctest-0.1.0.drv '.
741.32 s
Reason: builder failed with exit code 101 .
741.32 s
Output paths:
741.32 s
/nix/store/j6lkxlfh6a3ywr1qm199xz6v2ids5ry0-gammaloop-workspace-doctest-0.1.0
741.32 s
Last 316 log lines:
741.32 s
> Running phase: unpackPhase
741.32 s
> unpacking source archive /nix/store/jkbhll49z1x5ahw24kr1s7hg5j04yi8g-source
741.32 s
> source root is source
741.32 s
> Running phase: patchPhase
741.32 s
> Executing configureCargoCommonVars
741.32 s
> decompressing cargo artifacts from /nix/store/y3rckwyasbms4vpvjsg4f4zrvibk39ch-gammaloop-workspace-deps-deps-0.1.0/target.tar.zst to target
741.32 s
> Running phase: updateAutotoolsGnuConfigScriptsPhase
741.32 s
> Running phase: configurePhase
741.32 s
> will append /build/source/.cargo-home/config.toml with contents of /nix/store/9rqk4093qnvgswmdk1pbxk9najcrjn7a-vendor-cargo-deps/config.toml
741.32 s
> default configurePhase, nothing to do
741.32 s
> Running phase: buildPhase
741.32 s
> +++ command cargo --version
741.32 s
> cargo 1.98.1 (797e8a9bc 2026-08-05)
741.32 s
> +++ command cargo test --profile ci-optim --doc --locked --workspace --features gammaloop-api/cli,gammaloop-tracing-filter/clap,gammaloop-tracing-filter/symbolica,idenso/bincode,idenso/native,idenso/reference-cases,linnet/bincode,linnet/drawing,linnet/nodestore-vec,linnet/rkyv,linnet/serde,linnet/symbolica,spenso-macros/native,spenso-macros/shadowing,spenso/native,spenso/native-code-generation,spenso/shadowing,symbolica-utils/native,symbolica/tracing_max_level_info --exclude alphal00p-docs-python-exporter
741.32 s
> Compiling target-lexicon v0.13.5
741.32 s
> Compiling const-random-macro v0.1.16
741.32 s
> Compiling phf_generator v0.11.3
741.32 s
> Compiling rustpython-ast v0.4.0
741.32 s
> Compiling similar v2.7.0
741.32 s
> Compiling symbolica v2.2.0 (https://github.com/symbolica-dev/symbolica?rev=4f1323185fe5e0c0f8c864ab89edd1905e7adef1#4f132318)
741.32 s
> Compiling derive_more-impl v2.1.1
741.32 s
> Compiling gammaloop-tracing-filter-macros v0.1.0 (/build/source/crates/gammaloop-tracing-filter-macros)
741.32 s
> Compiling vakint v0.1.2 (/build/source/crates/vakint)
741.32 s
> Compiling gammalooprs v0.3.4 (/build/source/crates/gammalooprs)
741.32 s
> Compiling gammaloop-api v0.1.0 (/build/source/crates/gammaloop-api)
741.32 s
> Compiling alphal00p-docs-macros v0.1.0 (/build/source/crates/alphal00p-docs-macros)
741.32 s
> Compiling proc-macro-error-attr2 v2.0.0
741.32 s
> Compiling alphal00p-docs-schema v0.1.0 (/build/source/crates/alphal00p-docs-schema)
741.32 s
> Compiling rustc_version v0.4.1
741.32 s
> Compiling phf_codegen v0.11.3
741.32 s
> Compiling unicode_names2_generator v1.3.0
741.32 s
> Compiling figment v0.10.19
741.32 s
> Compiling bincode v1.3.3
741.32 s
> Compiling rustpython-parser v0.4.0
741.32 s
> Compiling gungraun-runner v0.18.2
741.32 s
> Compiling target-triple v1.0.1
741.32 s
> Compiling insta v1.47.2
741.32 s
> Compiling iai-callgrind-runner v0.14.2
741.32 s
> Compiling const-random v0.1.18
741.32 s
> Compiling ahash v0.8.12
741.32 s
> Compiling proc-macro-error2 v2.0.1
741.32 s
> Compiling gungraun-macros v0.8.0
741.32 s
> Compiling symjit v2.25.6
741.32 s
> Compiling numerica v3.0.0 (https://github.com/symbolica-dev/symbolica?rev=4f1323185fe5e0c0f8c864ab89edd1905e7adef1#4f132318)
741.32 s
> Compiling momtrop v0.3.0
741.32 s
> Compiling kurvst v0.1.0 (/build/source/crates/kurvst)
741.32 s
> Compiling gammaloop-integration-tests v0.1.0 (/build/source/tests)
741.32 s
> Compiling alphal00p-docs-catalogs v0.1.0 (/build/source/crates/alphal00p-docs-catalogs)
741.32 s
> Compiling test-log-core v0.2.20
741.32 s
> Compiling wait-timeout v0.2.1
741.32 s
> Compiling bit-vec v0.8.0
741.32 s
> Compiling iai-callgrind v0.14.2
741.32 s
> Compiling pyo3-build-config v0.28.3
741.32 s
> Compiling quick-error v1.2.3
741.32 s
> Compiling rusty-fork v0.3.1
741.32 s
> Compiling bit-set v0.8.0
741.32 s
> Compiling rand_xorshift v0.4.0
741.32 s
> Compiling unicode_names2 v1.3.0
741.32 s
> Compiling console v0.15.11
741.32 s
> Compiling base64 v0.21.7
741.32 s
> Compiling test-log-macros v0.2.20
741.32 s
> Compiling glob v0.3.4
741.32 s
> Compiling termcolor v1.4.1
741.32 s
> Compiling alphal00p-docs-examples v0.1.0 (/build/source/crates/alphal00p-docs-examples)
741.32 s
> Compiling unarray v0.1.4
741.32 s
> Compiling clinnet v0.1.8 (/build/source/crates/clinnet)
741.32 s
> Compiling proptest v1.11.0
741.32 s
> Compiling alphal00p-docs-builder v0.1.0 (/build/source/crates/alphal00p-docs-builder)
741.32 s
> Compiling trybuild v1.0.120
741.32 s
> Compiling ron v0.8.1
741.32 s
> Compiling graphica v3.0.0 (https://github.com/symbolica-dev/symbolica?rev=4f1323185fe5e0c0f8c864ab89edd1905e7adef1#4f132318)
741.32 s
> Compiling test-log v0.2.20
741.32 s
> Compiling similar-asserts v1.7.0
741.32 s
> Compiling pyo3-macros-backend v0.28.3
741.32 s
> Compiling pyo3-ffi v0.28.3
741.32 s
> Compiling pyo3 v0.28.3
741.32 s
> Compiling numpy v0.28.0
741.32 s
> Compiling linnet-py v0.1.0 (/build/source/crates/linnet-py)
741.32 s
> Compiling derive_more v2.1.1
741.32 s
> Compiling crossterm v0.29.0
741.32 s
> Compiling ratatui-crossterm v0.1.0
741.32 s
> Compiling ratatui v0.30.0
741.32 s
> Compiling iai-callgrind-macros v0.5.1
741.32 s
> Compiling pyo3-stub-gen-derive v0.17.2
741.32 s
> Compiling gungraun v0.18.2
741.32 s
> Compiling pyo3-macros v0.28.3
741.32 s
> Compiling symbolica-utils v0.1.0 (/build/source/crates/symbolica-utils)
741.32 s
> Compiling tymbolica-atom-payload v0.1.0 (https://github.com/lcnbr/tymbolica?rev=32ae00483b4845161401afac8be755cc336cb2bb#32ae0048)
741.32 s
> Compiling gammaloop-workspace-hack v0.1.0 (/build/source/crates/gammaloop-workspace-hack)
741.32 s
> Compiling spenso-macros v0.3.2 (/build/source/crates/spenso-macros)
741.32 s
> Compiling linnet v0.17.0 (/build/source/crates/linnet)
741.32 s
> Compiling spenso v0.6.0 (/build/source/crates/spenso)
741.32 s
> Compiling idenso v0.3.0 (/build/source/crates/idenso)
741.32 s
> Compiling gammaloop-tracing-filter v0.1.0 (/build/source/crates/gammaloop-tracing-filter)
741.32 s
> Compiling spenso-hep-lib v0.1.7 (/build/source/crates/spenso-hep-lib)
741.32 s
> Compiling spynso3 v0.1.2 (/build/source/crates/spynso3)
741.32 s
> Compiling linnest v0.1.0 (/build/source/crates/linnest)
741.32 s
> Finished `ci-optim` profile [optimized] target(s) in 11m 13s
741.32 s
> warning : the following packages contain code that will be rejected by a future version of Rust: proc-macro-error2 v2.0.1
741.32 s
> note : to see what the problems were, use the option `--future-incompat-report`, or run `cargo report future-incompatibilities --id 1`
741.32 s
> Doc-tests alphal00p_docs_builder
741.32 s
>
741.32 s
> running 0 tests
741.32 s
>
741.32 s
> test result: ok. 0 passed; 0 failed; 0 ignored; 0 measured; 0 filtered out; finished in 0.00s
741.32 s
>
741.32 s
> Doc-tests alphal00p_docs_catalogs
741.32 s
>
741.32 s
> running 0 tests
741.32 s
>
741.32 s
> test result: ok. 0 passed; 0 failed; 0 ignored; 0 measured; 0 filtered out; finished in 0.00s
741.32 s
>
741.32 s
> Doc-tests alphal00p_docs_examples
741.32 s
>
741.32 s
> running 0 tests
741.32 s
>
741.32 s
> test result: ok. 0 passed; 0 failed; 0 ignored; 0 measured; 0 filtered out; finished in 0.00s
741.32 s
>
741.32 s
> Doc-tests alphal00p_docs
741.32 s
>
741.32 s
> running 0 tests
741.32 s
>
741.32 s
> test result: ok. 0 passed; 0 failed; 0 ignored; 0 measured; 0 filtered out; finished in 0.00s
741.32 s
>
741.32 s
> Doc-tests alphal00p_docs_schema
741.32 s
>
741.32 s
> running 0 tests
741.32 s
>
741.32 s
> test result: ok. 0 passed; 0 failed; 0 ignored; 0 measured; 0 filtered out; finished in 0.00s
741.32 s
>
741.32 s
> Doc-tests clinnet
741.32 s
>
741.32 s
> running 0 tests
741.32 s
>
741.32 s
> test result: ok. 0 passed; 0 failed; 0 ignored; 0 measured; 0 filtered out; finished in 0.00s
741.32 s
>
741.32 s
> Doc-tests gammaloop_api
741.32 s
>
741.32 s
> running 2 tests
741.32 s
> test crates/gammaloop-api/src/lib.rs - (line 18) - compile ... ok
741.32 s
> test crates/gammaloop-api/src/commands/evaluate_samples.rs - commands::evaluate_samples::EvaluateSamples (line 49) ... ok
741.32 s
>
741.32 s
> test result: ok. 2 passed; 0 failed; 0 ignored; 0 measured; 0 filtered out; finished in 3.28s
741.32 s
>
741.32 s
> Doc-tests gammaloop_integration_tests
741.32 s
>
741.32 s
> running 0 tests
741.32 s
>
741.32 s
> test result: ok. 0 passed; 0 failed; 0 ignored; 0 measured; 0 filtered out; finished in 0.00s
741.32 s
>
741.32 s
> Doc-tests gammaloop_tracing_filter
741.32 s
>
741.32 s
> running 0 tests
741.32 s
>
741.32 s
> test result: ok. 0 passed; 0 failed; 0 ignored; 0 measured; 0 filtered out; finished in 0.00s
741.32 s
>
741.32 s
> Doc-tests gammaloop_tracing_filter_macros
741.32 s
>
741.32 s
> running 2 tests
741.32 s
> test crates/gammaloop-tracing-filter-macros/src/lib.rs - debug_instrument (line 14) ... ignored
741.32 s
> test crates/gammaloop-tracing-filter-macros/src/lib.rs - debug_instrument (line 8) ... ignored
741.32 s
>
741.32 s
> test result: ok. 0 passed; 0 failed; 2 ignored; 0 measured; 0 filtered out; finished in 0.00s
741.32 s
>
741.32 s
> all doctests ran in 0.40s; merged doctests compilation took 0.39s
741.32 s
> Doc-tests gammaloop_workspace_hack
741.32 s
>
741.32 s
> running 0 tests
741.32 s
>
741.32 s
> test result: ok. 0 passed; 0 failed; 0 ignored; 0 measured; 0 filtered out; finished in 0.00s
741.32 s
>
741.32 s
> Doc-tests gammalooprs
741.32 s
>
741.32 s
> running 2 tests
741.32 s
> test crates/gammalooprs/src/integrands/process/mod.rs - integrands::process::ProcessIntegrandImpl::signal_external_momenta_changed (line 2381) ... ignored
741.32 s
> test crates/gammalooprs/src/utils/linnet_ext.rs - utils::linnet_ext::Permutation::from_mappings (line 27) ... ok
741.32 s
>
741.32 s
> test result: ok. 1 passed; 0 failed; 1 ignored; 0 measured; 0 filtered out; finished in 0.00s
741.32 s
>
741.32 s
> all doctests ran in 1.78s; merged doctests compilation took 1.76s
741.32 s
> Doc-tests idenso
741.32 s
>
741.32 s
> running 5 tests
741.32 s
> test crates/idenso/src/color/macros.rs - color::macros::color_f (line 109) ... ignored
741.32 s
> test crates/idenso/src/color/macros.rs - color::macros::color_t (line 18) ... ignored
741.32 s
> test crates/idenso/src/dirac/macros.rs - dirac::macros::gamma (line 28) ... ignored
741.32 s
> test crates/idenso/src/dirac/macros.rs - dirac::macros::gamma0 (line 259) ... ignored
741.32 s
> test crates/idenso/src/dirac/macros.rs - dirac::macros::u (line 155) ... ignored
741.32 s
>
741.32 s
> test result: ok. 0 passed; 0 failed; 5 ignored; 0 measured; 0 filtered out; finished in 0.00s
741.32 s
>
741.32 s
> all doctests ran in 0.28s; merged doctests compilation took 0.28s
741.32 s
> Doc-tests kurvst
741.32 s
>
741.32 s
> running 0 tests
741.32 s
>
741.32 s
> test result: ok. 0 passed; 0 failed; 0 ignored; 0 measured; 0 filtered out; finished in 0.00s
741.32 s
>
741.32 s
> Doc-tests linnest
741.32 s
>
741.32 s
> running 0 tests
741.32 s
>
741.32 s
> test result: ok. 0 passed; 0 failed; 0 ignored; 0 measured; 0 filtered out; finished in 0.00s
741.32 s
>
741.32 s
> Doc-tests linnet
741.32 s
>
741.32 s
> running 46 tests
741.32 s
> test crates/linnet/src/half_edge/algorithms/transitive_ops.rs - half_edge::algorithms::transitive_ops::HedgeGraph<E,V,H,N>::transitive_closure (line 164) ... ignored
741.32 s
> test crates/linnet/src/half_edge/algorithms/transitive_ops.rs - half_edge::algorithms::transitive_ops::HedgeGraph<E,V,H,N>::transitive_reduction (line 300) ... ignored
741.32 s
> test crates/linnet/src/half_edge/builder.rs - half_edge::builder::HedgeGraphBuilder (line 108) ... ignored
741.32 s
> test crates/linnet/src/half_edge/algorithms/trace_unfold.rs - half_edge::algorithms::trace_unfold::TraceKey<O,D>::empty (line 1071) ... ok
741.32 s
> test crates/linnet/src/half_edge/algorithms/trace_unfold.rs - half_edge::algorithms::trace_unfold::TraceKey<O,D>::from_levels (line 1089) ... ok
741.32 s
> test crates/linnet/src/half_edge/algorithms/trace_unfold.rs - half_edge::algorithms::trace_unfold::TraceKey<O,D>::push (line 1253) ... ok
741.32 s
> test crates/linnet/src/half_edge/algorithms/trace_unfold.rs - half_edge::algorithms::trace_unfold::TraceKey (line 1029) ... ok
741.32 s
> test crates/linnet/src/half_edge/algorithms/trace_unfold.rs - half_edge::algorithms::trace_unfold::TraceKey<O,D>::is_empty (line 1136) ... ok
741.32 s
> test crates/linnet/src/half_edge/algorithms/trace_unfold.rs - half_edge::algorithms::trace_unfold::TraceKey<O,D>::iter_leaf_ops (line 1222) ... ok
741.32 s
> test crates/linnet/src/half_edge/algorithms/trace_unfold.rs - half_edge::algorithms::trace_unfold::TraceKey<O,D>::view (line 1110) ... ok
741.32 s
> test crates/linnet/src/half_edge/algorithms/trace_unfold.rs - half_edge::algorithms::trace_unfold::TraceKey<O,D>::iter_levels_bottom_up (line 1194) ... ok
741.32 s
> test crates/linnet/src/half_edge/algorithms/trace_unfold.rs - half_edge::algorithms::trace_unfold::TraceKeyView (line 872) ... ok
741.32 s
> test crates/linnet/src/permutation.rs - permutation::Permutation (line 61) ... ok
741.32 s
> test crates/linnet/src/half_edge/algorithms/trace_unfold.rs - half_edge::algorithms::trace_unfold::TraceKey<O,D>::iter_levels_top_down (line 1164) ... ok
741.32 s
> test crates/linnet/src/half_edge/algorithms/trace_unfold.rs - half_edge::algorithms::trace_unfold::TraceKey<O,D>::write_foata_like (line 1356) ... ok
741.32 s
> test crates/linnet/src/parser/mod.rs - parser (line 17) ... ok
741.32 s
> test crates/linnet/src/half_edge/algorithms/trace_unfold.rs - half_edge::algorithms::trace_unfold::TraceKeyView<'a,O,D>::to_owned (line 979) ... ok
741.32 s
> test crates/linnet/src/half_edge/algorithms/trace_unfold.rs - half_edge::algorithms::trace_unfold::TraceUnfold (line 127) ... ok
741.32 s
> test crates/linnet/src/half_edge/algorithms/trace_unfold.rs - half_edge::algorithms::trace_unfold::TraceUnfold::realizations_for_op (line 213) ... ok
741.32 s
> test crates/linnet/src/permutation.rs - permutation::Permutation::apply_slice (line 451) ... ok
741.32 s
> test crates/linnet/src/permutation.rs - permutation::Permutation::cycle_to_transpositions (line 713) ... ok
741.32 s
> test crates/linnet/src/permutation.rs - permutation::Permutation::from_map (line 113) ... ok
741.32 s
> test crates/linnet/src/permutation.rs - permutation::Permutation::from_cycles (line 1069) ... ok
741.32 s
> test crates/linnet/src/permutation.rs - permutation::Permutation::apply_slice_in_place_inv (line 510) ... ok
741.32 s
> test crates/linnet/src/permutation.rs - permutation::Permutation::apply_slice_in_place (line 488) ... ok
741.32 s
> test crates/linnet/src/permutation.rs - permutation::Permutation::inv (line 416) ... ok
741.32 s
> test crates/linnet/src/permutation.rs - permutation::Permutation::apply_slice_inv (line 469) ... ok
741.32 s
> test crates/linnet/src/permutation.rs - permutation::Permutation::find_cycles (line 680) ... ok
741.32 s
> test crates/linnet/src/permutation.rs - permutation::Permutation::from_prefix_sources (line 266) ... ok
741.32 s
> test crates/linnet/src/permutation.rs - permutation::Permutation::from_disjoint_cycles (line 978) ... ok
741.32 s
> test crates/linnet/src/permutation.rs - permutation::Permutation::iter_slice (line 543) ... ok
741.32 s
> test crates/linnet/src/permutation.rs - permutation::Permutation::map (line 402) ... ok
741.32 s
> test crates/linnet/src/permutation.rs - permutation::Permutation::inverse (line 434) ... ok
741.32 s
> test crates/linnet/src/permutation.rs - permutation::Permutation::id (line 96) ... ok
741.32 s
> test crates/linnet/src/permutation.rs - permutation::Permutation::iter_slice_mut (line 588) ... ok
741.32 s
> test crates/linnet/src/permutation.rs - permutation::Permutation::myrvold_ruskey_unrank1 (line 782) ... ok
741.32 s
> test crates/linnet/src/permutation.rs - permutation::Permutation::is_identity (line 851) ... ok
741.32 s
> test crates/linnet/src/permutation.rs - permutation::Permutation::iter_slice_inv (line 562) ... ok
741.32 s
> test crates/linnet/src/permutation.rs - permutation::Permutation::iter_slice_inv_mut (line 615) ... ok
741.32 s
> test crates/linnet/src/permutation.rs - permutation::Permutation::myrvold_ruskey_rank1 (line 760) ... ok
741.32 s
> test crates/linnet/src/permutation.rs - permutation::Permutation::myrvold_ruskey_rank2 (line 805) ... ok
741.32 s
> test crates/linnet/src/permutation.rs - permutation::Permutation::myrvold_ruskey_unrank2 (line 828) ... ok
741.32 s
> test crates/linnet/src/permutation.rs - permutation::Permutation::sign (line 869) ... ok
741.32 s
> test crates/linnet/src/permutation.rs - permutation::Permutation::transpositions (line 733) ... ok
741.32 s
> test crates/linnet/src/permutation.rs - permutation::Permutation::sort (line 640) ... ok
741.32 s
> test crates/linnet/src/permutation.rs - permutation::Permutation::pow (line 896) ... ok
741.32 s
>
741.32 s
> test result: ok. 43 passed; 0 failed; 3 ignored; 0 measured; 0 filtered out; finished in 18.31s
741.32 s
>
741.32 s
> Doc-tests linnet_py
741.32 s
>
741.32 s
> running 0 tests
741.32 s
>
741.32 s
> test result: ok. 0 passed; 0 failed; 0 ignored; 0 measured; 0 filtered out; finished in 0.00s
741.32 s
>
741.32 s
> Doc-tests spenso
741.32 s
>
741.32 s
> running 9 tests
741.32 s
> test crates/spenso/src/shadowing/macros.rs - shadowing::macros::antisym (line 337) ... ignored
741.32 s
> test crates/spenso/src/shadowing/macros.rs - shadowing::macros::chain (line 387) ... ignored
741.32 s
> test crates/spenso/src/shadowing/macros.rs - shadowing::macros::cyclic (line 361) ... ignored
741.32 s
> test crates/spenso/src/shadowing/macros.rs - shadowing::macros::slot (line 24) ... ignored
741.32 s
> test crates/spenso/src/shadowing/macros.rs - shadowing::macros::sym (line 313) ... ignored
741.32 s
> test crates/spenso/src/shadowing/macros.rs - shadowing::macros::tensor (line 110) ... ignored
741.32 s
> test crates/spenso/src/shadowing/macros.rs - shadowing::macros::trace (line 444) ... ignored
741.32 s
> test crates/spenso/src/shadowing/macros.rs - shadowing::macros::trace_sym (line 496) ... ignored
741.32 s
> test crates/spenso/src/network/mod.rs - network::Network (line 1693) ... FAILED
741.32 s
>
741.32 s
> failures:
741.32 s
>
741.32 s
> ---- crates/spenso/src/network/mod.rs - network::Network (line 1693) stdout ----
741.32 s
> Test executable failed (terminated by signal).
741.32 s
>
741.32 s
> stdout:
741.32 s
> ┌────────────────────────────────────────────────────────┐
741.32 s
> │ You are running a restricted Symbolica instance. │
741.32 s
> │ │
741.32 s
> │ For non-commercial use only, limited to one │
741.32 s
> │ Symbolica thread per user. │
741.32 s
> │ │
741.32 s
> ├─ Unlock all cores ─────────────────────────────────────┤
741.32 s
> │ │
741.32 s
> │ Hobbyists and students: free annual key │
741.32 s
> │ https://symbolica.io/license/#get-hobbyist-license │
741.32 s
> │ │
741.32 s
> │ Free 30-day professional trial: │
741.32 s
> │ https://symbolica.io/license/#get-trial-license │
741.32 s
> │ │
741.32 s
> └────────────────────────────────────────────────────────┘
741.32 s
> ┌──────────────────────────────────────────────────────────────────────────────────────────────────┐
741.32 s
> │ Cannot start another restricted Symbolica thread while this user's thread allowance is in use. │
741.32 s
> └──────────────────────────────────────────────────────────────────────────────────────────────────┘
741.32 s
>
741.32 s
> stderr:
741.32 s
> ┌────────────────────────────────────────────────────────┐
741.32 s
> │ The Symbolica license key format is outdated. │
741.32 s
> │ Renew your key at https://symbolica.io/license/ │
741.32 s
> └────────────────────────────────────────────────────────┘
741.32 s
> Could not acquire Symbolica thread permit: Permission denied (os error 13)
741.32 s
>
741.32 s
>
741.32 s
>
741.32 s
> failures:
741.32 s
> crates/spenso/src/network/mod.rs - network::Network (line 1693)
741.32 s
>
741.32 s
> test result: FAILED. 0 passed; 1 failed; 8 ignored; 0 measured; 0 filtered out; finished in 0.33s
741.32 s
>
741.32 s
> all doctests ran in 4.18s; merged doctests compilation took 3.83s
741.32 s
> error : doctest failed, to rerun pass `-p spenso --doc`
741.32 s
For full logs, run:
741.32 s
nix log /nix/store/qkv16lywvzf7qi552d4ffa1rpqvbynj9-gammaloop-workspace-doctest-0.1.0.drv
741.50 s
Run failed.