test packages.x86_64-linux.nix-ci-check-gammaloop-doctest

Reproduce this run
Original Run
  1. 0.02 s $ /nix/store/9ypz3flqsrl5xl495mm8h645gadjsxi1-coreutils-9.11/bin/timeout --kill-after=15s 7200s /nix/store/23zk8sgzamrbmj1fday15szf7f2279s8-nix-2.34.7/bin/nix --extra-experimental-features nix-command --extra-experimental-features flakes flake clone git+https://github.com/alphal00p/gammaloop --dest /tmp/nix-ci-worker/stable-pwd/repo/
  2. 0.50 s Cloning into '/tmp/nix-ci-worker/stable-pwd/repo'...
  3. 1.59 s remote: Enumerating objects: 93536, done.
  4. 1.81 s remote: Counting objects: 0% (1/9119) remote: Counting objects: 1% (92/9119) remote: Counting objects: 2% (183/9119) remote: Counting objects: 3% (274/9119) remote: Counting objects: 4% (365/9119) remote: Counting objects: 5% (456/9119) remote: Counting objects: 6% (548/9119) remote: Counting objects: 7% (639/9119) remote: Counting objects: 8% (730/9119) remote: Counting objects: 9% (821/9119) remote: Counting objects: 10% (912/9119) remote: Counting objects: 11% (1004/9119) remote: Counting objects: 12% (1095/9119) remote: Counting objects: 13% (1186/9119) remote: Counting objects: 14% (1277/9119) remote: Counting objects: 15% (1368/9119) remote: Counting objects: 16% (1460/9119) remote: Counting objects: 17% (1551/9119) remote: Counting objects: 18% (1642/9119) remote: Counting objects: 19% (1733/9119) remote: Counting objects: 20% (1824/9119) remote: Counting objects: 21% (1915/9119) remote: Counting objects: 22% (2007/9119) remote: Counting objects: 23% (2098/9119) remote: Counting objects: 24% (2189/9119) remote: Counting objects: 25% (2280/9119) remote: Counting objects: 26% (2371/9119) remote: Counting objects: 27% (2463/9119) remote: Counting objects: 28% (2554/9119) remote: Counting objects: 29% (2645/9119) remote: Counting objects: 30% (2736/9119) remote: Counting objects: 31% (2827/9119) remote: Counting objects: 32% (2919/9119) remote: Counting objects: 33% (3010/9119) remote: Counting objects: 34% (3101/9119) remote: Counting objects: 35% (3192/9119) remote: Counting objects: 36% (3283/9119) remote: Counting objects: 37% (3375/9119) remote: Counting objects: 38% (3466/9119) remote: Counting objects: 39% (3557/9119) remote: Counting objects: 40% (3648/9119) remote: Counting objects: 41% (3739/9119) remote: Counting objects: 42% (3830/9119) remote: Counting objects: 43% (3922/9119) remote: Counting objects: 44% (4013/9119) remote: Counting objects: 45% (4104/9119) remote: Counting objects: 46% (4195/9119) remote: Counting objects: 47% (4286/9119) remote: Counting objects: 48% (4378/9119) remote: Counting objects: 49% (4469/9119) remote: Counting objects: 50% (4560/9119) remote: Counting objects: 51% (4651/9119) remote: Counting objects: 52% (4742/9119) remote: Counting objects: 53% (4834/9119) remote: Counting objects: 54% (4925/9119) remote: Counting objects: 55% (5016/9119) remote: Counting objects: 56% (5107/9119) remote: Counting objects: 57% (5198/9119) remote: Counting objects: 58% (5290/9119) remote: Counting objects: 59% (5381/9119) remote: Counting objects: 60% (5472/9119) remote: Counting objects: 61% (5563/9119) remote: Counting objects: 62% (5654/9119) remote: Counting objects: 63% (5745/9119) remote: Counting objects: 64% (5837/9119) remote: Counting objects: 65% (5928/9119) remote: Counting objects: 66% (6019/9119) remote: Counting objects: 67% (6110/9119) remote: Counting objects: 68% (6201/9119) remote: Counting objects: 69% (6293/9119) remote: Counting objects: 70% (6384/9119) remote: Counting objects: 71% (6475/9119) remote: Counting objects: 72% (6566/9119) remote: Counting objects: 73% (6657/9119) remote: Counting objects: 74% (6749/9119) remote: Counting objects: 75% (6840/9119) remote: Counting objects: 76% (6931/9119) remote: Counting objects: 77% (7022/9119) remote: Counting objects: 78% (7113/9119) remote: Counting objects: 79% (7205/9119) remote: Counting objects: 80% (7296/9119) remote: Counting objects: 81% (7387/9119) remote: Counting objects: 82% (7478/9119) remote: Counting objects: 83% (7569/9119) remote: Counting objects: 84% (7660/9119) remote: Counting objects: 85% (7752/9119) remote: Counting objects: 86% (7843/9119) remote: Counting objects: 87% (7934/9119) remote: Counting objects: 88% (8025/9119) remote: Counting objects: 89% (8116/9119) remote: Counting objects: 90% (8208/9119) remote: Counting objects: 91% (8299/9119) remote: Counting objects: 92% (8390/9119) remote: Counting objects: 93% (8481/9119) remote: Counting objects: 94% (8572/9119) remote: Counting objects: 95% (8664/9119) remote: Counting objects: 96% (8755/9119) remote: Counting objects: 97% (8846/9119) remote: Counting objects: 98% (8937/9119) remote: Counting objects: 99% (9028/9119) remote: Counting objects: 100% (9119/9119) remote: Counting objects: 100% (9119/9119), done.
  5. 4.05 s remote: Compressing objects: 0% (1/1945) remote: Compressing objects: 1% (20/1945) remote: Compressing objects: 2% (39/1945) remote: Compressing objects: 3% (59/1945) remote: Compressing objects: 4% (78/1945) remote: Compressing objects: 5% (98/1945) remote: Compressing objects: 6% (117/1945) remote: Compressing objects: 7% (137/1945) remote: Compressing objects: 8% (156/1945) remote: Compressing objects: 9% (176/1945) remote: Compressing objects: 10% (195/1945) remote: Compressing objects: 11% (214/1945) remote: Compressing objects: 11% (219/1945) remote: Compressing objects: 12% (234/1945) remote: Compressing objects: 13% (253/1945) remote: Compressing objects: 14% (273/1945) remote: Compressing objects: 15% (292/1945) remote: Compressing objects: 16% (312/1945) remote: Compressing objects: 17% (331/1945) remote: Compressing objects: 18% (351/1945) remote: Compressing objects: 19% (370/1945) remote: Compressing objects: 20% (389/1945) remote: Compressing objects: 21% (409/1945) remote: Compressing objects: 21% (415/1945) remote: Compressing objects: 22% (428/1945) remote: Compressing objects: 23% (448/1945) remote: Compressing objects: 24% (467/1945) remote: Compressing objects: 25% (487/1945) remote: Compressing objects: 26% (506/1945) remote: Compressing objects: 27% (526/1945) remote: Compressing objects: 28% (545/1945) remote: Compressing objects: 29% (565/1945) remote: Compressing objects: 30% (584/1945) remote: Compressing objects: 31% (603/1945) remote: Compressing objects: 32% (623/1945) remote: Compressing objects: 33% (642/1945) remote: Compressing objects: 34% (662/1945) remote: Compressing objects: 35% (681/1945) remote: Compressing objects: 36% (701/1945) remote: Compressing objects: 37% (720/1945) remote: Compressing objects: 38% (740/1945) remote: Compressing objects: 39% (759/1945) remote: Compressing objects: 40% (778/1945) remote: Compressing objects: 41% (798/1945) remote: Compressing objects: 42% (817/1945) remote: Compressing objects: 43% (837/1945) remote: Compressing objects: 44% (856/1945) remote: Compressing objects: 45% (876/1945) remote: Compressing objects: 46% (895/1945) remote: Compressing objects: 47% (915/1945) remote: Compressing objects: 48% (934/1945) remote: Compressing objects: 49% (954/1945) remote: Compressing objects: 50% (973/1945) remote: Compressing objects: 51% (992/1945) remote: Compressing objects: 52% (1012/1945) remote: Compressing objects: 53% (1031/1945) remote: Compressing objects: 54% (1051/1945) remote: Compressing objects: 55% (1070/1945) remote: Compressing objects: 56% (1090/1945) remote: Compressing objects: 57% (1109/1945) remote: Compressing objects: 58% (1129/1945) remote: Compressing objects: 59% (1148/1945) remote: Compressing objects: 60% (1167/1945) remote: Compressing objects: 61% (1187/1945) remote: Compressing objects: 62% (1206/1945) remote: Compressing objects: 63% (1226/1945) remote: Compressing objects: 64% (1245/1945) remote: Compressing objects: 65% (1265/1945) remote: Compressing objects: 66% (1284/1945) remote: Compressing objects: 67% (1304/1945) remote: Compressing objects: 68% (1323/1945) remote: Compressing objects: 69% (1343/1945) remote: Compressing objects: 70% (1362/1945) remote: Compressing objects: 71% (1381/1945) remote: Compressing objects: 72% (1401/1945) remote: Compressing objects: 73% (1420/1945) remote: Compressing objects: 74% (1440/1945) remote: Compressing objects: 75% (1459/1945) remote: Compressing objects: 76% (1479/1945) remote: Compressing objects: 77% (1498/1945) remote: Compressing objects: 78% (1518/1945) remote: Compressing objects: 79% (1537/1945) remote: Compressing objects: 80% (1556/1945) remote: Compressing objects: 81% (1576/1945) remote: Compressing objects: 82% (1595/1945) remote: Compressing objects: 83% (1615/1945) remote: Compressing objects: 84% (1634/1945) remote: Compressing objects: 85% (1654/1945) remote: Compressing objects: 86% (1673/1945) remote: Compressing objects: 87% (1693/1945) remote: Compressing objects: 88% (1712/1945) remote: Compressing objects: 89% (1732/1945) remote: Compressing objects: 90% (1751/1945) remote: Compressing objects: 91% (1770/1945) remote: Compressing objects: 92% (1790/1945) remote: Compressing objects: 93% (1809/1945) remote: Compressing objects: 94% (1829/1945) remote: Compressing objects: 95% (1848/1945) remote: Compressing objects: 96% (1868/1945) remote: Compressing objects: 97% (1887/1945) remote: Compressing objects: 98% (1907/1945) remote: Compressing objects: 99% (1926/1945) remote: Compressing objects: 100% (1945/1945) remote: Compressing objects: 100% (1945/1945), done.
  6. 14.46 s Receiving objects: 0% (1/93536) Receiving objects: 1% (936/93536) Receiving objects: 2% (1871/93536) Receiving objects: 3% (2807/93536) Receiving objects: 4% (3742/93536) Receiving objects: 5% (4677/93536) Receiving objects: 6% (5613/93536), 9.09 MiB | 18.16 MiB/s Receiving objects: 7% (6548/93536), 9.09 MiB | 18.16 MiB/s Receiving objects: 8% (7483/93536), 9.09 MiB | 18.16 MiB/s Receiving objects: 9% (8419/93536), 9.09 MiB | 18.16 MiB/s Receiving objects: 10% (9354/93536), 9.09 MiB | 18.16 MiB/s Receiving objects: 11% (10289/93536), 9.09 MiB | 18.16 MiB/s Receiving objects: 11% (10796/93536), 9.09 MiB | 18.16 MiB/s Receiving objects: 12% (11225/93536), 19.16 MiB | 19.16 MiB/s Receiving objects: 13% (12160/93536), 19.16 MiB | 19.16 MiB/s Receiving objects: 14% (13096/93536), 19.16 MiB | 19.16 MiB/s Receiving objects: 15% (14031/93536), 19.16 MiB | 19.16 MiB/s Receiving objects: 16% (14966/93536), 19.16 MiB | 19.16 MiB/s Receiving objects: 17% (15902/93536), 19.16 MiB | 19.16 MiB/s Receiving objects: 18% (16837/93536), 19.16 MiB | 19.16 MiB/s Receiving objects: 19% (17772/93536), 19.16 MiB | 19.16 MiB/s Receiving objects: 20% (18708/93536), 19.16 MiB | 19.16 MiB/s Receiving objects: 21% (19643/93536), 19.16 MiB | 19.16 MiB/s Receiving objects: 22% (20578/93536), 19.16 MiB | 19.16 MiB/s Receiving objects: 23% (21514/93536), 19.16 MiB | 19.16 MiB/s Receiving objects: 24% (22449/93536), 19.16 MiB | 19.16 MiB/s Receiving objects: 25% (23384/93536), 19.16 MiB | 19.16 MiB/s Receiving objects: 26% (24320/93536), 19.16 MiB | 19.16 MiB/s Receiving objects: 27% (25255/93536), 19.16 MiB | 19.16 MiB/s Receiving objects: 28% (26191/93536), 19.16 MiB | 19.16 MiB/s Receiving objects: 29% (27126/93536), 19.16 MiB | 19.16 MiB/s Receiving objects: 30% (28061/93536), 19.16 MiB | 19.16 MiB/s Receiving objects: 31% (28997/93536), 19.16 MiB | 19.16 MiB/s Receiving objects: 32% (29932/93536), 19.16 MiB | 19.16 MiB/s Receiving objects: 33% (30867/93536), 19.16 MiB | 19.16 MiB/s Receiving objects: 34% (31803/93536), 19.16 MiB | 19.16 MiB/s Receiving objects: 35% (32738/93536), 19.16 MiB | 19.16 MiB/s Receiving objects: 36% (33673/93536), 19.16 MiB | 19.16 MiB/s Receiving objects: 37% (34609/93536), 19.16 MiB | 19.16 MiB/s Receiving objects: 38% (35544/93536), 34.79 MiB | 23.19 MiB/s Receiving objects: 39% (36480/93536), 34.79 MiB | 23.19 MiB/s Receiving objects: 40% (37415/93536), 34.79 MiB | 23.19 MiB/s Receiving objects: 41% (38350/93536), 34.79 MiB | 23.19 MiB/s Receiving objects: 42% (39286/93536), 34.79 MiB | 23.19 MiB/s Receiving objects: 43% (40221/93536), 34.79 MiB | 23.19 MiB/s Receiving objects: 44% (41156/93536), 34.79 MiB | 23.19 MiB/s Receiving objects: 45% (42092/93536), 34.79 MiB | 23.19 MiB/s Receiving objects: 46% (43027/93536), 34.79 MiB | 23.19 MiB/s Receiving objects: 47% (43962/93536), 34.79 MiB | 23.19 MiB/s Receiving objects: 47% (44412/93536), 34.79 MiB | 23.19 MiB/s Receiving objects: 48% (44898/93536), 53.77 MiB | 26.88 MiB/s Receiving objects: 49% (45833/93536), 53.77 MiB | 26.88 MiB/s Receiving objects: 50% (46768/93536), 53.77 MiB | 26.88 MiB/s Receiving objects: 51% (47704/93536), 53.77 MiB | 26.88 MiB/s Receiving objects: 52% (48639/93536), 53.77 MiB | 26.88 MiB/s Receiving objects: 53% (49575/93536), 53.77 MiB | 26.88 MiB/s Receiving objects: 54% (50510/93536), 70.76 MiB | 28.30 MiB/s Receiving objects: 55% (51445/93536), 70.76 MiB | 28.30 MiB/s Receiving objects: 56% (52381/93536), 70.76 MiB | 28.30 MiB/s Receiving objects: 57% (53316/93536), 70.76 MiB | 28.30 MiB/s Receiving objects: 58% (54251/93536), 70.76 MiB | 28.30 MiB/s Receiving objects: 59% (55187/93536), 70.76 MiB | 28.30 MiB/s Receiving objects: 60% (56122/93536), 70.76 MiB | 28.30 MiB/s Receiving objects: 61% (57057/93536), 70.76 MiB | 28.30 MiB/s Receiving objects: 61% (57082/93536), 92.66 MiB | 30.88 MiB/s Receiving objects: 61% (57151/93536), 123.32 MiB | 30.83 MiB/s Receiving objects: 61% (57245/93536), 154.88 MiB | 32.41 MiB/s Receiving objects: 62% (57993/93536), 171.28 MiB | 33.80 MiB/s Receiving objects: 62% (58747/93536), 171.28 MiB | 33.80 MiB/s Receiving objects: 63% (58928/93536), 184.73 MiB | 33.32 MiB/s Receiving objects: 64% (59864/93536), 184.73 MiB | 33.32 MiB/s Receiving objects: 65% (60799/93536), 184.73 MiB | 33.32 MiB/s Receiving objects: 66% (61734/93536), 184.73 MiB | 33.32 MiB/s Receiving objects: 67% (62670/93536), 184.73 MiB | 33.32 MiB/s Receiving objects: 68% (63605/93536), 198.45 MiB | 32.15 MiB/s Receiving objects: 69% (64540/93536), 198.45 MiB | 32.15 MiB/s Receiving objects: 70% (65476/93536), 198.45 MiB | 32.15 MiB/s Receiving objects: 70% (66220/93536), 198.45 MiB | 32.15 MiB/s Receiving objects: 71% (66411/93536), 210.93 MiB | 31.13 MiB/s Receiving objects: 72% (67346/93536), 210.93 MiB | 31.13 MiB/s Receiving objects: 73% (68282/93536), 210.93 MiB | 31.13 MiB/s Receiving objects: 74% (69217/93536), 210.93 MiB | 31.13 MiB/s Receiving objects: 75% (70152/93536), 210.93 MiB | 31.13 MiB/s Receiving objects: 76% (71088/93536), 210.93 MiB | 31.13 MiB/s Receiving objects: 77% (72023/93536), 210.93 MiB | 31.13 MiB/s Receiving objects: 78% (72959/93536), 210.93 MiB | 31.13 MiB/s Receiving objects: 79% (73894/93536), 210.93 MiB | 31.13 MiB/s Receiving objects: 80% (74829/93536), 210.93 MiB | 31.13 MiB/s Receiving objects: 81% (75765/93536), 210.93 MiB | 31.13 MiB/s Receiving objects: 82% (76700/93536), 224.68 MiB | 29.32 MiB/s Receiving objects: 82% (76863/93536), 224.68 MiB | 29.32 MiB/s Receiving objects: 83% (77635/93536), 251.34 MiB | 28.42 MiB/s Receiving objects: 84% (78571/93536), 251.34 MiB | 28.42 MiB/s Receiving objects: 85% (79506/93536), 251.34 MiB | 28.42 MiB/s Receiving objects: 86% (80441/93536), 251.34 MiB | 28.42 MiB/s Receiving objects: 87% (81377/93536), 251.34 MiB | 28.42 MiB/s Receiving objects: 88% (82312/93536), 251.34 MiB | 28.42 MiB/s Receiving objects: 88% (82732/93536), 251.34 MiB | 28.42 MiB/s Receiving objects: 89% (83248/93536), 265.75 MiB | 28.15 MiB/s Receiving objects: 90% (84183/93536), 265.75 MiB | 28.15 MiB/s Receiving objects: 91% (85118/93536), 265.75 MiB | 28.15 MiB/s Receiving objects: 92% (86054/93536), 265.75 MiB | 28.15 MiB/s Receiving objects: 93% (86989/93536), 265.75 MiB | 28.15 MiB/s Receiving objects: 94% (87924/93536), 265.75 MiB | 28.15 MiB/s Receiving objects: 95% (88860/93536), 265.75 MiB | 28.15 MiB/s Receiving objects: 96% (89795/93536), 265.75 MiB | 28.15 MiB/s Receiving objects: 97% (90730/93536), 265.75 MiB | 28.15 MiB/s Receiving objects: 98% (91666/93536), 265.75 MiB | 28.15 MiB/s Receiving objects: 99% (92601/93536), 265.75 MiB | 28.15 MiB/s Receiving objects: 99% (93456/93536), 294.21 MiB | 27.28 MiB/s remote: Total 93536 (delta 7847), reused 7280 (delta 7165), pack-reused 84417 (from 2)
  7. 14.46 s Receiving objects: 100% (93536/93536), 294.21 MiB | 27.28 MiB/s Receiving objects: 100% (93536/93536), 305.32 MiB | 29.37 MiB/s, done.
  8. 16.94 s Resolving deltas: 0% (0/63011) Resolving deltas: 1% (631/63011) Resolving deltas: 2% (1261/63011) Resolving deltas: 3% (1891/63011) Resolving deltas: 4% (2521/63011) Resolving deltas: 5% (3151/63011) Resolving deltas: 6% (3781/63011) Resolving deltas: 7% (4413/63011) Resolving deltas: 8% (5041/63011) Resolving deltas: 9% (5671/63011) Resolving deltas: 10% (6302/63011) Resolving deltas: 11% (6932/63011) Resolving deltas: 12% (7562/63011) Resolving deltas: 13% (8192/63011) Resolving deltas: 14% (8822/63011) Resolving deltas: 15% (9453/63011) Resolving deltas: 16% (10082/63011) Resolving deltas: 17% (10712/63011) Resolving deltas: 18% (11342/63011) Resolving deltas: 19% (11973/63011) Resolving deltas: 20% (12603/63011) Resolving deltas: 21% (13233/63011) Resolving deltas: 22% (13863/63011) Resolving deltas: 23% (14493/63011) Resolving deltas: 24% (15127/63011) Resolving deltas: 25% (15755/63011) Resolving deltas: 26% (16383/63011) Resolving deltas: 27% (17013/63011) Resolving deltas: 28% (17644/63011) Resolving deltas: 29% (18274/63011) Resolving deltas: 30% (18904/63011) Resolving deltas: 31% (19534/63011) Resolving deltas: 32% (20164/63011) Resolving deltas: 33% (20794/63011) Resolving deltas: 34% (21424/63011) Resolving deltas: 35% (22054/63011) Resolving deltas: 36% (22684/63011) Resolving deltas: 37% (23315/63011) Resolving deltas: 38% (23945/63011) Resolving deltas: 39% (24575/63011) Resolving deltas: 40% (25205/63011) Resolving deltas: 41% (25835/63011) Resolving deltas: 42% (26465/63011) Resolving deltas: 43% (27095/63011) Resolving deltas: 44% (27725/63011) Resolving deltas: 45% (28355/63011) Resolving deltas: 46% (28987/63011) Resolving deltas: 47% (29616/63011) Resolving deltas: 48% (30246/63011) Resolving deltas: 49% (30876/63011) Resolving deltas: 50% (31506/63011) Resolving deltas: 51% (32136/63011) Resolving deltas: 52% (32766/63011) Resolving deltas: 52% (33217/63011) Resolving deltas: 53% (33396/63011) Resolving deltas: 54% (34026/63011) Resolving deltas: 55% (34657/63011) Resolving deltas: 56% (35288/63011) Resolving deltas: 57% (35917/63011) Resolving deltas: 58% (36547/63011) Resolving deltas: 59% (37177/63011) Resolving deltas: 60% (37808/63011) Resolving deltas: 61% (38437/63011) Resolving deltas: 62% (39067/63011) Resolving deltas: 63% (39697/63011) Resolving deltas: 64% (40328/63011) Resolving deltas: 65% (40958/63011) Resolving deltas: 66% (41588/63011) Resolving deltas: 67% (42218/63011) Resolving deltas: 68% (42848/63011) Resolving deltas: 69% (43478/63011) Resolving deltas: 70% (44108/63011) Resolving deltas: 71% (44738/63011) Resolving deltas: 72% (45369/63011) Resolving deltas: 73% (45999/63011) Resolving deltas: 74% (46629/63011) Resolving deltas: 75% (47259/63011) Resolving deltas: 76% (47889/63011) Resolving deltas: 77% (48519/63011) Resolving deltas: 78% (49149/63011) Resolving deltas: 79% (49779/63011) Resolving deltas: 80% (50409/63011) Resolving deltas: 81% (51039/63011) Resolving deltas: 81% (51408/63011) Resolving deltas: 82% (51671/63011) Resolving deltas: 83% (52300/63011) Resolving deltas: 84% (52930/63011) Resolving deltas: 85% (53560/63011) Resolving deltas: 86% (54190/63011) Resolving deltas: 87% (54820/63011) Resolving deltas: 88% (55450/63011) Resolving deltas: 89% (56080/63011) Resolving deltas: 90% (56710/63011) Resolving deltas: 91% (57341/63011) Resolving deltas: 92% (57971/63011) Resolving deltas: 93% (58601/63011) Resolving deltas: 94% (59231/63011) Resolving deltas: 95% (59861/63011) Resolving deltas: 96% (60492/63011) Resolving deltas: 97% (61121/63011) Resolving deltas: 98% (61751/63011) Resolving deltas: 99% (62381/63011) Resolving deltas: 100% (63011/63011) Resolving deltas: 100% (63011/63011), done.
  9. 17.59 s Fetching commit 436f9ff52587582686db6aefd4ecd715b5693f90 for simplify-spenso-api ...
  10. 17.59 s $ /nix/store/bcnisk3ydfgv26v2gw3zlky24g00yww2-git-2.54.0/bin/git fetch origin 436f9ff52587582686db6aefd4ecd715b5693f90
  11. 18.16 s From https://github.com/alphal00p/gammaloop
  12. 18.16 s * branch 436f9ff52587582686db6aefd4ecd715b5693f90 -> FETCH_HEAD
  13. 18.18 s $ /nix/store/9ypz3flqsrl5xl495mm8h645gadjsxi1-coreutils-9.11/bin/timeout --kill-after=15s 7200s /nix/store/bcnisk3ydfgv26v2gw3zlky24g00yww2-git-2.54.0/bin/git -c advice.detachedHead=false checkout 436f9ff52587582686db6aefd4ecd715b5693f90
  14. 18.51 s HEAD is now at 436f9ff52 align Tymbolica interop with fixed Symbolica main
  15. 18.52 s $ /nix/store/9ypz3flqsrl5xl495mm8h645gadjsxi1-coreutils-9.11/bin/timeout --kill-after=15s 7200s /nix/store/23zk8sgzamrbmj1fday15szf7f2279s8-nix-2.34.7/bin/nix --extra-experimental-features nix-command --extra-experimental-features flakes --log-format internal-json run .#packages.x86_64-linux.nix-ci-check-gammaloop-doctest --print-build-logs
  16. 22.60 s
  17. 26.08 s evaluating derivation 'g copying '/nix/store/9x93 evaluating derivation 'g querying gammaloop-works [0/19 built, 0.0 KiB DL] [0/1 built, 0.0 KiB DL] [1/0/1 built, 0.0 KiB DLgammaloop-workspace-doctest> Running phase: unpackPhase
  18. 26.09 s gammaloop-workspace-doctest> unpacking source archive /nix/store/jkbhll49z1x5ahw24kr1s7hg5j04yi8g-source
  19. 26.31 s gammaloop-workspace-doctest> source root is source
  20. 26.33 s gammaloop-workspace-doctest> Running phase: patchPhase
  21. 26.34 s gammaloop-workspace-doctest> Executing configureCargoCommonVars
  22. 26.34 s gammaloop-workspace-doctest> decompressing cargo artifacts from /nix/store/y3rckwyasbms4vpvjsg4f4zrvibk39ch-gammaloop-workspace-deps-deps-0.1.0/target.tar.zst to target
  23. 27.80 s gammaloop-workspace-doctest> Running phase: updateAutotoolsGnuConfigScriptsPhase
  24. 27.84 s gammaloop-workspace-doctest> Running phase: configurePhase
  25. 27.84 s gammaloop-workspace-doctest> will append /build/source/.cargo-home/config.toml with contents of /nix/store/9rqk4093qnvgswmdk1pbxk9najcrjn7a-vendor-cargo-deps/config.toml
  26. 27.85 s gammaloop-workspace-doctest> default configurePhase, nothing to do
  27. 27.85 s gammaloop-workspace-doctest> Running phase: buildPhase
  28. 27.85 s gammaloop-workspace-doctest> +++ command cargo --version
  29. 27.85 s gammaloop-workspace-doctest> cargo 1.98.1 (797e8a9bc 2026-08-05)
  30. 27.88 s gammaloop-workspace-doctest> +++ command cargo test --profile ci-optim --doc --locked --workspace --features gammaloop-api/cli,gammaloop-tracing-filter/clap,gammaloop-tracing-filter/symbolica,idenso/bincode,idenso/native,idenso/reference-cases,linnet/bincode,linnet/drawing,linnet/nodestore-vec,linnet/rkyv,linnet/serde,linnet/symbolica,spenso-macros/native,spenso-macros/shadowing,spenso/native,spenso/native-code-generation,spenso/shadowing,symbolica-utils/native,symbolica/tracing_max_level_info --exclude alphal00p-docs-python-exporter
  31. 28.32 s gammaloop-workspace-doctest> Compiling target-lexicon v0.13.5
  32. 28.33 s gammaloop-workspace-doctest> Compiling const-random-macro v0.1.16
  33. 28.34 s gammaloop-workspace-doctest> Compiling phf_generator v0.11.3
  34. 28.34 s gammaloop-workspace-doctest> Compiling rustpython-ast v0.4.0
  35. 28.35 s gammaloop-workspace-doctest> Compiling similar v2.7.0
  36. 28.35 s gammaloop-workspace-doctest> Compiling symbolica v2.2.0 (https://github.com/symbolica-dev/symbolica?rev=4f1323185fe5e0c0f8c864ab89edd1905e7adef1#4f132318)
  37. 28.36 s gammaloop-workspace-doctest> Compiling derive_more-impl v2.1.1
  38. 28.37 s gammaloop-workspace-doctest> Compiling gammaloop-tracing-filter-macros v0.1.0 (/build/source/crates/gammaloop-tracing-filter-macros)
  39. 28.37 s gammaloop-workspace-doctest> Compiling vakint v0.1.2 (/build/source/crates/vakint)
  40. 28.38 s gammaloop-workspace-doctest> Compiling gammalooprs v0.3.4 (/build/source/crates/gammalooprs)
  41. 28.38 s gammaloop-workspace-doctest> Compiling gammaloop-api v0.1.0 (/build/source/crates/gammaloop-api)
  42. 28.39 s gammaloop-workspace-doctest> Compiling alphal00p-docs-macros v0.1.0 (/build/source/crates/alphal00p-docs-macros)
  43. 28.39 s gammaloop-workspace-doctest> Compiling proc-macro-error-attr2 v2.0.0
  44. 28.39 s gammaloop-workspace-doctest> Compiling alphal00p-docs-schema v0.1.0 (/build/source/crates/alphal00p-docs-schema)
  45. 28.40 s gammaloop-workspace-doctest> Compiling rustc_version v0.4.1
  46. 28.56 s gammaloop-workspace-doctest> Compiling phf_codegen v0.11.3
  47. 28.61 s gammaloop-workspace-doctest> Compiling figment v0.10.19
  48. 28.62 s gammaloop-workspace-doctest> Compiling bincode v1.3.3
  49. 28.67 s gammaloop-workspace-doctest> Compiling unicode_names2_generator v1.3.0
  50. 28.69 s gammaloop-workspace-doctest> Compiling rustpython-parser v0.4.0
  51. 28.75 s gammaloop-workspace-doctest> Compiling target-triple v1.0.1
  52. 28.82 s gammaloop-workspace-doctest> Compiling const-random v0.1.18
  53. 28.83 s gammaloop-workspace-doctest> Compiling gungraun-runner v0.18.2
  54. 28.86 s gammaloop-workspace-doctest> Compiling ahash v0.8.12
  55. 28.90 s gammaloop-workspace-doctest> Compiling iai-callgrind-runner v0.14.2
  56. 29.01 s gammaloop-workspace-doctest> Compiling insta v1.47.2
  57. 29.04 s gammaloop-workspace-doctest> Compiling symjit v2.25.6
  58. 29.05 s gammaloop-workspace-doctest> Compiling numerica v3.0.0 (https://github.com/symbolica-dev/symbolica?rev=4f1323185fe5e0c0f8c864ab89edd1905e7adef1#4f132318)
  59. 29.06 s gammaloop-workspace-doctest> Compiling momtrop v0.3.0
  60. 29.13 s gammaloop-workspace-doctest> Compiling gungraun-macros v0.8.0
  61. 29.14 s gammaloop-workspace-doctest> Compiling proc-macro-error2 v2.0.1
  62. 29.25 s gammaloop-workspace-doctest> Compiling kurvst v0.1.0 (/build/source/crates/kurvst)
  63. 29.45 s gammaloop-workspace-doctest> Compiling gammaloop-integration-tests v0.1.0 (/build/source/tests)
  64. 29.51 s gammaloop-workspace-doctest> Compiling alphal00p-docs-catalogs v0.1.0 (/build/source/crates/alphal00p-docs-catalogs)
  65. 29.70 s gammaloop-workspace-doctest> Compiling pyo3-build-config v0.28.3
  66. 29.79 s gammaloop-workspace-doctest> Compiling test-log-core v0.2.20
  67. 29.88 s gammaloop-workspace-doctest> Compiling wait-timeout v0.2.1
  68. 29.88 s gammaloop-workspace-doctest> Compiling quick-error v1.2.3
  69. 29.97 s gammaloop-workspace-doctest> Compiling bit-vec v0.8.0
  70. 29.98 s gammaloop-workspace-doctest> Compiling iai-callgrind v0.14.2
  71. 30.22 s gammaloop-workspace-doctest> Compiling bit-set v0.8.0
  72. 30.23 s gammaloop-workspace-doctest> Compiling rusty-fork v0.3.1
  73. 31.43 s gammaloop-workspace-doctest> Compiling test-log-macros v0.2.20
  74. 31.69 s gammaloop-workspace-doctest> Compiling rand_xorshift v0.4.0
  75. 31.79 s gammaloop-workspace-doctest> Compiling console v0.15.11
  76. 31.83 s gammaloop-workspace-doctest> Compiling termcolor v1.4.1
  77. 32.02 s gammaloop-workspace-doctest> Compiling glob v0.3.4
  78. 32.02 s gammaloop-workspace-doctest> Compiling unicode_names2 v1.3.0
  79. 32.30 s gammaloop-workspace-doctest> Compiling unarray v0.1.4
  80. 32.34 s gammaloop-workspace-doctest> Compiling alphal00p-docs-examples v0.1.0 (/build/source/crates/alphal00p-docs-examples)
  81. 32.40 s gammaloop-workspace-doctest> Compiling base64 v0.21.7
  82. 32.95 s gammaloop-workspace-doctest> Compiling graphica v3.0.0 (https://github.com/symbolica-dev/symbolica?rev=4f1323185fe5e0c0f8c864ab89edd1905e7adef1#4f132318)
  83. 33.01 s gammaloop-workspace-doctest> Compiling ron v0.8.1
  84. 33.02 s gammaloop-workspace-doctest> Compiling clinnet v0.1.8 (/build/source/crates/clinnet)
  85. 33.06 s gammaloop-workspace-doctest> Compiling proptest v1.11.0
  86. 33.26 s gammaloop-workspace-doctest> Compiling test-log v0.2.20
  87. 33.31 s gammaloop-workspace-doctest> Compiling trybuild v1.0.120
  88. 33.44 s gammaloop-workspace-doctest> Compiling similar-asserts v1.7.0
  89. 34.02 s gammaloop-workspace-doctest> Compiling alphal00p-docs-builder v0.1.0 (/build/source/crates/alphal00p-docs-builder)
  90. 34.83 s gammaloop-workspace-doctest> Compiling pyo3-ffi v0.28.3
  91. 35.05 s gammaloop-workspace-doctest> Compiling pyo3-macros-backend v0.28.3
  92. 35.36 s gammaloop-workspace-doctest> Compiling pyo3 v0.28.3
  93. 35.45 s gammaloop-workspace-doctest> Compiling numpy v0.28.0
  94. 35.70 s gammaloop-workspace-doctest> Compiling linnet-py v0.1.0 (/build/source/crates/linnet-py)
  95. 38.61 s gammaloop-workspace-doctest> Compiling derive_more v2.1.1
  96. 38.67 s gammaloop-workspace-doctest> Compiling crossterm v0.29.0
  97. 38.77 s gammaloop-workspace-doctest> Compiling iai-callgrind-macros v0.5.1
  98. 40.15 s gammaloop-workspace-doctest> Compiling ratatui-crossterm v0.1.0
  99. 40.53 s gammaloop-workspace-doctest> Compiling ratatui v0.30.0
  100. 45.05 s gammaloop-workspace-doctest> Compiling pyo3-stub-gen-derive v0.17.2
  101. 47.98 s gammaloop-workspace-doctest> Compiling gungraun v0.18.2
  102. 49.98 s gammaloop-workspace-doctest> Compiling pyo3-macros v0.28.3
  103. 89.78 s gammaloop-workspace-doctest> Compiling symbolica-utils v0.1.0 (/build/source/crates/symbolica-utils)
  104. 129.71 s gammaloop-workspace-doctest> Compiling tymbolica-atom-payload v0.1.0 (https://github.com/lcnbr/tymbolica?rev=32ae00483b4845161401afac8be755cc336cb2bb#32ae0048)
  105. 378.54 s gammaloop-workspace-doctest> Compiling gammaloop-workspace-hack v0.1.0 (/build/source/crates/gammaloop-workspace-hack)
  106. 378.54 s gammaloop-workspace-doctest> Compiling spenso-macros v0.3.2 (/build/source/crates/spenso-macros)
  107. 378.76 s gammaloop-workspace-doctest> Compiling linnet v0.17.0 (/build/source/crates/linnet)
  108. 383.82 s gammaloop-workspace-doctest> Compiling spenso v0.6.0 (/build/source/crates/spenso)
  109. 394.32 s gammaloop-workspace-doctest> Compiling idenso v0.3.0 (/build/source/crates/idenso)
  110. 394.32 s gammaloop-workspace-doctest> Compiling gammaloop-tracing-filter v0.1.0 (/build/source/crates/gammaloop-tracing-filter)
  111. 400.91 s gammaloop-workspace-doctest> Compiling spenso-hep-lib v0.1.7 (/build/source/crates/spenso-hep-lib)
  112. 401.25 s gammaloop-workspace-doctest> Compiling spynso3 v0.1.2 (/build/source/crates/spynso3)
  113. 473.03 s gammaloop-workspace-doctest> Compiling linnest v0.1.0 (/build/source/crates/linnest)
  114. 648.03 s gammaloop-workspace-doctest> Finished `ci-optim` profile [optimized] target(s) in 10m 20s
  115. 648.29 s gammaloop-workspace-doctest> warning: the following packages contain code that will be rejected by a future version of Rust: proc-macro-error2 v2.0.1
  116. 648.29 s gammaloop-workspace-doctest> note: to see what the problems were, use the option `--future-incompat-report`, or run `cargo report future-incompatibilities --id 1`
  117. 648.37 s gammaloop-workspace-doctest> Doc-tests alphal00p_docs_builder
  118. 648.83 s gammaloop-workspace-doctest>
  119. 648.83 s gammaloop-workspace-doctest> running 0 tests
  120. 648.83 s gammaloop-workspace-doctest>
  121. 648.83 s gammaloop-workspace-doctest> test result: ok. 0 passed; 0 failed; 0 ignored; 0 measured; 0 filtered out; finished in 0.00s
  122. 648.83 s gammaloop-workspace-doctest>
  123. 648.83 s gammaloop-workspace-doctest> Doc-tests alphal00p_docs_catalogs
  124. 651.27 s gammaloop-workspace-doctest>
  125. 651.27 s gammaloop-workspace-doctest> running 0 tests
  126. 651.27 s gammaloop-workspace-doctest>
  127. 651.27 s gammaloop-workspace-doctest> test result: ok. 0 passed; 0 failed; 0 ignored; 0 measured; 0 filtered out; finished in 0.00s
  128. 651.27 s gammaloop-workspace-doctest>
  129. 651.27 s gammaloop-workspace-doctest> Doc-tests alphal00p_docs_examples
  130. 651.29 s gammaloop-workspace-doctest>
  131. 651.29 s gammaloop-workspace-doctest> running 0 tests
  132. 651.29 s gammaloop-workspace-doctest>
  133. 651.29 s gammaloop-workspace-doctest> test result: ok. 0 passed; 0 failed; 0 ignored; 0 measured; 0 filtered out; finished in 0.00s
  134. 651.29 s gammaloop-workspace-doctest>
  135. 651.29 s gammaloop-workspace-doctest> Doc-tests alphal00p_docs
  136. 651.40 s gammaloop-workspace-doctest>
  137. 651.40 s gammaloop-workspace-doctest> running 0 tests
  138. 651.40 s gammaloop-workspace-doctest>
  139. 651.40 s gammaloop-workspace-doctest> test result: ok. 0 passed; 0 failed; 0 ignored; 0 measured; 0 filtered out; finished in 0.00s
  140. 651.40 s gammaloop-workspace-doctest>
  141. 651.40 s gammaloop-workspace-doctest> Doc-tests alphal00p_docs_schema
  142. 651.56 s gammaloop-workspace-doctest>
  143. 651.56 s gammaloop-workspace-doctest> running 0 tests
  144. 651.56 s gammaloop-workspace-doctest>
  145. 651.56 s gammaloop-workspace-doctest> test result: ok. 0 passed; 0 failed; 0 ignored; 0 measured; 0 filtered out; finished in 0.00s
  146. 651.56 s gammaloop-workspace-doctest>
  147. 651.56 s gammaloop-workspace-doctest> Doc-tests clinnet
  148. 651.64 s gammaloop-workspace-doctest>
  149. 651.64 s gammaloop-workspace-doctest> running 0 tests
  150. 651.64 s gammaloop-workspace-doctest>
  151. 651.64 s gammaloop-workspace-doctest> test result: ok. 0 passed; 0 failed; 0 ignored; 0 measured; 0 filtered out; finished in 0.00s
  152. 651.64 s gammaloop-workspace-doctest>
  153. 651.64 s gammaloop-workspace-doctest> Doc-tests gammaloop_api
  154. 653.21 s gammaloop-workspace-doctest>
  155. 653.21 s gammaloop-workspace-doctest> running 2 tests
  156. 653.33 s gammaloop-workspace-doctest> test crates/gammaloop-api/src/lib.rs - (line 18) - compile ... ok
  157. 657.87 s gammaloop-workspace-doctest> test crates/gammaloop-api/src/commands/evaluate_samples.rs - commands::evaluate_samples::EvaluateSamples (line 49) ... ok
  158. 657.87 s gammaloop-workspace-doctest>
  159. 657.87 s gammaloop-workspace-doctest> test result: ok. 2 passed; 0 failed; 0 ignored; 0 measured; 0 filtered out; finished in 4.65s
  160. 657.87 s gammaloop-workspace-doctest>
  161. 657.88 s gammaloop-workspace-doctest> Doc-tests gammaloop_integration_tests
  162. 657.97 s gammaloop-workspace-doctest>
  163. 657.97 s gammaloop-workspace-doctest> running 0 tests
  164. 657.97 s gammaloop-workspace-doctest>
  165. 657.97 s gammaloop-workspace-doctest> test result: ok. 0 passed; 0 failed; 0 ignored; 0 measured; 0 filtered out; finished in 0.00s
  166. 657.97 s gammaloop-workspace-doctest>
  167. 657.98 s gammaloop-workspace-doctest> Doc-tests gammaloop_tracing_filter
  168. 658.06 s gammaloop-workspace-doctest>
  169. 658.06 s gammaloop-workspace-doctest> running 0 tests
  170. 658.06 s gammaloop-workspace-doctest>
  171. 658.06 s gammaloop-workspace-doctest> test result: ok. 0 passed; 0 failed; 0 ignored; 0 measured; 0 filtered out; finished in 0.00s
  172. 658.06 s gammaloop-workspace-doctest>
  173. 658.06 s gammaloop-workspace-doctest> Doc-tests gammaloop_tracing_filter_macros
  174. 658.50 s gammaloop-workspace-doctest>
  175. 658.50 s gammaloop-workspace-doctest> running 2 tests
  176. 658.50 s gammaloop-workspace-doctest> test crates/gammaloop-tracing-filter-macros/src/lib.rs - debug_instrument (line 14) ... ignored
  177. 658.50 s gammaloop-workspace-doctest> test crates/gammaloop-tracing-filter-macros/src/lib.rs - debug_instrument (line 8) ... ignored
  178. 658.50 s gammaloop-workspace-doctest>
  179. 658.50 s gammaloop-workspace-doctest> test result: ok. 0 passed; 0 failed; 2 ignored; 0 measured; 0 filtered out; finished in 0.00s
  180. 658.50 s gammaloop-workspace-doctest>
  181. 658.51 s gammaloop-workspace-doctest> all doctests ran in 0.41s; merged doctests compilation took 0.40s
  182. 658.51 s gammaloop-workspace-doctest> Doc-tests gammaloop_workspace_hack
  183. 658.54 s gammaloop-workspace-doctest>
  184. 658.54 s gammaloop-workspace-doctest> running 0 tests
  185. 658.54 s gammaloop-workspace-doctest>
  186. 658.54 s gammaloop-workspace-doctest> test result: ok. 0 passed; 0 failed; 0 ignored; 0 measured; 0 filtered out; finished in 0.00s
  187. 658.54 s gammaloop-workspace-doctest>
  188. 658.54 s gammaloop-workspace-doctest> Doc-tests gammalooprs
  189. 666.42 s gammaloop-workspace-doctest>
  190. 666.42 s gammaloop-workspace-doctest> running 2 tests
  191. 666.42 s gammaloop-workspace-doctest> test crates/gammalooprs/src/integrands/process/mod.rs - integrands::process::ProcessIntegrandImpl::signal_external_momenta_changed (line 2381) ... ignored
  192. 666.43 s gammaloop-workspace-doctest> test crates/gammalooprs/src/utils/linnet_ext.rs - utils::linnet_ext::Permutation::from_mappings (line 27) ... ok
  193. 666.43 s gammaloop-workspace-doctest>
  194. 666.43 s gammaloop-workspace-doctest> test result: ok. 1 passed; 0 failed; 1 ignored; 0 measured; 0 filtered out; finished in 0.01s
  195. 666.43 s gammaloop-workspace-doctest>
  196. 666.45 s gammaloop-workspace-doctest> all doctests ran in 2.95s; merged doctests compilation took 2.90s
  197. 666.46 s gammaloop-workspace-doctest> Doc-tests idenso
  198. 667.65 s gammaloop-workspace-doctest>
  199. 667.65 s gammaloop-workspace-doctest> running 5 tests
  200. 667.65 s gammaloop-workspace-doctest> test crates/idenso/src/color/macros.rs - color::macros::color_f (line 109) ... ignored
  201. 667.65 s gammaloop-workspace-doctest> test crates/idenso/src/color/macros.rs - color::macros::color_t (line 18) ... ignored
  202. 667.65 s gammaloop-workspace-doctest> test crates/idenso/src/dirac/macros.rs - dirac::macros::gamma (line 28) ... ignored
  203. 667.65 s gammaloop-workspace-doctest> test crates/idenso/src/dirac/macros.rs - dirac::macros::gamma0 (line 259) ... ignored
  204. 667.65 s gammaloop-workspace-doctest> test crates/idenso/src/dirac/macros.rs - dirac::macros::u (line 155) ... ignored
  205. 667.65 s gammaloop-workspace-doctest>
  206. 667.65 s gammaloop-workspace-doctest> test result: ok. 0 passed; 0 failed; 5 ignored; 0 measured; 0 filtered out; finished in 0.00s
  207. 667.65 s gammaloop-workspace-doctest>
  208. 667.66 s gammaloop-workspace-doctest> all doctests ran in 0.59s; merged doctests compilation took 0.58s
  209. 667.66 s gammaloop-workspace-doctest> Doc-tests kurvst
  210. 667.80 s gammaloop-workspace-doctest>
  211. 667.80 s gammaloop-workspace-doctest> running 0 tests
  212. 667.80 s gammaloop-workspace-doctest>
  213. 667.80 s gammaloop-workspace-doctest> test result: ok. 0 passed; 0 failed; 0 ignored; 0 measured; 0 filtered out; finished in 0.00s
  214. 667.80 s gammaloop-workspace-doctest>
  215. 667.81 s gammaloop-workspace-doctest> Doc-tests linnest
  216. 668.31 s gammaloop-workspace-doctest>
  217. 668.31 s gammaloop-workspace-doctest> running 0 tests
  218. 668.31 s gammaloop-workspace-doctest>
  219. 668.31 s gammaloop-workspace-doctest> test result: ok. 0 passed; 0 failed; 0 ignored; 0 measured; 0 filtered out; finished in 0.00s
  220. 668.31 s gammaloop-workspace-doctest>
  221. 668.31 s gammaloop-workspace-doctest> Doc-tests linnet
  222. 669.29 s gammaloop-workspace-doctest>
  223. 669.29 s gammaloop-workspace-doctest> running 46 tests
  224. 669.29 s gammaloop-workspace-doctest> test crates/linnet/src/half_edge/algorithms/transitive_ops.rs - half_edge::algorithms::transitive_ops::HedgeGraph<E,V,H,N>::transitive_closure (line 164) ... ignored
  225. 669.29 s gammaloop-workspace-doctest> test crates/linnet/src/half_edge/algorithms/transitive_ops.rs - half_edge::algorithms::transitive_ops::HedgeGraph<E,V,H,N>::transitive_reduction (line 300) ... ignored
  226. 669.29 s gammaloop-workspace-doctest> test crates/linnet/src/half_edge/builder.rs - half_edge::builder::HedgeGraphBuilder (line 108) ... ignored
  227. 677.03 s gammaloop-workspace-doctest> test crates/linnet/src/half_edge/algorithms/trace_unfold.rs - half_edge::algorithms::trace_unfold::TraceKey<O,D>::write_foata_like (line 1356) ... ok
  228. 677.38 s gammaloop-workspace-doctest> test crates/linnet/src/half_edge/algorithms/trace_unfold.rs - half_edge::algorithms::trace_unfold::TraceUnfold::realizations_for_op (line 213) ... ok
  229. 677.87 s gammaloop-workspace-doctest> test crates/linnet/src/half_edge/algorithms/trace_unfold.rs - half_edge::algorithms::trace_unfold::TraceKey<O,D>::view (line 1110) ... ok
  230. 677.92 s gammaloop-workspace-doctest> test crates/linnet/src/half_edge/algorithms/trace_unfold.rs - half_edge::algorithms::trace_unfold::TraceKey<O,D>::push (line 1253) ... ok
  231. 678.23 s gammaloop-workspace-doctest> test crates/linnet/src/permutation.rs - permutation::Permutation (line 61) ... ok
  232. 678.28 s gammaloop-workspace-doctest> test crates/linnet/src/half_edge/algorithms/trace_unfold.rs - half_edge::algorithms::trace_unfold::TraceKeyView (line 872) ... ok
  233. 678.43 s gammaloop-workspace-doctest> test crates/linnet/src/half_edge/algorithms/trace_unfold.rs - half_edge::algorithms::trace_unfold::TraceKey<O,D>::is_empty (line 1136) ... ok
  234. 678.61 s gammaloop-workspace-doctest> test crates/linnet/src/half_edge/algorithms/trace_unfold.rs - half_edge::algorithms::trace_unfold::TraceKey<O,D>::iter_levels_top_down (line 1164) ... ok
  235. 678.70 s gammaloop-workspace-doctest> test crates/linnet/src/half_edge/algorithms/trace_unfold.rs - half_edge::algorithms::trace_unfold::TraceUnfold (line 127) ... ok
  236. 678.99 s gammaloop-workspace-doctest> test crates/linnet/src/half_edge/algorithms/trace_unfold.rs - half_edge::algorithms::trace_unfold::TraceKey (line 1029) ... ok
  237. 679.14 s gammaloop-workspace-doctest> test crates/linnet/src/half_edge/algorithms/trace_unfold.rs - half_edge::algorithms::trace_unfold::TraceKey<O,D>::empty (line 1071) ... ok
  238. 679.18 s gammaloop-workspace-doctest> test crates/linnet/src/half_edge/algorithms/trace_unfold.rs - half_edge::algorithms::trace_unfold::TraceKey<O,D>::from_levels (line 1089) ... ok
  239. 679.28 s gammaloop-workspace-doctest> test crates/linnet/src/parser/mod.rs - parser (line 17) ... ok
  240. 679.34 s gammaloop-workspace-doctest> test crates/linnet/src/half_edge/algorithms/trace_unfold.rs - half_edge::algorithms::trace_unfold::TraceKey<O,D>::iter_levels_bottom_up (line 1194) ... ok
  241. 679.35 s gammaloop-workspace-doctest> test crates/linnet/src/half_edge/algorithms/trace_unfold.rs - half_edge::algorithms::trace_unfold::TraceKeyView<'a,O,D>::to_owned (line 979) ... ok
  242. 679.68 s gammaloop-workspace-doctest> test crates/linnet/src/half_edge/algorithms/trace_unfold.rs - half_edge::algorithms::trace_unfold::TraceKey<O,D>::iter_leaf_ops (line 1222) ... ok
  243. 684.67 s gammaloop-workspace-doctest> test crates/linnet/src/permutation.rs - permutation::Permutation::cycle_to_transpositions (line 713) ... ok
  244. 684.90 s gammaloop-workspace-doctest> test crates/linnet/src/permutation.rs - permutation::Permutation::apply_slice (line 451) ... ok
  245. 685.94 s gammaloop-workspace-doctest> test crates/linnet/src/permutation.rs - permutation::Permutation::apply_slice_in_place (line 488) ... ok
  246. 686.42 s gammaloop-workspace-doctest> test crates/linnet/src/permutation.rs - permutation::Permutation::apply_slice_in_place_inv (line 510) ... ok
  247. 686.63 s gammaloop-workspace-doctest> test crates/linnet/src/permutation.rs - permutation::Permutation::find_cycles (line 680) ... ok
  248. 686.73 s gammaloop-workspace-doctest> test crates/linnet/src/permutation.rs - permutation::Permutation::apply_slice_inv (line 469) ... ok
  249. 687.20 s gammaloop-workspace-doctest> test crates/linnet/src/permutation.rs - permutation::Permutation::from_disjoint_cycles (line 978) ... ok
  250. 688.00 s gammaloop-workspace-doctest> test crates/linnet/src/permutation.rs - permutation::Permutation::inverse (line 434) ... ok
  251. 688.03 s gammaloop-workspace-doctest> test crates/linnet/src/permutation.rs - permutation::Permutation::from_map (line 113) ... ok
  252. 688.16 s gammaloop-workspace-doctest> test crates/linnet/src/permutation.rs - permutation::Permutation::from_prefix_sources (line 266) ... ok
  253. 688.19 s gammaloop-workspace-doctest> test crates/linnet/src/permutation.rs - permutation::Permutation::inv (line 416) ... ok
  254. 688.21 s gammaloop-workspace-doctest> test crates/linnet/src/permutation.rs - permutation::Permutation::id (line 96) ... ok
  255. 688.38 s gammaloop-workspace-doctest> test crates/linnet/src/permutation.rs - permutation::Permutation::from_cycles (line 1069) ... ok
  256. 688.64 s gammaloop-workspace-doctest> test crates/linnet/src/permutation.rs - permutation::Permutation::iter_slice (line 543) ... ok
  257. 688.65 s gammaloop-workspace-doctest> test crates/linnet/src/permutation.rs - permutation::Permutation::is_identity (line 851) ... ok
  258. 689.40 s gammaloop-workspace-doctest> test crates/linnet/src/permutation.rs - permutation::Permutation::iter_slice_inv (line 562) ... ok
  259. 691.65 s gammaloop-workspace-doctest> test crates/linnet/src/permutation.rs - permutation::Permutation::iter_slice_mut (line 588) ... ok
  260. 692.06 s gammaloop-workspace-doctest> test crates/linnet/src/permutation.rs - permutation::Permutation::iter_slice_inv_mut (line 615) ... ok
  261. 692.80 s gammaloop-workspace-doctest> test crates/linnet/src/permutation.rs - permutation::Permutation::map (line 402) ... ok
  262. 693.16 s gammaloop-workspace-doctest> test crates/linnet/src/permutation.rs - permutation::Permutation::myrvold_ruskey_rank2 (line 805) ... ok
  263. 693.22 s gammaloop-workspace-doctest> test crates/linnet/src/permutation.rs - permutation::Permutation::pow (line 896) ... ok
  264. 693.30 s gammaloop-workspace-doctest> test crates/linnet/src/permutation.rs - permutation::Permutation::myrvold_ruskey_unrank1 (line 782) ... ok
  265. 693.64 s gammaloop-workspace-doctest> test crates/linnet/src/permutation.rs - permutation::Permutation::sign (line 869) ... ok
  266. 693.74 s gammaloop-workspace-doctest> test crates/linnet/src/permutation.rs - permutation::Permutation::transpositions (line 733) ... ok
  267. 693.79 s gammaloop-workspace-doctest> test crates/linnet/src/permutation.rs - permutation::Permutation::myrvold_ruskey_unrank2 (line 828) ... ok
  268. 693.88 s gammaloop-workspace-doctest> test crates/linnet/src/permutation.rs - permutation::Permutation::myrvold_ruskey_rank1 (line 760) ... ok
  269. 693.91 s gammaloop-workspace-doctest> test crates/linnet/src/permutation.rs - permutation::Permutation::sort (line 640) ... ok
  270. 693.91 s gammaloop-workspace-doctest>
  271. 693.91 s gammaloop-workspace-doctest> test result: ok. 43 passed; 0 failed; 3 ignored; 0 measured; 0 filtered out; finished in 24.63s
  272. 693.91 s gammaloop-workspace-doctest>
  273. 693.92 s gammaloop-workspace-doctest> Doc-tests linnet_py
  274. 695.16 s gammaloop-workspace-doctest>
  275. 695.17 s gammaloop-workspace-doctest> running 0 tests
  276. 695.17 s gammaloop-workspace-doctest>
  277. 695.17 s gammaloop-workspace-doctest> test result: ok. 0 passed; 0 failed; 0 ignored; 0 measured; 0 filtered out; finished in 0.00s
  278. 695.17 s gammaloop-workspace-doctest>
  279. 695.17 s gammaloop-workspace-doctest> Doc-tests spenso
  280. 701.72 s gammaloop-workspace-doctest>
  281. 701.72 s gammaloop-workspace-doctest> running 9 tests
  282. 701.72 s gammaloop-workspace-doctest> test crates/spenso/src/shadowing/macros.rs - shadowing::macros::antisym (line 337) ... ignored
  283. 701.72 s gammaloop-workspace-doctest> test crates/spenso/src/shadowing/macros.rs - shadowing::macros::chain (line 387) ... ignored
  284. 701.72 s gammaloop-workspace-doctest> test crates/spenso/src/shadowing/macros.rs - shadowing::macros::cyclic (line 361) ... ignored
  285. 701.72 s gammaloop-workspace-doctest> test crates/spenso/src/shadowing/macros.rs - shadowing::macros::slot (line 24) ... ignored
  286. 701.72 s gammaloop-workspace-doctest> test crates/spenso/src/shadowing/macros.rs - shadowing::macros::sym (line 313) ... ignored
  287. 701.72 s gammaloop-workspace-doctest> test crates/spenso/src/shadowing/macros.rs - shadowing::macros::tensor (line 110) ... ignored
  288. 701.72 s gammaloop-workspace-doctest> test crates/spenso/src/shadowing/macros.rs - shadowing::macros::trace (line 444) ... ignored
  289. 701.72 s gammaloop-workspace-doctest> test crates/spenso/src/shadowing/macros.rs - shadowing::macros::trace_sym (line 496) ... ignored
  290. 702.06 s gammaloop-workspace-doctest> test crates/spenso/src/network/mod.rs - network::Network (line 1693) ... FAILED
  291. 702.06 s gammaloop-workspace-doctest>
  292. 702.06 s gammaloop-workspace-doctest> failures:
  293. 702.06 s gammaloop-workspace-doctest>
  294. 702.06 s gammaloop-workspace-doctest> ---- crates/spenso/src/network/mod.rs - network::Network (line 1693) stdout ----
  295. 702.06 s gammaloop-workspace-doctest> Test executable failed (terminated by signal).
  296. 702.06 s gammaloop-workspace-doctest>
  297. 702.06 s gammaloop-workspace-doctest> stdout:
  298. 702.06 s gammaloop-workspace-doctest> ┌────────────────────────────────────────────────────────┐
  299. 702.06 s gammaloop-workspace-doctest> │ You are running a restricted Symbolica instance. │
  300. 702.06 s gammaloop-workspace-doctest> │ │
  301. 702.06 s gammaloop-workspace-doctest> │ For non-commercial use only, limited to one │
  302. 702.06 s gammaloop-workspace-doctest> │ Symbolica thread per user. │
  303. 702.06 s gammaloop-workspace-doctest> │ │
  304. 702.06 s gammaloop-workspace-doctest> ├─ Unlock all cores ─────────────────────────────────────┤
  305. 702.06 s gammaloop-workspace-doctest> │ │
  306. 702.06 s gammaloop-workspace-doctest> │ Hobbyists and students: free annual key │
  307. 702.06 s gammaloop-workspace-doctest> │ https://symbolica.io/license/#get-hobbyist-license │
  308. 702.06 s gammaloop-workspace-doctest> │ │
  309. 702.06 s gammaloop-workspace-doctest> │ Free 30-day professional trial: │
  310. 702.06 s gammaloop-workspace-doctest> │ https://symbolica.io/license/#get-trial-license │
  311. 702.06 s gammaloop-workspace-doctest> │ │
  312. 702.06 s gammaloop-workspace-doctest> └────────────────────────────────────────────────────────┘
  313. 702.06 s gammaloop-workspace-doctest> ┌──────────────────────────────────────────────────────────────────────────────────────────────────┐
  314. 702.06 s gammaloop-workspace-doctest> │ Cannot start another restricted Symbolica thread while this user's thread allowance is in use. │
  315. 702.06 s gammaloop-workspace-doctest> └──────────────────────────────────────────────────────────────────────────────────────────────────┘
  316. 702.06 s gammaloop-workspace-doctest>
  317. 702.06 s gammaloop-workspace-doctest> stderr:
  318. 702.06 s gammaloop-workspace-doctest> ┌────────────────────────────────────────────────────────┐
  319. 702.06 s gammaloop-workspace-doctest> │ The Symbolica license key format is outdated. │
  320. 702.06 s gammaloop-workspace-doctest> │ Renew your key at https://symbolica.io/license/ │
  321. 702.06 s gammaloop-workspace-doctest> └────────────────────────────────────────────────────────┘
  322. 702.06 s gammaloop-workspace-doctest> Could not acquire Symbolica thread permit: Permission denied (os error 13)
  323. 702.06 s gammaloop-workspace-doctest>
  324. 702.06 s gammaloop-workspace-doctest>
  325. 702.06 s gammaloop-workspace-doctest>
  326. 702.06 s gammaloop-workspace-doctest> failures:
  327. 702.06 s gammaloop-workspace-doctest> crates/spenso/src/network/mod.rs - network::Network (line 1693)
  328. 702.06 s gammaloop-workspace-doctest>
  329. 702.06 s gammaloop-workspace-doctest> test result: FAILED. 0 passed; 1 failed; 8 ignored; 0 measured; 0 filtered out; finished in 0.34s
  330. 702.06 s gammaloop-workspace-doctest>
  331. 702.12 s gammaloop-workspace-doctest> all doctests ran in 5.69s; merged doctests compilation took 5.28s
  332. 702.12 s gammaloop-workspace-doctest> error: doctest failed, to rerun pass `-p spenso --doc`
  333. 703.04 s [0 built (1 failed), 0.0error: Cannot build '/nix/store/qkv16lywvzf7qi552d4ffa1rpqvbynj9-gammaloop-workspace-doctest-0.1.0.drv'.
  334. 703.04 s Reason: builder failed with exit code 101.
  335. 703.04 s Output paths:
  336. 703.04 s /nix/store/j6lkxlfh6a3ywr1qm199xz6v2ids5ry0-gammaloop-workspace-doctest-0.1.0
  337. 703.04 s Last 316 log lines:
  338. 703.04 s > Running phase: unpackPhase
  339. 703.04 s > unpacking source archive /nix/store/jkbhll49z1x5ahw24kr1s7hg5j04yi8g-source
  340. 703.04 s > source root is source
  341. 703.04 s > Running phase: patchPhase
  342. 703.04 s > Executing configureCargoCommonVars
  343. 703.04 s > decompressing cargo artifacts from /nix/store/y3rckwyasbms4vpvjsg4f4zrvibk39ch-gammaloop-workspace-deps-deps-0.1.0/target.tar.zst to target
  344. 703.04 s > Running phase: updateAutotoolsGnuConfigScriptsPhase
  345. 703.04 s > Running phase: configurePhase
  346. 703.04 s > will append /build/source/.cargo-home/config.toml with contents of /nix/store/9rqk4093qnvgswmdk1pbxk9najcrjn7a-vendor-cargo-deps/config.toml
  347. 703.04 s > default configurePhase, nothing to do
  348. 703.04 s > Running phase: buildPhase
  349. 703.04 s > +++ command cargo --version
  350. 703.04 s > cargo 1.98.1 (797e8a9bc 2026-08-05)
  351. 703.04 s > +++ command cargo test --profile ci-optim --doc --locked --workspace --features gammaloop-api/cli,gammaloop-tracing-filter/clap,gammaloop-tracing-filter/symbolica,idenso/bincode,idenso/native,idenso/reference-cases,linnet/bincode,linnet/drawing,linnet/nodestore-vec,linnet/rkyv,linnet/serde,linnet/symbolica,spenso-macros/native,spenso-macros/shadowing,spenso/native,spenso/native-code-generation,spenso/shadowing,symbolica-utils/native,symbolica/tracing_max_level_info --exclude alphal00p-docs-python-exporter
  352. 703.04 s > Compiling target-lexicon v0.13.5
  353. 703.04 s > Compiling const-random-macro v0.1.16
  354. 703.04 s > Compiling phf_generator v0.11.3
  355. 703.04 s > Compiling rustpython-ast v0.4.0
  356. 703.04 s > Compiling similar v2.7.0
  357. 703.04 s > Compiling symbolica v2.2.0 (https://github.com/symbolica-dev/symbolica?rev=4f1323185fe5e0c0f8c864ab89edd1905e7adef1#4f132318)
  358. 703.04 s > Compiling derive_more-impl v2.1.1
  359. 703.04 s > Compiling gammaloop-tracing-filter-macros v0.1.0 (/build/source/crates/gammaloop-tracing-filter-macros)
  360. 703.04 s > Compiling vakint v0.1.2 (/build/source/crates/vakint)
  361. 703.04 s > Compiling gammalooprs v0.3.4 (/build/source/crates/gammalooprs)
  362. 703.04 s > Compiling gammaloop-api v0.1.0 (/build/source/crates/gammaloop-api)
  363. 703.04 s > Compiling alphal00p-docs-macros v0.1.0 (/build/source/crates/alphal00p-docs-macros)
  364. 703.04 s > Compiling proc-macro-error-attr2 v2.0.0
  365. 703.04 s > Compiling alphal00p-docs-schema v0.1.0 (/build/source/crates/alphal00p-docs-schema)
  366. 703.04 s > Compiling rustc_version v0.4.1
  367. 703.04 s > Compiling phf_codegen v0.11.3
  368. 703.04 s > Compiling figment v0.10.19
  369. 703.04 s > Compiling bincode v1.3.3
  370. 703.04 s > Compiling unicode_names2_generator v1.3.0
  371. 703.04 s > Compiling rustpython-parser v0.4.0
  372. 703.04 s > Compiling target-triple v1.0.1
  373. 703.04 s > Compiling const-random v0.1.18
  374. 703.04 s > Compiling gungraun-runner v0.18.2
  375. 703.04 s > Compiling ahash v0.8.12
  376. 703.04 s > Compiling iai-callgrind-runner v0.14.2
  377. 703.04 s > Compiling insta v1.47.2
  378. 703.04 s > Compiling symjit v2.25.6
  379. 703.04 s > Compiling numerica v3.0.0 (https://github.com/symbolica-dev/symbolica?rev=4f1323185fe5e0c0f8c864ab89edd1905e7adef1#4f132318)
  380. 703.04 s > Compiling momtrop v0.3.0
  381. 703.04 s > Compiling gungraun-macros v0.8.0
  382. 703.04 s > Compiling proc-macro-error2 v2.0.1
  383. 703.04 s > Compiling kurvst v0.1.0 (/build/source/crates/kurvst)
  384. 703.04 s > Compiling gammaloop-integration-tests v0.1.0 (/build/source/tests)
  385. 703.04 s > Compiling alphal00p-docs-catalogs v0.1.0 (/build/source/crates/alphal00p-docs-catalogs)
  386. 703.04 s > Compiling pyo3-build-config v0.28.3
  387. 703.04 s > Compiling test-log-core v0.2.20
  388. 703.04 s > Compiling wait-timeout v0.2.1
  389. 703.04 s > Compiling quick-error v1.2.3
  390. 703.04 s > Compiling bit-vec v0.8.0
  391. 703.04 s > Compiling iai-callgrind v0.14.2
  392. 703.04 s > Compiling bit-set v0.8.0
  393. 703.04 s > Compiling rusty-fork v0.3.1
  394. 703.04 s > Compiling test-log-macros v0.2.20
  395. 703.04 s > Compiling rand_xorshift v0.4.0
  396. 703.04 s > Compiling console v0.15.11
  397. 703.04 s > Compiling termcolor v1.4.1
  398. 703.04 s > Compiling glob v0.3.4
  399. 703.04 s > Compiling unicode_names2 v1.3.0
  400. 703.04 s > Compiling unarray v0.1.4
  401. 703.04 s > Compiling alphal00p-docs-examples v0.1.0 (/build/source/crates/alphal00p-docs-examples)
  402. 703.04 s > Compiling base64 v0.21.7
  403. 703.04 s > Compiling graphica v3.0.0 (https://github.com/symbolica-dev/symbolica?rev=4f1323185fe5e0c0f8c864ab89edd1905e7adef1#4f132318)
  404. 703.04 s > Compiling ron v0.8.1
  405. 703.04 s > Compiling clinnet v0.1.8 (/build/source/crates/clinnet)
  406. 703.04 s > Compiling proptest v1.11.0
  407. 703.04 s > Compiling test-log v0.2.20
  408. 703.04 s > Compiling trybuild v1.0.120
  409. 703.04 s > Compiling similar-asserts v1.7.0
  410. 703.04 s > Compiling alphal00p-docs-builder v0.1.0 (/build/source/crates/alphal00p-docs-builder)
  411. 703.04 s > Compiling pyo3-ffi v0.28.3
  412. 703.04 s > Compiling pyo3-macros-backend v0.28.3
  413. 703.04 s > Compiling pyo3 v0.28.3
  414. 703.04 s > Compiling numpy v0.28.0
  415. 703.04 s > Compiling linnet-py v0.1.0 (/build/source/crates/linnet-py)
  416. 703.04 s > Compiling derive_more v2.1.1
  417. 703.04 s > Compiling crossterm v0.29.0
  418. 703.04 s > Compiling iai-callgrind-macros v0.5.1
  419. 703.04 s > Compiling ratatui-crossterm v0.1.0
  420. 703.04 s > Compiling ratatui v0.30.0
  421. 703.04 s > Compiling pyo3-stub-gen-derive v0.17.2
  422. 703.04 s > Compiling gungraun v0.18.2
  423. 703.04 s > Compiling pyo3-macros v0.28.3
  424. 703.04 s > Compiling symbolica-utils v0.1.0 (/build/source/crates/symbolica-utils)
  425. 703.04 s > Compiling tymbolica-atom-payload v0.1.0 (https://github.com/lcnbr/tymbolica?rev=32ae00483b4845161401afac8be755cc336cb2bb#32ae0048)
  426. 703.04 s > Compiling gammaloop-workspace-hack v0.1.0 (/build/source/crates/gammaloop-workspace-hack)
  427. 703.04 s > Compiling spenso-macros v0.3.2 (/build/source/crates/spenso-macros)
  428. 703.04 s > Compiling linnet v0.17.0 (/build/source/crates/linnet)
  429. 703.04 s > Compiling spenso v0.6.0 (/build/source/crates/spenso)
  430. 703.04 s > Compiling idenso v0.3.0 (/build/source/crates/idenso)
  431. 703.04 s > Compiling gammaloop-tracing-filter v0.1.0 (/build/source/crates/gammaloop-tracing-filter)
  432. 703.04 s > Compiling spenso-hep-lib v0.1.7 (/build/source/crates/spenso-hep-lib)
  433. 703.04 s > Compiling spynso3 v0.1.2 (/build/source/crates/spynso3)
  434. 703.04 s > Compiling linnest v0.1.0 (/build/source/crates/linnest)
  435. 703.04 s > Finished `ci-optim` profile [optimized] target(s) in 10m 20s
  436. 703.04 s > warning: the following packages contain code that will be rejected by a future version of Rust: proc-macro-error2 v2.0.1
  437. 703.04 s > note: to see what the problems were, use the option `--future-incompat-report`, or run `cargo report future-incompatibilities --id 1`
  438. 703.04 s > Doc-tests alphal00p_docs_builder
  439. 703.04 s >
  440. 703.04 s > running 0 tests
  441. 703.04 s >
  442. 703.04 s > test result: ok. 0 passed; 0 failed; 0 ignored; 0 measured; 0 filtered out; finished in 0.00s
  443. 703.04 s >
  444. 703.04 s > Doc-tests alphal00p_docs_catalogs
  445. 703.04 s >
  446. 703.04 s > running 0 tests
  447. 703.04 s >
  448. 703.04 s > test result: ok. 0 passed; 0 failed; 0 ignored; 0 measured; 0 filtered out; finished in 0.00s
  449. 703.04 s >
  450. 703.04 s > Doc-tests alphal00p_docs_examples
  451. 703.04 s >
  452. 703.04 s > running 0 tests
  453. 703.04 s >
  454. 703.04 s > test result: ok. 0 passed; 0 failed; 0 ignored; 0 measured; 0 filtered out; finished in 0.00s
  455. 703.04 s >
  456. 703.04 s > Doc-tests alphal00p_docs
  457. 703.04 s >
  458. 703.04 s > running 0 tests
  459. 703.04 s >
  460. 703.04 s > test result: ok. 0 passed; 0 failed; 0 ignored; 0 measured; 0 filtered out; finished in 0.00s
  461. 703.04 s >
  462. 703.04 s > Doc-tests alphal00p_docs_schema
  463. 703.04 s >
  464. 703.04 s > running 0 tests
  465. 703.04 s >
  466. 703.04 s > test result: ok. 0 passed; 0 failed; 0 ignored; 0 measured; 0 filtered out; finished in 0.00s
  467. 703.04 s >
  468. 703.04 s > Doc-tests clinnet
  469. 703.04 s >
  470. 703.04 s > running 0 tests
  471. 703.04 s >
  472. 703.04 s > test result: ok. 0 passed; 0 failed; 0 ignored; 0 measured; 0 filtered out; finished in 0.00s
  473. 703.04 s >
  474. 703.04 s > Doc-tests gammaloop_api
  475. 703.04 s >
  476. 703.04 s > running 2 tests
  477. 703.04 s > test crates/gammaloop-api/src/lib.rs - (line 18) - compile ... ok
  478. 703.04 s > test crates/gammaloop-api/src/commands/evaluate_samples.rs - commands::evaluate_samples::EvaluateSamples (line 49) ... ok
  479. 703.04 s >
  480. 703.04 s > test result: ok. 2 passed; 0 failed; 0 ignored; 0 measured; 0 filtered out; finished in 4.65s
  481. 703.04 s >
  482. 703.04 s > Doc-tests gammaloop_integration_tests
  483. 703.04 s >
  484. 703.04 s > running 0 tests
  485. 703.04 s >
  486. 703.04 s > test result: ok. 0 passed; 0 failed; 0 ignored; 0 measured; 0 filtered out; finished in 0.00s
  487. 703.04 s >
  488. 703.04 s > Doc-tests gammaloop_tracing_filter
  489. 703.04 s >
  490. 703.04 s > running 0 tests
  491. 703.04 s >
  492. 703.04 s > test result: ok. 0 passed; 0 failed; 0 ignored; 0 measured; 0 filtered out; finished in 0.00s
  493. 703.04 s >
  494. 703.04 s > Doc-tests gammaloop_tracing_filter_macros
  495. 703.04 s >
  496. 703.04 s > running 2 tests
  497. 703.04 s > test crates/gammaloop-tracing-filter-macros/src/lib.rs - debug_instrument (line 14) ... ignored
  498. 703.04 s > test crates/gammaloop-tracing-filter-macros/src/lib.rs - debug_instrument (line 8) ... ignored
  499. 703.04 s >
  500. 703.04 s > test result: ok. 0 passed; 0 failed; 2 ignored; 0 measured; 0 filtered out; finished in 0.00s
  501. 703.04 s >
  502. 703.04 s > all doctests ran in 0.41s; merged doctests compilation took 0.40s
  503. 703.04 s > Doc-tests gammaloop_workspace_hack
  504. 703.04 s >
  505. 703.04 s > running 0 tests
  506. 703.04 s >
  507. 703.04 s > test result: ok. 0 passed; 0 failed; 0 ignored; 0 measured; 0 filtered out; finished in 0.00s
  508. 703.04 s >
  509. 703.04 s > Doc-tests gammalooprs
  510. 703.04 s >
  511. 703.04 s > running 2 tests
  512. 703.04 s > test crates/gammalooprs/src/integrands/process/mod.rs - integrands::process::ProcessIntegrandImpl::signal_external_momenta_changed (line 2381) ... ignored
  513. 703.04 s > test crates/gammalooprs/src/utils/linnet_ext.rs - utils::linnet_ext::Permutation::from_mappings (line 27) ... ok
  514. 703.04 s >
  515. 703.04 s > test result: ok. 1 passed; 0 failed; 1 ignored; 0 measured; 0 filtered out; finished in 0.01s
  516. 703.04 s >
  517. 703.04 s > all doctests ran in 2.95s; merged doctests compilation took 2.90s
  518. 703.04 s > Doc-tests idenso
  519. 703.04 s >
  520. 703.04 s > running 5 tests
  521. 703.04 s > test crates/idenso/src/color/macros.rs - color::macros::color_f (line 109) ... ignored
  522. 703.04 s > test crates/idenso/src/color/macros.rs - color::macros::color_t (line 18) ... ignored
  523. 703.04 s > test crates/idenso/src/dirac/macros.rs - dirac::macros::gamma (line 28) ... ignored
  524. 703.04 s > test crates/idenso/src/dirac/macros.rs - dirac::macros::gamma0 (line 259) ... ignored
  525. 703.04 s > test crates/idenso/src/dirac/macros.rs - dirac::macros::u (line 155) ... ignored
  526. 703.04 s >
  527. 703.04 s > test result: ok. 0 passed; 0 failed; 5 ignored; 0 measured; 0 filtered out; finished in 0.00s
  528. 703.04 s >
  529. 703.04 s > all doctests ran in 0.59s; merged doctests compilation took 0.58s
  530. 703.05 s > Doc-tests kurvst
  531. 703.05 s >
  532. 703.05 s > running 0 tests
  533. 703.05 s >
  534. 703.05 s > test result: ok. 0 passed; 0 failed; 0 ignored; 0 measured; 0 filtered out; finished in 0.00s
  535. 703.05 s >
  536. 703.05 s > Doc-tests linnest
  537. 703.05 s >
  538. 703.05 s > running 0 tests
  539. 703.05 s >
  540. 703.05 s > test result: ok. 0 passed; 0 failed; 0 ignored; 0 measured; 0 filtered out; finished in 0.00s
  541. 703.05 s >
  542. 703.05 s > Doc-tests linnet
  543. 703.05 s >
  544. 703.05 s > running 46 tests
  545. 703.05 s > test crates/linnet/src/half_edge/algorithms/transitive_ops.rs - half_edge::algorithms::transitive_ops::HedgeGraph<E,V,H,N>::transitive_closure (line 164) ... ignored
  546. 703.05 s > test crates/linnet/src/half_edge/algorithms/transitive_ops.rs - half_edge::algorithms::transitive_ops::HedgeGraph<E,V,H,N>::transitive_reduction (line 300) ... ignored
  547. 703.05 s > test crates/linnet/src/half_edge/builder.rs - half_edge::builder::HedgeGraphBuilder (line 108) ... ignored
  548. 703.05 s > test crates/linnet/src/half_edge/algorithms/trace_unfold.rs - half_edge::algorithms::trace_unfold::TraceKey<O,D>::write_foata_like (line 1356) ... ok
  549. 703.05 s > test crates/linnet/src/half_edge/algorithms/trace_unfold.rs - half_edge::algorithms::trace_unfold::TraceUnfold::realizations_for_op (line 213) ... ok
  550. 703.05 s > test crates/linnet/src/half_edge/algorithms/trace_unfold.rs - half_edge::algorithms::trace_unfold::TraceKey<O,D>::view (line 1110) ... ok
  551. 703.05 s > test crates/linnet/src/half_edge/algorithms/trace_unfold.rs - half_edge::algorithms::trace_unfold::TraceKey<O,D>::push (line 1253) ... ok
  552. 703.05 s > test crates/linnet/src/permutation.rs - permutation::Permutation (line 61) ... ok
  553. 703.05 s > test crates/linnet/src/half_edge/algorithms/trace_unfold.rs - half_edge::algorithms::trace_unfold::TraceKeyView (line 872) ... ok
  554. 703.05 s > test crates/linnet/src/half_edge/algorithms/trace_unfold.rs - half_edge::algorithms::trace_unfold::TraceKey<O,D>::is_empty (line 1136) ... ok
  555. 703.05 s > test crates/linnet/src/half_edge/algorithms/trace_unfold.rs - half_edge::algorithms::trace_unfold::TraceKey<O,D>::iter_levels_top_down (line 1164) ... ok
  556. 703.05 s > test crates/linnet/src/half_edge/algorithms/trace_unfold.rs - half_edge::algorithms::trace_unfold::TraceUnfold (line 127) ... ok
  557. 703.05 s > test crates/linnet/src/half_edge/algorithms/trace_unfold.rs - half_edge::algorithms::trace_unfold::TraceKey (line 1029) ... ok
  558. 703.05 s > test crates/linnet/src/half_edge/algorithms/trace_unfold.rs - half_edge::algorithms::trace_unfold::TraceKey<O,D>::empty (line 1071) ... ok
  559. 703.05 s > test crates/linnet/src/half_edge/algorithms/trace_unfold.rs - half_edge::algorithms::trace_unfold::TraceKey<O,D>::from_levels (line 1089) ... ok
  560. 703.05 s > test crates/linnet/src/parser/mod.rs - parser (line 17) ... ok
  561. 703.05 s > test crates/linnet/src/half_edge/algorithms/trace_unfold.rs - half_edge::algorithms::trace_unfold::TraceKey<O,D>::iter_levels_bottom_up (line 1194) ... ok
  562. 703.05 s > test crates/linnet/src/half_edge/algorithms/trace_unfold.rs - half_edge::algorithms::trace_unfold::TraceKeyView<'a,O,D>::to_owned (line 979) ... ok
  563. 703.05 s > test crates/linnet/src/half_edge/algorithms/trace_unfold.rs - half_edge::algorithms::trace_unfold::TraceKey<O,D>::iter_leaf_ops (line 1222) ... ok
  564. 703.05 s > test crates/linnet/src/permutation.rs - permutation::Permutation::cycle_to_transpositions (line 713) ... ok
  565. 703.05 s > test crates/linnet/src/permutation.rs - permutation::Permutation::apply_slice (line 451) ... ok
  566. 703.05 s > test crates/linnet/src/permutation.rs - permutation::Permutation::apply_slice_in_place (line 488) ... ok
  567. 703.05 s > test crates/linnet/src/permutation.rs - permutation::Permutation::apply_slice_in_place_inv (line 510) ... ok
  568. 703.05 s > test crates/linnet/src/permutation.rs - permutation::Permutation::find_cycles (line 680) ... ok
  569. 703.05 s > test crates/linnet/src/permutation.rs - permutation::Permutation::apply_slice_inv (line 469) ... ok
  570. 703.05 s > test crates/linnet/src/permutation.rs - permutation::Permutation::from_disjoint_cycles (line 978) ... ok
  571. 703.05 s > test crates/linnet/src/permutation.rs - permutation::Permutation::inverse (line 434) ... ok
  572. 703.05 s > test crates/linnet/src/permutation.rs - permutation::Permutation::from_map (line 113) ... ok
  573. 703.05 s > test crates/linnet/src/permutation.rs - permutation::Permutation::from_prefix_sources (line 266) ... ok
  574. 703.05 s > test crates/linnet/src/permutation.rs - permutation::Permutation::inv (line 416) ... ok
  575. 703.05 s > test crates/linnet/src/permutation.rs - permutation::Permutation::id (line 96) ... ok
  576. 703.05 s > test crates/linnet/src/permutation.rs - permutation::Permutation::from_cycles (line 1069) ... ok
  577. 703.05 s > test crates/linnet/src/permutation.rs - permutation::Permutation::iter_slice (line 543) ... ok
  578. 703.05 s > test crates/linnet/src/permutation.rs - permutation::Permutation::is_identity (line 851) ... ok
  579. 703.05 s > test crates/linnet/src/permutation.rs - permutation::Permutation::iter_slice_inv (line 562) ... ok
  580. 703.05 s > test crates/linnet/src/permutation.rs - permutation::Permutation::iter_slice_mut (line 588) ... ok
  581. 703.05 s > test crates/linnet/src/permutation.rs - permutation::Permutation::iter_slice_inv_mut (line 615) ... ok
  582. 703.05 s > test crates/linnet/src/permutation.rs - permutation::Permutation::map (line 402) ... ok
  583. 703.05 s > test crates/linnet/src/permutation.rs - permutation::Permutation::myrvold_ruskey_rank2 (line 805) ... ok
  584. 703.05 s > test crates/linnet/src/permutation.rs - permutation::Permutation::pow (line 896) ... ok
  585. 703.05 s > test crates/linnet/src/permutation.rs - permutation::Permutation::myrvold_ruskey_unrank1 (line 782) ... ok
  586. 703.05 s > test crates/linnet/src/permutation.rs - permutation::Permutation::sign (line 869) ... ok
  587. 703.05 s > test crates/linnet/src/permutation.rs - permutation::Permutation::transpositions (line 733) ... ok
  588. 703.05 s > test crates/linnet/src/permutation.rs - permutation::Permutation::myrvold_ruskey_unrank2 (line 828) ... ok
  589. 703.05 s > test crates/linnet/src/permutation.rs - permutation::Permutation::myrvold_ruskey_rank1 (line 760) ... ok
  590. 703.05 s > test crates/linnet/src/permutation.rs - permutation::Permutation::sort (line 640) ... ok
  591. 703.05 s >
  592. 703.05 s > test result: ok. 43 passed; 0 failed; 3 ignored; 0 measured; 0 filtered out; finished in 24.63s
  593. 703.05 s >
  594. 703.05 s > Doc-tests linnet_py
  595. 703.05 s >
  596. 703.05 s > running 0 tests
  597. 703.05 s >
  598. 703.05 s > test result: ok. 0 passed; 0 failed; 0 ignored; 0 measured; 0 filtered out; finished in 0.00s
  599. 703.05 s >
  600. 703.05 s > Doc-tests spenso
  601. 703.05 s >
  602. 703.05 s > running 9 tests
  603. 703.05 s > test crates/spenso/src/shadowing/macros.rs - shadowing::macros::antisym (line 337) ... ignored
  604. 703.05 s > test crates/spenso/src/shadowing/macros.rs - shadowing::macros::chain (line 387) ... ignored
  605. 703.05 s > test crates/spenso/src/shadowing/macros.rs - shadowing::macros::cyclic (line 361) ... ignored
  606. 703.05 s > test crates/spenso/src/shadowing/macros.rs - shadowing::macros::slot (line 24) ... ignored
  607. 703.05 s > test crates/spenso/src/shadowing/macros.rs - shadowing::macros::sym (line 313) ... ignored
  608. 703.05 s > test crates/spenso/src/shadowing/macros.rs - shadowing::macros::tensor (line 110) ... ignored
  609. 703.05 s > test crates/spenso/src/shadowing/macros.rs - shadowing::macros::trace (line 444) ... ignored
  610. 703.05 s > test crates/spenso/src/shadowing/macros.rs - shadowing::macros::trace_sym (line 496) ... ignored
  611. 703.05 s > test crates/spenso/src/network/mod.rs - network::Network (line 1693) ... FAILED
  612. 703.05 s >
  613. 703.05 s > failures:
  614. 703.05 s >
  615. 703.05 s > ---- crates/spenso/src/network/mod.rs - network::Network (line 1693) stdout ----
  616. 703.05 s > Test executable failed (terminated by signal).
  617. 703.05 s >
  618. 703.05 s > stdout:
  619. 703.05 s > ┌────────────────────────────────────────────────────────┐
  620. 703.05 s > │ You are running a restricted Symbolica instance. │
  621. 703.05 s > │ │
  622. 703.05 s > │ For non-commercial use only, limited to one │
  623. 703.05 s > │ Symbolica thread per user. │
  624. 703.05 s > │ │
  625. 703.05 s > ├─ Unlock all cores ─────────────────────────────────────┤
  626. 703.05 s > │ │
  627. 703.05 s > │ Hobbyists and students: free annual key │
  628. 703.05 s > │ https://symbolica.io/license/#get-hobbyist-license │
  629. 703.05 s > │ │
  630. 703.05 s > │ Free 30-day professional trial: │
  631. 703.05 s > │ https://symbolica.io/license/#get-trial-license │
  632. 703.05 s > │ │
  633. 703.05 s > └────────────────────────────────────────────────────────┘
  634. 703.05 s > ┌──────────────────────────────────────────────────────────────────────────────────────────────────┐
  635. 703.05 s > │ Cannot start another restricted Symbolica thread while this user's thread allowance is in use. │
  636. 703.05 s > └──────────────────────────────────────────────────────────────────────────────────────────────────┘
  637. 703.05 s >
  638. 703.05 s > stderr:
  639. 703.05 s > ┌────────────────────────────────────────────────────────┐
  640. 703.05 s > │ The Symbolica license key format is outdated. │
  641. 703.05 s > │ Renew your key at https://symbolica.io/license/ │
  642. 703.05 s > └────────────────────────────────────────────────────────┘
  643. 703.05 s > Could not acquire Symbolica thread permit: Permission denied (os error 13)
  644. 703.05 s >
  645. 703.05 s >
  646. 703.05 s >
  647. 703.05 s > failures:
  648. 703.05 s > crates/spenso/src/network/mod.rs - network::Network (line 1693)
  649. 703.05 s >
  650. 703.05 s > test result: FAILED. 0 passed; 1 failed; 8 ignored; 0 measured; 0 filtered out; finished in 0.34s
  651. 703.05 s >
  652. 703.05 s > all doctests ran in 5.69s; merged doctests compilation took 5.28s
  653. 703.05 s > error: doctest failed, to rerun pass `-p spenso --doc`
  654. 703.05 s For full logs, run:
  655. 703.05 s nix log /nix/store/qkv16lywvzf7qi552d4ffa1rpqvbynj9-gammaloop-workspace-doctest-0.1.0.drv
  656. 703.20 s Run failed.