1. 0.00 s $ /nix/store/9ypz3flqsrl5xl495mm8h645gadjsxi1-coreutils-9.11/bin/timeout --kill-after=15s 7200s /nix/store/23zk8sgzamrbmj1fday15szf7f2279s8-nix-2.34.7/bin/nix --extra-experimental-features nix-command --extra-experimental-features flakes flake clone git+https://github.com/alphal00p/gammaloop --dest /tmp/nix-ci-worker/stable-pwd/repo/
  2. 0.09 s Cloning into '/tmp/nix-ci-worker/stable-pwd/repo'...
  3. 0.74 s remote: Enumerating objects: 93647, done.
  4. 0.86 s remote: Counting objects: 0% (1/9260) remote: Counting objects: 1% (93/9260) remote: Counting objects: 2% (186/9260) remote: Counting objects: 3% (278/9260) remote: Counting objects: 4% (371/9260) remote: Counting objects: 5% (463/9260) remote: Counting objects: 6% (556/9260) remote: Counting objects: 7% (649/9260) remote: Counting objects: 8% (741/9260) remote: Counting objects: 9% (834/9260) remote: Counting objects: 10% (926/9260) remote: Counting objects: 11% (1019/9260) remote: Counting objects: 12% (1112/9260) remote: Counting objects: 13% (1204/9260) remote: Counting objects: 14% (1297/9260) remote: Counting objects: 15% (1389/9260) remote: Counting objects: 16% (1482/9260) remote: Counting objects: 17% (1575/9260) remote: Counting objects: 18% (1667/9260) remote: Counting objects: 19% (1760/9260) remote: Counting objects: 20% (1852/9260) remote: Counting objects: 21% (1945/9260) remote: Counting objects: 22% (2038/9260) remote: Counting objects: 23% (2130/9260) remote: Counting objects: 24% (2223/9260) remote: Counting objects: 25% (2315/9260) remote: Counting objects: 26% (2408/9260) remote: Counting objects: 27% (2501/9260) remote: Counting objects: 28% (2593/9260) remote: Counting objects: 29% (2686/9260) remote: Counting objects: 30% (2778/9260) remote: Counting objects: 31% (2871/9260) remote: Counting objects: 32% (2964/9260) remote: Counting objects: 33% (3056/9260) remote: Counting objects: 34% (3149/9260) remote: Counting objects: 35% (3241/9260) remote: Counting objects: 36% (3334/9260) remote: Counting objects: 37% (3427/9260) remote: Counting objects: 38% (3519/9260) remote: Counting objects: 39% (3612/9260) remote: Counting objects: 40% (3704/9260) remote: Counting objects: 41% (3797/9260) remote: Counting objects: 42% (3890/9260) remote: Counting objects: 43% (3982/9260) remote: Counting objects: 44% (4075/9260) remote: Counting objects: 45% (4167/9260) remote: Counting objects: 46% (4260/9260) remote: Counting objects: 47% (4353/9260) remote: Counting objects: 48% (4445/9260) remote: Counting objects: 49% (4538/9260) remote: Counting objects: 50% (4630/9260) remote: Counting objects: 51% (4723/9260) remote: Counting objects: 52% (4816/9260) remote: Counting objects: 53% (4908/9260) remote: Counting objects: 54% (5001/9260) remote: Counting objects: 55% (5093/9260) remote: Counting objects: 56% (5186/9260) remote: Counting objects: 57% (5279/9260) remote: Counting objects: 58% (5371/9260) remote: Counting objects: 59% (5464/9260) remote: Counting objects: 60% (5556/9260) remote: Counting objects: 61% (5649/9260) remote: Counting objects: 62% (5742/9260) remote: Counting objects: 63% (5834/9260) remote: Counting objects: 64% (5927/9260) remote: Counting objects: 65% (6019/9260) remote: Counting objects: 66% (6112/9260) remote: Counting objects: 67% (6205/9260) remote: Counting objects: 68% (6297/9260) remote: Counting objects: 69% (6390/9260) remote: Counting objects: 70% (6482/9260) remote: Counting objects: 71% (6575/9260) remote: Counting objects: 72% (6668/9260) remote: Counting objects: 73% (6760/9260) remote: Counting objects: 74% (6853/9260) remote: Counting objects: 75% (6945/9260) remote: Counting objects: 76% (7038/9260) remote: Counting objects: 77% (7131/9260) remote: Counting objects: 78% (7223/9260) remote: Counting objects: 79% (7316/9260) remote: Counting objects: 80% (7408/9260) remote: Counting objects: 81% (7501/9260) remote: Counting objects: 82% (7594/9260) remote: Counting objects: 83% (7686/9260) remote: Counting objects: 84% (7779/9260) remote: Counting objects: 85% (7871/9260) remote: Counting objects: 86% (7964/9260) remote: Counting objects: 87% (8057/9260) remote: Counting objects: 88% (8149/9260) remote: Counting objects: 89% (8242/9260) remote: Counting objects: 90% (8334/9260) remote: Counting objects: 91% (8427/9260) remote: Counting objects: 92% (8520/9260) remote: Counting objects: 93% (8612/9260) remote: Counting objects: 94% (8705/9260) remote: Counting objects: 95% (8797/9260) remote: Counting objects: 96% (8890/9260) remote: Counting objects: 97% (8983/9260) remote: Counting objects: 98% (9075/9260) remote: Counting objects: 99% (9168/9260) remote: Counting objects: 100% (9260/9260) remote: Counting objects: 100% (9260/9260), done.
  5. 2.94 s remote: Compressing objects: 0% (1/2001) remote: Compressing objects: 1% (21/2001) remote: Compressing objects: 2% (41/2001) remote: Compressing objects: 3% (61/2001) remote: Compressing objects: 4% (81/2001) remote: Compressing objects: 5% (101/2001) remote: Compressing objects: 6% (121/2001) remote: Compressing objects: 7% (141/2001) remote: Compressing objects: 8% (161/2001) remote: Compressing objects: 9% (181/2001) remote: Compressing objects: 10% (201/2001) remote: Compressing objects: 11% (221/2001) remote: Compressing objects: 12% (241/2001) remote: Compressing objects: 12% (248/2001) remote: Compressing objects: 13% (261/2001) remote: Compressing objects: 14% (281/2001) remote: Compressing objects: 15% (301/2001) remote: Compressing objects: 16% (321/2001) remote: Compressing objects: 17% (341/2001) remote: Compressing objects: 18% (361/2001) remote: Compressing objects: 19% (381/2001) remote: Compressing objects: 20% (401/2001) remote: Compressing objects: 21% (421/2001) remote: Compressing objects: 22% (441/2001) remote: Compressing objects: 23% (461/2001) remote: Compressing objects: 24% (481/2001) remote: Compressing objects: 25% (501/2001) remote: Compressing objects: 26% (521/2001) remote: Compressing objects: 27% (541/2001) remote: Compressing objects: 28% (561/2001) remote: Compressing objects: 29% (581/2001) remote: Compressing objects: 30% (601/2001) remote: Compressing objects: 31% (621/2001) remote: Compressing objects: 32% (641/2001) remote: Compressing objects: 33% (661/2001) remote: Compressing objects: 34% (681/2001) remote: Compressing objects: 35% (701/2001) remote: Compressing objects: 36% (721/2001) remote: Compressing objects: 37% (741/2001) remote: Compressing objects: 38% (761/2001) remote: Compressing objects: 39% (781/2001) remote: Compressing objects: 40% (801/2001) remote: Compressing objects: 41% (821/2001) remote: Compressing objects: 42% (841/2001) remote: Compressing objects: 43% (861/2001) remote: Compressing objects: 44% (881/2001) remote: Compressing objects: 45% (901/2001) remote: Compressing objects: 46% (921/2001) remote: Compressing objects: 47% (941/2001) remote: Compressing objects: 48% (961/2001) remote: Compressing objects: 49% (981/2001) remote: Compressing objects: 50% (1001/2001) remote: Compressing objects: 51% (1021/2001) remote: Compressing objects: 52% (1041/2001) remote: Compressing objects: 53% (1061/2001) remote: Compressing objects: 54% (1081/2001) remote: Compressing objects: 55% (1101/2001) remote: Compressing objects: 56% (1121/2001) remote: Compressing objects: 57% (1141/2001) remote: Compressing objects: 58% (1161/2001) remote: Compressing objects: 59% (1181/2001) remote: Compressing objects: 60% (1201/2001) remote: Compressing objects: 61% (1221/2001) remote: Compressing objects: 62% (1241/2001) remote: Compressing objects: 63% (1261/2001) remote: Compressing objects: 64% (1281/2001) remote: Compressing objects: 65% (1301/2001) remote: Compressing objects: 66% (1321/2001) remote: Compressing objects: 67% (1341/2001) remote: Compressing objects: 68% (1361/2001) remote: Compressing objects: 69% (1381/2001) remote: Compressing objects: 70% (1401/2001) remote: Compressing objects: 71% (1421/2001) remote: Compressing objects: 72% (1441/2001) remote: Compressing objects: 73% (1461/2001) remote: Compressing objects: 74% (1481/2001) remote: Compressing objects: 75% (1501/2001) remote: Compressing objects: 76% (1521/2001) remote: Compressing objects: 77% (1541/2001) remote: Compressing objects: 78% (1561/2001) remote: Compressing objects: 79% (1581/2001) remote: Compressing objects: 80% (1601/2001) remote: Compressing objects: 81% (1621/2001) remote: Compressing objects: 82% (1641/2001) remote: Compressing objects: 83% (1661/2001) remote: Compressing objects: 84% (1681/2001) remote: Compressing objects: 85% (1701/2001) remote: Compressing objects: 86% (1721/2001) remote: Compressing objects: 87% (1741/2001) remote: Compressing objects: 88% (1761/2001) remote: Compressing objects: 89% (1781/2001) remote: Compressing objects: 90% (1801/2001) remote: Compressing objects: 91% (1821/2001) remote: Compressing objects: 92% (1841/2001) remote: Compressing objects: 93% (1861/2001) remote: Compressing objects: 94% (1881/2001) remote: Compressing objects: 95% (1901/2001) remote: Compressing objects: 96% (1921/2001) remote: Compressing objects: 97% (1941/2001) remote: Compressing objects: 98% (1961/2001) remote: Compressing objects: 99% (1981/2001) remote: Compressing objects: 100% (2001/2001) remote: Compressing objects: 100% (2001/2001), done.
  6. 12.55 s Receiving objects: 0% (1/93647) Receiving objects: 1% (937/93647) Receiving objects: 2% (1873/93647) Receiving objects: 3% (2810/93647) Receiving objects: 4% (3746/93647) Receiving objects: 5% (4683/93647) Receiving objects: 6% (5619/93647) Receiving objects: 7% (6556/93647) Receiving objects: 8% (7492/93647), 14.21 MiB | 28.41 MiB/s Receiving objects: 9% (8429/93647), 14.21 MiB | 28.41 MiB/s Receiving objects: 10% (9365/93647), 14.21 MiB | 28.41 MiB/s Receiving objects: 11% (10302/93647), 14.21 MiB | 28.41 MiB/s Receiving objects: 12% (11238/93647), 14.21 MiB | 28.41 MiB/s Receiving objects: 13% (12175/93647), 14.21 MiB | 28.41 MiB/s Receiving objects: 14% (13111/93647), 14.21 MiB | 28.41 MiB/s Receiving objects: 15% (14048/93647), 14.21 MiB | 28.41 MiB/s Receiving objects: 16% (14984/93647), 14.21 MiB | 28.41 MiB/s Receiving objects: 17% (15920/93647), 14.21 MiB | 28.41 MiB/s Receiving objects: 18% (16857/93647), 14.21 MiB | 28.41 MiB/s Receiving objects: 19% (17793/93647), 14.21 MiB | 28.41 MiB/s Receiving objects: 20% (18730/93647), 14.21 MiB | 28.41 MiB/s Receiving objects: 21% (19666/93647), 14.21 MiB | 28.41 MiB/s Receiving objects: 22% (20603/93647), 14.21 MiB | 28.41 MiB/s Receiving objects: 23% (21539/93647), 14.21 MiB | 28.41 MiB/s Receiving objects: 24% (22476/93647), 14.21 MiB | 28.41 MiB/s Receiving objects: 25% (23412/93647), 14.21 MiB | 28.41 MiB/s Receiving objects: 26% (24349/93647), 14.21 MiB | 28.41 MiB/s Receiving objects: 27% (25285/93647), 14.21 MiB | 28.41 MiB/s Receiving objects: 28% (26222/93647), 14.21 MiB | 28.41 MiB/s Receiving objects: 29% (27158/93647), 14.21 MiB | 28.41 MiB/s Receiving objects: 30% (28095/93647), 14.21 MiB | 28.41 MiB/s Receiving objects: 31% (29031/93647), 14.21 MiB | 28.41 MiB/s Receiving objects: 32% (29968/93647), 14.21 MiB | 28.41 MiB/s Receiving objects: 33% (30904/93647), 14.21 MiB | 28.41 MiB/s Receiving objects: 34% (31840/93647), 14.21 MiB | 28.41 MiB/s Receiving objects: 35% (32777/93647), 14.21 MiB | 28.41 MiB/s Receiving objects: 35% (33076/93647), 30.95 MiB | 30.94 MiB/s Receiving objects: 36% (33713/93647), 30.95 MiB | 30.94 MiB/s Receiving objects: 37% (34650/93647), 30.95 MiB | 30.94 MiB/s Receiving objects: 38% (35586/93647), 30.95 MiB | 30.94 MiB/s Receiving objects: 39% (36523/93647), 30.95 MiB | 30.94 MiB/s Receiving objects: 40% (37459/93647), 30.95 MiB | 30.94 MiB/s Receiving objects: 41% (38396/93647), 30.95 MiB | 30.94 MiB/s Receiving objects: 42% (39332/93647), 30.95 MiB | 30.94 MiB/s Receiving objects: 43% (40269/93647), 30.95 MiB | 30.94 MiB/s Receiving objects: 44% (41205/93647), 48.60 MiB | 31.63 MiB/s Receiving objects: 45% (42142/93647), 48.60 MiB | 31.63 MiB/s Receiving objects: 46% (43078/93647), 48.60 MiB | 31.63 MiB/s Receiving objects: 47% (44015/93647), 48.60 MiB | 31.63 MiB/s Receiving objects: 48% (44951/93647), 48.60 MiB | 31.63 MiB/s Receiving objects: 49% (45888/93647), 48.60 MiB | 31.63 MiB/s Receiving objects: 50% (46824/93647), 48.60 MiB | 31.63 MiB/s Receiving objects: 51% (47760/93647), 48.60 MiB | 31.63 MiB/s Receiving objects: 52% (48697/93647), 48.60 MiB | 31.63 MiB/s Receiving objects: 52% (48725/93647), 64.27 MiB | 31.32 MiB/s Receiving objects: 53% (49633/93647), 64.27 MiB | 31.32 MiB/s Receiving objects: 54% (50570/93647), 64.27 MiB | 31.32 MiB/s Receiving objects: 55% (51506/93647), 64.27 MiB | 31.32 MiB/s Receiving objects: 56% (52443/93647), 64.27 MiB | 31.32 MiB/s Receiving objects: 57% (53379/93647), 64.27 MiB | 31.32 MiB/s Receiving objects: 58% (54316/93647), 64.27 MiB | 31.32 MiB/s Receiving objects: 59% (55252/93647), 64.27 MiB | 31.32 MiB/s Receiving objects: 60% (56189/93647), 80.86 MiB | 31.67 MiB/s Receiving objects: 60% (57043/93647), 80.86 MiB | 31.67 MiB/s Receiving objects: 60% (57112/93647), 113.76 MiB | 31.67 MiB/s Receiving objects: 61% (57125/93647), 113.76 MiB | 31.67 MiB/s Receiving objects: 61% (57206/93647), 145.86 MiB | 31.65 MiB/s Receiving objects: 62% (58062/93647), 178.87 MiB | 32.11 MiB/s Receiving objects: 63% (58998/93647), 178.87 MiB | 32.11 MiB/s Receiving objects: 64% (59935/93647), 178.87 MiB | 32.11 MiB/s Receiving objects: 65% (60871/93647), 178.87 MiB | 32.11 MiB/s Receiving objects: 65% (61610/93647), 178.87 MiB | 32.11 MiB/s Receiving objects: 66% (61808/93647), 178.87 MiB | 32.11 MiB/s Receiving objects: 67% (62744/93647), 178.87 MiB | 32.11 MiB/s Receiving objects: 68% (63680/93647), 194.55 MiB | 31.76 MiB/s Receiving objects: 69% (64617/93647), 194.55 MiB | 31.76 MiB/s Receiving objects: 70% (65553/93647), 210.48 MiB | 31.79 MiB/s Receiving objects: 71% (66490/93647), 210.48 MiB | 31.79 MiB/s Receiving objects: 72% (67426/93647), 210.48 MiB | 31.79 MiB/s Receiving objects: 73% (68363/93647), 210.48 MiB | 31.79 MiB/s Receiving objects: 74% (69299/93647), 210.48 MiB | 31.79 MiB/s Receiving objects: 75% (70236/93647), 210.48 MiB | 31.79 MiB/s Receiving objects: 76% (71172/93647), 210.48 MiB | 31.79 MiB/s Receiving objects: 77% (72109/93647), 210.48 MiB | 31.79 MiB/s Receiving objects: 78% (73045/93647), 210.48 MiB | 31.79 MiB/s Receiving objects: 79% (73982/93647), 210.48 MiB | 31.79 MiB/s Receiving objects: 79% (74474/93647), 210.48 MiB | 31.79 MiB/s Receiving objects: 80% (74918/93647), 210.48 MiB | 31.79 MiB/s Receiving objects: 81% (75855/93647), 227.17 MiB | 31.82 MiB/s Receiving objects: 82% (76791/93647), 227.17 MiB | 31.82 MiB/s Receiving objects: 83% (77728/93647), 243.23 MiB | 31.78 MiB/s Receiving objects: 84% (78664/93647), 243.23 MiB | 31.78 MiB/s Receiving objects: 84% (79267/93647), 243.23 MiB | 31.78 MiB/s Receiving objects: 85% (79600/93647), 243.23 MiB | 31.78 MiB/s Receiving objects: 86% (80537/93647), 259.61 MiB | 31.99 MiB/s Receiving objects: 87% (81473/93647), 259.61 MiB | 31.99 MiB/s Receiving objects: 88% (82410/93647), 259.61 MiB | 31.99 MiB/s Receiving objects: 89% (83346/93647), 259.61 MiB | 31.99 MiB/s Receiving objects: 90% (84283/93647), 259.61 MiB | 31.99 MiB/s Receiving objects: 91% (85219/93647), 259.61 MiB | 31.99 MiB/s Receiving objects: 92% (86156/93647), 275.04 MiB | 32.00 MiB/s Receiving objects: 93% (87092/93647), 275.04 MiB | 32.00 MiB/s Receiving objects: 94% (88029/93647), 275.04 MiB | 32.00 MiB/s Receiving objects: 95% (88965/93647), 275.04 MiB | 32.00 MiB/s Receiving objects: 96% (89902/93647), 275.04 MiB | 32.00 MiB/s Receiving objects: 97% (90838/93647), 275.04 MiB | 32.00 MiB/s Receiving objects: 98% (91775/93647), 275.04 MiB | 32.00 MiB/s Receiving objects: 99% (92711/93647), 275.04 MiB | 32.00 MiB/s Receiving objects: 99% (93396/93647), 275.04 MiB | 32.00 MiB/s remote: Total 93647 (delta 7949), reused 7399 (delta 7250), pack-reused 84387 (from 2)
  7. 12.55 s Receiving objects: 100% (93647/93647), 290.19 MiB | 31.74 MiB/s Receiving objects: 100% (93647/93647), 305.42 MiB | 31.81 MiB/s, done.
  8. 13.62 s Resolving deltas: 0% (0/63083) Resolving deltas: 1% (632/63083) Resolving deltas: 2% (1263/63083) Resolving deltas: 3% (1893/63083) Resolving deltas: 4% (2524/63083) Resolving deltas: 5% (3155/63083) Resolving deltas: 6% (3785/63083) Resolving deltas: 7% (4416/63083) Resolving deltas: 8% (5047/63083) Resolving deltas: 9% (5678/63083) Resolving deltas: 10% (6309/63083) Resolving deltas: 11% (6940/63083) Resolving deltas: 12% (7570/63083) Resolving deltas: 13% (8201/63083) Resolving deltas: 14% (8832/63083) Resolving deltas: 15% (9463/63083) Resolving deltas: 16% (10095/63083) Resolving deltas: 17% (10726/63083) Resolving deltas: 18% (11355/63083) Resolving deltas: 19% (11986/63083) Resolving deltas: 20% (12618/63083) Resolving deltas: 21% (13248/63083) Resolving deltas: 22% (13879/63083) Resolving deltas: 23% (14510/63083) Resolving deltas: 24% (15140/63083) Resolving deltas: 25% (15772/63083) Resolving deltas: 26% (16403/63083) Resolving deltas: 27% (17033/63083) Resolving deltas: 28% (17664/63083) Resolving deltas: 29% (18297/63083) Resolving deltas: 30% (18926/63083) Resolving deltas: 31% (19556/63083) Resolving deltas: 32% (20187/63083) Resolving deltas: 33% (20818/63083) Resolving deltas: 34% (21449/63083) Resolving deltas: 35% (22080/63083) Resolving deltas: 36% (22710/63083) Resolving deltas: 37% (23341/63083) Resolving deltas: 38% (23972/63083) Resolving deltas: 39% (24603/63083) Resolving deltas: 40% (25235/63083) Resolving deltas: 41% (25865/63083) Resolving deltas: 42% (26496/63083) Resolving deltas: 43% (27126/63083) Resolving deltas: 44% (27758/63083) Resolving deltas: 45% (28388/63083) Resolving deltas: 46% (29019/63083) Resolving deltas: 47% (29650/63083) Resolving deltas: 48% (30280/63083) Resolving deltas: 49% (30912/63083) Resolving deltas: 50% (31542/63083) Resolving deltas: 51% (32173/63083) Resolving deltas: 52% (32804/63083) Resolving deltas: 53% (33434/63083) Resolving deltas: 54% (34066/63083) Resolving deltas: 55% (34696/63083) Resolving deltas: 56% (35327/63083) Resolving deltas: 57% (35958/63083) Resolving deltas: 58% (36590/63083) Resolving deltas: 59% (37219/63083) Resolving deltas: 60% (37850/63083) Resolving deltas: 61% (38481/63083) Resolving deltas: 62% (39112/63083) Resolving deltas: 63% (39743/63083) Resolving deltas: 64% (40374/63083) Resolving deltas: 65% (41004/63083) Resolving deltas: 66% (41635/63083) Resolving deltas: 67% (42266/63083) Resolving deltas: 68% (42897/63083) Resolving deltas: 69% (43528/63083) Resolving deltas: 70% (44159/63083) Resolving deltas: 71% (44789/63083) Resolving deltas: 72% (45420/63083) Resolving deltas: 73% (46051/63083) Resolving deltas: 74% (46682/63083) Resolving deltas: 75% (47318/63083) Resolving deltas: 76% (47944/63083) Resolving deltas: 77% (48574/63083) Resolving deltas: 78% (49205/63083) Resolving deltas: 79% (49836/63083) Resolving deltas: 80% (50467/63083) Resolving deltas: 81% (51098/63083) Resolving deltas: 82% (51729/63083) Resolving deltas: 83% (52360/63083) Resolving deltas: 84% (52990/63083) Resolving deltas: 85% (53621/63083) Resolving deltas: 86% (54252/63083) Resolving deltas: 87% (54883/63083) Resolving deltas: 88% (55514/63083) Resolving deltas: 89% (56144/63083) Resolving deltas: 90% (56775/63083) Resolving deltas: 91% (57406/63083) Resolving deltas: 92% (58037/63083) Resolving deltas: 93% (58668/63083) Resolving deltas: 93% (59092/63083) Resolving deltas: 94% (59299/63083) Resolving deltas: 95% (59929/63083) Resolving deltas: 96% (60560/63083) Resolving deltas: 97% (61191/63083) Resolving deltas: 98% (61822/63083) Resolving deltas: 99% (62454/63083) Resolving deltas: 100% (63083/63083) Resolving deltas: 100% (63083/63083), done.
  9. 14.19 s Fetching commit 436f9ff52587582686db6aefd4ecd715b5693f90 for simplify-spenso-api ...
  10. 14.19 s $ /nix/store/bcnisk3ydfgv26v2gw3zlky24g00yww2-git-2.54.0/bin/git fetch origin 436f9ff52587582686db6aefd4ecd715b5693f90
  11. 14.61 s From https://github.com/alphal00p/gammaloop
  12. 14.61 s * branch 436f9ff52587582686db6aefd4ecd715b5693f90 -> FETCH_HEAD
  13. 14.62 s $ /nix/store/9ypz3flqsrl5xl495mm8h645gadjsxi1-coreutils-9.11/bin/timeout --kill-after=15s 7200s /nix/store/bcnisk3ydfgv26v2gw3zlky24g00yww2-git-2.54.0/bin/git -c advice.detachedHead=false checkout 436f9ff52587582686db6aefd4ecd715b5693f90
  14. 14.86 s HEAD is now at 436f9ff52 align Tymbolica interop with fixed Symbolica main
  15. 14.86 s $ /nix/store/9ypz3flqsrl5xl495mm8h645gadjsxi1-coreutils-9.11/bin/timeout --kill-after=15s 7200s /nix/store/23zk8sgzamrbmj1fday15szf7f2279s8-nix-2.34.7/bin/nix --extra-experimental-features nix-command --extra-experimental-features flakes --log-format internal-json run .#packages.x86_64-linux.nix-ci-check-gammaloop-nextest-python-api --print-build-logs
  16. 14.97 s
  17. 23.09 s evaluating derivation 'g copying '/nix/store/9x93 evaluating derivation 'g copying '/nix/store/9x93 evaluating derivation 'g copying '/nix/store/9x93 evaluating derivation 'g copying '/nix/store/9x93 evaluating derivation 'g copying '/nix/store/9x93 evaluating derivation 'g copying '/nix/store/9x93 evaluating derivation 'g copying '/nix/store/9x93 evaluating derivation 'g copying '/nix/store/9x93 evaluating derivation 'g copying '/nix/store/9x93 evaluating derivation 'g copying '/nix/store/9x93 evaluating derivation 'g copying '/nix/store/9x93 evaluating derivation 'g copying '/nix/store/9x93 evaluating derivation 'g copying '/nix/store/9x93 evaluating derivation 'g copying '/nix/store/9x93 evaluating derivation 'g copying '/nix/store/9x93 evaluating derivation 'g copying '/nix/store/9x93 evaluating derivation 'g [0/1 built] [1/0/1 built] [1/0/1 built] building ggammaloop-nextest-python-api> Extracting 3 binaries (including 2 non-test binaries), 1 build script output directory, and 3 linked paths to /build/source
  18. 23.34 s gammaloop-nextest-python-api> Extracted 22 files to /build/source in 0.25s
  19. 23.35 s gammaloop-nextest-python-api> ------------
  20. 23.35 s gammaloop-nextest-python-api> Nextest run ID 50e55d44-9131-464e-b732-863caa36873c with nextest profile: ci_gammaloop
  21. 23.35 s gammaloop-nextest-python-api> Starting 5 tests across 1 binary
  22. 23.48 s gammaloop-nextest-python-api> FAIL [ 0.127s] (1/5) gammaloop-integration-tests::test_python_api python_evaluate_samples_batch_and_momentum_space_have_expected_shape
  23. 23.48 s gammaloop-nextest-python-api> stdout ---
  24. 23.48 s gammaloop-nextest-python-api>
  25. 23.48 s gammaloop-nextest-python-api> running 1 test
  26. 23.48 s gammaloop-nextest-python-api> test python_evaluate_samples_batch_and_momentum_space_have_expected_shape ... FAILED
  27. 23.48 s gammaloop-nextest-python-api>
  28. 23.48 s gammaloop-nextest-python-api> failures:
  29. 23.48 s gammaloop-nextest-python-api>
  30. 23.48 s gammaloop-nextest-python-api> failures:
  31. 23.48 s gammaloop-nextest-python-api> python_evaluate_samples_batch_and_momentum_space_have_expected_shape
  32. 23.48 s gammaloop-nextest-python-api>
  33. 23.48 s gammaloop-nextest-python-api> test result: FAILED. 0 passed; 1 failed; 0 ignored; 0 measured; 4 filtered out; finished in 0.12s
  34. 23.48 s gammaloop-nextest-python-api>
  35. 23.48 s gammaloop-nextest-python-api> stderr ---
  36. 23.48 s gammaloop-nextest-python-api> Error: Python API test subprocess failed.
  37. 23.48 s gammaloop-nextest-python-api> stdout:
  38. 23.48 s gammaloop-nextest-python-api> ┌────────────────────────────────────────────────────────┐
  39. 23.48 s gammaloop-nextest-python-api> │ You are running a restricted Symbolica instance. │
  40. 23.48 s gammaloop-nextest-python-api> │ │
  41. 23.48 s gammaloop-nextest-python-api> │ For non-commercial use only, limited to one │
  42. 23.48 s gammaloop-nextest-python-api> │ Symbolica thread per user. │
  43. 23.48 s gammaloop-nextest-python-api> │ │
  44. 23.48 s gammaloop-nextest-python-api> ├─ Unlock all cores ─────────────────────────────────────┤
  45. 23.48 s gammaloop-nextest-python-api> │ │
  46. 23.48 s gammaloop-nextest-python-api> │ Hobbyists and students: free annual key │
  47. 23.48 s gammaloop-nextest-python-api> │ https://symbolica.io/license/#get-hobbyist-license │
  48. 23.48 s gammaloop-nextest-python-api> │ │
  49. 23.48 s gammaloop-nextest-python-api> │ Free 30-day professional trial: │
  50. 23.48 s gammaloop-nextest-python-api> │ https://symbolica.io/license/#get-trial-license │
  51. 23.48 s gammaloop-nextest-python-api> │ │
  52. 23.48 s gammaloop-nextest-python-api> └────────────────────────────────────────────────────────┘
  53. 23.48 s gammaloop-nextest-python-api> ┌──────────────────────────────────────────────────────────────────────────────────────────────────┐
  54. 23.48 s gammaloop-nextest-python-api> │ Cannot start another restricted Symbolica thread while this user's thread allowance is in use. │
  55. 23.48 s gammaloop-nextest-python-api> └──────────────────────────────────────────────────────────────────────────────────────────────────┘
  56. 23.48 s gammaloop-nextest-python-api>
  57. 23.48 s gammaloop-nextest-python-api> stderr:
  58. 23.48 s gammaloop-nextest-python-api> ┌────────────────────────────────────────────────────────┐
  59. 23.48 s gammaloop-nextest-python-api> │ The Symbolica license key format is outdated. │
  60. 23.48 s gammaloop-nextest-python-api> │ Renew your key at https://symbolica.io/license/ │
  61. 23.48 s gammaloop-nextest-python-api> └────────────────────────────────────────────────────────┘
  62. 23.48 s gammaloop-nextest-python-api> Could not acquire Symbolica thread permit: Permission denied (os error 13)
  63. 23.48 s gammaloop-nextest-python-api>
  64. 23.48 s gammaloop-nextest-python-api>
  65. 23.48 s gammaloop-nextest-python-api> Location:
  66. 23.48 s gammaloop-nextest-python-api> tests/tests/test_python_api.rs:156:20
  67. 23.48 s gammaloop-nextest-python-api>
  68. 23.49 s gammaloop-nextest-python-api> FAIL [ 0.139s] (2/5) gammaloop-integration-tests::test_python_api python_settings_wrappers_expose_nested_runtime_and_global_settings
  69. 23.49 s gammaloop-nextest-python-api> stdout ---
  70. 23.49 s gammaloop-nextest-python-api>
  71. 23.49 s gammaloop-nextest-python-api> running 1 test
  72. 23.49 s gammaloop-nextest-python-api> test python_settings_wrappers_expose_nested_runtime_and_global_settings ... FAILED
  73. 23.49 s gammaloop-nextest-python-api>
  74. 23.49 s gammaloop-nextest-python-api> failures:
  75. 23.49 s gammaloop-nextest-python-api>
  76. 23.49 s gammaloop-nextest-python-api> failures:
  77. 23.49 s gammaloop-nextest-python-api> python_settings_wrappers_expose_nested_runtime_and_global_settings
  78. 23.49 s gammaloop-nextest-python-api>
  79. 23.49 s gammaloop-nextest-python-api> test result: FAILED. 0 passed; 1 failed; 0 ignored; 0 measured; 4 filtered out; finished in 0.13s
  80. 23.49 s gammaloop-nextest-python-api>
  81. 23.49 s gammaloop-nextest-python-api> stderr ---
  82. 23.49 s gammaloop-nextest-python-api> Error: Python API test subprocess failed.
  83. 23.49 s gammaloop-nextest-python-api> stdout:
  84. 23.49 s gammaloop-nextest-python-api> ┌────────────────────────────────────────────────────────┐
  85. 23.49 s gammaloop-nextest-python-api> │ You are running a restricted Symbolica instance. │
  86. 23.49 s gammaloop-nextest-python-api> │ │
  87. 23.49 s gammaloop-nextest-python-api> │ For non-commercial use only, limited to one │
  88. 23.49 s gammaloop-nextest-python-api> │ Symbolica thread per user. │
  89. 23.49 s gammaloop-nextest-python-api> │ │
  90. 23.49 s gammaloop-nextest-python-api> ├─ Unlock all cores ─────────────────────────────────────┤
  91. 23.49 s gammaloop-nextest-python-api> │ │
  92. 23.49 s gammaloop-nextest-python-api> │ Hobbyists and students: free annual key │
  93. 23.49 s gammaloop-nextest-python-api> │ https://symbolica.io/license/#get-hobbyist-license │
  94. 23.49 s gammaloop-nextest-python-api> │ │
  95. 23.49 s gammaloop-nextest-python-api> │ Free 30-day professional trial: │
  96. 23.49 s gammaloop-nextest-python-api> │ https://symbolica.io/license/#get-trial-license │
  97. 23.49 s gammaloop-nextest-python-api> │ │
  98. 23.49 s gammaloop-nextest-python-api> └────────────────────────────────────────────────────────┘
  99. 23.49 s gammaloop-nextest-python-api> ┌──────────────────────────────────────────────────────────────────────────────────────────────────┐
  100. 23.49 s gammaloop-nextest-python-api> │ Cannot start another restricted Symbolica thread while this user's thread allowance is in use. │
  101. 23.49 s gammaloop-nextest-python-api> └──────────────────────────────────────────────────────────────────────────────────────────────────┘
  102. 23.49 s gammaloop-nextest-python-api>
  103. 23.49 s gammaloop-nextest-python-api> stderr:
  104. 23.49 s gammaloop-nextest-python-api> ┌────────────────────────────────────────────────────────┐
  105. 23.49 s gammaloop-nextest-python-api> │ The Symbolica license key format is outdated. │
  106. 23.49 s gammaloop-nextest-python-api> │ Renew your key at https://symbolica.io/license/ │
  107. 23.49 s gammaloop-nextest-python-api> └────────────────────────────────────────────────────────┘
  108. 23.49 s gammaloop-nextest-python-api> Could not acquire Symbolica thread permit: Permission denied (os error 13)
  109. 23.49 s gammaloop-nextest-python-api>
  110. 23.49 s gammaloop-nextest-python-api>
  111. 23.49 s gammaloop-nextest-python-api> Location:
  112. 23.49 s gammaloop-nextest-python-api> tests/tests/test_python_api.rs:156:20
  113. 23.49 s gammaloop-nextest-python-api>
  114. 23.49 s gammaloop-nextest-python-api> FAIL [ 0.139s] (3/5) gammaloop-integration-tests::test_python_api python_session_getters_return_live_toml_and_command_blocks
  115. 23.49 s gammaloop-nextest-python-api> stdout ---
  116. 23.49 s gammaloop-nextest-python-api>
  117. 23.49 s gammaloop-nextest-python-api> running 1 test
  118. 23.49 s gammaloop-nextest-python-api> test python_session_getters_return_live_toml_and_command_blocks ... FAILED
  119. 23.49 s gammaloop-nextest-python-api>
  120. 23.49 s gammaloop-nextest-python-api> failures:
  121. 23.49 s gammaloop-nextest-python-api>
  122. 23.49 s gammaloop-nextest-python-api> failures:
  123. 23.49 s gammaloop-nextest-python-api> python_session_getters_return_live_toml_and_command_blocks
  124. 23.49 s gammaloop-nextest-python-api>
  125. 23.49 s gammaloop-nextest-python-api> test result: FAILED. 0 passed; 1 failed; 0 ignored; 0 measured; 4 filtered out; finished in 0.13s
  126. 23.49 s gammaloop-nextest-python-api>
  127. 23.49 s gammaloop-nextest-python-api> stderr ---
  128. 23.49 s gammaloop-nextest-python-api> Error: Python API test subprocess failed.
  129. 23.49 s gammaloop-nextest-python-api> stdout:
  130. 23.49 s gammaloop-nextest-python-api> ┌────────────────────────────────────────────────────────┐
  131. 23.49 s gammaloop-nextest-python-api> │ You are running a restricted Symbolica instance. │
  132. 23.49 s gammaloop-nextest-python-api> │ │
  133. 23.49 s gammaloop-nextest-python-api> │ For non-commercial use only, limited to one │
  134. 23.49 s gammaloop-nextest-python-api> │ Symbolica thread per user. │
  135. 23.49 s gammaloop-nextest-python-api> │ │
  136. 23.49 s gammaloop-nextest-python-api> ├─ Unlock all cores ─────────────────────────────────────┤
  137. 23.49 s gammaloop-nextest-python-api> │ │
  138. 23.49 s gammaloop-nextest-python-api> │ Hobbyists and students: free annual key │
  139. 23.49 s gammaloop-nextest-python-api> │ https://symbolica.io/license/#get-hobbyist-license │
  140. 23.49 s gammaloop-nextest-python-api> │ │
  141. 23.49 s gammaloop-nextest-python-api> │ Free 30-day professional trial: │
  142. 23.49 s gammaloop-nextest-python-api> │ https://symbolica.io/license/#get-trial-license │
  143. 23.49 s gammaloop-nextest-python-api> │ │
  144. 23.49 s gammaloop-nextest-python-api> └────────────────────────────────────────────────────────┘
  145. 23.49 s gammaloop-nextest-python-api> ┌──────────────────────────────────────────────────────────────────────────────────────────────────┐
  146. 23.49 s gammaloop-nextest-python-api> │ Cannot start another restricted Symbolica thread while this user's thread allowance is in use. │
  147. 23.49 s gammaloop-nextest-python-api> └──────────────────────────────────────────────────────────────────────────────────────────────────┘
  148. 23.49 s gammaloop-nextest-python-api>
  149. 23.49 s gammaloop-nextest-python-api> stderr:
  150. 23.49 s gammaloop-nextest-python-api> ┌────────────────────────────────────────────────────────┐
  151. 23.49 s gammaloop-nextest-python-api> │ The Symbolica license key format is outdated. │
  152. 23.49 s gammaloop-nextest-python-api> │ Renew your key at https://symbolica.io/license/ │
  153. 23.49 s gammaloop-nextest-python-api> └────────────────────────────────────────────────────────┘
  154. 23.49 s gammaloop-nextest-python-api> Could not acquire Symbolica thread permit: Permission denied (os error 13)
  155. 23.49 s gammaloop-nextest-python-api>
  156. 23.49 s gammaloop-nextest-python-api>
  157. 23.49 s gammaloop-nextest-python-api> Location:
  158. 23.49 s gammaloop-nextest-python-api> tests/tests/test_python_api.rs:156:20
  159. 23.49 s gammaloop-nextest-python-api>
  160. 23.49 s gammaloop-nextest-python-api> FAIL [ 0.139s] (4/5) gammaloop-integration-tests::test_python_api python_evaluate_sample_honors_generate_events_and_observable_snapshots
  161. 23.49 s gammaloop-nextest-python-api> stdout ---
  162. 23.49 s gammaloop-nextest-python-api>
  163. 23.49 s gammaloop-nextest-python-api> running 1 test
  164. 23.49 s gammaloop-nextest-python-api> test python_evaluate_sample_honors_generate_events_and_observable_snapshots ... FAILED
  165. 23.49 s gammaloop-nextest-python-api>
  166. 23.49 s gammaloop-nextest-python-api> failures:
  167. 23.49 s gammaloop-nextest-python-api>
  168. 23.49 s gammaloop-nextest-python-api> failures:
  169. 23.49 s gammaloop-nextest-python-api> python_evaluate_sample_honors_generate_events_and_observable_snapshots
  170. 23.49 s gammaloop-nextest-python-api>
  171. 23.49 s gammaloop-nextest-python-api> test result: FAILED. 0 passed; 1 failed; 0 ignored; 0 measured; 4 filtered out; finished in 0.13s
  172. 23.49 s gammaloop-nextest-python-api>
  173. 23.49 s gammaloop-nextest-python-api> stderr ---
  174. 23.49 s gammaloop-nextest-python-api> Error: Python API test subprocess failed.
  175. 23.49 s gammaloop-nextest-python-api> stdout:
  176. 23.49 s gammaloop-nextest-python-api> ┌────────────────────────────────────────────────────────┐
  177. 23.49 s gammaloop-nextest-python-api> │ You are running a restricted Symbolica instance. │
  178. 23.49 s gammaloop-nextest-python-api> │ │
  179. 23.49 s gammaloop-nextest-python-api> │ For non-commercial use only, limited to one │
  180. 23.49 s gammaloop-nextest-python-api> │ Symbolica thread per user. │
  181. 23.49 s gammaloop-nextest-python-api> │ │
  182. 23.49 s gammaloop-nextest-python-api> ├─ Unlock all cores ─────────────────────────────────────┤
  183. 23.49 s gammaloop-nextest-python-api> │ │
  184. 23.49 s gammaloop-nextest-python-api> │ Hobbyists and students: free annual key │
  185. 23.49 s gammaloop-nextest-python-api> │ https://symbolica.io/license/#get-hobbyist-license │
  186. 23.49 s gammaloop-nextest-python-api> │ │
  187. 23.49 s gammaloop-nextest-python-api> │ Free 30-day professional trial: │
  188. 23.49 s gammaloop-nextest-python-api> │ https://symbolica.io/license/#get-trial-license │
  189. 23.49 s gammaloop-nextest-python-api> │ │
  190. 23.49 s gammaloop-nextest-python-api> └────────────────────────────────────────────────────────┘
  191. 23.49 s gammaloop-nextest-python-api> ┌──────────────────────────────────────────────────────────────────────────────────────────────────┐
  192. 23.49 s gammaloop-nextest-python-api> │ Cannot start another restricted Symbolica thread while this user's thread allowance is in use. │
  193. 23.49 s gammaloop-nextest-python-api> └──────────────────────────────────────────────────────────────────────────────────────────────────┘
  194. 23.49 s gammaloop-nextest-python-api>
  195. 23.49 s gammaloop-nextest-python-api> stderr:
  196. 23.49 s gammaloop-nextest-python-api> ┌────────────────────────────────────────────────────────┐
  197. 23.49 s gammaloop-nextest-python-api> │ The Symbolica license key format is outdated. │
  198. 23.49 s gammaloop-nextest-python-api> │ Renew your key at https://symbolica.io/license/ │
  199. 23.49 s gammaloop-nextest-python-api> └────────────────────────────────────────────────────────┘
  200. 23.49 s gammaloop-nextest-python-api> Could not acquire Symbolica thread permit: Permission denied (os error 13)
  201. 23.49 s gammaloop-nextest-python-api>
  202. 23.49 s gammaloop-nextest-python-api>
  203. 23.49 s gammaloop-nextest-python-api> Location:
  204. 23.49 s gammaloop-nextest-python-api> tests/tests/test_python_api.rs:156:20
  205. 23.49 s gammaloop-nextest-python-api>
  206. 23.49 s gammaloop-nextest-python-api> FAIL [ 0.139s] (5/5) gammaloop-integration-tests::test_python_api python_evaluate_sample_preserves_graph_grouping_and_incoming_pdgs
  207. 23.49 s gammaloop-nextest-python-api> stdout ---
  208. 23.49 s gammaloop-nextest-python-api>
  209. 23.49 s gammaloop-nextest-python-api> running 1 test
  210. 23.49 s gammaloop-nextest-python-api> test python_evaluate_sample_preserves_graph_grouping_and_incoming_pdgs ... FAILED
  211. 23.49 s gammaloop-nextest-python-api>
  212. 23.49 s gammaloop-nextest-python-api> failures:
  213. 23.49 s gammaloop-nextest-python-api>
  214. 23.49 s gammaloop-nextest-python-api> failures:
  215. 23.49 s gammaloop-nextest-python-api> python_evaluate_sample_preserves_graph_grouping_and_incoming_pdgs
  216. 23.49 s gammaloop-nextest-python-api>
  217. 23.49 s gammaloop-nextest-python-api> test result: FAILED. 0 passed; 1 failed; 0 ignored; 0 measured; 4 filtered out; finished in 0.13s
  218. 23.49 s gammaloop-nextest-python-api>
  219. 23.49 s gammaloop-nextest-python-api> stderr ---
  220. 23.49 s gammaloop-nextest-python-api> Error: Python API test subprocess failed.
  221. 23.49 s gammaloop-nextest-python-api> stdout:
  222. 23.49 s gammaloop-nextest-python-api> ┌────────────────────────────────────────────────────────┐
  223. 23.49 s gammaloop-nextest-python-api> │ You are running a restricted Symbolica instance. │
  224. 23.49 s gammaloop-nextest-python-api> │ │
  225. 23.49 s gammaloop-nextest-python-api> │ For non-commercial use only, limited to one │
  226. 23.49 s gammaloop-nextest-python-api> │ Symbolica thread per user. │
  227. 23.49 s gammaloop-nextest-python-api> │ │
  228. 23.49 s gammaloop-nextest-python-api> ├─ Unlock all cores ─────────────────────────────────────┤
  229. 23.49 s gammaloop-nextest-python-api> │ │
  230. 23.49 s gammaloop-nextest-python-api> │ Hobbyists and students: free annual key │
  231. 23.49 s gammaloop-nextest-python-api> │ https://symbolica.io/license/#get-hobbyist-license │
  232. 23.49 s gammaloop-nextest-python-api> │ │
  233. 23.49 s gammaloop-nextest-python-api> │ Free 30-day professional trial: │
  234. 23.49 s gammaloop-nextest-python-api> │ https://symbolica.io/license/#get-trial-license │
  235. 23.49 s gammaloop-nextest-python-api> │ │
  236. 23.49 s gammaloop-nextest-python-api> └────────────────────────────────────────────────────────┘
  237. 23.49 s gammaloop-nextest-python-api> ┌──────────────────────────────────────────────────────────────────────────────────────────────────┐
  238. 23.49 s gammaloop-nextest-python-api> │ Cannot start another restricted Symbolica thread while this user's thread allowance is in use. │
  239. 23.49 s gammaloop-nextest-python-api> └──────────────────────────────────────────────────────────────────────────────────────────────────┘
  240. 23.49 s gammaloop-nextest-python-api>
  241. 23.49 s gammaloop-nextest-python-api> stderr:
  242. 23.49 s gammaloop-nextest-python-api> ┌────────────────────────────────────────────────────────┐
  243. 23.49 s gammaloop-nextest-python-api> │ The Symbolica license key format is outdated. │
  244. 23.49 s gammaloop-nextest-python-api> │ Renew your key at https://symbolica.io/license/ │
  245. 23.49 s gammaloop-nextest-python-api> └────────────────────────────────────────────────────────┘
  246. 23.49 s gammaloop-nextest-python-api> Could not acquire Symbolica thread permit: Permission denied (os error 13)
  247. 23.49 s gammaloop-nextest-python-api>
  248. 23.49 s gammaloop-nextest-python-api>
  249. 23.49 s gammaloop-nextest-python-api> Location:
  250. 23.49 s gammaloop-nextest-python-api> tests/tests/test_python_api.rs:156:20
  251. 23.49 s gammaloop-nextest-python-api>
  252. 23.49 s gammaloop-nextest-python-api> ------------
  253. 23.49 s gammaloop-nextest-python-api> Summary [ 0.140s] 5 tests run: 0 passed, 5 failed, 0 skipped
  254. 23.49 s gammaloop-nextest-python-api> FAIL [ 0.127s] (1/5) gammaloop-integration-tests::test_python_api python_evaluate_samples_batch_and_momentum_space_have_expected_shape
  255. 23.49 s gammaloop-nextest-python-api> stdout ---
  256. 23.49 s gammaloop-nextest-python-api>
  257. 23.49 s gammaloop-nextest-python-api> running 1 test
  258. 23.49 s gammaloop-nextest-python-api> test python_evaluate_samples_batch_and_momentum_space_have_expected_shape ... FAILED
  259. 23.49 s gammaloop-nextest-python-api>
  260. 23.49 s gammaloop-nextest-python-api> failures:
  261. 23.49 s gammaloop-nextest-python-api>
  262. 23.49 s gammaloop-nextest-python-api> failures:
  263. 23.49 s gammaloop-nextest-python-api> python_evaluate_samples_batch_and_momentum_space_have_expected_shape
  264. 23.49 s gammaloop-nextest-python-api>
  265. 23.49 s gammaloop-nextest-python-api> test result: FAILED. 0 passed; 1 failed; 0 ignored; 0 measured; 4 filtered out; finished in 0.12s
  266. 23.49 s gammaloop-nextest-python-api>
  267. 23.49 s gammaloop-nextest-python-api> stderr ---
  268. 23.49 s gammaloop-nextest-python-api> Error: Python API test subprocess failed.
  269. 23.49 s gammaloop-nextest-python-api> stdout:
  270. 23.49 s gammaloop-nextest-python-api> ┌────────────────────────────────────────────────────────┐
  271. 23.49 s gammaloop-nextest-python-api> │ You are running a restricted Symbolica instance. │
  272. 23.49 s gammaloop-nextest-python-api> │ │
  273. 23.49 s gammaloop-nextest-python-api> │ For non-commercial use only, limited to one │
  274. 23.49 s gammaloop-nextest-python-api> │ Symbolica thread per user. │
  275. 23.49 s gammaloop-nextest-python-api> │ │
  276. 23.49 s gammaloop-nextest-python-api> ├─ Unlock all cores ─────────────────────────────────────┤
  277. 23.49 s gammaloop-nextest-python-api> │ │
  278. 23.49 s gammaloop-nextest-python-api> │ Hobbyists and students: free annual key │
  279. 23.49 s gammaloop-nextest-python-api> │ https://symbolica.io/license/#get-hobbyist-license │
  280. 23.49 s gammaloop-nextest-python-api> │ │
  281. 23.49 s gammaloop-nextest-python-api> │ Free 30-day professional trial: │
  282. 23.49 s gammaloop-nextest-python-api> │ https://symbolica.io/license/#get-trial-license │
  283. 23.49 s gammaloop-nextest-python-api> │ │
  284. 23.49 s gammaloop-nextest-python-api> └────────────────────────────────────────────────────────┘
  285. 23.49 s gammaloop-nextest-python-api> ┌──────────────────────────────────────────────────────────────────────────────────────────────────┐
  286. 23.49 s gammaloop-nextest-python-api> │ Cannot start another restricted Symbolica thread while this user's thread allowance is in use. │
  287. 23.49 s gammaloop-nextest-python-api> └──────────────────────────────────────────────────────────────────────────────────────────────────┘
  288. 23.49 s gammaloop-nextest-python-api>
  289. 23.49 s gammaloop-nextest-python-api> stderr:
  290. 23.49 s gammaloop-nextest-python-api> ┌────────────────────────────────────────────────────────┐
  291. 23.49 s gammaloop-nextest-python-api> │ The Symbolica license key format is outdated. │
  292. 23.49 s gammaloop-nextest-python-api> │ Renew your key at https://symbolica.io/license/ │
  293. 23.49 s gammaloop-nextest-python-api> └────────────────────────────────────────────────────────┘
  294. 23.49 s gammaloop-nextest-python-api> Could not acquire Symbolica thread permit: Permission denied (os error 13)
  295. 23.49 s gammaloop-nextest-python-api>
  296. 23.49 s gammaloop-nextest-python-api>
  297. 23.49 s gammaloop-nextest-python-api> Location:
  298. 23.49 s gammaloop-nextest-python-api> tests/tests/test_python_api.rs:156:20
  299. 23.49 s gammaloop-nextest-python-api>
  300. 23.49 s gammaloop-nextest-python-api> FAIL [ 0.139s] (2/5) gammaloop-integration-tests::test_python_api python_settings_wrappers_expose_nested_runtime_and_global_settings
  301. 23.49 s gammaloop-nextest-python-api> stdout ---
  302. 23.49 s gammaloop-nextest-python-api>
  303. 23.49 s gammaloop-nextest-python-api> running 1 test
  304. 23.49 s gammaloop-nextest-python-api> test python_settings_wrappers_expose_nested_runtime_and_global_settings ... FAILED
  305. 23.49 s gammaloop-nextest-python-api>
  306. 23.49 s gammaloop-nextest-python-api> failures:
  307. 23.49 s gammaloop-nextest-python-api>
  308. 23.49 s gammaloop-nextest-python-api> failures:
  309. 23.49 s gammaloop-nextest-python-api> python_settings_wrappers_expose_nested_runtime_and_global_settings
  310. 23.49 s gammaloop-nextest-python-api>
  311. 23.49 s gammaloop-nextest-python-api> test result: FAILED. 0 passed; 1 failed; 0 ignored; 0 measured; 4 filtered out; finished in 0.13s
  312. 23.49 s gammaloop-nextest-python-api>
  313. 23.49 s gammaloop-nextest-python-api> stderr ---
  314. 23.49 s gammaloop-nextest-python-api> Error: Python API test subprocess failed.
  315. 23.49 s gammaloop-nextest-python-api> stdout:
  316. 23.49 s gammaloop-nextest-python-api> ┌────────────────────────────────────────────────────────┐
  317. 23.49 s gammaloop-nextest-python-api> │ You are running a restricted Symbolica instance. │
  318. 23.49 s gammaloop-nextest-python-api> │ │
  319. 23.49 s gammaloop-nextest-python-api> │ For non-commercial use only, limited to one │
  320. 23.49 s gammaloop-nextest-python-api> │ Symbolica thread per user. │
  321. 23.49 s gammaloop-nextest-python-api> │ │
  322. 23.49 s gammaloop-nextest-python-api> ├─ Unlock all cores ─────────────────────────────────────┤
  323. 23.49 s gammaloop-nextest-python-api> │ │
  324. 23.49 s gammaloop-nextest-python-api> │ Hobbyists and students: free annual key │
  325. 23.49 s gammaloop-nextest-python-api> │ https://symbolica.io/license/#get-hobbyist-license │
  326. 23.49 s gammaloop-nextest-python-api> │ │
  327. 23.49 s gammaloop-nextest-python-api> │ Free 30-day professional trial: │
  328. 23.49 s gammaloop-nextest-python-api> │ https://symbolica.io/license/#get-trial-license │
  329. 23.49 s gammaloop-nextest-python-api> │ │
  330. 23.49 s gammaloop-nextest-python-api> └────────────────────────────────────────────────────────┘
  331. 23.49 s gammaloop-nextest-python-api> ┌──────────────────────────────────────────────────────────────────────────────────────────────────┐
  332. 23.49 s gammaloop-nextest-python-api> │ Cannot start another restricted Symbolica thread while this user's thread allowance is in use. │
  333. 23.49 s gammaloop-nextest-python-api> └──────────────────────────────────────────────────────────────────────────────────────────────────┘
  334. 23.49 s gammaloop-nextest-python-api>
  335. 23.49 s gammaloop-nextest-python-api> stderr:
  336. 23.49 s gammaloop-nextest-python-api> ┌────────────────────────────────────────────────────────┐
  337. 23.49 s gammaloop-nextest-python-api> │ The Symbolica license key format is outdated. │
  338. 23.49 s gammaloop-nextest-python-api> │ Renew your key at https://symbolica.io/license/ │
  339. 23.49 s gammaloop-nextest-python-api> └────────────────────────────────────────────────────────┘
  340. 23.49 s gammaloop-nextest-python-api> Could not acquire Symbolica thread permit: Permission denied (os error 13)
  341. 23.49 s gammaloop-nextest-python-api>
  342. 23.49 s gammaloop-nextest-python-api>
  343. 23.49 s gammaloop-nextest-python-api> Location:
  344. 23.49 s gammaloop-nextest-python-api> tests/tests/test_python_api.rs:156:20
  345. 23.49 s gammaloop-nextest-python-api>
  346. 23.49 s gammaloop-nextest-python-api> FAIL [ 0.139s] (3/5) gammaloop-integration-tests::test_python_api python_session_getters_return_live_toml_and_command_blocks
  347. 23.49 s gammaloop-nextest-python-api> stdout ---
  348. 23.49 s gammaloop-nextest-python-api>
  349. 23.49 s gammaloop-nextest-python-api> running 1 test
  350. 23.49 s gammaloop-nextest-python-api> test python_session_getters_return_live_toml_and_command_blocks ... FAILED
  351. 23.49 s gammaloop-nextest-python-api>
  352. 23.49 s gammaloop-nextest-python-api> failures:
  353. 23.49 s gammaloop-nextest-python-api>
  354. 23.49 s gammaloop-nextest-python-api> failures:
  355. 23.49 s gammaloop-nextest-python-api> python_session_getters_return_live_toml_and_command_blocks
  356. 23.49 s gammaloop-nextest-python-api>
  357. 23.49 s gammaloop-nextest-python-api> test result: FAILED. 0 passed; 1 failed; 0 ignored; 0 measured; 4 filtered out; finished in 0.13s
  358. 23.49 s gammaloop-nextest-python-api>
  359. 23.49 s gammaloop-nextest-python-api> stderr ---
  360. 23.49 s gammaloop-nextest-python-api> Error: Python API test subprocess failed.
  361. 23.49 s gammaloop-nextest-python-api> stdout:
  362. 23.49 s gammaloop-nextest-python-api> ┌────────────────────────────────────────────────────────┐
  363. 23.49 s gammaloop-nextest-python-api> │ You are running a restricted Symbolica instance. │
  364. 23.49 s gammaloop-nextest-python-api> │ │
  365. 23.49 s gammaloop-nextest-python-api> │ For non-commercial use only, limited to one │
  366. 23.49 s gammaloop-nextest-python-api> │ Symbolica thread per user. │
  367. 23.49 s gammaloop-nextest-python-api> │ │
  368. 23.49 s gammaloop-nextest-python-api> ├─ Unlock all cores ─────────────────────────────────────┤
  369. 23.49 s gammaloop-nextest-python-api> │ │
  370. 23.49 s gammaloop-nextest-python-api> │ Hobbyists and students: free annual key │
  371. 23.49 s gammaloop-nextest-python-api> │ https://symbolica.io/license/#get-hobbyist-license │
  372. 23.49 s gammaloop-nextest-python-api> │ │
  373. 23.49 s gammaloop-nextest-python-api> │ Free 30-day professional trial: │
  374. 23.49 s gammaloop-nextest-python-api> │ https://symbolica.io/license/#get-trial-license │
  375. 23.49 s gammaloop-nextest-python-api> │ │
  376. 23.49 s gammaloop-nextest-python-api> └────────────────────────────────────────────────────────┘
  377. 23.49 s gammaloop-nextest-python-api> ┌──────────────────────────────────────────────────────────────────────────────────────────────────┐
  378. 23.49 s gammaloop-nextest-python-api> │ Cannot start another restricted Symbolica thread while this user's thread allowance is in use. │
  379. 23.49 s gammaloop-nextest-python-api> └──────────────────────────────────────────────────────────────────────────────────────────────────┘
  380. 23.49 s gammaloop-nextest-python-api>
  381. 23.49 s gammaloop-nextest-python-api> stderr:
  382. 23.49 s gammaloop-nextest-python-api> ┌────────────────────────────────────────────────────────┐
  383. 23.49 s gammaloop-nextest-python-api> │ The Symbolica license key format is outdated. │
  384. 23.49 s gammaloop-nextest-python-api> │ Renew your key at https://symbolica.io/license/ │
  385. 23.49 s gammaloop-nextest-python-api> └────────────────────────────────────────────────────────┘
  386. 23.49 s gammaloop-nextest-python-api> Could not acquire Symbolica thread permit: Permission denied (os error 13)
  387. 23.49 s gammaloop-nextest-python-api>
  388. 23.49 s gammaloop-nextest-python-api>
  389. 23.49 s gammaloop-nextest-python-api> Location:
  390. 23.49 s gammaloop-nextest-python-api> tests/tests/test_python_api.rs:156:20
  391. 23.49 s gammaloop-nextest-python-api>
  392. 23.49 s gammaloop-nextest-python-api> FAIL [ 0.139s] (4/5) gammaloop-integration-tests::test_python_api python_evaluate_sample_honors_generate_events_and_observable_snapshots
  393. 23.49 s gammaloop-nextest-python-api> stdout ---
  394. 23.49 s gammaloop-nextest-python-api>
  395. 23.49 s gammaloop-nextest-python-api> running 1 test
  396. 23.49 s gammaloop-nextest-python-api> test python_evaluate_sample_honors_generate_events_and_observable_snapshots ... FAILED
  397. 23.49 s gammaloop-nextest-python-api>
  398. 23.49 s gammaloop-nextest-python-api> failures:
  399. 23.49 s gammaloop-nextest-python-api>
  400. 23.49 s gammaloop-nextest-python-api> failures:
  401. 23.49 s gammaloop-nextest-python-api> python_evaluate_sample_honors_generate_events_and_observable_snapshots
  402. 23.49 s gammaloop-nextest-python-api>
  403. 23.49 s gammaloop-nextest-python-api> test result: FAILED. 0 passed; 1 failed; 0 ignored; 0 measured; 4 filtered out; finished in 0.13s
  404. 23.49 s gammaloop-nextest-python-api>
  405. 23.49 s gammaloop-nextest-python-api> stderr ---
  406. 23.49 s gammaloop-nextest-python-api> Error: Python API test subprocess failed.
  407. 23.49 s gammaloop-nextest-python-api> stdout:
  408. 23.49 s gammaloop-nextest-python-api> ┌────────────────────────────────────────────────────────┐
  409. 23.49 s gammaloop-nextest-python-api> │ You are running a restricted Symbolica instance. │
  410. 23.49 s gammaloop-nextest-python-api> │ │
  411. 23.49 s gammaloop-nextest-python-api> │ For non-commercial use only, limited to one │
  412. 23.49 s gammaloop-nextest-python-api> │ Symbolica thread per user. │
  413. 23.49 s gammaloop-nextest-python-api> │ │
  414. 23.49 s gammaloop-nextest-python-api> ├─ Unlock all cores ─────────────────────────────────────┤
  415. 23.49 s gammaloop-nextest-python-api> │ │
  416. 23.49 s gammaloop-nextest-python-api> │ Hobbyists and students: free annual key │
  417. 23.49 s gammaloop-nextest-python-api> │ https://symbolica.io/license/#get-hobbyist-license │
  418. 23.49 s gammaloop-nextest-python-api> │ │
  419. 23.49 s gammaloop-nextest-python-api> │ Free 30-day professional trial: │
  420. 23.49 s gammaloop-nextest-python-api> │ https://symbolica.io/license/#get-trial-license │
  421. 23.49 s gammaloop-nextest-python-api> │ │
  422. 23.49 s gammaloop-nextest-python-api> └────────────────────────────────────────────────────────┘
  423. 23.49 s gammaloop-nextest-python-api> ┌──────────────────────────────────────────────────────────────────────────────────────────────────┐
  424. 23.49 s gammaloop-nextest-python-api> │ Cannot start another restricted Symbolica thread while this user's thread allowance is in use. │
  425. 23.49 s gammaloop-nextest-python-api> └──────────────────────────────────────────────────────────────────────────────────────────────────┘
  426. 23.49 s gammaloop-nextest-python-api>
  427. 23.49 s gammaloop-nextest-python-api> stderr:
  428. 23.49 s gammaloop-nextest-python-api> ┌────────────────────────────────────────────────────────┐
  429. 23.49 s gammaloop-nextest-python-api> │ The Symbolica license key format is outdated. │
  430. 23.49 s gammaloop-nextest-python-api> │ Renew your key at https://symbolica.io/license/ │
  431. 23.49 s gammaloop-nextest-python-api> └────────────────────────────────────────────────────────┘
  432. 23.49 s gammaloop-nextest-python-api> Could not acquire Symbolica thread permit: Permission denied (os error 13)
  433. 23.49 s gammaloop-nextest-python-api>
  434. 23.49 s gammaloop-nextest-python-api>
  435. 23.49 s gammaloop-nextest-python-api> Location:
  436. 23.49 s gammaloop-nextest-python-api> tests/tests/test_python_api.rs:156:20
  437. 23.49 s gammaloop-nextest-python-api>
  438. 23.49 s gammaloop-nextest-python-api> FAIL [ 0.139s] (5/5) gammaloop-integration-tests::test_python_api python_evaluate_sample_preserves_graph_grouping_and_incoming_pdgs
  439. 23.49 s gammaloop-nextest-python-api> stdout ---
  440. 23.49 s gammaloop-nextest-python-api>
  441. 23.49 s gammaloop-nextest-python-api> running 1 test
  442. 23.49 s gammaloop-nextest-python-api> test python_evaluate_sample_preserves_graph_grouping_and_incoming_pdgs ... FAILED
  443. 23.49 s gammaloop-nextest-python-api>
  444. 23.49 s gammaloop-nextest-python-api> failures:
  445. 23.49 s gammaloop-nextest-python-api>
  446. 23.49 s gammaloop-nextest-python-api> failures:
  447. 23.49 s gammaloop-nextest-python-api> python_evaluate_sample_preserves_graph_grouping_and_incoming_pdgs
  448. 23.49 s gammaloop-nextest-python-api>
  449. 23.49 s gammaloop-nextest-python-api> test result: FAILED. 0 passed; 1 failed; 0 ignored; 0 measured; 4 filtered out; finished in 0.13s
  450. 23.49 s gammaloop-nextest-python-api>
  451. 23.49 s gammaloop-nextest-python-api> stderr ---
  452. 23.49 s gammaloop-nextest-python-api> Error: Python API test subprocess failed.
  453. 23.49 s gammaloop-nextest-python-api> stdout:
  454. 23.49 s gammaloop-nextest-python-api> ┌────────────────────────────────────────────────────────┐
  455. 23.49 s gammaloop-nextest-python-api> │ You are running a restricted Symbolica instance. │
  456. 23.49 s gammaloop-nextest-python-api> │ │
  457. 23.49 s gammaloop-nextest-python-api> │ For non-commercial use only, limited to one │
  458. 23.49 s gammaloop-nextest-python-api> │ Symbolica thread per user. │
  459. 23.49 s gammaloop-nextest-python-api> │ │
  460. 23.49 s gammaloop-nextest-python-api> ├─ Unlock all cores ─────────────────────────────────────┤
  461. 23.49 s gammaloop-nextest-python-api> │ │
  462. 23.49 s gammaloop-nextest-python-api> │ Hobbyists and students: free annual key │
  463. 23.49 s gammaloop-nextest-python-api> │ https://symbolica.io/license/#get-hobbyist-license │
  464. 23.49 s gammaloop-nextest-python-api> │ │
  465. 23.49 s gammaloop-nextest-python-api> │ Free 30-day professional trial: │
  466. 23.49 s gammaloop-nextest-python-api> │ https://symbolica.io/license/#get-trial-license │
  467. 23.49 s gammaloop-nextest-python-api> │ │
  468. 23.49 s gammaloop-nextest-python-api> └────────────────────────────────────────────────────────┘
  469. 23.49 s gammaloop-nextest-python-api> ┌──────────────────────────────────────────────────────────────────────────────────────────────────┐
  470. 23.49 s gammaloop-nextest-python-api> │ Cannot start another restricted Symbolica thread while this user's thread allowance is in use. │
  471. 23.49 s gammaloop-nextest-python-api> └──────────────────────────────────────────────────────────────────────────────────────────────────┘
  472. 23.49 s gammaloop-nextest-python-api>
  473. 23.49 s gammaloop-nextest-python-api> stderr:
  474. 23.49 s gammaloop-nextest-python-api> ┌────────────────────────────────────────────────────────┐
  475. 23.49 s gammaloop-nextest-python-api> │ The Symbolica license key format is outdated. │
  476. 23.49 s gammaloop-nextest-python-api> │ Renew your key at https://symbolica.io/license/ │
  477. 23.49 s gammaloop-nextest-python-api> └────────────────────────────────────────────────────────┘
  478. 23.49 s gammaloop-nextest-python-api> Could not acquire Symbolica thread permit: Permission denied (os error 13)
  479. 23.49 s gammaloop-nextest-python-api>
  480. 23.49 s gammaloop-nextest-python-api>
  481. 23.49 s gammaloop-nextest-python-api> Location:
  482. 23.49 s gammaloop-nextest-python-api> tests/tests/test_python_api.rs:156:20
  483. 23.49 s gammaloop-nextest-python-api>
  484. 23.49 s gammaloop-nextest-python-api> error: test run failed
  485. 23.52 s gammaloop-nextest-python-api>
  486. 23.52 s gammaloop-nextest-python-api> ========== nextest test summary ==========
  487. 23.52 s gammaloop-nextest-python-api> report: target/nextest/ci_gammaloop/junit.xml
  488. 23.52 s gammaloop-nextest-python-api> tests: 5, failures: 5, errors: 0
  489. 23.52 s gammaloop-nextest-python-api>
  490. 23.52 s gammaloop-nextest-python-api> 1. gammaloop-integration-tests::test_python_api::python_evaluate_samples_batch_and_momentum_space_have_expected_shape
  491. 23.52 s gammaloop-nextest-python-api> failure: test failure with exit code 101
  492. 23.52 s gammaloop-nextest-python-api> Error: Python API test subprocess failed.
  493. 23.52 s gammaloop-nextest-python-api> stdout:
  494. 23.52 s gammaloop-nextest-python-api> ┌────────────────────────────────────────────────────────┐
  495. 23.52 s gammaloop-nextest-python-api> │ You are running a restricted Symbolica instance. │
  496. 23.52 s gammaloop-nextest-python-api> │ │
  497. 23.52 s gammaloop-nextest-python-api> │ For non-commercial use only, limited to one │
  498. 23.52 s gammaloop-nextest-python-api> │ Symbolica thread per user. │
  499. 23.52 s gammaloop-nextest-python-api> │ │
  500. 23.52 s gammaloop-nextest-python-api> ├─ Unlock all cores ─────────────────────────────────────┤
  501. 23.52 s gammaloop-nextest-python-api> │ │
  502. 23.52 s gammaloop-nextest-python-api> │ Hobbyists and students: free annual key │
  503. 23.52 s gammaloop-nextest-python-api> │ https://symbolica.io/license/#get-hobbyist-license │
  504. 23.52 s gammaloop-nextest-python-api> │ │
  505. 23.52 s gammaloop-nextest-python-api> │ Free 30-day professional trial: │
  506. 23.52 s gammaloop-nextest-python-api> │ https://symbolica.io/license/#get-trial-license │
  507. 23.52 s gammaloop-nextest-python-api> │ │
  508. 23.52 s gammaloop-nextest-python-api> └────────────────────────────────────────────────────────┘
  509. 23.52 s gammaloop-nextest-python-api> ┌──────────────────────────────────────────────────────────────────────────────────────────────────┐
  510. 23.52 s gammaloop-nextest-python-api> │ Cannot start another restricted Symbolica thread while this user's thread allowance is in use. │
  511. 23.52 s gammaloop-nextest-python-api> └──────────────────────────────────────────────────────────────────────────────────────────────────┘
  512. 23.52 s gammaloop-nextest-python-api>
  513. 23.52 s gammaloop-nextest-python-api> stderr:
  514. 23.52 s gammaloop-nextest-python-api> ┌────────────────────────────────────────────────────────┐
  515. 23.52 s gammaloop-nextest-python-api> │ The Symbolica license key format is outdated. │
  516. 23.52 s gammaloop-nextest-python-api> │ Renew your key at https://symbolica.io/license/ │
  517. 23.52 s gammaloop-nextest-python-api> └────────────────────────────────────────────────────────┘
  518. 23.52 s gammaloop-nextest-python-api> Could not acquire Symbolica thread permit: Permission denied (os error 13)
  519. 23.52 s gammaloop-nextest-python-api>
  520. 23.52 s gammaloop-nextest-python-api>
  521. 23.52 s gammaloop-nextest-python-api> Location:
  522. 23.52 s gammaloop-nextest-python-api> tests/tests/test_python_api.rs:156:20
  523. 23.52 s gammaloop-nextest-python-api> system-out
  524. 23.52 s gammaloop-nextest-python-api> running 1 test
  525. 23.52 s gammaloop-nextest-python-api> test python_evaluate_samples_batch_and_momentum_space_have_expected_shape ... FAILED
  526. 23.52 s gammaloop-nextest-python-api>
  527. 23.52 s gammaloop-nextest-python-api> failures:
  528. 23.52 s gammaloop-nextest-python-api>
  529. 23.52 s gammaloop-nextest-python-api> failures:
  530. 23.52 s gammaloop-nextest-python-api> python_evaluate_samples_batch_and_momentum_space_have_expected_shape
  531. 23.52 s gammaloop-nextest-python-api>
  532. 23.52 s gammaloop-nextest-python-api> test result: FAILED. 0 passed; 1 failed; 0 ignored; 0 measured; 4 filtered out; finished in 0.12s
  533. 23.52 s gammaloop-nextest-python-api> system-err
  534. 23.52 s gammaloop-nextest-python-api> Error: Python API test subprocess failed.
  535. 23.52 s gammaloop-nextest-python-api> stdout:
  536. 23.52 s gammaloop-nextest-python-api> ┌────────────────────────────────────────────────────────┐
  537. 23.52 s gammaloop-nextest-python-api> │ You are running a restricted Symbolica instance. │
  538. 23.52 s gammaloop-nextest-python-api> │ │
  539. 23.52 s gammaloop-nextest-python-api> │ For non-commercial use only, limited to one │
  540. 23.52 s gammaloop-nextest-python-api> │ Symbolica thread per user. │
  541. 23.52 s gammaloop-nextest-python-api> │ │
  542. 23.52 s gammaloop-nextest-python-api> ├─ Unlock all cores ─────────────────────────────────────┤
  543. 23.52 s gammaloop-nextest-python-api> │ │
  544. 23.52 s gammaloop-nextest-python-api> │ Hobbyists and students: free annual key │
  545. 23.52 s gammaloop-nextest-python-api> │ https://symbolica.io/license/#get-hobbyist-license │
  546. 23.52 s gammaloop-nextest-python-api> │ │
  547. 23.52 s gammaloop-nextest-python-api> │ Free 30-day professional trial: │
  548. 23.52 s gammaloop-nextest-python-api> │ https://symbolica.io/license/#get-trial-license │
  549. 23.52 s gammaloop-nextest-python-api> │ │
  550. 23.52 s gammaloop-nextest-python-api> └────────────────────────────────────────────────────────┘
  551. 23.52 s gammaloop-nextest-python-api> ┌──────────────────────────────────────────────────────────────────────────────────────────────────┐
  552. 23.52 s gammaloop-nextest-python-api> │ Cannot start another restricted Symbolica thread while this user's thread allowance is in use. │
  553. 23.52 s gammaloop-nextest-python-api> └──────────────────────────────────────────────────────────────────────────────────────────────────┘
  554. 23.52 s gammaloop-nextest-python-api>
  555. 23.52 s gammaloop-nextest-python-api> stderr:
  556. 23.52 s gammaloop-nextest-python-api> ┌────────────────────────────────────────────────────────┐
  557. 23.52 s gammaloop-nextest-python-api> │ The Symbolica license key format is outdated. │
  558. 23.52 s gammaloop-nextest-python-api> │ Renew your key at https://symbolica.io/license/ │
  559. 23.52 s gammaloop-nextest-python-api> └────────────────────────────────────────────────────────┘
  560. 23.52 s gammaloop-nextest-python-api> Could not acquire Symbolica thread permit: Permission denied (os error 13)
  561. 23.52 s gammaloop-nextest-python-api>
  562. 23.52 s gammaloop-nextest-python-api>
  563. 23.52 s gammaloop-nextest-python-api> Location:
  564. 23.52 s gammaloop-nextest-python-api> tests/tests/test_python_api.rs:156:20
  565. 23.52 s gammaloop-nextest-python-api>
  566. 23.52 s gammaloop-nextest-python-api> 2. gammaloop-integration-tests::test_python_api::python_settings_wrappers_expose_nested_runtime_and_global_settings
  567. 23.52 s gammaloop-nextest-python-api> failure: test failure with exit code 101
  568. 23.52 s gammaloop-nextest-python-api> Error: Python API test subprocess failed.
  569. 23.52 s gammaloop-nextest-python-api> stdout:
  570. 23.52 s gammaloop-nextest-python-api> ┌────────────────────────────────────────────────────────┐
  571. 23.52 s gammaloop-nextest-python-api> │ You are running a restricted Symbolica instance. │
  572. 23.52 s gammaloop-nextest-python-api> │ │
  573. 23.52 s gammaloop-nextest-python-api> │ For non-commercial use only, limited to one │
  574. 23.52 s gammaloop-nextest-python-api> │ Symbolica thread per user. │
  575. 23.52 s gammaloop-nextest-python-api> │ │
  576. 23.52 s gammaloop-nextest-python-api> ├─ Unlock all cores ─────────────────────────────────────┤
  577. 23.52 s gammaloop-nextest-python-api> │ │
  578. 23.52 s gammaloop-nextest-python-api> │ Hobbyists and students: free annual key │
  579. 23.52 s gammaloop-nextest-python-api> │ https://symbolica.io/license/#get-hobbyist-license │
  580. 23.52 s gammaloop-nextest-python-api> │ │
  581. 23.52 s gammaloop-nextest-python-api> │ Free 30-day professional trial: │
  582. 23.52 s gammaloop-nextest-python-api> │ https://symbolica.io/license/#get-trial-license │
  583. 23.52 s gammaloop-nextest-python-api> │ │
  584. 23.52 s gammaloop-nextest-python-api> └────────────────────────────────────────────────────────┘
  585. 23.52 s gammaloop-nextest-python-api> ┌──────────────────────────────────────────────────────────────────────────────────────────────────┐
  586. 23.52 s gammaloop-nextest-python-api> │ Cannot start another restricted Symbolica thread while this user's thread allowance is in use. │
  587. 23.52 s gammaloop-nextest-python-api> └──────────────────────────────────────────────────────────────────────────────────────────────────┘
  588. 23.52 s gammaloop-nextest-python-api>
  589. 23.52 s gammaloop-nextest-python-api> stderr:
  590. 23.52 s gammaloop-nextest-python-api> ┌────────────────────────────────────────────────────────┐
  591. 23.52 s gammaloop-nextest-python-api> │ The Symbolica license key format is outdated. │
  592. 23.52 s gammaloop-nextest-python-api> │ Renew your key at https://symbolica.io/license/ │
  593. 23.52 s gammaloop-nextest-python-api> └────────────────────────────────────────────────────────┘
  594. 23.52 s gammaloop-nextest-python-api> Could not acquire Symbolica thread permit: Permission denied (os error 13)
  595. 23.52 s gammaloop-nextest-python-api>
  596. 23.52 s gammaloop-nextest-python-api>
  597. 23.52 s gammaloop-nextest-python-api> Location:
  598. 23.52 s gammaloop-nextest-python-api> tests/tests/test_python_api.rs:156:20
  599. 23.52 s gammaloop-nextest-python-api> system-out
  600. 23.52 s gammaloop-nextest-python-api> running 1 test
  601. 23.52 s gammaloop-nextest-python-api> test python_settings_wrappers_expose_nested_runtime_and_global_settings ... FAILED
  602. 23.52 s gammaloop-nextest-python-api>
  603. 23.52 s gammaloop-nextest-python-api> failures:
  604. 23.52 s gammaloop-nextest-python-api>
  605. 23.52 s gammaloop-nextest-python-api> failures:
  606. 23.52 s gammaloop-nextest-python-api> python_settings_wrappers_expose_nested_runtime_and_global_settings
  607. 23.52 s gammaloop-nextest-python-api>
  608. 23.52 s gammaloop-nextest-python-api> test result: FAILED. 0 passed; 1 failed; 0 ignored; 0 measured; 4 filtered out; finished in 0.13s
  609. 23.52 s gammaloop-nextest-python-api> system-err
  610. 23.52 s gammaloop-nextest-python-api> Error: Python API test subprocess failed.
  611. 23.52 s gammaloop-nextest-python-api> stdout:
  612. 23.52 s gammaloop-nextest-python-api> ┌────────────────────────────────────────────────────────┐
  613. 23.52 s gammaloop-nextest-python-api> │ You are running a restricted Symbolica instance. │
  614. 23.52 s gammaloop-nextest-python-api> │ │
  615. 23.52 s gammaloop-nextest-python-api> │ For non-commercial use only, limited to one │
  616. 23.52 s gammaloop-nextest-python-api> │ Symbolica thread per user. │
  617. 23.52 s gammaloop-nextest-python-api> │ │
  618. 23.52 s gammaloop-nextest-python-api> ├─ Unlock all cores ─────────────────────────────────────┤
  619. 23.52 s gammaloop-nextest-python-api> │ │
  620. 23.52 s gammaloop-nextest-python-api> │ Hobbyists and students: free annual key │
  621. 23.52 s gammaloop-nextest-python-api> │ https://symbolica.io/license/#get-hobbyist-license │
  622. 23.52 s gammaloop-nextest-python-api> │ │
  623. 23.52 s gammaloop-nextest-python-api> │ Free 30-day professional trial: │
  624. 23.52 s gammaloop-nextest-python-api> │ https://symbolica.io/license/#get-trial-license │
  625. 23.52 s gammaloop-nextest-python-api> │ │
  626. 23.52 s gammaloop-nextest-python-api> └────────────────────────────────────────────────────────┘
  627. 23.52 s gammaloop-nextest-python-api> ┌──────────────────────────────────────────────────────────────────────────────────────────────────┐
  628. 23.52 s gammaloop-nextest-python-api> │ Cannot start another restricted Symbolica thread while this user's thread allowance is in use. │
  629. 23.52 s gammaloop-nextest-python-api> └──────────────────────────────────────────────────────────────────────────────────────────────────┘
  630. 23.52 s gammaloop-nextest-python-api>
  631. 23.52 s gammaloop-nextest-python-api> stderr:
  632. 23.52 s gammaloop-nextest-python-api> ┌────────────────────────────────────────────────────────┐
  633. 23.52 s gammaloop-nextest-python-api> │ The Symbolica license key format is outdated. │
  634. 23.52 s gammaloop-nextest-python-api> │ Renew your key at https://symbolica.io/license/ │
  635. 23.52 s gammaloop-nextest-python-api> └────────────────────────────────────────────────────────┘
  636. 23.52 s gammaloop-nextest-python-api> Could not acquire Symbolica thread permit: Permission denied (os error 13)
  637. 23.52 s gammaloop-nextest-python-api>
  638. 23.52 s gammaloop-nextest-python-api>
  639. 23.52 s gammaloop-nextest-python-api> Location:
  640. 23.52 s gammaloop-nextest-python-api> tests/tests/test_python_api.rs:156:20
  641. 23.52 s gammaloop-nextest-python-api>
  642. 23.52 s gammaloop-nextest-python-api> 3. gammaloop-integration-tests::test_python_api::python_session_getters_return_live_toml_and_command_blocks
  643. 23.52 s gammaloop-nextest-python-api> failure: test failure with exit code 101
  644. 23.52 s gammaloop-nextest-python-api> Error: Python API test subprocess failed.
  645. 23.52 s gammaloop-nextest-python-api> stdout:
  646. 23.52 s gammaloop-nextest-python-api> ┌────────────────────────────────────────────────────────┐
  647. 23.52 s gammaloop-nextest-python-api> │ You are running a restricted Symbolica instance. │
  648. 23.52 s gammaloop-nextest-python-api> │ │
  649. 23.52 s gammaloop-nextest-python-api> │ For non-commercial use only, limited to one │
  650. 23.52 s gammaloop-nextest-python-api> │ Symbolica thread per user. │
  651. 23.52 s gammaloop-nextest-python-api> │ │
  652. 23.52 s gammaloop-nextest-python-api> ├─ Unlock all cores ─────────────────────────────────────┤
  653. 23.52 s gammaloop-nextest-python-api> │ │
  654. 23.52 s gammaloop-nextest-python-api> │ Hobbyists and students: free annual key │
  655. 23.52 s gammaloop-nextest-python-api> │ https://symbolica.io/license/#get-hobbyist-license │
  656. 23.52 s gammaloop-nextest-python-api> │ │
  657. 23.52 s gammaloop-nextest-python-api> │ Free 30-day professional trial: │
  658. 23.52 s gammaloop-nextest-python-api> │ https://symbolica.io/license/#get-trial-license │
  659. 23.52 s gammaloop-nextest-python-api> │ │
  660. 23.52 s gammaloop-nextest-python-api> └────────────────────────────────────────────────────────┘
  661. 23.52 s gammaloop-nextest-python-api> ┌──────────────────────────────────────────────────────────────────────────────────────────────────┐
  662. 23.52 s gammaloop-nextest-python-api> │ Cannot start another restricted Symbolica thread while this user's thread allowance is in use. │
  663. 23.52 s gammaloop-nextest-python-api> └──────────────────────────────────────────────────────────────────────────────────────────────────┘
  664. 23.52 s gammaloop-nextest-python-api>
  665. 23.52 s gammaloop-nextest-python-api> stderr:
  666. 23.52 s gammaloop-nextest-python-api> ┌────────────────────────────────────────────────────────┐
  667. 23.52 s gammaloop-nextest-python-api> │ The Symbolica license key format is outdated. │
  668. 23.52 s gammaloop-nextest-python-api> │ Renew your key at https://symbolica.io/license/ │
  669. 23.52 s gammaloop-nextest-python-api> └────────────────────────────────────────────────────────┘
  670. 23.52 s gammaloop-nextest-python-api> Could not acquire Symbolica thread permit: Permission denied (os error 13)
  671. 23.52 s gammaloop-nextest-python-api>
  672. 23.52 s gammaloop-nextest-python-api>
  673. 23.52 s gammaloop-nextest-python-api> Location:
  674. 23.52 s gammaloop-nextest-python-api> tests/tests/test_python_api.rs:156:20
  675. 23.52 s gammaloop-nextest-python-api> system-out
  676. 23.52 s gammaloop-nextest-python-api> running 1 test
  677. 23.52 s gammaloop-nextest-python-api> test python_session_getters_return_live_toml_and_command_blocks ... FAILED
  678. 23.52 s gammaloop-nextest-python-api>
  679. 23.52 s gammaloop-nextest-python-api> failures:
  680. 23.52 s gammaloop-nextest-python-api>
  681. 23.52 s gammaloop-nextest-python-api> failures:
  682. 23.52 s gammaloop-nextest-python-api> python_session_getters_return_live_toml_and_command_blocks
  683. 23.52 s gammaloop-nextest-python-api>
  684. 23.52 s gammaloop-nextest-python-api> test result: FAILED. 0 passed; 1 failed; 0 ignored; 0 measured; 4 filtered out; finished in 0.13s
  685. 23.52 s gammaloop-nextest-python-api> system-err
  686. 23.52 s gammaloop-nextest-python-api> Error: Python API test subprocess failed.
  687. 23.52 s gammaloop-nextest-python-api> stdout:
  688. 23.52 s gammaloop-nextest-python-api> ┌────────────────────────────────────────────────────────┐
  689. 23.52 s gammaloop-nextest-python-api> │ You are running a restricted Symbolica instance. │
  690. 23.52 s gammaloop-nextest-python-api> │ │
  691. 23.52 s gammaloop-nextest-python-api> │ For non-commercial use only, limited to one │
  692. 23.52 s gammaloop-nextest-python-api> │ Symbolica thread per user. │
  693. 23.52 s gammaloop-nextest-python-api> │ │
  694. 23.52 s gammaloop-nextest-python-api> ├─ Unlock all cores ─────────────────────────────────────┤
  695. 23.52 s gammaloop-nextest-python-api> │ │
  696. 23.52 s gammaloop-nextest-python-api> │ Hobbyists and students: free annual key │
  697. 23.52 s gammaloop-nextest-python-api> │ https://symbolica.io/license/#get-hobbyist-license │
  698. 23.52 s gammaloop-nextest-python-api> │ │
  699. 23.52 s gammaloop-nextest-python-api> │ Free 30-day professional trial: │
  700. 23.52 s gammaloop-nextest-python-api> │ https://symbolica.io/license/#get-trial-license │
  701. 23.52 s gammaloop-nextest-python-api> │ │
  702. 23.52 s gammaloop-nextest-python-api> └────────────────────────────────────────────────────────┘
  703. 23.52 s gammaloop-nextest-python-api> ┌──────────────────────────────────────────────────────────────────────────────────────────────────┐
  704. 23.52 s gammaloop-nextest-python-api> │ Cannot start another restricted Symbolica thread while this user's thread allowance is in use. │
  705. 23.52 s gammaloop-nextest-python-api> └──────────────────────────────────────────────────────────────────────────────────────────────────┘
  706. 23.52 s gammaloop-nextest-python-api>
  707. 23.52 s gammaloop-nextest-python-api> stderr:
  708. 23.52 s gammaloop-nextest-python-api> ┌────────────────────────────────────────────────────────┐
  709. 23.52 s gammaloop-nextest-python-api> │ The Symbolica license key format is outdated. │
  710. 23.52 s gammaloop-nextest-python-api> │ Renew your key at https://symbolica.io/license/ │
  711. 23.52 s gammaloop-nextest-python-api> └────────────────────────────────────────────────────────┘
  712. 23.52 s gammaloop-nextest-python-api> Could not acquire Symbolica thread permit: Permission denied (os error 13)
  713. 23.52 s gammaloop-nextest-python-api>
  714. 23.52 s gammaloop-nextest-python-api>
  715. 23.52 s gammaloop-nextest-python-api> Location:
  716. 23.52 s gammaloop-nextest-python-api> tests/tests/test_python_api.rs:156:20
  717. 23.52 s gammaloop-nextest-python-api>
  718. 23.52 s gammaloop-nextest-python-api> 4. gammaloop-integration-tests::test_python_api::python_evaluate_sample_honors_generate_events_and_observable_snapshots
  719. 23.52 s gammaloop-nextest-python-api> failure: test failure with exit code 101
  720. 23.52 s gammaloop-nextest-python-api> Error: Python API test subprocess failed.
  721. 23.52 s gammaloop-nextest-python-api> stdout:
  722. 23.52 s gammaloop-nextest-python-api> ┌────────────────────────────────────────────────────────┐
  723. 23.52 s gammaloop-nextest-python-api> │ You are running a restricted Symbolica instance. │
  724. 23.52 s gammaloop-nextest-python-api> │ │
  725. 23.52 s gammaloop-nextest-python-api> │ For non-commercial use only, limited to one │
  726. 23.52 s gammaloop-nextest-python-api> │ Symbolica thread per user. │
  727. 23.52 s gammaloop-nextest-python-api> │ │
  728. 23.52 s gammaloop-nextest-python-api> ├─ Unlock all cores ─────────────────────────────────────┤
  729. 23.52 s gammaloop-nextest-python-api> │ │
  730. 23.52 s gammaloop-nextest-python-api> │ Hobbyists and students: free annual key │
  731. 23.52 s gammaloop-nextest-python-api> │ https://symbolica.io/license/#get-hobbyist-license │
  732. 23.52 s gammaloop-nextest-python-api> │ │
  733. 23.52 s gammaloop-nextest-python-api> │ Free 30-day professional trial: │
  734. 23.52 s gammaloop-nextest-python-api> │ https://symbolica.io/license/#get-trial-license │
  735. 23.52 s gammaloop-nextest-python-api> │ │
  736. 23.52 s gammaloop-nextest-python-api> └────────────────────────────────────────────────────────┘
  737. 23.52 s gammaloop-nextest-python-api> ┌──────────────────────────────────────────────────────────────────────────────────────────────────┐
  738. 23.52 s gammaloop-nextest-python-api> │ Cannot start another restricted Symbolica thread while this user's thread allowance is in use. │
  739. 23.52 s gammaloop-nextest-python-api> └──────────────────────────────────────────────────────────────────────────────────────────────────┘
  740. 23.52 s gammaloop-nextest-python-api>
  741. 23.52 s gammaloop-nextest-python-api> stderr:
  742. 23.52 s gammaloop-nextest-python-api> ┌────────────────────────────────────────────────────────┐
  743. 23.52 s gammaloop-nextest-python-api> │ The Symbolica license key format is outdated. │
  744. 23.52 s gammaloop-nextest-python-api> │ Renew your key at https://symbolica.io/license/ │
  745. 23.52 s gammaloop-nextest-python-api> └────────────────────────────────────────────────────────┘
  746. 23.52 s gammaloop-nextest-python-api> Could not acquire Symbolica thread permit: Permission denied (os error 13)
  747. 23.52 s gammaloop-nextest-python-api>
  748. 23.52 s gammaloop-nextest-python-api>
  749. 23.52 s gammaloop-nextest-python-api> Location:
  750. 23.52 s gammaloop-nextest-python-api> tests/tests/test_python_api.rs:156:20
  751. 23.52 s gammaloop-nextest-python-api> system-out
  752. 23.52 s gammaloop-nextest-python-api> running 1 test
  753. 23.52 s gammaloop-nextest-python-api> test python_evaluate_sample_honors_generate_events_and_observable_snapshots ... FAILED
  754. 23.52 s gammaloop-nextest-python-api>
  755. 23.52 s gammaloop-nextest-python-api> failures:
  756. 23.52 s gammaloop-nextest-python-api>
  757. 23.52 s gammaloop-nextest-python-api> failures:
  758. 23.52 s gammaloop-nextest-python-api> python_evaluate_sample_honors_generate_events_and_observable_snapshots
  759. 23.52 s gammaloop-nextest-python-api>
  760. 23.52 s gammaloop-nextest-python-api> test result: FAILED. 0 passed; 1 failed; 0 ignored; 0 measured; 4 filtered out; finished in 0.13s
  761. 23.52 s gammaloop-nextest-python-api> system-err
  762. 23.52 s gammaloop-nextest-python-api> Error: Python API test subprocess failed.
  763. 23.52 s gammaloop-nextest-python-api> stdout:
  764. 23.52 s gammaloop-nextest-python-api> ┌────────────────────────────────────────────────────────┐
  765. 23.52 s gammaloop-nextest-python-api> │ You are running a restricted Symbolica instance. │
  766. 23.52 s gammaloop-nextest-python-api> │ │
  767. 23.52 s gammaloop-nextest-python-api> │ For non-commercial use only, limited to one │
  768. 23.52 s gammaloop-nextest-python-api> │ Symbolica thread per user. │
  769. 23.52 s gammaloop-nextest-python-api> │ │
  770. 23.52 s gammaloop-nextest-python-api> ├─ Unlock all cores ─────────────────────────────────────┤
  771. 23.52 s gammaloop-nextest-python-api> │ │
  772. 23.52 s gammaloop-nextest-python-api> │ Hobbyists and students: free annual key │
  773. 23.52 s gammaloop-nextest-python-api> │ https://symbolica.io/license/#get-hobbyist-license │
  774. 23.52 s gammaloop-nextest-python-api> │ │
  775. 23.52 s gammaloop-nextest-python-api> │ Free 30-day professional trial: │
  776. 23.52 s gammaloop-nextest-python-api> │ https://symbolica.io/license/#get-trial-license │
  777. 23.52 s gammaloop-nextest-python-api> │ │
  778. 23.52 s gammaloop-nextest-python-api> └────────────────────────────────────────────────────────┘
  779. 23.52 s gammaloop-nextest-python-api> ┌──────────────────────────────────────────────────────────────────────────────────────────────────┐
  780. 23.52 s gammaloop-nextest-python-api> │ Cannot start another restricted Symbolica thread while this user's thread allowance is in use. │
  781. 23.52 s gammaloop-nextest-python-api> └──────────────────────────────────────────────────────────────────────────────────────────────────┘
  782. 23.52 s gammaloop-nextest-python-api>
  783. 23.52 s gammaloop-nextest-python-api> stderr:
  784. 23.52 s gammaloop-nextest-python-api> ┌────────────────────────────────────────────────────────┐
  785. 23.52 s gammaloop-nextest-python-api> │ The Symbolica license key format is outdated. │
  786. 23.52 s gammaloop-nextest-python-api> │ Renew your key at https://symbolica.io/license/ │
  787. 23.52 s gammaloop-nextest-python-api> └────────────────────────────────────────────────────────┘
  788. 23.52 s gammaloop-nextest-python-api> Could not acquire Symbolica thread permit: Permission denied (os error 13)
  789. 23.52 s gammaloop-nextest-python-api>
  790. 23.52 s gammaloop-nextest-python-api>
  791. 23.52 s gammaloop-nextest-python-api> Location:
  792. 23.52 s gammaloop-nextest-python-api> tests/tests/test_python_api.rs:156:20
  793. 23.52 s gammaloop-nextest-python-api>
  794. 23.52 s gammaloop-nextest-python-api> 5. gammaloop-integration-tests::test_python_api::python_evaluate_sample_preserves_graph_grouping_and_incoming_pdgs
  795. 23.52 s gammaloop-nextest-python-api> failure: test failure with exit code 101
  796. 23.52 s gammaloop-nextest-python-api> Error: Python API test subprocess failed.
  797. 23.52 s gammaloop-nextest-python-api> stdout:
  798. 23.52 s gammaloop-nextest-python-api> ┌────────────────────────────────────────────────────────┐
  799. 23.52 s gammaloop-nextest-python-api> │ You are running a restricted Symbolica instance. │
  800. 23.52 s gammaloop-nextest-python-api> │ │
  801. 23.52 s gammaloop-nextest-python-api> │ For non-commercial use only, limited to one │
  802. 23.52 s gammaloop-nextest-python-api> │ Symbolica thread per user. │
  803. 23.52 s gammaloop-nextest-python-api> │ │
  804. 23.52 s gammaloop-nextest-python-api> ├─ Unlock all cores ─────────────────────────────────────┤
  805. 23.52 s gammaloop-nextest-python-api> │ │
  806. 23.52 s gammaloop-nextest-python-api> │ Hobbyists and students: free annual key │
  807. 23.52 s gammaloop-nextest-python-api> │ https://symbolica.io/license/#get-hobbyist-license │
  808. 23.52 s gammaloop-nextest-python-api> │ │
  809. 23.52 s gammaloop-nextest-python-api> │ Free 30-day professional trial: │
  810. 23.52 s gammaloop-nextest-python-api> │ https://symbolica.io/license/#get-trial-license │
  811. 23.52 s gammaloop-nextest-python-api> │ │
  812. 23.52 s gammaloop-nextest-python-api> └────────────────────────────────────────────────────────┘
  813. 23.52 s gammaloop-nextest-python-api> ┌──────────────────────────────────────────────────────────────────────────────────────────────────┐
  814. 23.52 s gammaloop-nextest-python-api> │ Cannot start another restricted Symbolica thread while this user's thread allowance is in use. │
  815. 23.52 s gammaloop-nextest-python-api> └──────────────────────────────────────────────────────────────────────────────────────────────────┘
  816. 23.52 s gammaloop-nextest-python-api>
  817. 23.52 s gammaloop-nextest-python-api> stderr:
  818. 23.52 s gammaloop-nextest-python-api> ┌────────────────────────────────────────────────────────┐
  819. 23.52 s gammaloop-nextest-python-api> │ The Symbolica license key format is outdated. │
  820. 23.52 s gammaloop-nextest-python-api> │ Renew your key at https://symbolica.io/license/ │
  821. 23.52 s gammaloop-nextest-python-api> └────────────────────────────────────────────────────────┘
  822. 23.52 s gammaloop-nextest-python-api> Could not acquire Symbolica thread permit: Permission denied (os error 13)
  823. 23.52 s gammaloop-nextest-python-api>
  824. 23.52 s gammaloop-nextest-python-api>
  825. 23.52 s gammaloop-nextest-python-api> Location:
  826. 23.52 s gammaloop-nextest-python-api> tests/tests/test_python_api.rs:156:20
  827. 23.52 s gammaloop-nextest-python-api> system-out
  828. 23.52 s gammaloop-nextest-python-api> running 1 test
  829. 23.52 s gammaloop-nextest-python-api> test python_evaluate_sample_preserves_graph_grouping_and_incoming_pdgs ... FAILED
  830. 23.52 s gammaloop-nextest-python-api>
  831. 23.52 s gammaloop-nextest-python-api> failures:
  832. 23.52 s gammaloop-nextest-python-api>
  833. 23.52 s gammaloop-nextest-python-api> failures:
  834. 23.52 s gammaloop-nextest-python-api> python_evaluate_sample_preserves_graph_grouping_and_incoming_pdgs
  835. 23.52 s gammaloop-nextest-python-api>
  836. 23.52 s gammaloop-nextest-python-api> test result: FAILED. 0 passed; 1 failed; 0 ignored; 0 measured; 4 filtered out; finished in 0.13s
  837. 23.52 s gammaloop-nextest-python-api> system-err
  838. 23.52 s gammaloop-nextest-python-api> Error: Python API test subprocess failed.
  839. 23.52 s gammaloop-nextest-python-api> stdout:
  840. 23.52 s gammaloop-nextest-python-api> ┌────────────────────────────────────────────────────────┐
  841. 23.52 s gammaloop-nextest-python-api> │ You are running a restricted Symbolica instance. │
  842. 23.52 s gammaloop-nextest-python-api> │ │
  843. 23.52 s gammaloop-nextest-python-api> │ For non-commercial use only, limited to one │
  844. 23.52 s gammaloop-nextest-python-api> │ Symbolica thread per user. │
  845. 23.52 s gammaloop-nextest-python-api> │ │
  846. 23.53 s gammaloop-nextest-python-api> ├─ Unlock all cores ─────────────────────────────────────┤
  847. 23.53 s gammaloop-nextest-python-api> │ │
  848. 23.53 s gammaloop-nextest-python-api> │ Hobbyists and students: free annual key │
  849. 23.53 s gammaloop-nextest-python-api> │ https://symbolica.io/license/#get-hobbyist-license │
  850. 23.53 s gammaloop-nextest-python-api> │ │
  851. 23.53 s gammaloop-nextest-python-api> │ Free 30-day professional trial: │
  852. 23.53 s gammaloop-nextest-python-api> │ https://symbolica.io/license/#get-trial-license │
  853. 23.53 s gammaloop-nextest-python-api> │ │
  854. 23.53 s gammaloop-nextest-python-api> └────────────────────────────────────────────────────────┘
  855. 23.53 s gammaloop-nextest-python-api> ┌──────────────────────────────────────────────────────────────────────────────────────────────────┐
  856. 23.53 s gammaloop-nextest-python-api> │ Cannot start another restricted Symbolica thread while this user's thread allowance is in use. │
  857. 23.53 s gammaloop-nextest-python-api> └──────────────────────────────────────────────────────────────────────────────────────────────────┘
  858. 23.53 s gammaloop-nextest-python-api>
  859. 23.53 s gammaloop-nextest-python-api> stderr:
  860. 23.53 s gammaloop-nextest-python-api> ┌────────────────────────────────────────────────────────┐
  861. 23.53 s gammaloop-nextest-python-api> │ The Symbolica license key format is outdated. │
  862. 23.53 s gammaloop-nextest-python-api> │ Renew your key at https://symbolica.io/license/ │
  863. 23.53 s gammaloop-nextest-python-api> └────────────────────────────────────────────────────────┘
  864. 23.53 s gammaloop-nextest-python-api> Could not acquire Symbolica thread permit: Permission denied (os error 13)
  865. 23.53 s gammaloop-nextest-python-api>
  866. 23.53 s gammaloop-nextest-python-api>
  867. 23.53 s gammaloop-nextest-python-api> Location:
  868. 23.53 s gammaloop-nextest-python-api> tests/tests/test_python_api.rs:156:20
  869. 23.53 s gammaloop-nextest-python-api> =========================================
  870. 23.63 s error: Cannot build '/nix/store/0yp6rnk546sqdif2snfpaz9n62n7pczx-gammaloop-nextest-python-api.drv'.
  871. 23.63 s Reason: builder failed with exit code 100.
  872. 23.63 s Output paths:
  873. 23.63 s /nix/store/y7cr6qdsp6prpykmg0qgky1552gqq1q8-gammaloop-nextest-python-api
  874. 23.63 s Last 853 log lines:
  875. 23.63 s > Extracting 3 binaries (including 2 non-test binaries), 1 build script output directory, and 3 linked paths to /build/source
  876. 23.63 s > Extracted 22 files to /build/source in 0.25s
  877. 23.63 s > ------------
  878. 23.63 s > Nextest run ID 50e55d44-9131-464e-b732-863caa36873c with nextest profile: ci_gammaloop
  879. 23.63 s > Starting 5 tests across 1 binary
  880. 23.63 s > FAIL [ 0.127s] (1/5) gammaloop-integration-tests::test_python_api python_evaluate_samples_batch_and_momentum_space_have_expected_shape
  881. 23.63 s > stdout ---
  882. 23.63 s >
  883. 23.63 s > running 1 test
  884. 23.63 s > test python_evaluate_samples_batch_and_momentum_space_have_expected_shape ... FAILED
  885. 23.63 s >
  886. 23.63 s > failures:
  887. 23.63 s >
  888. 23.63 s > failures:
  889. 23.63 s > python_evaluate_samples_batch_and_momentum_space_have_expected_shape
  890. 23.63 s >
  891. 23.63 s > test result: FAILED. 0 passed; 1 failed; 0 ignored; 0 measured; 4 filtered out; finished in 0.12s
  892. 23.63 s >
  893. 23.63 s > stderr ---
  894. 23.63 s > Error: Python API test subprocess failed.
  895. 23.63 s > stdout:
  896. 23.63 s > ┌────────────────────────────────────────────────────────┐
  897. 23.63 s > │ You are running a restricted Symbolica instance. │
  898. 23.63 s > │ │
  899. 23.63 s > │ For non-commercial use only, limited to one │
  900. 23.63 s > │ Symbolica thread per user. │
  901. 23.63 s > │ │
  902. 23.63 s > ├─ Unlock all cores ─────────────────────────────────────┤
  903. 23.63 s > │ │
  904. 23.63 s > │ Hobbyists and students: free annual key │
  905. 23.63 s > │ https://symbolica.io/license/#get-hobbyist-license │
  906. 23.63 s > │ │
  907. 23.63 s > │ Free 30-day professional trial: │
  908. 23.63 s > │ https://symbolica.io/license/#get-trial-license │
  909. 23.63 s > │ │
  910. 23.63 s > └────────────────────────────────────────────────────────┘
  911. 23.63 s > ┌──────────────────────────────────────────────────────────────────────────────────────────────────┐
  912. 23.63 s > │ Cannot start another restricted Symbolica thread while this user's thread allowance is in use. │
  913. 23.63 s > └──────────────────────────────────────────────────────────────────────────────────────────────────┘
  914. 23.63 s >
  915. 23.63 s > stderr:
  916. 23.63 s > ┌────────────────────────────────────────────────────────┐
  917. 23.63 s > │ The Symbolica license key format is outdated. │
  918. 23.63 s > │ Renew your key at https://symbolica.io/license/ │
  919. 23.63 s > └────────────────────────────────────────────────────────┘
  920. 23.63 s > Could not acquire Symbolica thread permit: Permission denied (os error 13)
  921. 23.63 s >
  922. 23.63 s >
  923. 23.63 s > Location:
  924. 23.63 s > tests/tests/test_python_api.rs:156:20
  925. 23.63 s >
  926. 23.63 s > FAIL [ 0.139s] (2/5) gammaloop-integration-tests::test_python_api python_settings_wrappers_expose_nested_runtime_and_global_settings
  927. 23.63 s > stdout ---
  928. 23.63 s >
  929. 23.63 s > running 1 test
  930. 23.63 s > test python_settings_wrappers_expose_nested_runtime_and_global_settings ... FAILED
  931. 23.63 s >
  932. 23.63 s > failures:
  933. 23.63 s >
  934. 23.63 s > failures:
  935. 23.63 s > python_settings_wrappers_expose_nested_runtime_and_global_settings
  936. 23.63 s >
  937. 23.63 s > test result: FAILED. 0 passed; 1 failed; 0 ignored; 0 measured; 4 filtered out; finished in 0.13s
  938. 23.63 s >
  939. 23.63 s > stderr ---
  940. 23.63 s > Error: Python API test subprocess failed.
  941. 23.63 s > stdout:
  942. 23.63 s > ┌────────────────────────────────────────────────────────┐
  943. 23.63 s > │ You are running a restricted Symbolica instance. │
  944. 23.63 s > │ │
  945. 23.63 s > │ For non-commercial use only, limited to one │
  946. 23.63 s > │ Symbolica thread per user. │
  947. 23.63 s > │ │
  948. 23.63 s > ├─ Unlock all cores ─────────────────────────────────────┤
  949. 23.63 s > │ │
  950. 23.63 s > │ Hobbyists and students: free annual key │
  951. 23.63 s > │ https://symbolica.io/license/#get-hobbyist-license │
  952. 23.63 s > │ │
  953. 23.63 s > │ Free 30-day professional trial: │
  954. 23.63 s > │ https://symbolica.io/license/#get-trial-license │
  955. 23.63 s > │ │
  956. 23.63 s > └────────────────────────────────────────────────────────┘
  957. 23.63 s > ┌──────────────────────────────────────────────────────────────────────────────────────────────────┐
  958. 23.63 s > │ Cannot start another restricted Symbolica thread while this user's thread allowance is in use. │
  959. 23.63 s > └──────────────────────────────────────────────────────────────────────────────────────────────────┘
  960. 23.63 s >
  961. 23.63 s > stderr:
  962. 23.63 s > ┌────────────────────────────────────────────────────────┐
  963. 23.63 s > │ The Symbolica license key format is outdated. │
  964. 23.63 s > │ Renew your key at https://symbolica.io/license/ │
  965. 23.63 s > └────────────────────────────────────────────────────────┘
  966. 23.63 s > Could not acquire Symbolica thread permit: Permission denied (os error 13)
  967. 23.63 s >
  968. 23.63 s >
  969. 23.63 s > Location:
  970. 23.63 s > tests/tests/test_python_api.rs:156:20
  971. 23.63 s >
  972. 23.63 s > FAIL [ 0.139s] (3/5) gammaloop-integration-tests::test_python_api python_session_getters_return_live_toml_and_command_blocks
  973. 23.63 s > stdout ---
  974. 23.63 s >
  975. 23.63 s > running 1 test
  976. 23.63 s > test python_session_getters_return_live_toml_and_command_blocks ... FAILED
  977. 23.63 s >
  978. 23.63 s > failures:
  979. 23.63 s >
  980. 23.63 s > failures:
  981. 23.63 s > python_session_getters_return_live_toml_and_command_blocks
  982. 23.63 s >
  983. 23.63 s > test result: FAILED. 0 passed; 1 failed; 0 ignored; 0 measured; 4 filtered out; finished in 0.13s
  984. 23.63 s >
  985. 23.63 s > stderr ---
  986. 23.63 s > Error: Python API test subprocess failed.
  987. 23.63 s > stdout:
  988. 23.63 s > ┌────────────────────────────────────────────────────────┐
  989. 23.63 s > │ You are running a restricted Symbolica instance. │
  990. 23.63 s > │ │
  991. 23.63 s > │ For non-commercial use only, limited to one │
  992. 23.63 s > │ Symbolica thread per user. │
  993. 23.63 s > │ │
  994. 23.63 s > ├─ Unlock all cores ─────────────────────────────────────┤
  995. 23.63 s > │ │
  996. 23.63 s > │ Hobbyists and students: free annual key │
  997. 23.63 s > │ https://symbolica.io/license/#get-hobbyist-license │
  998. 23.63 s > │ │
  999. 23.63 s > │ Free 30-day professional trial: │
  1000. 23.63 s > │ https://symbolica.io/license/#get-trial-license │
  1001. 23.63 s > │ │
  1002. 23.63 s > └────────────────────────────────────────────────────────┘
  1003. 23.63 s > ┌──────────────────────────────────────────────────────────────────────────────────────────────────┐
  1004. 23.63 s > │ Cannot start another restricted Symbolica thread while this user's thread allowance is in use. │
  1005. 23.63 s > └──────────────────────────────────────────────────────────────────────────────────────────────────┘
  1006. 23.63 s >
  1007. 23.63 s > stderr:
  1008. 23.63 s > ┌────────────────────────────────────────────────────────┐
  1009. 23.63 s > │ The Symbolica license key format is outdated. │
  1010. 23.63 s > │ Renew your key at https://symbolica.io/license/ │
  1011. 23.63 s > └────────────────────────────────────────────────────────┘
  1012. 23.63 s > Could not acquire Symbolica thread permit: Permission denied (os error 13)
  1013. 23.63 s >
  1014. 23.63 s >
  1015. 23.63 s > Location:
  1016. 23.63 s > tests/tests/test_python_api.rs:156:20
  1017. 23.63 s >
  1018. 23.63 s > FAIL [ 0.139s] (4/5) gammaloop-integration-tests::test_python_api python_evaluate_sample_honors_generate_events_and_observable_snapshots
  1019. 23.63 s > stdout ---
  1020. 23.63 s >
  1021. 23.63 s > running 1 test
  1022. 23.63 s > test python_evaluate_sample_honors_generate_events_and_observable_snapshots ... FAILED
  1023. 23.63 s >
  1024. 23.63 s > failures:
  1025. 23.63 s >
  1026. 23.63 s > failures:
  1027. 23.63 s > python_evaluate_sample_honors_generate_events_and_observable_snapshots
  1028. 23.63 s >
  1029. 23.63 s > test result: FAILED. 0 passed; 1 failed; 0 ignored; 0 measured; 4 filtered out; finished in 0.13s
  1030. 23.63 s >
  1031. 23.63 s > stderr ---
  1032. 23.63 s > Error: Python API test subprocess failed.
  1033. 23.63 s > stdout:
  1034. 23.63 s > ┌────────────────────────────────────────────────────────┐
  1035. 23.63 s > │ You are running a restricted Symbolica instance. │
  1036. 23.63 s > │ │
  1037. 23.63 s > │ For non-commercial use only, limited to one │
  1038. 23.63 s > │ Symbolica thread per user. │
  1039. 23.63 s > │ │
  1040. 23.63 s > ├─ Unlock all cores ─────────────────────────────────────┤
  1041. 23.63 s > │ │
  1042. 23.63 s > │ Hobbyists and students: free annual key │
  1043. 23.63 s > │ https://symbolica.io/license/#get-hobbyist-license │
  1044. 23.63 s > │ │
  1045. 23.63 s > │ Free 30-day professional trial: │
  1046. 23.63 s > │ https://symbolica.io/license/#get-trial-license │
  1047. 23.63 s > │ │
  1048. 23.63 s > └────────────────────────────────────────────────────────┘
  1049. 23.63 s > ┌──────────────────────────────────────────────────────────────────────────────────────────────────┐
  1050. 23.63 s > │ Cannot start another restricted Symbolica thread while this user's thread allowance is in use. │
  1051. 23.63 s > └──────────────────────────────────────────────────────────────────────────────────────────────────┘
  1052. 23.63 s >
  1053. 23.63 s > stderr:
  1054. 23.63 s > ┌────────────────────────────────────────────────────────┐
  1055. 23.63 s > │ The Symbolica license key format is outdated. │
  1056. 23.63 s > │ Renew your key at https://symbolica.io/license/ │
  1057. 23.63 s > └────────────────────────────────────────────────────────┘
  1058. 23.63 s > Could not acquire Symbolica thread permit: Permission denied (os error 13)
  1059. 23.63 s >
  1060. 23.63 s >
  1061. 23.63 s > Location:
  1062. 23.63 s > tests/tests/test_python_api.rs:156:20
  1063. 23.63 s >
  1064. 23.63 s > FAIL [ 0.139s] (5/5) gammaloop-integration-tests::test_python_api python_evaluate_sample_preserves_graph_grouping_and_incoming_pdgs
  1065. 23.63 s > stdout ---
  1066. 23.63 s >
  1067. 23.63 s > running 1 test
  1068. 23.63 s > test python_evaluate_sample_preserves_graph_grouping_and_incoming_pdgs ... FAILED
  1069. 23.63 s >
  1070. 23.63 s > failures:
  1071. 23.63 s >
  1072. 23.63 s > failures:
  1073. 23.63 s > python_evaluate_sample_preserves_graph_grouping_and_incoming_pdgs
  1074. 23.63 s >
  1075. 23.63 s > test result: FAILED. 0 passed; 1 failed; 0 ignored; 0 measured; 4 filtered out; finished in 0.13s
  1076. 23.63 s >
  1077. 23.63 s > stderr ---
  1078. 23.63 s > Error: Python API test subprocess failed.
  1079. 23.63 s > stdout:
  1080. 23.63 s > ┌────────────────────────────────────────────────────────┐
  1081. 23.63 s > │ You are running a restricted Symbolica instance. │
  1082. 23.63 s > │ │
  1083. 23.63 s > │ For non-commercial use only, limited to one │
  1084. 23.63 s > │ Symbolica thread per user. │
  1085. 23.63 s > │ │
  1086. 23.63 s > ├─ Unlock all cores ─────────────────────────────────────┤
  1087. 23.63 s > │ │
  1088. 23.63 s > │ Hobbyists and students: free annual key │
  1089. 23.63 s > │ https://symbolica.io/license/#get-hobbyist-license │
  1090. 23.63 s > │ │
  1091. 23.63 s > │ Free 30-day professional trial: │
  1092. 23.63 s > │ https://symbolica.io/license/#get-trial-license │
  1093. 23.63 s > │ │
  1094. 23.63 s > └────────────────────────────────────────────────────────┘
  1095. 23.63 s > ┌──────────────────────────────────────────────────────────────────────────────────────────────────┐
  1096. 23.63 s > │ Cannot start another restricted Symbolica thread while this user's thread allowance is in use. │
  1097. 23.63 s > └──────────────────────────────────────────────────────────────────────────────────────────────────┘
  1098. 23.63 s >
  1099. 23.63 s > stderr:
  1100. 23.63 s > ┌────────────────────────────────────────────────────────┐
  1101. 23.63 s > │ The Symbolica license key format is outdated. │
  1102. 23.63 s > │ Renew your key at https://symbolica.io/license/ │
  1103. 23.63 s > └────────────────────────────────────────────────────────┘
  1104. 23.63 s > Could not acquire Symbolica thread permit: Permission denied (os error 13)
  1105. 23.63 s >
  1106. 23.63 s >
  1107. 23.63 s > Location:
  1108. 23.63 s > tests/tests/test_python_api.rs:156:20
  1109. 23.63 s >
  1110. 23.63 s > ------------
  1111. 23.63 s > Summary [ 0.140s] 5 tests run: 0 passed, 5 failed, 0 skipped
  1112. 23.63 s > FAIL [ 0.127s] (1/5) gammaloop-integration-tests::test_python_api python_evaluate_samples_batch_and_momentum_space_have_expected_shape
  1113. 23.63 s > stdout ---
  1114. 23.63 s >
  1115. 23.63 s > running 1 test
  1116. 23.63 s > test python_evaluate_samples_batch_and_momentum_space_have_expected_shape ... FAILED
  1117. 23.63 s >
  1118. 23.63 s > failures:
  1119. 23.63 s >
  1120. 23.63 s > failures:
  1121. 23.63 s > python_evaluate_samples_batch_and_momentum_space_have_expected_shape
  1122. 23.63 s >
  1123. 23.63 s > test result: FAILED. 0 passed; 1 failed; 0 ignored; 0 measured; 4 filtered out; finished in 0.12s
  1124. 23.63 s >
  1125. 23.63 s > stderr ---
  1126. 23.63 s > Error: Python API test subprocess failed.
  1127. 23.63 s > stdout:
  1128. 23.63 s > ┌────────────────────────────────────────────────────────┐
  1129. 23.63 s > │ You are running a restricted Symbolica instance. │
  1130. 23.63 s > │ │
  1131. 23.63 s > │ For non-commercial use only, limited to one │
  1132. 23.63 s > │ Symbolica thread per user. │
  1133. 23.63 s > │ │
  1134. 23.63 s > ├─ Unlock all cores ─────────────────────────────────────┤
  1135. 23.63 s > │ │
  1136. 23.63 s > │ Hobbyists and students: free annual key │
  1137. 23.63 s > │ https://symbolica.io/license/#get-hobbyist-license │
  1138. 23.63 s > │ │
  1139. 23.63 s > │ Free 30-day professional trial: │
  1140. 23.63 s > │ https://symbolica.io/license/#get-trial-license │
  1141. 23.63 s > │ │
  1142. 23.63 s > └────────────────────────────────────────────────────────┘
  1143. 23.63 s > ┌──────────────────────────────────────────────────────────────────────────────────────────────────┐
  1144. 23.63 s > │ Cannot start another restricted Symbolica thread while this user's thread allowance is in use. │
  1145. 23.63 s > └──────────────────────────────────────────────────────────────────────────────────────────────────┘
  1146. 23.63 s >
  1147. 23.63 s > stderr:
  1148. 23.63 s > ┌────────────────────────────────────────────────────────┐
  1149. 23.63 s > │ The Symbolica license key format is outdated. │
  1150. 23.63 s > │ Renew your key at https://symbolica.io/license/ │
  1151. 23.63 s > └────────────────────────────────────────────────────────┘
  1152. 23.63 s > Could not acquire Symbolica thread permit: Permission denied (os error 13)
  1153. 23.63 s >
  1154. 23.63 s >
  1155. 23.63 s > Location:
  1156. 23.63 s > tests/tests/test_python_api.rs:156:20
  1157. 23.63 s >
  1158. 23.63 s > FAIL [ 0.139s] (2/5) gammaloop-integration-tests::test_python_api python_settings_wrappers_expose_nested_runtime_and_global_settings
  1159. 23.63 s > stdout ---
  1160. 23.63 s >
  1161. 23.63 s > running 1 test
  1162. 23.63 s > test python_settings_wrappers_expose_nested_runtime_and_global_settings ... FAILED
  1163. 23.63 s >
  1164. 23.63 s > failures:
  1165. 23.63 s >
  1166. 23.63 s > failures:
  1167. 23.63 s > python_settings_wrappers_expose_nested_runtime_and_global_settings
  1168. 23.63 s >
  1169. 23.63 s > test result: FAILED. 0 passed; 1 failed; 0 ignored; 0 measured; 4 filtered out; finished in 0.13s
  1170. 23.63 s >
  1171. 23.63 s > stderr ---
  1172. 23.63 s > Error: Python API test subprocess failed.
  1173. 23.63 s > stdout:
  1174. 23.63 s > ┌────────────────────────────────────────────────────────┐
  1175. 23.63 s > │ You are running a restricted Symbolica instance. │
  1176. 23.63 s > │ │
  1177. 23.63 s > │ For non-commercial use only, limited to one │
  1178. 23.63 s > │ Symbolica thread per user. │
  1179. 23.63 s > │ │
  1180. 23.63 s > ├─ Unlock all cores ─────────────────────────────────────┤
  1181. 23.63 s > │ │
  1182. 23.63 s > │ Hobbyists and students: free annual key │
  1183. 23.63 s > │ https://symbolica.io/license/#get-hobbyist-license │
  1184. 23.63 s > │ │
  1185. 23.63 s > │ Free 30-day professional trial: │
  1186. 23.63 s > │ https://symbolica.io/license/#get-trial-license │
  1187. 23.63 s > │ │
  1188. 23.63 s > └────────────────────────────────────────────────────────┘
  1189. 23.63 s > ┌──────────────────────────────────────────────────────────────────────────────────────────────────┐
  1190. 23.63 s > │ Cannot start another restricted Symbolica thread while this user's thread allowance is in use. │
  1191. 23.63 s > └──────────────────────────────────────────────────────────────────────────────────────────────────┘
  1192. 23.63 s >
  1193. 23.63 s > stderr:
  1194. 23.63 s > ┌────────────────────────────────────────────────────────┐
  1195. 23.63 s > │ The Symbolica license key format is outdated. │
  1196. 23.63 s > │ Renew your key at https://symbolica.io/license/ │
  1197. 23.63 s > └────────────────────────────────────────────────────────┘
  1198. 23.63 s > Could not acquire Symbolica thread permit: Permission denied (os error 13)
  1199. 23.63 s >
  1200. 23.63 s >
  1201. 23.63 s > Location:
  1202. 23.63 s > tests/tests/test_python_api.rs:156:20
  1203. 23.63 s >
  1204. 23.63 s > FAIL [ 0.139s] (3/5) gammaloop-integration-tests::test_python_api python_session_getters_return_live_toml_and_command_blocks
  1205. 23.63 s > stdout ---
  1206. 23.63 s >
  1207. 23.63 s > running 1 test
  1208. 23.63 s > test python_session_getters_return_live_toml_and_command_blocks ... FAILED
  1209. 23.63 s >
  1210. 23.63 s > failures:
  1211. 23.63 s >
  1212. 23.63 s > failures:
  1213. 23.63 s > python_session_getters_return_live_toml_and_command_blocks
  1214. 23.63 s >
  1215. 23.63 s > test result: FAILED. 0 passed; 1 failed; 0 ignored; 0 measured; 4 filtered out; finished in 0.13s
  1216. 23.63 s >
  1217. 23.63 s > stderr ---
  1218. 23.63 s > Error: Python API test subprocess failed.
  1219. 23.63 s > stdout:
  1220. 23.63 s > ┌────────────────────────────────────────────────────────┐
  1221. 23.63 s > │ You are running a restricted Symbolica instance. │
  1222. 23.63 s > │ │
  1223. 23.63 s > │ For non-commercial use only, limited to one │
  1224. 23.63 s > │ Symbolica thread per user. │
  1225. 23.63 s > │ │
  1226. 23.63 s > ├─ Unlock all cores ─────────────────────────────────────┤
  1227. 23.63 s > │ │
  1228. 23.63 s > │ Hobbyists and students: free annual key │
  1229. 23.63 s > │ https://symbolica.io/license/#get-hobbyist-license │
  1230. 23.63 s > │ │
  1231. 23.63 s > │ Free 30-day professional trial: │
  1232. 23.63 s > │ https://symbolica.io/license/#get-trial-license │
  1233. 23.63 s > │ │
  1234. 23.63 s > └────────────────────────────────────────────────────────┘
  1235. 23.63 s > ┌──────────────────────────────────────────────────────────────────────────────────────────────────┐
  1236. 23.63 s > │ Cannot start another restricted Symbolica thread while this user's thread allowance is in use. │
  1237. 23.63 s > └──────────────────────────────────────────────────────────────────────────────────────────────────┘
  1238. 23.63 s >
  1239. 23.63 s > stderr:
  1240. 23.63 s > ┌────────────────────────────────────────────────────────┐
  1241. 23.63 s > │ The Symbolica license key format is outdated. │
  1242. 23.63 s > │ Renew your key at https://symbolica.io/license/ │
  1243. 23.63 s > └────────────────────────────────────────────────────────┘
  1244. 23.63 s > Could not acquire Symbolica thread permit: Permission denied (os error 13)
  1245. 23.63 s >
  1246. 23.63 s >
  1247. 23.63 s > Location:
  1248. 23.63 s > tests/tests/test_python_api.rs:156:20
  1249. 23.63 s >
  1250. 23.63 s > FAIL [ 0.139s] (4/5) gammaloop-integration-tests::test_python_api python_evaluate_sample_honors_generate_events_and_observable_snapshots
  1251. 23.63 s > stdout ---
  1252. 23.63 s >
  1253. 23.63 s > running 1 test
  1254. 23.63 s > test python_evaluate_sample_honors_generate_events_and_observable_snapshots ... FAILED
  1255. 23.63 s >
  1256. 23.63 s > failures:
  1257. 23.63 s >
  1258. 23.63 s > failures:
  1259. 23.63 s > python_evaluate_sample_honors_generate_events_and_observable_snapshots
  1260. 23.63 s >
  1261. 23.63 s > test result: FAILED. 0 passed; 1 failed; 0 ignored; 0 measured; 4 filtered out; finished in 0.13s
  1262. 23.63 s >
  1263. 23.63 s > stderr ---
  1264. 23.63 s > Error: Python API test subprocess failed.
  1265. 23.63 s > stdout:
  1266. 23.63 s > ┌────────────────────────────────────────────────────────┐
  1267. 23.63 s > │ You are running a restricted Symbolica instance. │
  1268. 23.63 s > │ │
  1269. 23.63 s > │ For non-commercial use only, limited to one │
  1270. 23.63 s > │ Symbolica thread per user. │
  1271. 23.63 s > │ │
  1272. 23.63 s > ├─ Unlock all cores ─────────────────────────────────────┤
  1273. 23.63 s > │ │
  1274. 23.63 s > │ Hobbyists and students: free annual key │
  1275. 23.63 s > │ https://symbolica.io/license/#get-hobbyist-license │
  1276. 23.63 s > │ │
  1277. 23.63 s > │ Free 30-day professional trial: │
  1278. 23.63 s > │ https://symbolica.io/license/#get-trial-license │
  1279. 23.63 s > │ │
  1280. 23.63 s > └────────────────────────────────────────────────────────┘
  1281. 23.63 s > ┌──────────────────────────────────────────────────────────────────────────────────────────────────┐
  1282. 23.63 s > │ Cannot start another restricted Symbolica thread while this user's thread allowance is in use. │
  1283. 23.63 s > └──────────────────────────────────────────────────────────────────────────────────────────────────┘
  1284. 23.63 s >
  1285. 23.63 s > stderr:
  1286. 23.63 s > ┌────────────────────────────────────────────────────────┐
  1287. 23.63 s > │ The Symbolica license key format is outdated. │
  1288. 23.63 s > │ Renew your key at https://symbolica.io/license/ │
  1289. 23.63 s > └────────────────────────────────────────────────────────┘
  1290. 23.63 s > Could not acquire Symbolica thread permit: Permission denied (os error 13)
  1291. 23.63 s >
  1292. 23.63 s >
  1293. 23.63 s > Location:
  1294. 23.63 s > tests/tests/test_python_api.rs:156:20
  1295. 23.63 s >
  1296. 23.63 s > FAIL [ 0.139s] (5/5) gammaloop-integration-tests::test_python_api python_evaluate_sample_preserves_graph_grouping_and_incoming_pdgs
  1297. 23.63 s > stdout ---
  1298. 23.63 s >
  1299. 23.63 s > running 1 test
  1300. 23.63 s > test python_evaluate_sample_preserves_graph_grouping_and_incoming_pdgs ... FAILED
  1301. 23.63 s >
  1302. 23.63 s > failures:
  1303. 23.63 s >
  1304. 23.63 s > failures:
  1305. 23.63 s > python_evaluate_sample_preserves_graph_grouping_and_incoming_pdgs
  1306. 23.63 s >
  1307. 23.63 s > test result: FAILED. 0 passed; 1 failed; 0 ignored; 0 measured; 4 filtered out; finished in 0.13s
  1308. 23.63 s >
  1309. 23.63 s > stderr ---
  1310. 23.63 s > Error: Python API test subprocess failed.
  1311. 23.63 s > stdout:
  1312. 23.63 s > ┌────────────────────────────────────────────────────────┐
  1313. 23.63 s > │ You are running a restricted Symbolica instance. │
  1314. 23.63 s > │ │
  1315. 23.63 s > │ For non-commercial use only, limited to one │
  1316. 23.63 s > │ Symbolica thread per user. │
  1317. 23.63 s > │ │
  1318. 23.63 s > ├─ Unlock all cores ─────────────────────────────────────┤
  1319. 23.63 s > │ │
  1320. 23.63 s > │ Hobbyists and students: free annual key │
  1321. 23.63 s > │ https://symbolica.io/license/#get-hobbyist-license │
  1322. 23.63 s > │ │
  1323. 23.63 s > │ Free 30-day professional trial: │
  1324. 23.63 s > │ https://symbolica.io/license/#get-trial-license │
  1325. 23.63 s > │ │
  1326. 23.63 s > └────────────────────────────────────────────────────────┘
  1327. 23.63 s > ┌──────────────────────────────────────────────────────────────────────────────────────────────────┐
  1328. 23.63 s > │ Cannot start another restricted Symbolica thread while this user's thread allowance is in use. │
  1329. 23.63 s > └──────────────────────────────────────────────────────────────────────────────────────────────────┘
  1330. 23.63 s >
  1331. 23.63 s > stderr:
  1332. 23.63 s > ┌────────────────────────────────────────────────────────┐
  1333. 23.63 s > │ The Symbolica license key format is outdated. │
  1334. 23.63 s > │ Renew your key at https://symbolica.io/license/ │
  1335. 23.63 s > └────────────────────────────────────────────────────────┘
  1336. 23.63 s > Could not acquire Symbolica thread permit: Permission denied (os error 13)
  1337. 23.63 s >
  1338. 23.63 s >
  1339. 23.63 s > Location:
  1340. 23.63 s > tests/tests/test_python_api.rs:156:20
  1341. 23.63 s >
  1342. 23.63 s > error: test run failed
  1343. 23.63 s >
  1344. 23.63 s > ========== nextest test summary ==========
  1345. 23.63 s > report: target/nextest/ci_gammaloop/junit.xml
  1346. 23.63 s > tests: 5, failures: 5, errors: 0
  1347. 23.63 s >
  1348. 23.63 s > 1. gammaloop-integration-tests::test_python_api::python_evaluate_samples_batch_and_momentum_space_have_expected_shape
  1349. 23.63 s > failure: test failure with exit code 101
  1350. 23.63 s > Error: Python API test subprocess failed.
  1351. 23.63 s > stdout:
  1352. 23.63 s > ┌────────────────────────────────────────────────────────┐
  1353. 23.63 s > │ You are running a restricted Symbolica instance. │
  1354. 23.63 s > │ │
  1355. 23.63 s > │ For non-commercial use only, limited to one │
  1356. 23.63 s > │ Symbolica thread per user. │
  1357. 23.63 s > │ │
  1358. 23.63 s > ├─ Unlock all cores ─────────────────────────────────────┤
  1359. 23.63 s > │ │
  1360. 23.63 s > │ Hobbyists and students: free annual key │
  1361. 23.63 s > │ https://symbolica.io/license/#get-hobbyist-license │
  1362. 23.63 s > │ │
  1363. 23.63 s > │ Free 30-day professional trial: │
  1364. 23.63 s > │ https://symbolica.io/license/#get-trial-license │
  1365. 23.63 s > │ │
  1366. 23.63 s > └────────────────────────────────────────────────────────┘
  1367. 23.63 s > ┌──────────────────────────────────────────────────────────────────────────────────────────────────┐
  1368. 23.63 s > │ Cannot start another restricted Symbolica thread while this user's thread allowance is in use. │
  1369. 23.63 s > └──────────────────────────────────────────────────────────────────────────────────────────────────┘
  1370. 23.63 s >
  1371. 23.63 s > stderr:
  1372. 23.63 s > ┌────────────────────────────────────────────────────────┐
  1373. 23.63 s > │ The Symbolica license key format is outdated. │
  1374. 23.63 s > │ Renew your key at https://symbolica.io/license/ │
  1375. 23.63 s > └────────────────────────────────────────────────────────┘
  1376. 23.63 s > Could not acquire Symbolica thread permit: Permission denied (os error 13)
  1377. 23.63 s >
  1378. 23.63 s >
  1379. 23.63 s > Location:
  1380. 23.63 s > tests/tests/test_python_api.rs:156:20
  1381. 23.63 s > system-out
  1382. 23.63 s > running 1 test
  1383. 23.63 s > test python_evaluate_samples_batch_and_momentum_space_have_expected_shape ... FAILED
  1384. 23.63 s >
  1385. 23.63 s > failures:
  1386. 23.63 s >
  1387. 23.63 s > failures:
  1388. 23.63 s > python_evaluate_samples_batch_and_momentum_space_have_expected_shape
  1389. 23.63 s >
  1390. 23.63 s > test result: FAILED. 0 passed; 1 failed; 0 ignored; 0 measured; 4 filtered out; finished in 0.12s
  1391. 23.63 s > system-err
  1392. 23.63 s > Error: Python API test subprocess failed.
  1393. 23.63 s > stdout:
  1394. 23.63 s > ┌────────────────────────────────────────────────────────┐
  1395. 23.63 s > │ You are running a restricted Symbolica instance. │
  1396. 23.63 s > │ │
  1397. 23.63 s > │ For non-commercial use only, limited to one │
  1398. 23.63 s > │ Symbolica thread per user. │
  1399. 23.63 s > │ │
  1400. 23.63 s > ├─ Unlock all cores ─────────────────────────────────────┤
  1401. 23.63 s > │ │
  1402. 23.63 s > │ Hobbyists and students: free annual key │
  1403. 23.63 s > │ https://symbolica.io/license/#get-hobbyist-license │
  1404. 23.63 s > │ │
  1405. 23.63 s > │ Free 30-day professional trial: │
  1406. 23.63 s > │ https://symbolica.io/license/#get-trial-license │
  1407. 23.63 s > │ │
  1408. 23.63 s > └────────────────────────────────────────────────────────┘
  1409. 23.63 s > ┌──────────────────────────────────────────────────────────────────────────────────────────────────┐
  1410. 23.63 s > │ Cannot start another restricted Symbolica thread while this user's thread allowance is in use. │
  1411. 23.63 s > └──────────────────────────────────────────────────────────────────────────────────────────────────┘
  1412. 23.63 s >
  1413. 23.63 s > stderr:
  1414. 23.63 s > ┌────────────────────────────────────────────────────────┐
  1415. 23.63 s > │ The Symbolica license key format is outdated. │
  1416. 23.63 s > │ Renew your key at https://symbolica.io/license/ │
  1417. 23.63 s > └────────────────────────────────────────────────────────┘
  1418. 23.63 s > Could not acquire Symbolica thread permit: Permission denied (os error 13)
  1419. 23.63 s >
  1420. 23.63 s >
  1421. 23.63 s > Location:
  1422. 23.63 s > tests/tests/test_python_api.rs:156:20
  1423. 23.63 s >
  1424. 23.63 s > 2. gammaloop-integration-tests::test_python_api::python_settings_wrappers_expose_nested_runtime_and_global_settings
  1425. 23.63 s > failure: test failure with exit code 101
  1426. 23.63 s > Error: Python API test subprocess failed.
  1427. 23.63 s > stdout:
  1428. 23.63 s > ┌────────────────────────────────────────────────────────┐
  1429. 23.63 s > │ You are running a restricted Symbolica instance. │
  1430. 23.63 s > │ │
  1431. 23.63 s > │ For non-commercial use only, limited to one │
  1432. 23.63 s > │ Symbolica thread per user. │
  1433. 23.63 s > │ │
  1434. 23.63 s > ├─ Unlock all cores ─────────────────────────────────────┤
  1435. 23.63 s > │ │
  1436. 23.63 s > │ Hobbyists and students: free annual key │
  1437. 23.63 s > │ https://symbolica.io/license/#get-hobbyist-license │
  1438. 23.63 s > │ │
  1439. 23.63 s > │ Free 30-day professional trial: │
  1440. 23.63 s > │ https://symbolica.io/license/#get-trial-license │
  1441. 23.63 s > │ │
  1442. 23.63 s > └────────────────────────────────────────────────────────┘
  1443. 23.63 s > ┌──────────────────────────────────────────────────────────────────────────────────────────────────┐
  1444. 23.63 s > │ Cannot start another restricted Symbolica thread while this user's thread allowance is in use. │
  1445. 23.63 s > └──────────────────────────────────────────────────────────────────────────────────────────────────┘
  1446. 23.63 s >
  1447. 23.63 s > stderr:
  1448. 23.63 s > ┌────────────────────────────────────────────────────────┐
  1449. 23.63 s > │ The Symbolica license key format is outdated. │
  1450. 23.63 s > │ Renew your key at https://symbolica.io/license/ │
  1451. 23.63 s > └────────────────────────────────────────────────────────┘
  1452. 23.63 s > Could not acquire Symbolica thread permit: Permission denied (os error 13)
  1453. 23.63 s >
  1454. 23.63 s >
  1455. 23.63 s > Location:
  1456. 23.63 s > tests/tests/test_python_api.rs:156:20
  1457. 23.63 s > system-out
  1458. 23.63 s > running 1 test
  1459. 23.63 s > test python_settings_wrappers_expose_nested_runtime_and_global_settings ... FAILED
  1460. 23.63 s >
  1461. 23.63 s > failures:
  1462. 23.63 s >
  1463. 23.63 s > failures:
  1464. 23.63 s > python_settings_wrappers_expose_nested_runtime_and_global_settings
  1465. 23.63 s >
  1466. 23.63 s > test result: FAILED. 0 passed; 1 failed; 0 ignored; 0 measured; 4 filtered out; finished in 0.13s
  1467. 23.63 s > system-err
  1468. 23.63 s > Error: Python API test subprocess failed.
  1469. 23.63 s > stdout:
  1470. 23.63 s > ┌────────────────────────────────────────────────────────┐
  1471. 23.63 s > │ You are running a restricted Symbolica instance. │
  1472. 23.63 s > │ │
  1473. 23.63 s > │ For non-commercial use only, limited to one │
  1474. 23.63 s > │ Symbolica thread per user. │
  1475. 23.63 s > │ │
  1476. 23.63 s > ├─ Unlock all cores ─────────────────────────────────────┤
  1477. 23.63 s > │ │
  1478. 23.63 s > │ Hobbyists and students: free annual key │
  1479. 23.63 s > │ https://symbolica.io/license/#get-hobbyist-license │
  1480. 23.63 s > │ │
  1481. 23.63 s > │ Free 30-day professional trial: │
  1482. 23.63 s > │ https://symbolica.io/license/#get-trial-license │
  1483. 23.63 s > │ │
  1484. 23.63 s > └────────────────────────────────────────────────────────┘
  1485. 23.63 s > ┌──────────────────────────────────────────────────────────────────────────────────────────────────┐
  1486. 23.63 s > │ Cannot start another restricted Symbolica thread while this user's thread allowance is in use. │
  1487. 23.63 s > └──────────────────────────────────────────────────────────────────────────────────────────────────┘
  1488. 23.63 s >
  1489. 23.63 s > stderr:
  1490. 23.63 s > ┌────────────────────────────────────────────────────────┐
  1491. 23.63 s > │ The Symbolica license key format is outdated. │
  1492. 23.63 s > │ Renew your key at https://symbolica.io/license/ │
  1493. 23.63 s > └────────────────────────────────────────────────────────┘
  1494. 23.63 s > Could not acquire Symbolica thread permit: Permission denied (os error 13)
  1495. 23.63 s >
  1496. 23.63 s >
  1497. 23.63 s > Location:
  1498. 23.63 s > tests/tests/test_python_api.rs:156:20
  1499. 23.63 s >
  1500. 23.63 s > 3. gammaloop-integration-tests::test_python_api::python_session_getters_return_live_toml_and_command_blocks
  1501. 23.63 s > failure: test failure with exit code 101
  1502. 23.63 s > Error: Python API test subprocess failed.
  1503. 23.63 s > stdout:
  1504. 23.63 s > ┌────────────────────────────────────────────────────────┐
  1505. 23.63 s > │ You are running a restricted Symbolica instance. │
  1506. 23.63 s > │ │
  1507. 23.63 s > │ For non-commercial use only, limited to one │
  1508. 23.63 s > │ Symbolica thread per user. │
  1509. 23.63 s > │ │
  1510. 23.63 s > ├─ Unlock all cores ─────────────────────────────────────┤
  1511. 23.63 s > │ │
  1512. 23.63 s > │ Hobbyists and students: free annual key │
  1513. 23.63 s > │ https://symbolica.io/license/#get-hobbyist-license │
  1514. 23.63 s > │ │
  1515. 23.63 s > │ Free 30-day professional trial: │
  1516. 23.63 s > │ https://symbolica.io/license/#get-trial-license │
  1517. 23.63 s > │ │
  1518. 23.63 s > └────────────────────────────────────────────────────────┘
  1519. 23.63 s > ┌──────────────────────────────────────────────────────────────────────────────────────────────────┐
  1520. 23.63 s > │ Cannot start another restricted Symbolica thread while this user's thread allowance is in use. │
  1521. 23.63 s > └──────────────────────────────────────────────────────────────────────────────────────────────────┘
  1522. 23.63 s >
  1523. 23.63 s > stderr:
  1524. 23.63 s > ┌────────────────────────────────────────────────────────┐
  1525. 23.63 s > │ The Symbolica license key format is outdated. │
  1526. 23.63 s > │ Renew your key at https://symbolica.io/license/ │
  1527. 23.63 s > └────────────────────────────────────────────────────────┘
  1528. 23.63 s > Could not acquire Symbolica thread permit: Permission denied (os error 13)
  1529. 23.63 s >
  1530. 23.63 s >
  1531. 23.63 s > Location:
  1532. 23.63 s > tests/tests/test_python_api.rs:156:20
  1533. 23.63 s > system-out
  1534. 23.63 s > running 1 test
  1535. 23.63 s > test python_session_getters_return_live_toml_and_command_blocks ... FAILED
  1536. 23.63 s >
  1537. 23.63 s > failures:
  1538. 23.63 s >
  1539. 23.63 s > failures:
  1540. 23.63 s > python_session_getters_return_live_toml_and_command_blocks
  1541. 23.63 s >
  1542. 23.63 s > test result: FAILED. 0 passed; 1 failed; 0 ignored; 0 measured; 4 filtered out; finished in 0.13s
  1543. 23.63 s > system-err
  1544. 23.63 s > Error: Python API test subprocess failed.
  1545. 23.63 s > stdout:
  1546. 23.63 s > ┌────────────────────────────────────────────────────────┐
  1547. 23.63 s > │ You are running a restricted Symbolica instance. │
  1548. 23.63 s > │ │
  1549. 23.63 s > │ For non-commercial use only, limited to one │
  1550. 23.63 s > │ Symbolica thread per user. │
  1551. 23.63 s > │ │
  1552. 23.63 s > ├─ Unlock all cores ─────────────────────────────────────┤
  1553. 23.63 s > │ │
  1554. 23.63 s > │ Hobbyists and students: free annual key │
  1555. 23.63 s > │ https://symbolica.io/license/#get-hobbyist-license │
  1556. 23.63 s > │ │
  1557. 23.63 s > │ Free 30-day professional trial: │
  1558. 23.63 s > │ https://symbolica.io/license/#get-trial-license │
  1559. 23.63 s > │ │
  1560. 23.63 s > └────────────────────────────────────────────────────────┘
  1561. 23.63 s > ┌──────────────────────────────────────────────────────────────────────────────────────────────────┐
  1562. 23.63 s > │ Cannot start another restricted Symbolica thread while this user's thread allowance is in use. │
  1563. 23.63 s > └──────────────────────────────────────────────────────────────────────────────────────────────────┘
  1564. 23.63 s >
  1565. 23.63 s > stderr:
  1566. 23.63 s > ┌────────────────────────────────────────────────────────┐
  1567. 23.63 s > │ The Symbolica license key format is outdated. │
  1568. 23.63 s > │ Renew your key at https://symbolica.io/license/ │
  1569. 23.63 s > └────────────────────────────────────────────────────────┘
  1570. 23.63 s > Could not acquire Symbolica thread permit: Permission denied (os error 13)
  1571. 23.63 s >
  1572. 23.63 s >
  1573. 23.63 s > Location:
  1574. 23.63 s > tests/tests/test_python_api.rs:156:20
  1575. 23.63 s >
  1576. 23.63 s > 4. gammaloop-integration-tests::test_python_api::python_evaluate_sample_honors_generate_events_and_observable_snapshots
  1577. 23.63 s > failure: test failure with exit code 101
  1578. 23.63 s > Error: Python API test subprocess failed.
  1579. 23.63 s > stdout:
  1580. 23.63 s > ┌────────────────────────────────────────────────────────┐
  1581. 23.63 s > │ You are running a restricted Symbolica instance. │
  1582. 23.63 s > │ │
  1583. 23.63 s > │ For non-commercial use only, limited to one │
  1584. 23.63 s > │ Symbolica thread per user. │
  1585. 23.63 s > │ │
  1586. 23.63 s > ├─ Unlock all cores ─────────────────────────────────────┤
  1587. 23.63 s > │ │
  1588. 23.63 s > │ Hobbyists and students: free annual key │
  1589. 23.63 s > │ https://symbolica.io/license/#get-hobbyist-license │
  1590. 23.63 s > │ │
  1591. 23.63 s > │ Free 30-day professional trial: │
  1592. 23.63 s > │ https://symbolica.io/license/#get-trial-license │
  1593. 23.63 s > │ │
  1594. 23.63 s > └────────────────────────────────────────────────────────┘
  1595. 23.63 s > ┌──────────────────────────────────────────────────────────────────────────────────────────────────┐
  1596. 23.63 s > │ Cannot start another restricted Symbolica thread while this user's thread allowance is in use. │
  1597. 23.63 s > └──────────────────────────────────────────────────────────────────────────────────────────────────┘
  1598. 23.63 s >
  1599. 23.63 s > stderr:
  1600. 23.63 s > ┌────────────────────────────────────────────────────────┐
  1601. 23.63 s > │ The Symbolica license key format is outdated. │
  1602. 23.63 s > │ Renew your key at https://symbolica.io/license/ │
  1603. 23.63 s > └────────────────────────────────────────────────────────┘
  1604. 23.63 s > Could not acquire Symbolica thread permit: Permission denied (os error 13)
  1605. 23.63 s >
  1606. 23.63 s >
  1607. 23.63 s > Location:
  1608. 23.63 s > tests/tests/test_python_api.rs:156:20
  1609. 23.63 s > system-out
  1610. 23.63 s > running 1 test
  1611. 23.63 s > test python_evaluate_sample_honors_generate_events_and_observable_snapshots ... FAILED
  1612. 23.63 s >
  1613. 23.63 s > failures:
  1614. 23.63 s >
  1615. 23.63 s > failures:
  1616. 23.63 s > python_evaluate_sample_honors_generate_events_and_observable_snapshots
  1617. 23.63 s >
  1618. 23.63 s > test result: FAILED. 0 passed; 1 failed; 0 ignored; 0 measured; 4 filtered out; finished in 0.13s
  1619. 23.63 s > system-err
  1620. 23.63 s > Error: Python API test subprocess failed.
  1621. 23.63 s > stdout:
  1622. 23.63 s > ┌────────────────────────────────────────────────────────┐
  1623. 23.63 s > │ You are running a restricted Symbolica instance. │
  1624. 23.63 s > │ │
  1625. 23.63 s > │ For non-commercial use only, limited to one │
  1626. 23.63 s > │ Symbolica thread per user. │
  1627. 23.63 s > │ │
  1628. 23.63 s > ├─ Unlock all cores ─────────────────────────────────────┤
  1629. 23.63 s > │ │
  1630. 23.63 s > │ Hobbyists and students: free annual key │
  1631. 23.63 s > │ https://symbolica.io/license/#get-hobbyist-license │
  1632. 23.63 s > │ │
  1633. 23.63 s > │ Free 30-day professional trial: │
  1634. 23.63 s > │ https://symbolica.io/license/#get-trial-license │
  1635. 23.63 s > │ │
  1636. 23.63 s > └────────────────────────────────────────────────────────┘
  1637. 23.63 s > ┌──────────────────────────────────────────────────────────────────────────────────────────────────┐
  1638. 23.63 s > │ Cannot start another restricted Symbolica thread while this user's thread allowance is in use. │
  1639. 23.63 s > └──────────────────────────────────────────────────────────────────────────────────────────────────┘
  1640. 23.63 s >
  1641. 23.63 s > stderr:
  1642. 23.63 s > ┌────────────────────────────────────────────────────────┐
  1643. 23.63 s > │ The Symbolica license key format is outdated. │
  1644. 23.63 s > │ Renew your key at https://symbolica.io/license/ │
  1645. 23.63 s > └────────────────────────────────────────────────────────┘
  1646. 23.63 s > Could not acquire Symbolica thread permit: Permission denied (os error 13)
  1647. 23.63 s >
  1648. 23.63 s >
  1649. 23.63 s > Location:
  1650. 23.63 s > tests/tests/test_python_api.rs:156:20
  1651. 23.63 s >
  1652. 23.63 s > 5. gammaloop-integration-tests::test_python_api::python_evaluate_sample_preserves_graph_grouping_and_incoming_pdgs
  1653. 23.63 s > failure: test failure with exit code 101
  1654. 23.63 s > Error: Python API test subprocess failed.
  1655. 23.63 s > stdout:
  1656. 23.63 s > ┌────────────────────────────────────────────────────────┐
  1657. 23.63 s > │ You are running a restricted Symbolica instance. │
  1658. 23.63 s > │ │
  1659. 23.63 s > │ For non-commercial use only, limited to one │
  1660. 23.63 s > │ Symbolica thread per user. │
  1661. 23.63 s > │ │
  1662. 23.63 s > ├─ Unlock all cores ─────────────────────────────────────┤
  1663. 23.63 s > │ │
  1664. 23.63 s > │ Hobbyists and students: free annual key │
  1665. 23.63 s > │ https://symbolica.io/license/#get-hobbyist-license │
  1666. 23.63 s > │ │
  1667. 23.63 s > │ Free 30-day professional trial: │
  1668. 23.63 s > │ https://symbolica.io/license/#get-trial-license │
  1669. 23.63 s > │ │
  1670. 23.63 s > └────────────────────────────────────────────────────────┘
  1671. 23.63 s > ┌──────────────────────────────────────────────────────────────────────────────────────────────────┐
  1672. 23.63 s > │ Cannot start another restricted Symbolica thread while this user's thread allowance is in use. │
  1673. 23.63 s > └──────────────────────────────────────────────────────────────────────────────────────────────────┘
  1674. 23.63 s >
  1675. 23.63 s > stderr:
  1676. 23.63 s > ┌────────────────────────────────────────────────────────┐
  1677. 23.63 s > │ The Symbolica license key format is outdated. │
  1678. 23.63 s > │ Renew your key at https://symbolica.io/license/ │
  1679. 23.63 s > └────────────────────────────────────────────────────────┘
  1680. 23.63 s > Could not acquire Symbolica thread permit: Permission denied (os error 13)
  1681. 23.63 s >
  1682. 23.63 s >
  1683. 23.63 s > Location:
  1684. 23.63 s > tests/tests/test_python_api.rs:156:20
  1685. 23.63 s > system-out
  1686. 23.63 s > running 1 test
  1687. 23.63 s > test python_evaluate_sample_preserves_graph_grouping_and_incoming_pdgs ... FAILED
  1688. 23.63 s >
  1689. 23.63 s > failures:
  1690. 23.63 s >
  1691. 23.63 s > failures:
  1692. 23.63 s > python_evaluate_sample_preserves_graph_grouping_and_incoming_pdgs
  1693. 23.63 s >
  1694. 23.63 s > test result: FAILED. 0 passed; 1 failed; 0 ignored; 0 measured; 4 filtered out; finished in 0.13s
  1695. 23.63 s > system-err
  1696. 23.63 s > Error: Python API test subprocess failed.
  1697. 23.63 s > stdout:
  1698. 23.63 s > ┌────────────────────────────────────────────────────────┐
  1699. 23.63 s > │ You are running a restricted Symbolica instance. │
  1700. 23.63 s > │ │
  1701. 23.63 s > │ For non-commercial use only, limited to one │
  1702. 23.63 s > │ Symbolica thread per user. │
  1703. 23.63 s > │ │
  1704. 23.63 s > ├─ Unlock all cores ─────────────────────────────────────┤
  1705. 23.63 s > │ │
  1706. 23.63 s > │ Hobbyists and students: free annual key │
  1707. 23.63 s > │ https://symbolica.io/license/#get-hobbyist-license │
  1708. 23.63 s > │ │
  1709. 23.63 s > │ Free 30-day professional trial: │
  1710. 23.63 s > │ https://symbolica.io/license/#get-trial-license │
  1711. 23.63 s > │ │
  1712. 23.63 s > └────────────────────────────────────────────────────────┘
  1713. 23.63 s > ┌──────────────────────────────────────────────────────────────────────────────────────────────────┐
  1714. 23.63 s > │ Cannot start another restricted Symbolica thread while this user's thread allowance is in use. │
  1715. 23.63 s > └──────────────────────────────────────────────────────────────────────────────────────────────────┘
  1716. 23.63 s >
  1717. 23.63 s > stderr:
  1718. 23.63 s > ┌────────────────────────────────────────────────────────┐
  1719. 23.63 s > │ The Symbolica license key format is outdated. │
  1720. 23.63 s > │ Renew your key at https://symbolica.io/license/ │
  1721. 23.63 s > └────────────────────────────────────────────────────────┘
  1722. 23.63 s > Could not acquire Symbolica thread permit: Permission denied (os error 13)
  1723. 23.63 s >
  1724. 23.63 s >
  1725. 23.63 s > Location:
  1726. 23.63 s > tests/tests/test_python_api.rs:156:20
  1727. 23.63 s > =========================================
  1728. 23.63 s For full logs, run:
  1729. 23.63 s nix log /nix/store/0yp6rnk546sqdif2snfpaz9n62n7pczx-gammaloop-nextest-python-api.drv
  1730. 23.77 s [0 built (1 failed)]Run failed.