build packages.x86_64-linux.alphal00p-docs-cargo-artifacts

Reproduce this run
Original Run
  1. 0.00 s $ /nix/store/9ypz3flqsrl5xl495mm8h645gadjsxi1-coreutils-9.11/bin/timeout --kill-after=15s 7200s /nix/store/23zk8sgzamrbmj1fday15szf7f2279s8-nix-2.34.7/bin/nix --extra-experimental-features nix-command --extra-experimental-features flakes --log-format internal-json build --no-link --print-out-paths git+https://github.com/alphal00p/gammaloop?ref=simplify-spenso-api&rev=436f9ff52587582686db6aefd4ecd715b5693f90&shallow=1#packages.x86_64-linux.alphal00p-docs-cargo-artifacts --print-build-logs
  2. 2.27 s
  3. 2.67 s Building /nix/store/25hrbpahaiadf5lrxdqibcnq2kvhmvqg-alphal00p-docs-cargo-0.1.0.drv
  4. 2.72 s [alphal00p-docs-cargo] cargoArtifacts not set, will not reuse any cargo artifacts
  5. 2.76 s [alphal00p-docs-cargo] Phase: unpackPhase
  6. 2.76 s [alphal00p-docs-cargo] unpacking source archive /nix/store/jldj3zljswf5fawkzgiqar8jvghjs6cb-source
  7. 2.84 s [alphal00p-docs-cargo] source root is source
  8. 2.87 s [alphal00p-docs-cargo] Phase: patchPhase
  9. 2.88 s [alphal00p-docs-cargo] Executing configureCargoCommonVars
  10. 2.89 s [alphal00p-docs-cargo] Phase: updateAutotoolsGnuConfigScriptsPhase
  11. 2.90 s [alphal00p-docs-cargo] Phase: configurePhase
  12. 2.90 s [alphal00p-docs-cargo] will append /build/source/.cargo-home/config.toml with contents of /nix/store/9rqk4093qnvgswmdk1pbxk9najcrjn7a-vendor-cargo-deps/config.toml
  13. 2.91 s [alphal00p-docs-cargo] default configurePhase, nothing to do
  14. 2.91 s [alphal00p-docs-cargo] Phase: buildPhase
  15. 2.91 s [alphal00p-docs-cargo] +++ command cargo --version
  16. 2.92 s [alphal00p-docs-cargo] cargo 1.98.1 (797e8a9bc 2026-08-05)
  17. 2.92 s [alphal00p-docs-cargo] +++ command cargo build --profile docs --locked -p alphal00p-docs-catalogs --bin alphal00p-docs-catalogs
  18. 3.50 s [alphal00p-docs-cargo] Compiling proc-macro2 v1.0.106
  19. 3.50 s [alphal00p-docs-cargo] Compiling unicode-ident v1.0.24
  20. 3.50 s [alphal00p-docs-cargo] Compiling quote v1.0.45
  21. 3.50 s [alphal00p-docs-cargo] Compiling serde_core v1.0.228
  22. 3.50 s [alphal00p-docs-cargo] Compiling memchr v2.8.0
  23. 3.50 s [alphal00p-docs-cargo] Compiling zmij v1.0.21
  24. 3.50 s [alphal00p-docs-cargo] Compiling utf8parse v0.2.2
  25. 3.50 s [alphal00p-docs-cargo] Compiling serde v1.0.228
  26. 3.52 s [alphal00p-docs-cargo] Compiling serde_json v1.0.149
  27. 3.53 s [alphal00p-docs-cargo] Compiling thiserror v2.0.18
  28. 3.54 s [alphal00p-docs-cargo] Compiling anstyle-query v1.1.5
  29. 3.55 s [alphal00p-docs-cargo] Compiling colorchoice v1.0.5
  30. 3.55 s [alphal00p-docs-cargo] Compiling is_terminal_polyfill v1.70.2
  31. 3.56 s [alphal00p-docs-cargo] Compiling anstyle v1.0.14
  32. 3.56 s [alphal00p-docs-cargo] Compiling equivalent v1.0.2
  33. 3.56 s [alphal00p-docs-cargo] Compiling hashbrown v0.17.1
  34. 3.61 s [alphal00p-docs-cargo] Compiling anstyle-parse v1.0.0
  35. 3.63 s [alphal00p-docs-cargo] Compiling clap_lex v1.1.0
  36. 3.64 s [alphal00p-docs-cargo] Compiling eyre v0.6.12
  37. 3.66 s [alphal00p-docs-cargo] Compiling heck v0.5.0
  38. 3.67 s [alphal00p-docs-cargo] Compiling itoa v1.0.18
  39. 3.71 s [alphal00p-docs-cargo] Compiling strsim v0.11.1
  40. 3.83 s [alphal00p-docs-cargo] Compiling regex-syntax v0.8.10
  41. 3.89 s [alphal00p-docs-cargo] Compiling anstream v1.0.0
  42. 3.91 s [alphal00p-docs-cargo] Compiling indenter v0.3.4
  43. 3.92 s [alphal00p-docs-cargo] Compiling once_cell v1.21.4
  44. 4.17 s [alphal00p-docs-cargo] Compiling clap_builder v4.6.0
  45. 4.23 s [alphal00p-docs-cargo] Compiling aho-corasick v1.1.4
  46. 4.71 s [alphal00p-docs-cargo] Compiling syn v2.0.117
  47. 5.47 s [alphal00p-docs-cargo] Compiling regex-automata v0.4.14
  48. 6.03 s [alphal00p-docs-cargo] Compiling indexmap v2.14.0
  49. 7.40 s [alphal00p-docs-cargo] Compiling thiserror-impl v2.0.18
  50. 7.40 s [alphal00p-docs-cargo] Compiling serde_derive v1.0.228
  51. 7.40 s [alphal00p-docs-cargo] Compiling clap_derive v4.6.1
  52. 7.40 s [alphal00p-docs-cargo] Compiling alphal00p-docs-macros v0.1.0 (/build/source/crates/alphal00p-docs-macros)
  53. 7.63 s [alphal00p-docs-cargo] Compiling regex v1.12.3
  54. 9.09 s [alphal00p-docs-cargo] Compiling clap v4.6.1
  55. 10.19 s [alphal00p-docs-cargo] Compiling alphal00p-docs-schema v0.1.0 (/build/source/crates/alphal00p-docs-schema)
  56. 11.03 s [alphal00p-docs-cargo] Compiling alphal00p-docs-catalogs v0.1.0 (/build/source/crates/alphal00p-docs-catalogs)
  57. 18.12 s [alphal00p-docs-cargo] Finished `docs` profile [unoptimized] target(s) in 15.19s
  58. 18.20 s [alphal00p-docs-cargo] +++ command cargo build --profile docs --locked -p alphal00p-docs-python-exporter --features gammaloop
  59. 18.84 s [alphal00p-docs-cargo] Compiling serde_core v1.0.228
  60. 18.84 s [alphal00p-docs-cargo] Compiling libc v0.2.186
  61. 18.84 s [alphal00p-docs-cargo] Compiling cfg-if v1.0.4
  62. 18.84 s [alphal00p-docs-cargo] Compiling serde v1.0.228
  63. 18.84 s [alphal00p-docs-cargo] Compiling memchr v2.8.0
  64. 18.84 s [alphal00p-docs-cargo] Compiling autocfg v1.5.0
  65. 18.84 s [alphal00p-docs-cargo] Compiling version_check v0.9.5
  66. 18.84 s [alphal00p-docs-cargo] Compiling libm v0.2.16
  67. 18.85 s [alphal00p-docs-cargo] Compiling either v1.15.0
  68. 18.87 s [alphal00p-docs-cargo] Compiling zerocopy v0.8.48
  69. 18.88 s [alphal00p-docs-cargo] Compiling crossbeam-utils v0.8.21
  70. 18.88 s [alphal00p-docs-cargo] Compiling log v0.4.29
  71. 18.90 s [alphal00p-docs-cargo] Compiling rayon-core v1.13.0
  72. 18.90 s [alphal00p-docs-cargo] Compiling unicode-width v0.2.2
  73. 18.90 s [alphal00p-docs-cargo] Compiling foldhash v0.2.0
  74. 18.90 s [alphal00p-docs-cargo] Compiling syn v2.0.117
  75. 18.91 s [alphal00p-docs-cargo] Compiling syn v3.0.4
  76. 19.04 s [alphal00p-docs-cargo] Compiling serde_json v1.0.149
  77. 19.07 s [alphal00p-docs-cargo] Compiling lazy_static v1.5.0
  78. 19.09 s [alphal00p-docs-cargo] Compiling paste v1.0.15
  79. 19.14 s [alphal00p-docs-cargo] Compiling getrandom v0.3.4
  80. 19.17 s [alphal00p-docs-cargo] Compiling siphasher v1.0.2
  81. 19.19 s [alphal00p-docs-cargo] Compiling anyhow v1.0.102
  82. 19.25 s [alphal00p-docs-cargo] Compiling itertools v0.14.0
  83. 19.25 s [alphal00p-docs-cargo] Compiling num-traits v0.2.19
  84. 19.25 s [alphal00p-docs-cargo] Compiling num-conv v0.2.1
  85. 19.35 s [alphal00p-docs-cargo] Compiling rustix v1.1.4
  86. 19.35 s [alphal00p-docs-cargo] Compiling powerfmt v0.2.0
  87. 19.39 s [alphal00p-docs-cargo] Compiling crunchy v0.2.4
  88. 19.41 s [alphal00p-docs-cargo] Compiling static_assertions v1.1.0
  89. 19.45 s [alphal00p-docs-cargo] Compiling aho-corasick v1.1.4
  90. 19.55 s [alphal00p-docs-cargo] Compiling time-core v0.1.8
  91. 19.57 s [alphal00p-docs-cargo] Compiling deranged v0.5.8
  92. 19.65 s [alphal00p-docs-cargo] Compiling tiny-keccak v2.0.2
  93. 19.68 s [alphal00p-docs-cargo] Compiling linux-raw-sys v0.12.1
  94. 19.68 s [alphal00p-docs-cargo] Compiling time-macros v0.2.27
  95. 19.77 s [alphal00p-docs-cargo] Compiling crossbeam-epoch v0.9.18
  96. 19.86 s [alphal00p-docs-cargo] Compiling allocator-api2 v0.2.21
  97. 19.88 s [alphal00p-docs-cargo] Compiling num_threads v0.1.7
  98. 19.97 s [alphal00p-docs-cargo] Compiling tracing-core v0.1.36
  99. 19.98 s [alphal00p-docs-cargo] Compiling target-lexicon v0.13.5
  100. 19.99 s [alphal00p-docs-cargo] Compiling arrayvec v0.7.6
  101. 20.07 s [alphal00p-docs-cargo] Compiling crossbeam-deque v0.8.6
  102. 20.09 s [alphal00p-docs-cargo] Compiling virtue v0.0.18
  103. 20.19 s [alphal00p-docs-cargo] Compiling hashbrown v0.16.1
  104. 20.21 s [alphal00p-docs-cargo] Compiling unty v0.0.4
  105. 20.29 s [alphal00p-docs-cargo] Compiling gmp-mpfr-sys v1.7.1
  106. 20.30 s [alphal00p-docs-cargo] Compiling winnow v1.0.2
  107. 20.64 s [alphal00p-docs-cargo] Compiling regex-automata v0.4.14
  108. 20.79 s [alphal00p-docs-cargo] Compiling rayon v1.12.0
  109. 20.89 s [alphal00p-docs-cargo] Compiling bincode_derive v2.0.1
  110. 20.91 s [alphal00p-docs-cargo] Compiling nu-ansi-term v0.50.3
  111. 20.92 s [alphal00p-docs-cargo] Compiling pin-project-lite v0.2.17
  112. 20.93 s [alphal00p-docs-cargo] Compiling toml_writer v1.1.1+spec-1.1.0
  113. 20.94 s [alphal00p-docs-cargo] Compiling pyo3-build-config v0.28.3
  114. 20.96 s [alphal00p-docs-cargo] Compiling tracing-log v0.2.0
  115. 20.97 s [alphal00p-docs-cargo] Compiling sharded-slab v0.1.7
  116. 21.12 s [alphal00p-docs-cargo] Compiling thread_local v1.1.9
  117. 21.15 s [alphal00p-docs-cargo] Compiling option-ext v0.2.0
  118. 21.19 s [alphal00p-docs-cargo] Compiling rug v1.30.0
  119. 21.24 s [alphal00p-docs-cargo] Compiling getrandom v0.2.17
  120. 21.30 s [alphal00p-docs-cargo] Compiling time v0.3.47
  121. 21.42 s [alphal00p-docs-cargo] Compiling num-integer v0.1.46
  122. 21.44 s [alphal00p-docs-cargo] Compiling approx v0.5.1
  123. 21.47 s [alphal00p-docs-cargo] Compiling rand_core v0.9.5
  124. 21.49 s [alphal00p-docs-cargo] Compiling rand_core v0.6.4
  125. 21.52 s [alphal00p-docs-cargo] Compiling syn v1.0.109
  126. 21.56 s [alphal00p-docs-cargo] Compiling typenum v1.20.0
  127. 21.57 s [alphal00p-docs-cargo] Compiling dirs-sys v0.5.0
  128. 21.64 s [alphal00p-docs-cargo] Compiling toml_parser v1.1.2+spec-1.1.0
  129. 21.70 s [alphal00p-docs-cargo] Compiling hashbrown v0.17.1
  130. 21.72 s [alphal00p-docs-cargo] Compiling fnv v1.0.7
  131. 21.73 s [alphal00p-docs-cargo] Compiling alloc-no-stdlib v2.0.4
  132. 21.75 s [alphal00p-docs-cargo] Compiling az v1.3.0
  133. 21.78 s [alphal00p-docs-cargo] Compiling dyn-clone v1.0.20
  134. 21.79 s [alphal00p-docs-cargo] Compiling generic-array v0.14.7
  135. 21.81 s [alphal00p-docs-cargo] Compiling bitflags v2.11.1
  136. 21.84 s [alphal00p-docs-cargo] Compiling serde_spanned v1.1.1
  137. 21.92 s [alphal00p-docs-cargo] Compiling toml_datetime v1.1.1+spec-1.1.0
  138. 22.05 s [alphal00p-docs-cargo] Compiling alloc-stdlib v0.2.2
  139. 22.15 s [alphal00p-docs-cargo] Compiling colored v3.1.1
  140. 22.22 s [alphal00p-docs-cargo] Compiling bitflags v1.3.2
  141. 22.30 s [alphal00p-docs-cargo] Compiling num-bigint v0.4.6
  142. 22.32 s [alphal00p-docs-cargo] Compiling errno v0.3.14
  143. 22.33 s [alphal00p-docs-cargo] Compiling bytemuck_derive v1.12.0
  144. 22.41 s [alphal00p-docs-cargo] Compiling matrixmultiply v0.3.10
  145. 22.43 s [alphal00p-docs-cargo] Compiling same-file v1.0.6
  146. 22.51 s [alphal00p-docs-cargo] Compiling ident_case v1.0.1
  147. 22.55 s [alphal00p-docs-cargo] Compiling parking_lot_core v0.9.12
  148. 22.62 s [alphal00p-docs-cargo] Compiling signal-hook v0.3.18
  149. 22.69 s [alphal00p-docs-cargo] Compiling walkdir v2.5.0
  150. 22.88 s [alphal00p-docs-cargo] Compiling signal-hook-registry v1.4.8
  151. 22.89 s [alphal00p-docs-cargo] Compiling region v3.0.2
  152. 22.91 s [alphal00p-docs-cargo] Compiling toml v1.1.2+spec-1.1.0
  153. 22.96 s [alphal00p-docs-cargo] Compiling const-random-macro v0.1.16
  154. 23.02 s [alphal00p-docs-cargo] Compiling num-complex v0.4.6
  155. 23.11 s [alphal00p-docs-cargo] Compiling wasmtime-jit-icache-coherence v34.0.2
  156. 23.16 s [alphal00p-docs-cargo] Compiling indexmap v2.14.0
  157. 23.17 s [alphal00p-docs-cargo] Compiling hugepage-rs v0.1.1
  158. 23.20 s [alphal00p-docs-cargo] Compiling vte v0.14.1
  159. 23.26 s [alphal00p-docs-cargo] Compiling smartstring v1.0.1
  160. 23.32 s [alphal00p-docs-cargo] Compiling ahash v0.8.12
  161. 23.35 s [alphal00p-docs-cargo] Compiling synstructure v0.13.2
  162. 23.38 s [alphal00p-docs-cargo] Compiling spec_math v0.1.6
  163. 23.41 s [alphal00p-docs-cargo] Compiling rawpointer v0.2.1
  164. 23.47 s [alphal00p-docs-cargo] Compiling scopeguard v1.2.0
  165. 23.52 s [alphal00p-docs-cargo] Compiling lock_api v0.4.14
  166. 23.63 s [alphal00p-docs-cargo] Compiling const-random v0.1.18
  167. 23.69 s [alphal00p-docs-cargo] Compiling brotli-decompressor v5.0.0
  168. 23.70 s [alphal00p-docs-cargo] Compiling mio v1.2.0
  169. 23.88 s [alphal00p-docs-cargo] Compiling bytemuck v1.25.0
  170. 23.92 s [alphal00p-docs-cargo] Compiling rustix v0.38.44
  171. 23.93 s [alphal00p-docs-cargo] Compiling unicase v2.9.0
  172. 23.94 s [alphal00p-docs-cargo] Compiling indenter v0.3.4
  173. 23.95 s [alphal00p-docs-cargo] Compiling inventory v0.3.24
  174. 24.02 s [alphal00p-docs-cargo] Compiling minimal-lexical v0.2.1
  175. 24.02 s [alphal00p-docs-cargo] Compiling fastrand v2.4.1
  176. 24.09 s [alphal00p-docs-cargo] Compiling matchers v0.2.0
  177. 24.17 s [alphal00p-docs-cargo] Compiling safe_arch v0.7.4
  178. 24.17 s [alphal00p-docs-cargo] Compiling safe_arch v1.2.0
  179. 24.20 s [alphal00p-docs-cargo] Compiling regex v1.12.3
  180. 24.21 s [alphal00p-docs-cargo] Compiling terminal_size v0.4.4
  181. 24.21 s [alphal00p-docs-cargo] Compiling signal-hook-mio v0.2.5
  182. 24.23 s [alphal00p-docs-cargo] Compiling nom v7.1.3
  183. 24.23 s [alphal00p-docs-cargo] Compiling block-buffer v0.10.4
  184. 24.27 s [alphal00p-docs-cargo] Compiling crypto-common v0.1.7
  185. 24.33 s [alphal00p-docs-cargo] Compiling clap_builder v4.6.0
  186. 24.33 s [alphal00p-docs-cargo] Compiling directories v6.0.0
  187. 24.35 s [alphal00p-docs-cargo] Compiling libloading v0.9.0
  188. 24.36 s [alphal00p-docs-cargo] Compiling iana-time-zone v0.1.65
  189. 24.39 s [alphal00p-docs-cargo] Compiling self_cell v1.2.2
  190. 24.42 s [alphal00p-docs-cargo] Compiling append-only-vec v0.1.8
  191. 24.46 s [alphal00p-docs-cargo] Compiling tinyjson v2.5.1
  192. 24.52 s [alphal00p-docs-cargo] Compiling data-encoding v2.11.1
  193. 24.53 s [alphal00p-docs-cargo] Compiling ed25519-compact v2.4.2
  194. 24.54 s [alphal00p-docs-cargo] Compiling wide v0.7.33
  195. 24.55 s [alphal00p-docs-cargo] Compiling byteorder v1.5.0
  196. 24.59 s [alphal00p-docs-cargo] Compiling bytes v1.11.1
  197. 24.61 s [alphal00p-docs-cargo] Compiling wide v1.7.0
  198. 24.68 s [alphal00p-docs-cargo] Compiling brotli v8.0.2
  199. 24.69 s [alphal00p-docs-cargo] Compiling linux-raw-sys v0.4.15
  200. 24.79 s [alphal00p-docs-cargo] Compiling winnow v0.7.15
  201. 24.80 s [alphal00p-docs-cargo] Compiling unicode-segmentation v1.13.2
  202. 24.89 s [alphal00p-docs-cargo] Compiling digest v0.10.7
  203. 25.12 s [alphal00p-docs-cargo] Compiling bstr v1.12.1
  204. 25.13 s [alphal00p-docs-cargo] Compiling phf_shared v0.13.1
  205. 25.17 s [alphal00p-docs-cargo] Compiling serde_derive v1.0.228
  206. 25.26 s [alphal00p-docs-cargo] Compiling zerocopy-derive v0.8.48
  207. 25.28 s [alphal00p-docs-cargo] Compiling tracing-attributes v0.1.31
  208. 25.29 s [alphal00p-docs-cargo] Compiling thiserror-impl v2.0.18
  209. 25.39 s [alphal00p-docs-cargo] Compiling strum_macros v0.27.2
  210. 25.63 s [alphal00p-docs-cargo] Compiling clap_derive v4.6.1
  211. 25.89 s [alphal00p-docs-cargo] Compiling zerofrom-derive v0.1.7
  212. 26.05 s [alphal00p-docs-cargo] Compiling ansitok v0.3.0
  213. 26.13 s [alphal00p-docs-cargo] Compiling yoke-derive v0.8.2
  214. 26.41 s [alphal00p-docs-cargo] Compiling simba v0.9.1
  215. 26.74 s [alphal00p-docs-cargo] Compiling phf_shared v0.11.3
  216. 26.91 s [alphal00p-docs-cargo] Compiling typeid v1.0.3
  217. 26.93 s [alphal00p-docs-cargo] Compiling cpufeatures v0.2.17
  218. 26.99 s [alphal00p-docs-cargo] Compiling getrandom v0.4.2
  219. 27.04 s [alphal00p-docs-cargo] Compiling thiserror v2.0.18
  220. 27.06 s [alphal00p-docs-cargo] Compiling plotters-backend v0.3.7
  221. 27.10 s [alphal00p-docs-cargo] Compiling stable_deref_trait v1.2.1
  222. 27.16 s [alphal00p-docs-cargo] Compiling ciborium-io v0.2.2
  223. 27.21 s [alphal00p-docs-cargo] Compiling sha2 v0.10.9
  224. 27.23 s [alphal00p-docs-cargo] Compiling tracing v0.1.44
  225. 27.27 s [alphal00p-docs-cargo] Compiling globset v0.4.18
  226. 27.33 s [alphal00p-docs-cargo] Compiling plotters-svg v0.3.7
  227. 27.34 s [alphal00p-docs-cargo] Compiling num-rational v0.4.2
  228. 27.44 s [alphal00p-docs-cargo] Compiling zerovec-derive v0.11.6
  229. 27.50 s [alphal00p-docs-cargo] Compiling console v0.16.3
  230. 27.61 s [alphal00p-docs-cargo] Compiling zerofrom v0.1.8
  231. 27.65 s [alphal00p-docs-cargo] Compiling itertools v0.10.5
  232. 27.71 s [alphal00p-docs-cargo] Compiling toml_write v0.1.2
  233. 27.74 s [alphal00p-docs-cargo] Compiling yoke v0.8.3
  234. 27.88 s [alphal00p-docs-cargo] Compiling ucd-trie v0.1.7
  235. 27.94 s [alphal00p-docs-cargo] Compiling adler2 v2.0.1
  236. 28.01 s [alphal00p-docs-cargo] Compiling cast v0.3.0
  237. 28.02 s [alphal00p-docs-cargo] Compiling simd-adler32 v0.3.10
  238. 28.04 s [alphal00p-docs-cargo] Compiling symbolica v2.2.0 (https://github.com/symbolica-dev/symbolica?rev=4f1323185fe5e0c0f8c864ab89edd1905e7adef1#4f132318)
  239. 28.11 s [alphal00p-docs-cargo] Compiling rustversion v1.0.22
  240. 28.12 s [alphal00p-docs-cargo] Compiling pest v2.8.6
  241. 28.17 s [alphal00p-docs-cargo] Compiling rust-embed-utils v8.11.0
  242. 28.20 s [alphal00p-docs-cargo] Compiling miniz_oxide v0.8.9
  243. 28.22 s [alphal00p-docs-cargo] Compiling strum v0.27.2
  244. 28.24 s [alphal00p-docs-cargo] Compiling clap v4.6.1
  245. 28.25 s [alphal00p-docs-cargo] Compiling plotters v0.3.7
  246. 28.39 s [alphal00p-docs-cargo] Compiling ansi-str v0.9.0
  247. 28.41 s [alphal00p-docs-cargo] Compiling displaydoc v0.2.7
  248. 28.47 s [alphal00p-docs-cargo] Compiling is-terminal v0.4.17
  249. 28.51 s [alphal00p-docs-cargo] Compiling slotmap v1.1.1
  250. 28.54 s [alphal00p-docs-cargo] Compiling bytecount v0.6.9
  251. 28.63 s [alphal00p-docs-cargo] Compiling anes v0.1.6
  252. 28.74 s [alphal00p-docs-cargo] Compiling oorandom v11.1.5
  253. 28.78 s [alphal00p-docs-cargo] Compiling papergrid v0.18.0
  254. 28.86 s [alphal00p-docs-cargo] Compiling tempfile v3.27.0
  255. 28.90 s [alphal00p-docs-cargo] Compiling eyre v0.6.12
  256. 28.93 s [alphal00p-docs-cargo] Compiling criterion-plot v0.5.0
  257. 28.96 s [alphal00p-docs-cargo] Compiling testing_table v0.3.0
  258. 28.99 s [alphal00p-docs-cargo] Compiling tabled_derive v0.12.0
  259. 29.11 s [alphal00p-docs-cargo] Compiling toml_edit v0.25.11+spec-1.1.0
  260. 29.15 s [alphal00p-docs-cargo] Compiling similar v2.7.0
  261. 29.22 s [alphal00p-docs-cargo] Compiling proc-macro2-diagnostics v0.10.1
  262. 29.26 s [alphal00p-docs-cargo] Compiling uncased v0.9.10
  263. 29.36 s [alphal00p-docs-cargo] Compiling proc-macro-error-attr v1.0.4
  264. 29.42 s [alphal00p-docs-cargo] Compiling strsim v0.10.0
  265. 29.50 s [alphal00p-docs-cargo] Compiling slab v0.4.12
  266. 29.55 s [alphal00p-docs-cargo] Compiling pest_meta v2.8.6
  267. 29.59 s [alphal00p-docs-cargo] Compiling radium v0.7.0
  268. 29.60 s [alphal00p-docs-cargo] Compiling darling_core v0.14.4
  269. 29.73 s [alphal00p-docs-cargo] Compiling darling_core v0.23.0
  270. 29.74 s [alphal00p-docs-cargo] Compiling pyo3-ffi v0.28.3
  271. 29.76 s [alphal00p-docs-cargo] Compiling pyo3-macros-backend v0.28.3
  272. 29.77 s [alphal00p-docs-cargo] Compiling proc-macro-error v1.0.4
  273. 29.92 s [alphal00p-docs-cargo] Compiling figment v0.10.19
  274. 30.06 s [alphal00p-docs-cargo] Compiling getopts v0.2.24
  275. 30.07 s [alphal00p-docs-cargo] Compiling ryu v1.0.23
  276. 30.08 s [alphal00p-docs-cargo] Compiling tap v1.0.1
  277. 30.18 s [alphal00p-docs-cargo] Compiling smallvec v1.15.1
  278. 30.19 s [alphal00p-docs-cargo] Compiling bincode v2.0.1
  279. 30.21 s [alphal00p-docs-cargo] Compiling tracing-serde v0.2.0
  280. 30.40 s [alphal00p-docs-cargo] Compiling tracing-subscriber v0.3.23
  281. 30.59 s [alphal00p-docs-cargo] Compiling chrono v0.4.44
  282. 30.60 s [alphal00p-docs-cargo] Compiling toml_datetime v0.6.11
  283. 30.71 s [alphal00p-docs-cargo] Compiling parking_lot v0.12.5
  284. 30.76 s [alphal00p-docs-cargo] Compiling serde_spanned v0.6.9
  285. 30.86 s [alphal00p-docs-cargo] Compiling toml_edit v0.22.27
  286. 30.87 s [alphal00p-docs-cargo] Compiling tinytemplate v1.2.1
  287. 30.87 s [alphal00p-docs-cargo] Compiling zerovec v0.11.8
  288. 31.10 s [alphal00p-docs-cargo] Compiling crossterm v0.28.1
  289. 31.26 s [alphal00p-docs-cargo] Compiling xprec v0.2.2
  290. 31.26 s [alphal00p-docs-cargo] Compiling bincode-trait-derive v0.1.1
  291. 31.37 s [alphal00p-docs-cargo] Compiling ron v0.12.1
  292. 31.49 s [alphal00p-docs-cargo] Compiling tabled v0.22.0
  293. 31.85 s [alphal00p-docs-cargo] Compiling ppv-lite86 v0.2.21
  294. 32.07 s [alphal00p-docs-cargo] Compiling half v2.7.1
  295. 32.11 s [alphal00p-docs-cargo] Compiling pest_generator v2.8.6
  296. 32.16 s [alphal00p-docs-cargo] Compiling tinystr v0.8.4
  297. 32.21 s [alphal00p-docs-cargo] Compiling rand_chacha v0.3.1
  298. 32.23 s [alphal00p-docs-cargo] Compiling rand_chacha v0.9.0
  299. 32.37 s [alphal00p-docs-cargo] Compiling ciborium-ll v0.2.2
  300. 32.43 s [alphal00p-docs-cargo] Compiling rand v0.8.6
  301. 32.46 s [alphal00p-docs-cargo] Compiling rand v0.9.4
  302. 32.56 s [alphal00p-docs-cargo] Compiling ciborium v0.2.2
  303. 32.62 s [alphal00p-docs-cargo] Compiling insta v1.47.2
  304. 32.63 s [alphal00p-docs-cargo] Compiling unic-langid-impl v0.9.6
  305. 32.69 s [alphal00p-docs-cargo] Compiling darling_macro v0.14.4
  306. 32.74 s [alphal00p-docs-cargo] Compiling darling_macro v0.23.0
  307. 32.81 s [alphal00p-docs-cargo] Compiling wyz v0.5.1
  308. 32.89 s [alphal00p-docs-cargo] Compiling toml v0.8.23
  309. 32.96 s [alphal00p-docs-cargo] Compiling pest_derive v2.8.6
  310. 33.03 s [alphal00p-docs-cargo] Compiling symjit v2.25.6
  311. 33.08 s [alphal00p-docs-cargo] Compiling phf_generator v0.11.3
  312. 33.12 s [alphal00p-docs-cargo] Compiling criterion v0.5.1
  313. 33.22 s [alphal00p-docs-cargo] Compiling phf_codegen v0.11.3
  314. 33.32 s [alphal00p-docs-cargo] Compiling unicode_names2_generator v1.3.0
  315. 33.34 s [alphal00p-docs-cargo] Compiling castaway v0.2.4
  316. 33.35 s [alphal00p-docs-cargo] Compiling unic-common v0.9.0
  317. 33.41 s [alphal00p-docs-cargo] Compiling instability v0.3.12
  318. 33.44 s [alphal00p-docs-cargo] Compiling indoc v2.0.7
  319. 33.48 s [alphal00p-docs-cargo] Compiling shlex v1.3.0
  320. 33.51 s [alphal00p-docs-cargo] Compiling funty v2.0.0
  321. 33.55 s [alphal00p-docs-cargo] Compiling find-msvc-tools v0.1.9
  322. 33.58 s [alphal00p-docs-cargo] Compiling unic-char-range v0.9.0
  323. 33.64 s [alphal00p-docs-cargo] Compiling heck v0.4.1
  324. 33.67 s [alphal00p-docs-cargo] Compiling unic-char-property v0.9.0
  325. 33.71 s [alphal00p-docs-cargo] Compiling cc v1.2.61
  326. 33.75 s [alphal00p-docs-cargo] Compiling dot-parser v0.5.1
  327. 33.77 s [alphal00p-docs-cargo] Compiling darling v0.23.0
  328. 33.83 s [alphal00p-docs-cargo] Compiling darling v0.14.4
  329. 33.83 s [alphal00p-docs-cargo] Compiling compact_str v0.9.0
  330. 33.87 s [alphal00p-docs-cargo] Compiling unic-ucd-version v0.9.0
  331. 33.91 s [alphal00p-docs-cargo] Compiling duplicate v2.0.1
  332. 33.98 s [alphal00p-docs-cargo] Compiling unicode_names2 v1.3.0
  333. 33.99 s [alphal00p-docs-cargo] Compiling bitvec v1.0.1
  334. 34.17 s [alphal00p-docs-cargo] Compiling kasuari v0.4.12
  335. 34.37 s [alphal00p-docs-cargo] Compiling convert_case v0.10.0
  336. 34.41 s [alphal00p-docs-cargo] Compiling unicode-truncate v2.0.1
  337. 34.52 s [alphal00p-docs-cargo] Compiling serde_repr v0.1.20
  338. 34.56 s [alphal00p-docs-cargo] Compiling is-macro v0.3.7
  339. 34.64 s [alphal00p-docs-cargo] Compiling env_filter v1.0.1
  340. 34.65 s [alphal00p-docs-cargo] Compiling pyo3 v0.28.3
  341. 34.90 s [alphal00p-docs-cargo] Compiling num-iter v0.1.45
  342. 34.93 s [alphal00p-docs-cargo] Compiling lru v0.16.4
  343. 35.00 s [alphal00p-docs-cargo] Compiling rustpython-parser-vendored v0.4.0
  344. 35.01 s [alphal00p-docs-cargo] Compiling itertools v0.11.0
  345. 35.04 s [alphal00p-docs-cargo] Compiling jiff v0.2.24
  346. 35.11 s [alphal00p-docs-cargo] Compiling ref-ops v0.2.5
  347. 35.14 s [alphal00p-docs-cargo] Compiling convert_case v0.4.0
  348. 35.15 s [alphal00p-docs-cargo] Compiling blake3 v1.8.5
  349. 35.22 s [alphal00p-docs-cargo] Compiling ratatui-core v0.1.0
  350. 35.29 s [alphal00p-docs-cargo] Compiling num v0.4.3
  351. 35.32 s [alphal00p-docs-cargo] Compiling derive_more-impl v2.1.1
  352. 35.37 s [alphal00p-docs-cargo] Compiling duplicate v1.0.0
  353. 35.55 s [alphal00p-docs-cargo] Compiling rustpython-parser-core v0.4.0
  354. 35.64 s [alphal00p-docs-cargo] Compiling derive_more v0.99.20
  355. 35.71 s [alphal00p-docs-cargo] Compiling derive_builder_core v0.11.2
  356. 35.75 s [alphal00p-docs-cargo] Compiling enum-try-as-inner v0.1.1
  357. 36.45 s [alphal00p-docs-cargo] Compiling rustpython-parser v0.4.0
  358. 36.48 s [alphal00p-docs-cargo] Compiling phf v0.11.3
  359. 36.51 s [alphal00p-docs-cargo] Compiling delegate v0.12.0
  360. 36.59 s [alphal00p-docs-cargo] Compiling rand_xoshiro v0.6.0
  361. 36.60 s [alphal00p-docs-cargo] Compiling features v0.10.0
  362. 36.63 s [alphal00p-docs-cargo] Compiling colored v2.2.0
  363. 36.65 s [alphal00p-docs-cargo] Compiling litrs v1.0.0
  364. 36.65 s [alphal00p-docs-cargo] Compiling portable-atomic v1.13.1
  365. 36.88 s [alphal00p-docs-cargo] Compiling object v0.37.3
  366. 36.90 s [alphal00p-docs-cargo] Compiling constcat v0.5.1
  367. 36.91 s [alphal00p-docs-cargo] Compiling owo-colors v4.3.0
  368. 36.95 s [alphal00p-docs-cargo] Compiling thiserror v1.0.69
  369. 36.96 s [alphal00p-docs-cargo] Compiling gat-lending-iterator v0.1.8
  370. 36.97 s [alphal00p-docs-cargo] Compiling cfg_aliases v0.2.1
  371. 37.01 s [alphal00p-docs-cargo] Compiling nix v0.31.2
  372. 37.16 s [alphal00p-docs-cargo] Compiling document-features v0.2.12
  373. 37.18 s [alphal00p-docs-cargo] Compiling derive_builder_macro v0.11.2
  374. 37.19 s [alphal00p-docs-cargo] Compiling derive_more v2.1.1
  375. 37.21 s [alphal00p-docs-cargo] Compiling rustpython-ast v0.4.0
  376. 37.27 s [alphal00p-docs-cargo] Compiling unic-ucd-ident v0.9.0
  377. 37.34 s [alphal00p-docs-cargo] Compiling unic-emoji-char v0.9.0
  378. 37.42 s [alphal00p-docs-cargo] Compiling rand_distr v0.4.3
  379. 37.46 s [alphal00p-docs-cargo] Compiling simba v0.6.0
  380. 37.48 s [alphal00p-docs-cargo] Compiling nalgebra-macros v0.1.0
  381. 37.63 s [alphal00p-docs-cargo] Compiling phf_generator v0.13.1
  382. 37.78 s [alphal00p-docs-cargo] Compiling thiserror-impl v1.0.69
  383. 37.79 s [alphal00p-docs-cargo] Compiling numpy v0.28.0
  384. 37.81 s [alphal00p-docs-cargo] Compiling line-clipping v0.3.7
  385. 37.81 s [alphal00p-docs-cargo] Compiling dirs v6.0.0
  386. 37.88 s [alphal00p-docs-cargo] Compiling vte v0.15.0
  387. 37.91 s [alphal00p-docs-cargo] Compiling color-spantrace v0.3.0
  388. 37.99 s [alphal00p-docs-cargo] Compiling rustc-hash v2.1.2
  389. 38.00 s [alphal00p-docs-cargo] Compiling gimli v0.32.3
  390. 38.03 s [alphal00p-docs-cargo] Compiling joinery v2.1.0
  391. 38.09 s [alphal00p-docs-cargo] Compiling lalrpop-util v0.20.2
  392. 38.10 s [alphal00p-docs-cargo] Compiling ref-cast v1.0.25
  393. 38.13 s [alphal00p-docs-cargo] Compiling cpufeatures v0.3.0
  394. 38.15 s [alphal00p-docs-cargo] Compiling constant_time_eq v0.4.2
  395. 38.18 s [alphal00p-docs-cargo] Compiling rustc-hash v1.1.0
  396. 38.23 s [alphal00p-docs-cargo] Compiling arrayref v0.3.9
  397. 38.25 s [alphal00p-docs-cargo] Compiling clarabel v0.11.1
  398. 38.27 s [alphal00p-docs-cargo] Compiling titlecase v2.2.1
  399. 38.34 s [alphal00p-docs-cargo] Compiling vt100 v0.16.2
  400. 38.49 s [alphal00p-docs-cargo] Compiling derive_builder v0.11.2
  401. 38.52 s [alphal00p-docs-cargo] Compiling ratatui-widgets v0.3.0
  402. 38.53 s [alphal00p-docs-cargo] Compiling crossterm v0.29.0
  403. 38.56 s [alphal00p-docs-cargo] Compiling env_logger v0.11.10
  404. 38.61 s [alphal00p-docs-cargo] Compiling phf_macros v0.13.1
  405. 38.90 s [alphal00p-docs-cargo] Compiling tracing-error v0.2.1
  406. 38.90 s [alphal00p-docs-cargo] Compiling ndarray v0.17.2
  407. 38.93 s [alphal00p-docs-cargo] Compiling pyo3-macros v0.28.3
  408. 39.08 s [alphal00p-docs-cargo] Compiling serde-big-array v0.5.1
  409. 39.19 s [alphal00p-docs-cargo] Compiling enum_dispatch v0.3.13
  410. 39.34 s [alphal00p-docs-cargo] Compiling ref-cast-impl v1.0.25
  411. 39.37 s [alphal00p-docs-cargo] Compiling delegate v0.13.5
  412. 39.44 s [alphal00p-docs-cargo] Compiling serde_derive_internals v0.29.1
  413. 39.55 s [alphal00p-docs-cargo] Compiling toml_datetime v0.7.5+spec-1.1.0
  414. 39.58 s [alphal00p-docs-cargo] Compiling amd v0.2.2
  415. 39.62 s [alphal00p-docs-cargo] Compiling subprocess v0.2.15
  416. 39.65 s [alphal00p-docs-cargo] Compiling rust_lisp v0.18.0
  417. 39.80 s [alphal00p-docs-cargo] Compiling unit-prefix v0.5.2
  418. 39.83 s [alphal00p-docs-cargo] Compiling semver v1.0.28
  419. 39.89 s [alphal00p-docs-cargo] Compiling base64 v0.22.1
  420. 39.98 s [alphal00p-docs-cargo] Compiling vakint v0.1.2 (/build/source/crates/vakint)
  421. 40.07 s [alphal00p-docs-cargo] Compiling rustc-demangle v0.1.27
  422. 40.10 s [alphal00p-docs-cargo] Compiling deprecate-until v1.0.0
  423. 40.17 s [alphal00p-docs-cargo] Compiling string-template-plus v0.4.3
  424. 40.28 s [alphal00p-docs-cargo] Compiling indicatif v0.18.4
  425. 40.34 s [alphal00p-docs-cargo] Compiling addr2line v0.25.1
  426. 40.36 s [alphal00p-docs-cargo] Compiling schemars_derive v1.2.1
  427. 40.49 s [alphal00p-docs-cargo] Compiling toml v0.9.12+spec-1.1.0
  428. 40.50 s [alphal00p-docs-cargo] Compiling phf v0.13.1
  429. 40.54 s [alphal00p-docs-cargo] Compiling ratatui-macros v0.7.0
  430. 40.64 s [alphal00p-docs-cargo] Compiling ratatui-crossterm v0.1.0
  431. 40.66 s [alphal00p-docs-cargo] Compiling shellexpand v3.1.2
  432. 40.70 s [alphal00p-docs-cargo] Compiling xpct v0.5.1
  433. 40.77 s [alphal00p-docs-cargo] Compiling brotli-decompressor v4.0.3
  434. 40.79 s [alphal00p-docs-cargo] Compiling integer-sqrt v0.1.5
  435. 40.80 s [alphal00p-docs-cargo] Compiling crossbeam-channel v0.5.15
  436. 40.85 s [alphal00p-docs-cargo] Compiling itertools v0.12.1
  437. 40.90 s [alphal00p-docs-cargo] Compiling gammaloop-tracing-filter-macros v0.1.0 (/build/source/crates/gammaloop-tracing-filter-macros)
  438. 41.19 s [alphal00p-docs-cargo] Compiling include_dir_macros v0.7.4
  439. 41.21 s [alphal00p-docs-cargo] Compiling version-compare v0.2.1
  440. 41.24 s [alphal00p-docs-cargo] Compiling unsafe-libyaml v0.2.11
  441. 41.36 s [alphal00p-docs-cargo] Compiling maplit v1.0.2
  442. 41.40 s [alphal00p-docs-cargo] Compiling symlink v0.1.0
  443. 41.42 s [alphal00p-docs-cargo] Compiling gammalooprs v0.3.4 (/build/source/crates/gammalooprs)
  444. 41.43 s [alphal00p-docs-cargo] Compiling ctrlc v3.5.2
  445. 41.45 s [alphal00p-docs-cargo] Compiling tracing-appender v0.2.5
  446. 41.53 s [alphal00p-docs-cargo] Compiling pathfinding v4.15.0
  447. 41.63 s [alphal00p-docs-cargo] Compiling include_dir v0.7.4
  448. 41.69 s [alphal00p-docs-cargo] Compiling brotli v7.0.0
  449. 41.72 s [alphal00p-docs-cargo] Compiling tracing-indicatif v0.3.14
  450. 41.83 s [alphal00p-docs-cargo] Compiling nalgebra v0.29.0
  451. 41.84 s [alphal00p-docs-cargo] Compiling serde_yaml v0.9.34+deprecated
  452. 41.93 s [alphal00p-docs-cargo] Compiling rust-embed-impl v8.11.0
  453. 41.97 s [alphal00p-docs-cargo] Compiling ratatui v0.30.0
  454. 42.00 s [alphal00p-docs-cargo] Compiling json5 v0.4.1
  455. 42.03 s [alphal00p-docs-cargo] Compiling typed-index-collections v3.5.0
  456. 42.08 s [alphal00p-docs-cargo] Compiling vectorize v0.2.0
  457. 42.13 s [alphal00p-docs-cargo] Compiling strum_macros v0.26.4
  458. 42.14 s [alphal00p-docs-cargo] Compiling clap_complete v4.6.3
  459. 42.15 s [alphal00p-docs-cargo] Compiling fd-lock v4.0.4
  460. 42.22 s [alphal00p-docs-cargo] Compiling strip-ansi-escapes v0.2.1
  461. 42.26 s [alphal00p-docs-cargo] Compiling backtrace v0.3.76
  462. 42.29 s [alphal00p-docs-cargo] Compiling schemars v1.2.1
  463. 42.31 s [alphal00p-docs-cargo] Compiling gammaloop-api v0.1.0 (/build/source/crates/gammaloop-api)
  464. 42.35 s [alphal00p-docs-cargo] Compiling itertools v0.13.0
  465. 42.45 s [alphal00p-docs-cargo] Compiling strum v0.26.3
  466. 42.51 s [alphal00p-docs-cargo] Compiling base62 v2.2.4
  467. 42.53 s [alphal00p-docs-cargo] Compiling ringbuffer v0.16.0
  468. 42.60 s [alphal00p-docs-cargo] Compiling clap_complete_nushell v4.6.0
  469. 42.66 s [alphal00p-docs-cargo] Compiling sysinfo v0.33.1
  470. 42.71 s [alphal00p-docs-cargo] Compiling color-eyre v0.6.5
  471. 43.10 s [alphal00p-docs-cargo] Compiling rust-embed v8.11.0
  472. 43.41 s [alphal00p-docs-cargo] Compiling pyo3-stub-gen-derive v0.17.2
  473. 43.46 s [alphal00p-docs-cargo] Compiling reedline v0.42.0
  474. 44.66 s [alphal00p-docs-cargo] Compiling pyo3-stub-gen v0.17.2
  475. 45.92 s [alphal00p-docs-cargo] Compiling statrs v0.16.1
  476. 46.27 s [alphal00p-docs-cargo] Compiling momtrop v0.3.0
  477. 124.01 s [alphal00p-docs-cargo] Compiling numerica v3.0.0 (https://github.com/symbolica-dev/symbolica?rev=4f1323185fe5e0c0f8c864ab89edd1905e7adef1#4f132318)
  478. 127.12 s [alphal00p-docs-cargo] Compiling graphica v3.0.0 (https://github.com/symbolica-dev/symbolica?rev=4f1323185fe5e0c0f8c864ab89edd1905e7adef1#4f132318)
  479. 154.26 s [alphal00p-docs-cargo] Compiling symbolica-utils v0.1.0 (/build/source/crates/symbolica-utils)
  480. 170.77 s [alphal00p-docs-cargo] Compiling gammaloop-workspace-hack v0.1.0 (/build/source/crates/gammaloop-workspace-hack)
  481. 170.77 s [alphal00p-docs-cargo] Compiling spenso-macros v0.3.2 (/build/source/crates/spenso-macros)
  482. 171.01 s [alphal00p-docs-cargo] Compiling linnet v0.17.0 (/build/source/crates/linnet)
  483. 174.10 s [alphal00p-docs-cargo] Compiling spenso v0.6.0 (/build/source/crates/spenso)
  484. 179.17 s [alphal00p-docs-cargo] Compiling idenso v0.3.0 (/build/source/crates/idenso)
  485. 179.17 s [alphal00p-docs-cargo] Compiling gammaloop-tracing-filter v0.1.0 (/build/source/crates/gammaloop-tracing-filter)
  486. 182.90 s [alphal00p-docs-cargo] Compiling spenso-hep-lib v0.1.7 (/build/source/crates/spenso-hep-lib)
  487. 249.20 s [alphal00p-docs-cargo] Compiling alphal00p-docs-python-exporter v0.1.0 (/build/source/crates/alphal00p-docs-python-exporter)
  488. 268.80 s [alphal00p-docs-cargo] Finished `docs` profile [unoptimized] target(s) in 4m 10s
  489. 268.90 s [alphal00p-docs-cargo] +++ command cargo build --profile docs --locked -p alphal00p-docs-python-exporter --features linnet
  490. 269.36 s [alphal00p-docs-cargo] Compiling libc v0.2.186
  491. 269.36 s [alphal00p-docs-cargo] Compiling serde_core v1.0.228
  492. 269.36 s [alphal00p-docs-cargo] Compiling zerocopy v0.8.48
  493. 269.37 s [alphal00p-docs-cargo] Compiling log v0.4.29
  494. 269.38 s [alphal00p-docs-cargo] Compiling num-traits v0.2.19
  495. 269.38 s [alphal00p-docs-cargo] Compiling syn v1.0.109
  496. 269.40 s [alphal00p-docs-cargo] Compiling syn v2.0.117
  497. 269.40 s [alphal00p-docs-cargo] Compiling ahash v0.7.8
  498. 269.41 s [alphal00p-docs-cargo] Compiling bytecheck v0.6.12
  499. 269.41 s [alphal00p-docs-cargo] Compiling regex-syntax v0.8.10
  500. 269.42 s [alphal00p-docs-cargo] Compiling simdutf8 v0.1.5
  501. 269.42 s [alphal00p-docs-cargo] Compiling rend v0.4.2
  502. 269.44 s [alphal00p-docs-cargo] Compiling indexmap v2.14.0
  503. 269.45 s [alphal00p-docs-cargo] Compiling figment v0.10.19
  504. 269.45 s [alphal00p-docs-cargo] Compiling ahash v0.8.12
  505. 269.45 s [alphal00p-docs-cargo] Compiling either v1.15.0
  506. 269.55 s [alphal00p-docs-cargo] Compiling rkyv v0.7.46
  507. 269.71 s [alphal00p-docs-cargo] Compiling cgmath v0.18.0
  508. 269.73 s [alphal00p-docs-cargo] Compiling itertools v0.11.0
  509. 269.76 s [alphal00p-docs-cargo] Compiling bincode v2.0.1
  510. 269.76 s [alphal00p-docs-cargo] Compiling pyo3 v0.28.3
  511. 269.78 s [alphal00p-docs-cargo] Compiling venial v0.5.0
  512. 269.83 s [alphal00p-docs-cargo] Compiling arrayvec v0.7.6
  513. 269.87 s [alphal00p-docs-cargo] Compiling rustix v1.1.4
  514. 269.88 s [alphal00p-docs-cargo] Compiling winnow v1.0.2
  515. 270.01 s [alphal00p-docs-cargo] Compiling seahash v4.1.0
  516. 270.07 s [alphal00p-docs-cargo] Compiling polycool v0.4.0
  517. 270.17 s [alphal00p-docs-cargo] Compiling toml_writer v1.1.1+spec-1.1.0
  518. 270.25 s [alphal00p-docs-cargo] Compiling toml_parser v1.1.2+spec-1.1.0
  519. 270.25 s [alphal00p-docs-cargo] Compiling smallvec v1.15.1
  520. 270.36 s [alphal00p-docs-cargo] Compiling bitflags v2.11.1
  521. 270.37 s [alphal00p-docs-cargo] Compiling winnow v0.7.15
  522. 270.43 s [alphal00p-docs-cargo] Compiling linnet-py v0.1.0 (/build/source/crates/linnet-py)
  523. 270.46 s [alphal00p-docs-cargo] Compiling kurbo v0.13.1
  524. 270.70 s [alphal00p-docs-cargo] Compiling num-integer v0.1.46
  525. 270.76 s [alphal00p-docs-cargo] Compiling approx v0.4.0
  526. 270.77 s [alphal00p-docs-cargo] Compiling num-complex v0.4.6
  527. 270.80 s [alphal00p-docs-cargo] Compiling regex-automata v0.4.14
  528. 270.81 s [alphal00p-docs-cargo] Compiling wasm-minimal-protocol v0.2.0
  529. 270.93 s [alphal00p-docs-cargo] Compiling chrono v0.4.44
  530. 271.02 s [alphal00p-docs-cargo] Compiling num-bigint v0.4.6
  531. 271.10 s [alphal00p-docs-cargo] Compiling getrandom v0.2.17
  532. 271.21 s [alphal00p-docs-cargo] Compiling dirs-sys v0.5.0
  533. 271.28 s [alphal00p-docs-cargo] Compiling rand_core v0.6.4
  534. 271.31 s [alphal00p-docs-cargo] Compiling const-random-macro v0.1.16
  535. 271.47 s [alphal00p-docs-cargo] Compiling dirs v6.0.0
  536. 271.48 s [alphal00p-docs-cargo] Compiling pyo3-ffi v0.28.3
  537. 271.56 s [alphal00p-docs-cargo] Compiling hashbrown v0.12.3
  538. 271.59 s [alphal00p-docs-cargo] Compiling shellexpand v3.1.2
  539. 271.64 s [alphal00p-docs-cargo] Compiling getrandom v0.4.2
  540. 271.79 s [alphal00p-docs-cargo] Compiling const-random v0.1.18
  541. 272.14 s [alphal00p-docs-cargo] Compiling tempfile v3.27.0
  542. 272.26 s [alphal00p-docs-cargo] Compiling toml_datetime v0.7.5+spec-1.1.0
  543. 272.29 s [alphal00p-docs-cargo] Compiling serde_spanned v1.1.1
  544. 272.32 s [alphal00p-docs-cargo] Compiling serde_json v1.0.149
  545. 272.43 s [alphal00p-docs-cargo] Compiling toml v0.9.12+spec-1.1.0
  546. 272.45 s [alphal00p-docs-cargo] Compiling ptr_meta_derive v0.1.4
  547. 272.45 s [alphal00p-docs-cargo] Compiling bytecheck_derive v0.6.12
  548. 272.45 s [alphal00p-docs-cargo] Compiling rkyv_derive v0.7.46
  549. 272.53 s [alphal00p-docs-cargo] Compiling pest_generator v2.8.6
  550. 272.53 s [alphal00p-docs-cargo] Compiling pyo3-macros-backend v0.28.3
  551. 272.53 s [alphal00p-docs-cargo] Compiling proc-macro2-diagnostics v0.10.1
  552. 272.55 s [alphal00p-docs-cargo] Compiling globset v0.4.18
  553. 272.89 s [alphal00p-docs-cargo] Compiling rust-embed-utils v8.11.0
  554. 273.00 s [alphal00p-docs-cargo] Compiling ptr_meta v0.1.4
  555. 273.13 s [alphal00p-docs-cargo] Compiling zerocopy-derive v0.8.48
  556. 273.13 s [alphal00p-docs-cargo] Compiling serde_derive v1.0.228
  557. 273.13 s [alphal00p-docs-cargo] Compiling is-macro v0.3.7
  558. 273.13 s [alphal00p-docs-cargo] Compiling thiserror-impl v2.0.18
  559. 273.13 s [alphal00p-docs-cargo] Compiling bincode-trait-derive v0.1.1
  560. 273.13 s [alphal00p-docs-cargo] Compiling serde_repr v0.1.20
  561. 273.13 s [alphal00p-docs-cargo] Compiling duplicate v2.0.1
  562. 273.13 s [alphal00p-docs-cargo] Compiling rust-embed-impl v8.11.0
  563. 273.17 s [alphal00p-docs-cargo] Compiling pest_derive v2.8.6
  564. 273.84 s [alphal00p-docs-cargo] Compiling dot-parser v0.5.1
  565. 273.88 s [alphal00p-docs-cargo] Compiling rustpython-parser-core v0.4.0
  566. 273.95 s [alphal00p-docs-cargo] Compiling rustpython-ast v0.4.0
  567. 274.02 s [alphal00p-docs-cargo] Compiling ppv-lite86 v0.2.21
  568. 274.21 s [alphal00p-docs-cargo] Compiling rust-embed v8.11.0
  569. 274.27 s [alphal00p-docs-cargo] Compiling rand_chacha v0.3.1
  570. 274.32 s [alphal00p-docs-cargo] Compiling thiserror v2.0.18
  571. 274.41 s [alphal00p-docs-cargo] Compiling rand v0.8.6
  572. 274.79 s [alphal00p-docs-cargo] Compiling phf_generator v0.11.3
  573. 274.89 s [alphal00p-docs-cargo] Compiling phf_codegen v0.11.3
  574. 274.94 s [alphal00p-docs-cargo] Compiling unicode_names2_generator v1.3.0
  575. 274.95 s [alphal00p-docs-cargo] Compiling rustpython-parser v0.4.0
  576. 275.00 s [alphal00p-docs-cargo] Compiling pyo3-macros v0.28.3
  577. 275.22 s [alphal00p-docs-cargo] Compiling unicode_names2 v1.3.0
  578. 275.32 s [alphal00p-docs-cargo] Compiling serde v1.0.228
  579. 275.59 s [alphal00p-docs-cargo] Compiling bitvec v1.0.1
  580. 276.75 s [alphal00p-docs-cargo] Compiling half v2.7.1
  581. 276.89 s [alphal00p-docs-cargo] Compiling ciborium-ll v0.2.2
  582. 276.97 s [alphal00p-docs-cargo] Compiling ciborium v0.2.2
  583. 277.32 s [alphal00p-docs-cargo] Compiling kurvst v0.1.0 (/build/source/crates/kurvst)
  584. 278.15 s [alphal00p-docs-cargo] Compiling linnet v0.17.0 (/build/source/crates/linnet)
  585. 279.71 s [alphal00p-docs-cargo] Compiling pyo3-stub-gen-derive v0.17.2
  586. 280.77 s [alphal00p-docs-cargo] Compiling pyo3-stub-gen v0.17.2
  587. 281.55 s [alphal00p-docs-cargo] Compiling linnest v0.1.0 (/build/source/crates/linnest)
  588. 292.80 s [alphal00p-docs-cargo] Compiling alphal00p-docs-python-exporter v0.1.0 (/build/source/crates/alphal00p-docs-python-exporter)
  589. 294.32 s [alphal00p-docs-cargo] Finished `docs` profile [unoptimized] target(s) in 25.41s
  590. 294.39 s [alphal00p-docs-cargo] +++ command cargo build --profile docs --locked -p alphal00p-docs-python-exporter --features spenso
  591. 294.83 s [alphal00p-docs-cargo] Compiling pyo3-build-config v0.28.3
  592. 294.84 s [alphal00p-docs-cargo] Compiling symbolica v2.2.0 (https://github.com/symbolica-dev/symbolica?rev=4f1323185fe5e0c0f8c864ab89edd1905e7adef1#4f132318)
  593. 294.85 s [alphal00p-docs-cargo] Compiling syn v1.0.109
  594. 294.85 s [alphal00p-docs-cargo] Compiling figment v0.10.19
  595. 295.41 s [alphal00p-docs-cargo] Compiling proc-macro-error v1.0.4
  596. 295.56 s [alphal00p-docs-cargo] Compiling duplicate v1.0.0
  597. 295.77 s [alphal00p-docs-cargo] Compiling pyo3-macros-backend v0.28.3
  598. 295.77 s [alphal00p-docs-cargo] Compiling pyo3-ffi v0.28.3
  599. 295.77 s [alphal00p-docs-cargo] Compiling pyo3 v0.28.3
  600. 295.77 s [alphal00p-docs-cargo] Compiling numpy v0.28.0
  601. 298.35 s [alphal00p-docs-cargo] Compiling pyo3-macros v0.28.3
  602. 302.68 s [alphal00p-docs-cargo] Compiling pyo3-stub-gen v0.17.2
  603. 303.63 s [alphal00p-docs-cargo] Compiling numerica v3.0.0 (https://github.com/symbolica-dev/symbolica?rev=4f1323185fe5e0c0f8c864ab89edd1905e7adef1#4f132318)
  604. 308.21 s [alphal00p-docs-cargo] Compiling graphica v3.0.0 (https://github.com/symbolica-dev/symbolica?rev=4f1323185fe5e0c0f8c864ab89edd1905e7adef1#4f132318)
  605. 344.54 s [alphal00p-docs-cargo] Compiling symbolica-utils v0.1.0 (/build/source/crates/symbolica-utils)
  606. 344.54 s [alphal00p-docs-cargo] Compiling gammaloop-workspace-hack v0.1.0 (/build/source/crates/gammaloop-workspace-hack)
  607. 344.54 s [alphal00p-docs-cargo] Compiling tymbolica-atom-payload v0.1.0 (https://github.com/lcnbr/tymbolica?rev=32ae00483b4845161401afac8be755cc336cb2bb#32ae0048)
  608. 344.88 s [alphal00p-docs-cargo] Compiling linnet v0.17.0 (/build/source/crates/linnet)
  609. 347.83 s [alphal00p-docs-cargo] Compiling spenso v0.6.0 (/build/source/crates/spenso)
  610. 353.29 s [alphal00p-docs-cargo] Compiling idenso v0.3.0 (/build/source/crates/idenso)
  611. 359.07 s [alphal00p-docs-cargo] Compiling spenso-hep-lib v0.1.7 (/build/source/crates/spenso-hep-lib)
  612. 359.70 s [alphal00p-docs-cargo] Compiling spynso3 v0.1.2 (/build/source/crates/spynso3)
  613. 367.96 s [alphal00p-docs-cargo] Compiling alphal00p-docs-python-exporter v0.1.0 (/build/source/crates/alphal00p-docs-python-exporter)
  614. 379.29 s [alphal00p-docs-cargo] Finished `docs` profile [unoptimized] target(s) in 1m 24s
  615. 379.37 s [alphal00p-docs-cargo] +++ command cargo build --profile docs --locked -p alphal00p-docs-python-exporter --features idenso
  616. 379.88 s [alphal00p-docs-cargo] Compiling pyo3 v0.28.3
  617. 382.45 s [alphal00p-docs-cargo] Compiling numpy v0.28.0
  618. 383.15 s [alphal00p-docs-cargo] Compiling pyo3-stub-gen v0.17.2
  619. 384.00 s [alphal00p-docs-cargo] Compiling numerica v3.0.0 (https://github.com/symbolica-dev/symbolica?rev=4f1323185fe5e0c0f8c864ab89edd1905e7adef1#4f132318)
  620. 388.19 s [alphal00p-docs-cargo] Compiling graphica v3.0.0 (https://github.com/symbolica-dev/symbolica?rev=4f1323185fe5e0c0f8c864ab89edd1905e7adef1#4f132318)
  621. 388.53 s [alphal00p-docs-cargo] Compiling symbolica v2.2.0 (https://github.com/symbolica-dev/symbolica?rev=4f1323185fe5e0c0f8c864ab89edd1905e7adef1#4f132318)
  622. 444.88 s [alphal00p-docs-cargo] Compiling gammaloop-workspace-hack v0.1.0 (/build/source/crates/gammaloop-workspace-hack)
  623. 444.88 s [alphal00p-docs-cargo] Compiling symbolica-utils v0.1.0 (/build/source/crates/symbolica-utils)
  624. 445.52 s [alphal00p-docs-cargo] Compiling linnet v0.17.0 (/build/source/crates/linnet)
  625. 451.86 s [alphal00p-docs-cargo] Compiling spenso v0.6.0 (/build/source/crates/spenso)
  626. 472.26 s [alphal00p-docs-cargo] Compiling idenso v0.3.0 (/build/source/crates/idenso)
  627. 488.60 s [alphal00p-docs-cargo] Compiling alphal00p-docs-python-exporter v0.1.0 (/build/source/crates/alphal00p-docs-python-exporter)
  628. 504.85 s [alphal00p-docs-cargo] Finished `docs` profile [unoptimized] target(s) in 2m 05s
  629. 505.00 s [alphal00p-docs-cargo] +++ command cargo build --profile docs --locked -p alphal00p-docs-python-exporter --features vakint
  630. 505.62 s [alphal00p-docs-cargo] Compiling libc v0.2.186
  631. 505.62 s [alphal00p-docs-cargo] Compiling tiny-keccak v2.0.2
  632. 505.62 s [alphal00p-docs-cargo] Compiling bytemuck v1.25.0
  633. 505.62 s [alphal00p-docs-cargo] Compiling matrixmultiply v0.3.10
  634. 505.63 s [alphal00p-docs-cargo] Compiling getrandom v0.3.4
  635. 505.64 s [alphal00p-docs-cargo] Compiling num-integer v0.1.46
  636. 505.64 s [alphal00p-docs-cargo] Compiling pyo3 v0.28.3
  637. 505.66 s [alphal00p-docs-cargo] Compiling regex-automata v0.4.14
  638. 505.71 s [alphal00p-docs-cargo] Compiling pyo3-macros-backend v0.28.3
  639. 505.71 s [alphal00p-docs-cargo] Compiling pyo3-ffi v0.28.3
  640. 505.71 s [alphal00p-docs-cargo] Compiling approx v0.5.1
  641. 505.72 s [alphal00p-docs-cargo] Compiling ahash v0.8.12
  642. 505.75 s [alphal00p-docs-cargo] Compiling serde v1.0.228
  643. 505.77 s [alphal00p-docs-cargo] Compiling itertools v0.14.0
  644. 505.79 s [alphal00p-docs-cargo] Compiling gmp-mpfr-sys v1.7.1
  645. 505.80 s [alphal00p-docs-cargo] Compiling smallvec v1.15.1
  646. 506.18 s [alphal00p-docs-cargo] Compiling safe_arch v0.7.4
  647. 506.31 s [alphal00p-docs-cargo] Compiling safe_arch v1.2.0
  648. 506.36 s [alphal00p-docs-cargo] Compiling rand_core v0.9.5
  649. 506.49 s [alphal00p-docs-cargo] Compiling rayon v1.12.0
  650. 506.84 s [alphal00p-docs-cargo] Compiling rand_chacha v0.9.0
  651. 507.14 s [alphal00p-docs-cargo] Compiling smartstring v1.0.1
  652. 507.19 s [alphal00p-docs-cargo] Compiling phf_shared v0.13.1
  653. 507.28 s [alphal00p-docs-cargo] Compiling tracing-attributes v0.1.31
  654. 507.29 s [alphal00p-docs-cargo] Compiling fastrand v2.4.1
  655. 507.68 s [alphal00p-docs-cargo] Compiling wide v0.7.33
  656. 507.81 s [alphal00p-docs-cargo] Compiling rand v0.9.4
  657. 508.06 s [alphal00p-docs-cargo] Compiling rug v1.30.0
  658. 508.38 s [alphal00p-docs-cargo] Compiling phf_generator v0.13.1
  659. 508.40 s [alphal00p-docs-cargo] Compiling wide v1.7.0
  660. 508.69 s [alphal00p-docs-cargo] Compiling symbolica v2.2.0 (https://github.com/symbolica-dev/symbolica?rev=4f1323185fe5e0c0f8c864ab89edd1905e7adef1#4f132318)
  661. 508.97 s [alphal00p-docs-cargo] Compiling phf_macros v0.13.1
  662. 509.21 s [alphal00p-docs-cargo] Compiling directories v6.0.0
  663. 509.64 s [alphal00p-docs-cargo] Compiling ndarray v0.17.2
  664. 509.72 s [alphal00p-docs-cargo] Compiling subprocess v0.2.15
  665. 510.03 s [alphal00p-docs-cargo] Compiling vakint v0.1.2 (/build/source/crates/vakint)
  666. 511.06 s [alphal00p-docs-cargo] Compiling getrandom v0.2.17
  667. 511.60 s [alphal00p-docs-cargo] Compiling rand_core v0.6.4
  668. 511.70 s [alphal00p-docs-cargo] Compiling phf v0.13.1
  669. 512.11 s [alphal00p-docs-cargo] Compiling rand_chacha v0.3.1
  670. 512.41 s [alphal00p-docs-cargo] Compiling rand v0.8.6
  671. 512.80 s [alphal00p-docs-cargo] Compiling tracing v0.1.44
  672. 514.21 s [alphal00p-docs-cargo] Compiling simba v0.9.1
  673. 514.21 s [alphal00p-docs-cargo] Compiling phf_generator v0.11.3
  674. 514.53 s [alphal00p-docs-cargo] Compiling phf_codegen v0.11.3
  675. 514.73 s [alphal00p-docs-cargo] Compiling unicode_names2_generator v1.3.0
  676. 514.75 s [alphal00p-docs-cargo] Compiling rustpython-parser v0.4.0
  677. 515.73 s [alphal00p-docs-cargo] Compiling unicode_names2 v1.3.0
  678. 517.32 s [alphal00p-docs-cargo] Compiling matchers v0.2.0
  679. 517.33 s [alphal00p-docs-cargo] Compiling regex v1.12.3
  680. 517.56 s [alphal00p-docs-cargo] Compiling tracing-subscriber v0.3.23
  681. 518.53 s [alphal00p-docs-cargo] Compiling pyo3-macros v0.28.3
  682. 519.41 s [alphal00p-docs-cargo] Compiling titlecase v2.2.1
  683. 519.70 s [alphal00p-docs-cargo] Compiling string-template-plus v0.4.3
  684. 526.47 s [alphal00p-docs-cargo] Compiling xprec v0.2.2
  685. 528.07 s [alphal00p-docs-cargo] Compiling numpy v0.28.0
  686. 531.60 s [alphal00p-docs-cargo] Compiling pyo3-stub-gen-derive v0.17.2
  687. 534.49 s [alphal00p-docs-cargo] Compiling pyo3-stub-gen v0.17.2
  688. 535.90 s [alphal00p-docs-cargo] Compiling numerica v3.0.0 (https://github.com/symbolica-dev/symbolica?rev=4f1323185fe5e0c0f8c864ab89edd1905e7adef1#4f132318)
  689. 536.30 s [alphal00p-docs-cargo] error: select an integer backend: `integer-gmp` or `integer-malachite`
  690. 536.30 s [alphal00p-docs-cargo] --> /nix/store/9rqk4093qnvgswmdk1pbxk9najcrjn7a-vendor-cargo-deps/bc87b2b0f37b9a43ffdd82e8f11f3e864d9447ccd53a9a964250c3414c3656d9/numerica-3.0.0/src/lib.rs:40:1
  691. 536.30 s [alphal00p-docs-cargo] |
  692. 536.30 s [alphal00p-docs-cargo] 40 | compile_error!("select an integer backend: `integer-gmp` or `integer-malachite`");
  693. 536.30 s [alphal00p-docs-cargo] | ^^^^^^^^^^^^^^^^^^^^^^^^^^^^^^^^^^^^^^^^^^^^^^^^^^^^^^^^^^^^^^^^^^^^^^^^^^^^^^^^^
  694. 536.30 s [alphal00p-docs-cargo]
  695. 536.30 s [alphal00p-docs-cargo] error: select a float backend: `float-mpfr` or `float-astro`
  696. 536.30 s [alphal00p-docs-cargo] --> /nix/store/9rqk4093qnvgswmdk1pbxk9najcrjn7a-vendor-cargo-deps/bc87b2b0f37b9a43ffdd82e8f11f3e864d9447ccd53a9a964250c3414c3656d9/numerica-3.0.0/src/lib.rs:44:1
  697. 536.30 s [alphal00p-docs-cargo] |
  698. 536.30 s [alphal00p-docs-cargo] 44 | compile_error!("select a float backend: `float-mpfr` or `float-astro`");
  699. 536.30 s [alphal00p-docs-cargo] | ^^^^^^^^^^^^^^^^^^^^^^^^^^^^^^^^^^^^^^^^^^^^^^^^^^^^^^^^^^^^^^^^^^^^^^^
  700. 536.30 s [alphal00p-docs-cargo]
  701. 536.77 s [alphal00p-docs-cargo] error[E0432]: unresolved import `implementation::BackendRandState`
  702. 536.77 s [alphal00p-docs-cargo] --> /nix/store/9rqk4093qnvgswmdk1pbxk9najcrjn7a-vendor-cargo-deps/bc87b2b0f37b9a43ffdd82e8f11f3e864d9447ccd53a9a964250c3414c3656d9/numerica-3.0.0/src/domains/backend/integer.rs:1614:33
  703. 536.77 s [alphal00p-docs-cargo] |
  704. 536.77 s [alphal00p-docs-cargo] 1614 | pub(crate) use implementation::{BackendRandState, Complete, RemRounding};
  705. 536.77 s [alphal00p-docs-cargo] | ^^^^^^^^^^^^^^^^ no `BackendRandState` in `domains::backend::integer::implementation`
  706. 536.77 s [alphal00p-docs-cargo] |
  707. 536.77 s [alphal00p-docs-cargo] note: found an item that was configured out
  708. 536.77 s [alphal00p-docs-cargo] --> /nix/store/9rqk4093qnvgswmdk1pbxk9najcrjn7a-vendor-cargo-deps/bc87b2b0f37b9a43ffdd82e8f11f3e864d9447ccd53a9a964250c3414c3656d9/numerica-3.0.0/src/domains/backend/integer.rs:1378:23
  709. 536.77 s [alphal00p-docs-cargo] |
  710. 536.77 s [alphal00p-docs-cargo] 1377 | #[cfg(feature = "integer-malachite")]
  711. 536.77 s [alphal00p-docs-cargo] | ----------------------------- the item is gated behind the `integer-malachite` feature
  712. 536.77 s [alphal00p-docs-cargo] 1378 | pub(crate) struct BackendRandState {
  713. 536.77 s [alphal00p-docs-cargo] | ^^^^^^^^^^^^^^^^
  714. 536.77 s [alphal00p-docs-cargo] note: found an item that was configured out
  715. 536.77 s [alphal00p-docs-cargo] --> /nix/store/9rqk4093qnvgswmdk1pbxk9najcrjn7a-vendor-cargo-deps/bc87b2b0f37b9a43ffdd82e8f11f3e864d9447ccd53a9a964250c3414c3656d9/numerica-3.0.0/src/domains/backend/integer.rs:1413:23
  716. 536.77 s [alphal00p-docs-cargo] |
  717. 536.77 s [alphal00p-docs-cargo] 1412 | #[cfg(feature = "integer-gmp")]
  718. 536.77 s [alphal00p-docs-cargo] | ----------------------- the item is gated behind the `integer-gmp` feature
  719. 536.77 s [alphal00p-docs-cargo] 1413 | pub(crate) struct BackendRandState(rug::rand::RandState<'static>);
  720. 536.77 s [alphal00p-docs-cargo] | ^^^^^^^^^^^^^^^^
  721. 536.77 s [alphal00p-docs-cargo]
  722. 536.77 s [alphal00p-docs-cargo] error[E0432]: unresolved import `implementation::RawMultiPrecisionInteger`
  723. 536.77 s [alphal00p-docs-cargo] --> /nix/store/9rqk4093qnvgswmdk1pbxk9najcrjn7a-vendor-cargo-deps/bc87b2b0f37b9a43ffdd82e8f11f3e864d9447ccd53a9a964250c3414c3656d9/numerica-3.0.0/src/domains/backend/integer.rs:1616:61
  724. 536.77 s [alphal00p-docs-cargo] |
  725. 536.77 s [alphal00p-docs-cargo] 1616 | MultiPrecisionInteger, ParseMultiPrecisionIntegerError, RawMultiPrecisionInteger,
  726. 536.77 s [alphal00p-docs-cargo] | ^^^^^^^^^^^^^^^^^^^^^^^^ no `RawMultiPrecisionInteger` in `domains::backend::integer::implementation`
  727. 536.77 s [alphal00p-docs-cargo] |
  728. 536.77 s [alphal00p-docs-cargo] note: found an item that was configured out
  729. 536.77 s [alphal00p-docs-cargo] --> /nix/store/9rqk4093qnvgswmdk1pbxk9najcrjn7a-vendor-cargo-deps/bc87b2b0f37b9a43ffdd82e8f11f3e864d9447ccd53a9a964250c3414c3656d9/numerica-3.0.0/src/domains/backend/integer.rs:26:14
  730. 536.77 s [alphal00p-docs-cargo] |
  731. 536.77 s [alphal00p-docs-cargo] 25 | #[cfg(feature = "integer-malachite")]
  732. 536.77 s [alphal00p-docs-cargo] | ----------------------------- the item is gated behind the `integer-malachite` feature
  733. 536.77 s [alphal00p-docs-cargo] 26 | pub type RawMultiPrecisionInteger = malachite_nz::integer::Integer;
  734. 536.77 s [alphal00p-docs-cargo] | ^^^^^^^^^^^^^^^^^^^^^^^^
  735. 536.77 s [alphal00p-docs-cargo] note: found an item that was configured out
  736. 536.77 s [alphal00p-docs-cargo] --> /nix/store/9rqk4093qnvgswmdk1pbxk9najcrjn7a-vendor-cargo-deps/bc87b2b0f37b9a43ffdd82e8f11f3e864d9447ccd53a9a964250c3414c3656d9/numerica-3.0.0/src/domains/backend/integer.rs:29:14
  737. 536.77 s [alphal00p-docs-cargo] |
  738. 536.77 s [alphal00p-docs-cargo] 28 | #[cfg(feature = "integer-gmp")]
  739. 536.77 s [alphal00p-docs-cargo] | ----------------------- the item is gated behind the `integer-gmp` feature
  740. 536.77 s [alphal00p-docs-cargo] 29 | pub type RawMultiPrecisionInteger = rug::Integer;
  741. 536.77 s [alphal00p-docs-cargo] | ^^^^^^^^^^^^^^^^^^^^^^^^
  742. 536.77 s [alphal00p-docs-cargo] help: a similar name exists in the module
  743. 536.77 s [alphal00p-docs-cargo] |
  744. 536.77 s [alphal00p-docs-cargo] 1616 - MultiPrecisionInteger, ParseMultiPrecisionIntegerError, RawMultiPrecisionInteger,
  745. 536.77 s [alphal00p-docs-cargo] 1616 + MultiPrecisionInteger, ParseMultiPrecisionIntegerError, MultiPrecisionInteger,
  746. 536.77 s [alphal00p-docs-cargo] |
  747. 536.77 s [alphal00p-docs-cargo]
  748. 536.79 s [alphal00p-docs-cargo] error[E0432]: unresolved imports `implementation::from_be_bytes`, `implementation::to_be_bytes`
  749. 536.79 s [alphal00p-docs-cargo] --> /nix/store/9rqk4093qnvgswmdk1pbxk9najcrjn7a-vendor-cargo-deps/bc87b2b0f37b9a43ffdd82e8f11f3e864d9447ccd53a9a964250c3414c3656d9/numerica-3.0.0/src/domains/backend/integer.rs:1709:33
  750. 536.79 s [alphal00p-docs-cargo] |
  751. 536.79 s [alphal00p-docs-cargo] 1709 | pub(crate) use implementation::{from_be_bytes, to_be_bytes};
  752. 536.79 s [alphal00p-docs-cargo] | ^^^^^^^^^^^^^ ^^^^^^^^^^^ no `to_be_bytes` in `domains::backend::integer::implementation`
  753. 536.79 s [alphal00p-docs-cargo] | |
  754. 536.79 s [alphal00p-docs-cargo] | no `from_be_bytes` in `domains::backend::integer::implementation`
  755. 536.79 s [alphal00p-docs-cargo] |
  756. 536.79 s [alphal00p-docs-cargo] note: found an item that was configured out
  757. 536.79 s [alphal00p-docs-cargo] --> /nix/store/9rqk4093qnvgswmdk1pbxk9najcrjn7a-vendor-cargo-deps/bc87b2b0f37b9a43ffdd82e8f11f3e864d9447ccd53a9a964250c3414c3656d9/numerica-3.0.0/src/domains/backend/integer.rs:1370:19
  758. 536.79 s [alphal00p-docs-cargo] |
  759. 536.79 s [alphal00p-docs-cargo] 1369 | #[cfg(all(feature = "integer-malachite", feature = "bincode"))]
  760. 536.79 s [alphal00p-docs-cargo] | ----------------------------- the item is gated behind the `integer-malachite` feature
  761. 536.79 s [alphal00p-docs-cargo] 1370 | pub(crate) fn from_be_bytes(bytes: &[u8]) -> Result<MultiPrecisionInteger, &'static str> {
  762. 536.79 s [alphal00p-docs-cargo] | ^^^^^^^^^^^^^
  763. 536.79 s [alphal00p-docs-cargo] note: found an item that was configured out
  764. 536.79 s [alphal00p-docs-cargo] --> /nix/store/9rqk4093qnvgswmdk1pbxk9najcrjn7a-vendor-cargo-deps/bc87b2b0f37b9a43ffdd82e8f11f3e864d9447ccd53a9a964250c3414c3656d9/numerica-3.0.0/src/domains/backend/integer.rs:1405:19
  765. 536.79 s [alphal00p-docs-cargo] |
  766. 536.79 s [alphal00p-docs-cargo] 1404 | #[cfg(all(feature = "integer-gmp", feature = "bincode"))]
  767. 536.79 s [alphal00p-docs-cargo] | ----------------------- the item is gated behind the `integer-gmp` feature
  768. 536.79 s [alphal00p-docs-cargo] 1405 | pub(crate) fn from_be_bytes(bytes: &[u8]) -> Result<MultiPrecisionInteger, &'static str> {
  769. 536.79 s [alphal00p-docs-cargo] | ^^^^^^^^^^^^^
  770. 536.79 s [alphal00p-docs-cargo] note: found an item that was configured out
  771. 536.79 s [alphal00p-docs-cargo] --> /nix/store/9rqk4093qnvgswmdk1pbxk9najcrjn7a-vendor-cargo-deps/bc87b2b0f37b9a43ffdd82e8f11f3e864d9447ccd53a9a964250c3414c3656d9/numerica-3.0.0/src/domains/backend/integer.rs:1365:19
  772. 536.79 s [alphal00p-docs-cargo] |
  773. 536.79 s [alphal00p-docs-cargo] 1364 | #[cfg(all(feature = "integer-malachite", feature = "bincode"))]
  774. 536.79 s [alphal00p-docs-cargo] | ----------------------------- the item is gated behind the `integer-malachite` feature
  775. 536.79 s [alphal00p-docs-cargo] 1365 | pub(crate) fn to_be_bytes(value: &MultiPrecisionInteger) -> Vec<u8> {
  776. 536.79 s [alphal00p-docs-cargo] | ^^^^^^^^^^^
  777. 536.79 s [alphal00p-docs-cargo] note: found an item that was configured out
  778. 536.79 s [alphal00p-docs-cargo] --> /nix/store/9rqk4093qnvgswmdk1pbxk9najcrjn7a-vendor-cargo-deps/bc87b2b0f37b9a43ffdd82e8f11f3e864d9447ccd53a9a964250c3414c3656d9/numerica-3.0.0/src/domains/backend/integer.rs:1400:19
  779. 536.79 s [alphal00p-docs-cargo] |
  780. 536.79 s [alphal00p-docs-cargo] 1399 | #[cfg(all(feature = "integer-gmp", feature = "bincode"))]
  781. 536.79 s [alphal00p-docs-cargo] | ----------------------- the item is gated behind the `integer-gmp` feature
  782. 536.79 s [alphal00p-docs-cargo] 1400 | pub(crate) fn to_be_bytes(value: &MultiPrecisionInteger) -> Vec<u8> {
  783. 536.79 s [alphal00p-docs-cargo] | ^^^^^^^^^^^
  784. 536.79 s [alphal00p-docs-cargo]
  785. 536.80 s [alphal00p-docs-cargo] error[E0432]: unresolved imports `crate::domains::backend::float::Assign`, `crate::domains::backend::float::CompleteRound`, `crate::domains::backend::float::Constant`, `crate::domains::backend::float::MultiPrecisionFloat`, `crate::domains::backend::float::Pow`
  786. 536.80 s [alphal00p-docs-cargo] --> /nix/store/9rqk4093qnvgswmdk1pbxk9najcrjn7a-vendor-cargo-deps/bc87b2b0f37b9a43ffdd82e8f11f3e864d9447ccd53a9a964250c3414c3656d9/numerica-3.0.0/src/domains/float/multiprecision.rs:15:9
  787. 536.80 s [alphal00p-docs-cargo] |
  788. 536.80 s [alphal00p-docs-cargo] 15 | Assign, CompleteRound, Constant, MultiPrecisionFloat, MultiPrecisionFloatInteger,
  789. 536.80 s [alphal00p-docs-cargo] | ^^^^^^ ^^^^^^^^^^^^^ ^^^^^^^^ ^^^^^^^^^^^^^^^^^^^ no `MultiPrecisionFloat` in `domains::backend::float`
  790. 536.80 s [alphal00p-docs-cargo] | | | |
  791. 536.80 s [alphal00p-docs-cargo] | | | no `Constant` in `domains::backend::float`
  792. 536.80 s [alphal00p-docs-cargo] | | no `CompleteRound` in `domains::backend::float`
  793. 536.80 s [alphal00p-docs-cargo] | no `Assign` in `domains::backend::float`
  794. 536.80 s [alphal00p-docs-cargo] 16 | MultiPrecisionFloatRational, MultiPrecisionFloatRounding, Pow, RoundingDirection,
  795. 536.80 s [alphal00p-docs-cargo] | ^^^ no `Pow` in `domains::backend::float`
  796. 536.80 s [alphal00p-docs-cargo] |
  797. 536.80 s [alphal00p-docs-cargo] note: found an item that was configured out
  798. 536.80 s [alphal00p-docs-cargo] --> /nix/store/9rqk4093qnvgswmdk1pbxk9najcrjn7a-vendor-cargo-deps/bc87b2b0f37b9a43ffdd82e8f11f3e864d9447ccd53a9a964250c3414c3656d9/numerica-3.0.0/src/domains/backend/float.rs:17:5
  799. 536.80 s [alphal00p-docs-cargo] |
  800. 536.80 s [alphal00p-docs-cargo] 15 | #[cfg(feature = "float-mpfr")]
  801. 536.80 s [alphal00p-docs-cargo] | ---------------------- the item is gated behind the `float-mpfr` feature
  802. 536.80 s [alphal00p-docs-cargo] 16 | pub use rug::{
  803. 536.80 s [alphal00p-docs-cargo] 17 | Assign, Float as MultiPrecisionFloat, Rational as BackendRational,
  804. 536.80 s [alphal00p-docs-cargo] | ^^^^^^
  805. 536.80 s [alphal00p-docs-cargo] note: found an item that was configured out
  806. 536.80 s [alphal00p-docs-cargo] --> /nix/store/9rqk4093qnvgswmdk1pbxk9najcrjn7a-vendor-cargo-deps/bc87b2b0f37b9a43ffdd82e8f11f3e864d9447ccd53a9a964250c3414c3656d9/numerica-3.0.0/src/domains/backend/float.rs:1578:5
  807. 536.80 s [alphal00p-docs-cargo] |
  808. 536.80 s [alphal00p-docs-cargo] 1576 | #[cfg(feature = "float-astro")]
  809. 536.80 s [alphal00p-docs-cargo] | ----------------------- the item is gated behind the `float-astro` feature
  810. 536.80 s [alphal00p-docs-cargo] 1577 | pub use astro::{
  811. 536.80 s [alphal00p-docs-cargo] 1578 | Assign, BackendRational, CompleteRound, Constant, IntoMultiPrecisionFloat, MultiPrecisionFloat,
  812. 536.80 s [alphal00p-docs-cargo] | ^^^^^^
  813. 536.80 s [alphal00p-docs-cargo] note: found an item that was configured out
  814. 536.80 s [alphal00p-docs-cargo] --> /nix/store/9rqk4093qnvgswmdk1pbxk9najcrjn7a-vendor-cargo-deps/bc87b2b0f37b9a43ffdd82e8f11f3e864d9447ccd53a9a964250c3414c3656d9/numerica-3.0.0/src/domains/backend/float.rs:19:11
  815. 536.80 s [alphal00p-docs-cargo] |
  816. 536.80 s [alphal00p-docs-cargo] 15 | #[cfg(feature = "float-mpfr")]
  817. 536.80 s [alphal00p-docs-cargo] | ---------------------- the item is gated behind the `float-mpfr` feature
  818. 536.80 s [alphal00p-docs-cargo] ...
  819. 536.80 s [alphal00p-docs-cargo] 19 | ops::{CompleteRound, Pow},
  820. 536.80 s [alphal00p-docs-cargo] | ^^^^^^^^^^^^^
  821. 536.80 s [alphal00p-docs-cargo] note: found an item that was configured out
  822. 536.80 s [alphal00p-docs-cargo] --> /nix/store/9rqk4093qnvgswmdk1pbxk9najcrjn7a-vendor-cargo-deps/bc87b2b0f37b9a43ffdd82e8f11f3e864d9447ccd53a9a964250c3414c3656d9/numerica-3.0.0/src/domains/backend/float.rs:1578:30
  823. 536.80 s [alphal00p-docs-cargo] |
  824. 536.80 s [alphal00p-docs-cargo] 1576 | #[cfg(feature = "float-astro")]
  825. 536.80 s [alphal00p-docs-cargo] | ----------------------- the item is gated behind the `float-astro` feature
  826. 536.80 s [alphal00p-docs-cargo] 1577 | pub use astro::{
  827. 536.81 s [alphal00p-docs-cargo] 1578 | Assign, BackendRational, CompleteRound, Constant, IntoMultiPrecisionFloat, MultiPrecisionFloat,
  828. 536.81 s [alphal00p-docs-cargo] | ^^^^^^^^^^^^^
  829. 536.81 s [alphal00p-docs-cargo] note: found an item that was configured out
  830. 536.81 s [alphal00p-docs-cargo] --> /nix/store/9rqk4093qnvgswmdk1pbxk9najcrjn7a-vendor-cargo-deps/bc87b2b0f37b9a43ffdd82e8f11f3e864d9447ccd53a9a964250c3414c3656d9/numerica-3.0.0/src/domains/backend/float.rs:18:12
  831. 536.81 s [alphal00p-docs-cargo] |
  832. 536.81 s [alphal00p-docs-cargo] 15 | #[cfg(feature = "float-mpfr")]
  833. 536.81 s [alphal00p-docs-cargo] | ---------------------- the item is gated behind the `float-mpfr` feature
  834. 536.81 s [alphal00p-docs-cargo] ...
  835. 536.81 s [alphal00p-docs-cargo] 18 | float::Constant,
  836. 536.81 s [alphal00p-docs-cargo] | ^^^^^^^^
  837. 536.81 s [alphal00p-docs-cargo] note: found an item that was configured out
  838. 536.81 s [alphal00p-docs-cargo] --> /nix/store/9rqk4093qnvgswmdk1pbxk9najcrjn7a-vendor-cargo-deps/bc87b2b0f37b9a43ffdd82e8f11f3e864d9447ccd53a9a964250c3414c3656d9/numerica-3.0.0/src/domains/backend/float.rs:1578:45
  839. 536.81 s [alphal00p-docs-cargo] |
  840. 536.81 s [alphal00p-docs-cargo] 1576 | #[cfg(feature = "float-astro")]
  841. 536.81 s [alphal00p-docs-cargo] | ----------------------- the item is gated behind the `float-astro` feature
  842. 536.81 s [alphal00p-docs-cargo] 1577 | pub use astro::{
  843. 536.81 s [alphal00p-docs-cargo] 1578 | Assign, BackendRational, CompleteRound, Constant, IntoMultiPrecisionFloat, MultiPrecisionFloat,
  844. 536.81 s [alphal00p-docs-cargo] | ^^^^^^^^
  845. 536.81 s [alphal00p-docs-cargo] note: found an item that was configured out
  846. 536.81 s [alphal00p-docs-cargo] --> /nix/store/9rqk4093qnvgswmdk1pbxk9najcrjn7a-vendor-cargo-deps/bc87b2b0f37b9a43ffdd82e8f11f3e864d9447ccd53a9a964250c3414c3656d9/numerica-3.0.0/src/domains/backend/float.rs:17:22
  847. 536.81 s [alphal00p-docs-cargo] |
  848. 536.81 s [alphal00p-docs-cargo] 15 | #[cfg(feature = "float-mpfr")]
  849. 536.81 s [alphal00p-docs-cargo] | ---------------------- the item is gated behind the `float-mpfr` feature
  850. 536.81 s [alphal00p-docs-cargo] 16 | pub use rug::{
  851. 536.81 s [alphal00p-docs-cargo] 17 | Assign, Float as MultiPrecisionFloat, Rational as BackendRational,
  852. 536.81 s [alphal00p-docs-cargo] | ^^^^^^^^^^^^^^^^^^^
  853. 536.81 s [alphal00p-docs-cargo] note: found an item that was configured out
  854. 536.81 s [alphal00p-docs-cargo] --> /nix/store/9rqk4093qnvgswmdk1pbxk9najcrjn7a-vendor-cargo-deps/bc87b2b0f37b9a43ffdd82e8f11f3e864d9447ccd53a9a964250c3414c3656d9/numerica-3.0.0/src/domains/backend/float.rs:1578:80
  855. 536.81 s [alphal00p-docs-cargo] |
  856. 536.81 s [alphal00p-docs-cargo] 1576 | #[cfg(feature = "float-astro")]
  857. 536.81 s [alphal00p-docs-cargo] | ----------------------- the item is gated behind the `float-astro` feature
  858. 536.81 s [alphal00p-docs-cargo] 1577 | pub use astro::{
  859. 536.81 s [alphal00p-docs-cargo] 1578 | Assign, BackendRational, CompleteRound, Constant, IntoMultiPrecisionFloat, MultiPrecisionFloat,
  860. 536.81 s [alphal00p-docs-cargo] | ^^^^^^^^^^^^^^^^^^^
  861. 536.81 s [alphal00p-docs-cargo] note: found an item that was configured out
  862. 536.81 s [alphal00p-docs-cargo] --> /nix/store/9rqk4093qnvgswmdk1pbxk9najcrjn7a-vendor-cargo-deps/bc87b2b0f37b9a43ffdd82e8f11f3e864d9447ccd53a9a964250c3414c3656d9/numerica-3.0.0/src/domains/backend/float.rs:19:26
  863. 536.81 s [alphal00p-docs-cargo] |
  864. 536.81 s [alphal00p-docs-cargo] 15 | #[cfg(feature = "float-mpfr")]
  865. 536.81 s [alphal00p-docs-cargo] | ---------------------- the item is gated behind the `float-mpfr` feature
  866. 536.81 s [alphal00p-docs-cargo] ...
  867. 536.81 s [alphal00p-docs-cargo] 19 | ops::{CompleteRound, Pow},
  868. 536.81 s [alphal00p-docs-cargo] | ^^^
  869. 536.81 s [alphal00p-docs-cargo] note: found an item that was configured out
  870. 536.81 s [alphal00p-docs-cargo] --> /nix/store/9rqk4093qnvgswmdk1pbxk9najcrjn7a-vendor-cargo-deps/bc87b2b0f37b9a43ffdd82e8f11f3e864d9447ccd53a9a964250c3414c3656d9/numerica-3.0.0/src/domains/backend/float.rs:1579:5
  871. 536.81 s [alphal00p-docs-cargo] |
  872. 536.81 s [alphal00p-docs-cargo] 1576 | #[cfg(feature = "float-astro")]
  873. 536.81 s [alphal00p-docs-cargo] | ----------------------- the item is gated behind the `float-astro` feature
  874. 536.81 s [alphal00p-docs-cargo] ...
  875. 536.81 s [alphal00p-docs-cargo] 1579 | Pow,
  876. 536.81 s [alphal00p-docs-cargo] | ^^^
  877. 536.81 s [alphal00p-docs-cargo]
  878. 537.71 s [alphal00p-docs-cargo] error[E0425]: cannot find type `RawMultiPrecisionInteger` in this scope
  879. 537.71 s [alphal00p-docs-cargo] --> /nix/store/9rqk4093qnvgswmdk1pbxk9najcrjn7a-vendor-cargo-deps/bc87b2b0f37b9a43ffdd82e8f11f3e864d9447ccd53a9a964250c3414c3656d9/numerica-3.0.0/src/domains/backend/integer.rs:52:38
  880. 537.71 s [alphal00p-docs-cargo] |
  881. 537.71 s [alphal00p-docs-cargo] 52 | pub struct MultiPrecisionInteger(RawMultiPrecisionInteger);
  882. 537.71 s [alphal00p-docs-cargo] | ^^^^^^^^^^^^^^^^^^^^^^^^ not found in this scope
  883. 537.71 s [alphal00p-docs-cargo]
  884. 537.73 s [alphal00p-docs-cargo] error[E0425]: cannot find type `RawMultiPrecisionInteger` in this scope
  885. 537.73 s [alphal00p-docs-cargo] --> /nix/store/9rqk4093qnvgswmdk1pbxk9najcrjn7a-vendor-cargo-deps/bc87b2b0f37b9a43ffdd82e8f11f3e864d9447ccd53a9a964250c3414c3656d9/numerica-3.0.0/src/domains/backend/integer.rs:52:38
  886. 537.73 s [alphal00p-docs-cargo] |
  887. 537.73 s [alphal00p-docs-cargo] 52 | pub struct MultiPrecisionInteger(RawMultiPrecisionInteger);
  888. 537.73 s [alphal00p-docs-cargo] | ^^^^^^^^^^^^^^^^^^^^^^^^ not found in this scope
  889. 537.73 s [alphal00p-docs-cargo] |
  890. 537.73 s [alphal00p-docs-cargo] help: you might be missing a type parameter
  891. 537.73 s [alphal00p-docs-cargo] |
  892. 537.73 s [alphal00p-docs-cargo] 52 | pub struct MultiPrecisionInteger<RawMultiPrecisionInteger>(RawMultiPrecisionInteger);
  893. 537.73 s [alphal00p-docs-cargo] | ++++++++++++++++++++++++++
  894. 537.73 s [alphal00p-docs-cargo]
  895. 537.76 s [alphal00p-docs-cargo] error[E0425]: cannot find type `RawMultiPrecisionInteger` in this scope
  896. 537.76 s [alphal00p-docs-cargo] --> /nix/store/9rqk4093qnvgswmdk1pbxk9najcrjn7a-vendor-cargo-deps/bc87b2b0f37b9a43ffdd82e8f11f3e864d9447ccd53a9a964250c3414c3656d9/numerica-3.0.0/src/domains/backend/integer.rs:149:32
  897. 537.76 s [alphal00p-docs-cargo] |
  898. 537.76 s [alphal00p-docs-cargo] 52 | pub struct MultiPrecisionInteger(RawMultiPrecisionInteger);
  899. 537.76 s [alphal00p-docs-cargo] | ----------------------------------------------------------- similarly named struct `MultiPrecisionInteger` defined here
  900. 537.76 s [alphal00p-docs-cargo] ...
  901. 537.76 s [alphal00p-docs-cargo] 149 | pub fn from_raw(value: RawMultiPrecisionInteger) -> Self {
  902. 537.76 s [alphal00p-docs-cargo] | ^^^^^^^^^^^^^^^^^^^^^^^^
  903. 537.76 s [alphal00p-docs-cargo] |
  904. 537.76 s [alphal00p-docs-cargo] help: a struct with a similar name exists
  905. 537.76 s [alphal00p-docs-cargo] |
  906. 537.76 s [alphal00p-docs-cargo] 149 - pub fn from_raw(value: RawMultiPrecisionInteger) -> Self {
  907. 537.76 s [alphal00p-docs-cargo] 149 + pub fn from_raw(value: MultiPrecisionInteger) -> Self {
  908. 537.76 s [alphal00p-docs-cargo] |
  909. 537.76 s [alphal00p-docs-cargo]
  910. 537.78 s [alphal00p-docs-cargo] error[E0425]: cannot find type `RawMultiPrecisionInteger` in this scope
  911. 537.78 s [alphal00p-docs-cargo] --> /nix/store/9rqk4093qnvgswmdk1pbxk9najcrjn7a-vendor-cargo-deps/bc87b2b0f37b9a43ffdd82e8f11f3e864d9447ccd53a9a964250c3414c3656d9/numerica-3.0.0/src/domains/backend/integer.rs:187:34
  912. 537.78 s [alphal00p-docs-cargo] |
  913. 537.78 s [alphal00p-docs-cargo] 52 | pub struct MultiPrecisionInteger(RawMultiPrecisionInteger);
  914. 537.78 s [alphal00p-docs-cargo] | ----------------------------------------------------------- similarly named struct `MultiPrecisionInteger` defined here
  915. 537.78 s [alphal00p-docs-cargo] ...
  916. 537.78 s [alphal00p-docs-cargo] 187 | pub fn as_raw(&self) -> &RawMultiPrecisionInteger {
  917. 537.78 s [alphal00p-docs-cargo] | ^^^^^^^^^^^^^^^^^^^^^^^^
  918. 537.78 s [alphal00p-docs-cargo] |
  919. 537.78 s [alphal00p-docs-cargo] help: a struct with a similar name exists
  920. 537.78 s [alphal00p-docs-cargo] |
  921. 537.78 s [alphal00p-docs-cargo] 187 - pub fn as_raw(&self) -> &RawMultiPrecisionInteger {
  922. 537.78 s [alphal00p-docs-cargo] 187 + pub fn as_raw(&self) -> &MultiPrecisionInteger {
  923. 537.78 s [alphal00p-docs-cargo] |
  924. 537.78 s [alphal00p-docs-cargo]
  925. 537.80 s [alphal00p-docs-cargo] error[E0425]: cannot find type `RawMultiPrecisionInteger` in this scope
  926. 537.80 s [alphal00p-docs-cargo] --> /nix/store/9rqk4093qnvgswmdk1pbxk9najcrjn7a-vendor-cargo-deps/bc87b2b0f37b9a43ffdd82e8f11f3e864d9447ccd53a9a964250c3414c3656d9/numerica-3.0.0/src/domains/backend/integer.rs:193:33
  927. 537.80 s [alphal00p-docs-cargo] |
  928. 537.80 s [alphal00p-docs-cargo] 52 | pub struct MultiPrecisionInteger(RawMultiPrecisionInteger);
  929. 537.80 s [alphal00p-docs-cargo] | ----------------------------------------------------------- similarly named struct `MultiPrecisionInteger` defined here
  930. 537.80 s [alphal00p-docs-cargo] ...
  931. 537.80 s [alphal00p-docs-cargo] 193 | pub fn to_raw(&self) -> RawMultiPrecisionInteger {
  932. 537.80 s [alphal00p-docs-cargo] | ^^^^^^^^^^^^^^^^^^^^^^^^
  933. 537.80 s [alphal00p-docs-cargo] |
  934. 537.80 s [alphal00p-docs-cargo] help: a struct with a similar name exists
  935. 537.80 s [alphal00p-docs-cargo] |
  936. 537.80 s [alphal00p-docs-cargo] 193 - pub fn to_raw(&self) -> RawMultiPrecisionInteger {
  937. 537.80 s [alphal00p-docs-cargo] 193 + pub fn to_raw(&self) -> MultiPrecisionInteger {
  938. 537.80 s [alphal00p-docs-cargo] |
  939. 537.80 s [alphal00p-docs-cargo]
  940. 537.81 s [alphal00p-docs-cargo] error[E0425]: cannot find type `RawMultiPrecisionInteger` in this scope
  941. 537.81 s [alphal00p-docs-cargo] --> /nix/store/9rqk4093qnvgswmdk1pbxk9najcrjn7a-vendor-cargo-deps/bc87b2b0f37b9a43ffdd82e8f11f3e864d9447ccd53a9a964250c3414c3656d9/numerica-3.0.0/src/domains/backend/integer.rs:199:34
  942. 537.81 s [alphal00p-docs-cargo] |
  943. 537.82 s [alphal00p-docs-cargo] 52 | pub struct MultiPrecisionInteger(RawMultiPrecisionInteger);
  944. 537.82 s [alphal00p-docs-cargo] | ----------------------------------------------------------- similarly named struct `MultiPrecisionInteger` defined here
  945. 537.82 s [alphal00p-docs-cargo] ...
  946. 537.82 s [alphal00p-docs-cargo] 199 | pub fn into_raw(self) -> RawMultiPrecisionInteger {
  947. 537.82 s [alphal00p-docs-cargo] | ^^^^^^^^^^^^^^^^^^^^^^^^
  948. 537.82 s [alphal00p-docs-cargo] |
  949. 537.82 s [alphal00p-docs-cargo] help: a struct with a similar name exists
  950. 537.82 s [alphal00p-docs-cargo] |
  951. 537.82 s [alphal00p-docs-cargo] 199 - pub fn into_raw(self) -> RawMultiPrecisionInteger {
  952. 537.82 s [alphal00p-docs-cargo] 199 + pub fn into_raw(self) -> MultiPrecisionInteger {
  953. 537.82 s [alphal00p-docs-cargo] |
  954. 537.82 s [alphal00p-docs-cargo]
  955. 537.84 s [alphal00p-docs-cargo] error[E0425]: cannot find type `RawMultiPrecisionInteger` in this scope
  956. 537.84 s [alphal00p-docs-cargo] --> /nix/store/9rqk4093qnvgswmdk1pbxk9najcrjn7a-vendor-cargo-deps/bc87b2b0f37b9a43ffdd82e8f11f3e864d9447ccd53a9a964250c3414c3656d9/numerica-3.0.0/src/domains/backend/integer.rs:567:27
  957. 537.84 s [alphal00p-docs-cargo] |
  958. 537.84 s [alphal00p-docs-cargo] 52 | pub struct MultiPrecisionInteger(RawMultiPrecisionInteger);
  959. 537.84 s [alphal00p-docs-cargo] | ----------------------------------------------------------- similarly named struct `MultiPrecisionInteger` defined here
  960. 537.84 s [alphal00p-docs-cargo] ...
  961. 537.84 s [alphal00p-docs-cargo] 567 | fn rem_trunc(lhs: RawMultiPrecisionInteger, rhs: RawMultiPrecisionInteger) -> Self {
  962. 537.84 s [alphal00p-docs-cargo] | ^^^^^^^^^^^^^^^^^^^^^^^^
  963. 537.84 s [alphal00p-docs-cargo] |
  964. 537.84 s [alphal00p-docs-cargo] help: a struct with a similar name exists
  965. 537.84 s [alphal00p-docs-cargo] |
  966. 537.84 s [alphal00p-docs-cargo] 567 - fn rem_trunc(lhs: RawMultiPrecisionInteger, rhs: RawMultiPrecisionInteger) -> Self {
  967. 537.84 s [alphal00p-docs-cargo] 567 + fn rem_trunc(lhs: MultiPrecisionInteger, rhs: RawMultiPrecisionInteger) -> Self {
  968. 537.84 s [alphal00p-docs-cargo] |
  969. 537.84 s [alphal00p-docs-cargo]
  970. 537.85 s [alphal00p-docs-cargo] error[E0425]: cannot find type `RawMultiPrecisionInteger` in this scope
  971. 537.85 s [alphal00p-docs-cargo] --> /nix/store/9rqk4093qnvgswmdk1pbxk9najcrjn7a-vendor-cargo-deps/bc87b2b0f37b9a43ffdd82e8f11f3e864d9447ccd53a9a964250c3414c3656d9/numerica-3.0.0/src/domains/backend/integer.rs:567:58
  972. 537.85 s [alphal00p-docs-cargo] |
  973. 537.85 s [alphal00p-docs-cargo] 52 | pub struct MultiPrecisionInteger(RawMultiPrecisionInteger);
  974. 537.85 s [alphal00p-docs-cargo] | ----------------------------------------------------------- similarly named struct `MultiPrecisionInteger` defined here
  975. 537.85 s [alphal00p-docs-cargo] ...
  976. 537.85 s [alphal00p-docs-cargo] 567 | fn rem_trunc(lhs: RawMultiPrecisionInteger, rhs: RawMultiPrecisionInteger) -> Self {
  977. 537.85 s [alphal00p-docs-cargo] | ^^^^^^^^^^^^^^^^^^^^^^^^
  978. 537.85 s [alphal00p-docs-cargo] |
  979. 537.85 s [alphal00p-docs-cargo] help: a struct with a similar name exists
  980. 537.85 s [alphal00p-docs-cargo] |
  981. 537.85 s [alphal00p-docs-cargo] 567 - fn rem_trunc(lhs: RawMultiPrecisionInteger, rhs: RawMultiPrecisionInteger) -> Self {
  982. 537.85 s [alphal00p-docs-cargo] 567 + fn rem_trunc(lhs: RawMultiPrecisionInteger, rhs: MultiPrecisionInteger) -> Self {
  983. 537.85 s [alphal00p-docs-cargo] |
  984. 537.85 s [alphal00p-docs-cargo]
  985. 537.87 s [alphal00p-docs-cargo] error[E0425]: cannot find type `RawMultiPrecisionInteger` in this scope
  986. 537.87 s [alphal00p-docs-cargo] --> /nix/store/9rqk4093qnvgswmdk1pbxk9najcrjn7a-vendor-cargo-deps/bc87b2b0f37b9a43ffdd82e8f11f3e864d9447ccd53a9a964250c3414c3656d9/numerica-3.0.0/src/domains/backend/integer.rs:582:27
  987. 537.87 s [alphal00p-docs-cargo] |
  988. 537.87 s [alphal00p-docs-cargo] 52 | pub struct MultiPrecisionInteger(RawMultiPrecisionInteger);
  989. 537.87 s [alphal00p-docs-cargo] | ----------------------------------------------------------- similarly named struct `MultiPrecisionInteger` defined here
  990. 537.87 s [alphal00p-docs-cargo] ...
  991. 537.87 s [alphal00p-docs-cargo] 582 | fn shl_raw(value: RawMultiPrecisionInteger, rhs: u64) -> RawMultiPrecisionInteger {
  992. 537.87 s [alphal00p-docs-cargo] | ^^^^^^^^^^^^^^^^^^^^^^^^
  993. 537.87 s [alphal00p-docs-cargo] |
  994. 537.87 s [alphal00p-docs-cargo] help: a struct with a similar name exists
  995. 537.87 s [alphal00p-docs-cargo] |
  996. 537.87 s [alphal00p-docs-cargo] 582 - fn shl_raw(value: RawMultiPrecisionInteger, rhs: u64) -> RawMultiPrecisionInteger {
  997. 537.87 s [alphal00p-docs-cargo] 582 + fn shl_raw(value: MultiPrecisionInteger, rhs: u64) -> RawMultiPrecisionInteger {
  998. 537.87 s [alphal00p-docs-cargo] |
  999. 537.87 s [alphal00p-docs-cargo]
  1000. 537.88 s [alphal00p-docs-cargo] error[E0425]: cannot find type `RawMultiPrecisionInteger` in this scope
  1001. 537.88 s [alphal00p-docs-cargo] --> /nix/store/9rqk4093qnvgswmdk1pbxk9najcrjn7a-vendor-cargo-deps/bc87b2b0f37b9a43ffdd82e8f11f3e864d9447ccd53a9a964250c3414c3656d9/numerica-3.0.0/src/domains/backend/integer.rs:582:66
  1002. 537.88 s [alphal00p-docs-cargo] |
  1003. 537.88 s [alphal00p-docs-cargo] 52 | pub struct MultiPrecisionInteger(RawMultiPrecisionInteger);
  1004. 537.88 s [alphal00p-docs-cargo] | ----------------------------------------------------------- similarly named struct `MultiPrecisionInteger` defined here
  1005. 537.88 s [alphal00p-docs-cargo] ...
  1006. 537.88 s [alphal00p-docs-cargo] 582 | fn shl_raw(value: RawMultiPrecisionInteger, rhs: u64) -> RawMultiPrecisionInteger {
  1007. 537.88 s [alphal00p-docs-cargo] | ^^^^^^^^^^^^^^^^^^^^^^^^
  1008. 537.88 s [alphal00p-docs-cargo] |
  1009. 537.88 s [alphal00p-docs-cargo] help: a struct with a similar name exists
  1010. 537.88 s [alphal00p-docs-cargo] |
  1011. 537.88 s [alphal00p-docs-cargo] 582 - fn shl_raw(value: RawMultiPrecisionInteger, rhs: u64) -> RawMultiPrecisionInteger {
  1012. 537.88 s [alphal00p-docs-cargo] 582 + fn shl_raw(value: RawMultiPrecisionInteger, rhs: u64) -> MultiPrecisionInteger {
  1013. 537.88 s [alphal00p-docs-cargo] |
  1014. 537.88 s [alphal00p-docs-cargo]
  1015. 537.90 s [alphal00p-docs-cargo] error[E0425]: cannot find type `RawMultiPrecisionInteger` in this scope
  1016. 537.90 s [alphal00p-docs-cargo] --> /nix/store/9rqk4093qnvgswmdk1pbxk9najcrjn7a-vendor-cargo-deps/bc87b2b0f37b9a43ffdd82e8f11f3e864d9447ccd53a9a964250c3414c3656d9/numerica-3.0.0/src/domains/backend/integer.rs:590:27
  1017. 537.90 s [alphal00p-docs-cargo] |
  1018. 537.90 s [alphal00p-docs-cargo] 52 | pub struct MultiPrecisionInteger(RawMultiPrecisionInteger);
  1019. 537.90 s [alphal00p-docs-cargo] | ----------------------------------------------------------- similarly named struct `MultiPrecisionInteger` defined here
  1020. 537.90 s [alphal00p-docs-cargo] ...
  1021. 537.90 s [alphal00p-docs-cargo] 590 | fn shr_raw(value: RawMultiPrecisionInteger, rhs: u64) -> RawMultiPrecisionInteger {
  1022. 537.90 s [alphal00p-docs-cargo] | ^^^^^^^^^^^^^^^^^^^^^^^^
  1023. 537.90 s [alphal00p-docs-cargo] |
  1024. 537.90 s [alphal00p-docs-cargo] help: a struct with a similar name exists
  1025. 537.90 s [alphal00p-docs-cargo] |
  1026. 537.90 s [alphal00p-docs-cargo] 590 - fn shr_raw(value: RawMultiPrecisionInteger, rhs: u64) -> RawMultiPrecisionInteger {
  1027. 537.90 s [alphal00p-docs-cargo] 590 + fn shr_raw(value: MultiPrecisionInteger, rhs: u64) -> RawMultiPrecisionInteger {
  1028. 537.90 s [alphal00p-docs-cargo] |
  1029. 537.90 s [alphal00p-docs-cargo]
  1030. 537.92 s [alphal00p-docs-cargo] error[E0425]: cannot find type `RawMultiPrecisionInteger` in this scope
  1031. 537.92 s [alphal00p-docs-cargo] --> /nix/store/9rqk4093qnvgswmdk1pbxk9najcrjn7a-vendor-cargo-deps/bc87b2b0f37b9a43ffdd82e8f11f3e864d9447ccd53a9a964250c3414c3656d9/numerica-3.0.0/src/domains/backend/integer.rs:590:66
  1032. 537.92 s [alphal00p-docs-cargo] |
  1033. 537.92 s [alphal00p-docs-cargo] 52 | pub struct MultiPrecisionInteger(RawMultiPrecisionInteger);
  1034. 537.92 s [alphal00p-docs-cargo] | ----------------------------------------------------------- similarly named struct `MultiPrecisionInteger` defined here
  1035. 537.92 s [alphal00p-docs-cargo] ...
  1036. 537.92 s [alphal00p-docs-cargo] 590 | fn shr_raw(value: RawMultiPrecisionInteger, rhs: u64) -> RawMultiPrecisionInteger {
  1037. 537.92 s [alphal00p-docs-cargo] | ^^^^^^^^^^^^^^^^^^^^^^^^
  1038. 537.92 s [alphal00p-docs-cargo] |
  1039. 537.92 s [alphal00p-docs-cargo] help: a struct with a similar name exists
  1040. 537.92 s [alphal00p-docs-cargo] |
  1041. 537.92 s [alphal00p-docs-cargo] 590 - fn shr_raw(value: RawMultiPrecisionInteger, rhs: u64) -> RawMultiPrecisionInteger {
  1042. 537.92 s [alphal00p-docs-cargo] 590 + fn shr_raw(value: RawMultiPrecisionInteger, rhs: u64) -> MultiPrecisionInteger {
  1043. 537.92 s [alphal00p-docs-cargo] |
  1044. 537.92 s [alphal00p-docs-cargo]
  1045. 537.94 s [alphal00p-docs-cargo] error[E0425]: cannot find type `RawMultiPrecisionInteger` in this scope
  1046. 537.94 s [alphal00p-docs-cargo] --> /nix/store/9rqk4093qnvgswmdk1pbxk9najcrjn7a-vendor-cargo-deps/bc87b2b0f37b9a43ffdd82e8f11f3e864d9447ccd53a9a964250c3414c3656d9/numerica-3.0.0/src/domains/backend/integer.rs:654:15
  1047. 537.94 s [alphal00p-docs-cargo] |
  1048. 537.94 s [alphal00p-docs-cargo] 52 | pub struct MultiPrecisionInteger(RawMultiPrecisionInteger);
  1049. 537.94 s [alphal00p-docs-cargo] | ----------------------------------------------------------- similarly named struct `MultiPrecisionInteger` defined here
  1050. 537.94 s [alphal00p-docs-cargo] ...
  1051. 537.94 s [alphal00p-docs-cargo] 654 | impl From<RawMultiPrecisionInteger> for MultiPrecisionInteger {
  1052. 537.94 s [alphal00p-docs-cargo] | ^^^^^^^^^^^^^^^^^^^^^^^^
  1053. 537.94 s [alphal00p-docs-cargo] |
  1054. 537.94 s [alphal00p-docs-cargo] help: a struct with a similar name exists
  1055. 537.94 s [alphal00p-docs-cargo] |
  1056. 537.94 s [alphal00p-docs-cargo] 654 - impl From<RawMultiPrecisionInteger> for MultiPrecisionInteger {
  1057. 537.94 s [alphal00p-docs-cargo] 654 + impl From<MultiPrecisionInteger> for MultiPrecisionInteger {
  1058. 537.94 s [alphal00p-docs-cargo] |
  1059. 537.94 s [alphal00p-docs-cargo] help: you might be missing a type parameter
  1060. 537.94 s [alphal00p-docs-cargo] |
  1061. 537.94 s [alphal00p-docs-cargo] 654 | impl<RawMultiPrecisionInteger> From<RawMultiPrecisionInteger> for MultiPrecisionInteger {
  1062. 537.94 s [alphal00p-docs-cargo] | ++++++++++++++++++++++++++
  1063. 537.94 s [alphal00p-docs-cargo]
  1064. 537.95 s [alphal00p-docs-cargo] error[E0425]: cannot find type `RawMultiPrecisionInteger` in this scope
  1065. 537.95 s [alphal00p-docs-cargo] --> /nix/store/9rqk4093qnvgswmdk1pbxk9najcrjn7a-vendor-cargo-deps/bc87b2b0f37b9a43ffdd82e8f11f3e864d9447ccd53a9a964250c3414c3656d9/numerica-3.0.0/src/domains/backend/integer.rs:656:24
  1066. 537.95 s [alphal00p-docs-cargo] |
  1067. 537.95 s [alphal00p-docs-cargo] 52 | pub struct MultiPrecisionInteger(RawMultiPrecisionInteger);
  1068. 537.95 s [alphal00p-docs-cargo] | ----------------------------------------------------------- similarly named struct `MultiPrecisionInteger` defined here
  1069. 537.95 s [alphal00p-docs-cargo] ...
  1070. 537.95 s [alphal00p-docs-cargo] 656 | fn from(value: RawMultiPrecisionInteger) -> Self {
  1071. 537.95 s [alphal00p-docs-cargo] | ^^^^^^^^^^^^^^^^^^^^^^^^
  1072. 537.95 s [alphal00p-docs-cargo] |
  1073. 537.95 s [alphal00p-docs-cargo] help: a struct with a similar name exists
  1074. 537.95 s [alphal00p-docs-cargo] |
  1075. 537.95 s [alphal00p-docs-cargo] 656 - fn from(value: RawMultiPrecisionInteger) -> Self {
  1076. 537.95 s [alphal00p-docs-cargo] 656 + fn from(value: MultiPrecisionInteger) -> Self {
  1077. 537.95 s [alphal00p-docs-cargo] |
  1078. 537.95 s [alphal00p-docs-cargo]
  1079. 537.97 s [alphal00p-docs-cargo] error[E0425]: cannot find type `RawMultiPrecisionInteger` in this scope
  1080. 537.97 s [alphal00p-docs-cargo] --> /nix/store/9rqk4093qnvgswmdk1pbxk9najcrjn7a-vendor-cargo-deps/bc87b2b0f37b9a43ffdd82e8f11f3e864d9447ccd53a9a964250c3414c3656d9/numerica-3.0.0/src/domains/backend/integer.rs:661:42
  1081. 537.97 s [alphal00p-docs-cargo] |
  1082. 537.97 s [alphal00p-docs-cargo] 52 | pub struct MultiPrecisionInteger(RawMultiPrecisionInteger);
  1083. 537.97 s [alphal00p-docs-cargo] | ----------------------------------------------------------- similarly named struct `MultiPrecisionInteger` defined here
  1084. 537.97 s [alphal00p-docs-cargo] ...
  1085. 537.97 s [alphal00p-docs-cargo] 661 | impl From<MultiPrecisionInteger> for RawMultiPrecisionInteger {
  1086. 537.97 s [alphal00p-docs-cargo] | ^^^^^^^^^^^^^^^^^^^^^^^^
  1087. 537.97 s [alphal00p-docs-cargo] |
  1088. 537.97 s [alphal00p-docs-cargo] help: a struct with a similar name exists
  1089. 537.97 s [alphal00p-docs-cargo] |
  1090. 537.97 s [alphal00p-docs-cargo] 661 - impl From<MultiPrecisionInteger> for RawMultiPrecisionInteger {
  1091. 537.97 s [alphal00p-docs-cargo] 661 + impl From<MultiPrecisionInteger> for MultiPrecisionInteger {
  1092. 537.97 s [alphal00p-docs-cargo] |
  1093. 537.97 s [alphal00p-docs-cargo]
  1094. 538.88 s [alphal00p-docs-cargo] error[E0433]: cannot find type `RawMultiPrecisionInteger` in this scope
  1095. 538.88 s [alphal00p-docs-cargo] --> /nix/store/9rqk4093qnvgswmdk1pbxk9najcrjn7a-vendor-cargo-deps/bc87b2b0f37b9a43ffdd82e8f11f3e864d9447ccd53a9a964250c3414c3656d9/numerica-3.0.0/src/domains/backend/integer.rs:620:13
  1096. 538.88 s [alphal00p-docs-cargo] |
  1097. 538.88 s [alphal00p-docs-cargo] 620 | RawMultiPrecisionInteger::from_str(s)
  1098. 538.88 s [alphal00p-docs-cargo] | ^^^^^^^^^^^^^^^^^^^^^^^^ use of undeclared type `RawMultiPrecisionInteger`
  1099. 538.88 s [alphal00p-docs-cargo] |
  1100. 538.88 s [alphal00p-docs-cargo] help: a struct with a similar name exists
  1101. 538.88 s [alphal00p-docs-cargo] |
  1102. 538.88 s [alphal00p-docs-cargo] 620 - RawMultiPrecisionInteger::from_str(s)
  1103. 538.88 s [alphal00p-docs-cargo] 620 + MultiPrecisionInteger::from_str(s)
  1104. 538.88 s [alphal00p-docs-cargo] |
  1105. 538.88 s [alphal00p-docs-cargo]
  1106. 538.88 s [alphal00p-docs-cargo] error[E0433]: cannot find type `RawMultiPrecisionInteger` in this scope
  1107. 538.88 s [alphal00p-docs-cargo] --> /nix/store/9rqk4093qnvgswmdk1pbxk9najcrjn7a-vendor-cargo-deps/bc87b2b0f37b9a43ffdd82e8f11f3e864d9447ccd53a9a964250c3414c3656d9/numerica-3.0.0/src/domains/backend/integer.rs:674:35
  1108. 538.88 s [alphal00p-docs-cargo] |
  1109. 538.88 s [alphal00p-docs-cargo] 674 | self.0 == RawMultiPrecisionInteger::from(*other)
  1110. 538.88 s [alphal00p-docs-cargo] | ^^^^^^^^^^^^^^^^^^^^^^^^ use of undeclared type `RawMultiPrecisionInteger`
  1111. 538.88 s [alphal00p-docs-cargo] ...
  1112. 538.88 s [alphal00p-docs-cargo] 702 | impl_cmp_primitive!(i32, i64, i128, u32, u64, u128);
  1113. 538.88 s [alphal00p-docs-cargo] | --------------------------------------------------- in this macro invocation
  1114. 538.88 s [alphal00p-docs-cargo] |
  1115. 538.88 s [alphal00p-docs-cargo] = note: this error originates in the macro `impl_cmp_primitive` (in Nightly builds, run with -Z macro-backtrace for more info)
  1116. 538.88 s [alphal00p-docs-cargo] help: a struct with a similar name exists
  1117. 538.88 s [alphal00p-docs-cargo] |
  1118. 538.88 s [alphal00p-docs-cargo] 674 - self.0 == RawMultiPrecisionInteger::from(*other)
  1119. 538.88 s [alphal00p-docs-cargo] 674 + self.0 == MultiPrecisionInteger::from(*other)
  1120. 538.88 s [alphal00p-docs-cargo] |
  1121. 538.88 s [alphal00p-docs-cargo]
  1122. 538.88 s [alphal00p-docs-cargo] error[E0433]: cannot find type `RawMultiPrecisionInteger` in this scope
  1123. 538.88 s [alphal00p-docs-cargo] --> /nix/store/9rqk4093qnvgswmdk1pbxk9najcrjn7a-vendor-cargo-deps/bc87b2b0f37b9a43ffdd82e8f11f3e864d9447ccd53a9a964250c3414c3656d9/numerica-3.0.0/src/domains/backend/integer.rs:681:25
  1124. 538.88 s [alphal00p-docs-cargo] |
  1125. 538.88 s [alphal00p-docs-cargo] 681 | RawMultiPrecisionInteger::from(*self) == other.0
  1126. 538.88 s [alphal00p-docs-cargo] | ^^^^^^^^^^^^^^^^^^^^^^^^ use of undeclared type `RawMultiPrecisionInteger`
  1127. 538.88 s [alphal00p-docs-cargo] ...
  1128. 538.88 s [alphal00p-docs-cargo] 702 | impl_cmp_primitive!(i32, i64, i128, u32, u64, u128);
  1129. 538.88 s [alphal00p-docs-cargo] | --------------------------------------------------- in this macro invocation
  1130. 538.88 s [alphal00p-docs-cargo] |
  1131. 538.88 s [alphal00p-docs-cargo] = note: this error originates in the macro `impl_cmp_primitive` (in Nightly builds, run with -Z macro-backtrace for more info)
  1132. 538.88 s [alphal00p-docs-cargo] help: a struct with a similar name exists
  1133. 538.88 s [alphal00p-docs-cargo] |
  1134. 538.88 s [alphal00p-docs-cargo] 681 - RawMultiPrecisionInteger::from(*self) == other.0
  1135. 538.88 s [alphal00p-docs-cargo] 681 + MultiPrecisionInteger::from(*self) == other.0
  1136. 538.88 s [alphal00p-docs-cargo] |
  1137. 538.88 s [alphal00p-docs-cargo]
  1138. 538.88 s [alphal00p-docs-cargo] error[E0433]: cannot find type `RawMultiPrecisionInteger` in this scope
  1139. 538.88 s [alphal00p-docs-cargo] --> /nix/store/9rqk4093qnvgswmdk1pbxk9najcrjn7a-vendor-cargo-deps/bc87b2b0f37b9a43ffdd82e8f11f3e864d9447ccd53a9a964250c3414c3656d9/numerica-3.0.0/src/domains/backend/integer.rs:688:45
  1140. 538.88 s [alphal00p-docs-cargo] |
  1141. 538.88 s [alphal00p-docs-cargo] 688 | self.0.partial_cmp(&RawMultiPrecisionInteger::from(*other))
  1142. 538.88 s [alphal00p-docs-cargo] | ^^^^^^^^^^^^^^^^^^^^^^^^ use of undeclared type `RawMultiPrecisionInteger`
  1143. 538.88 s [alphal00p-docs-cargo] ...
  1144. 538.88 s [alphal00p-docs-cargo] 702 | impl_cmp_primitive!(i32, i64, i128, u32, u64, u128);
  1145. 538.88 s [alphal00p-docs-cargo] | --------------------------------------------------- in this macro invocation
  1146. 538.88 s [alphal00p-docs-cargo] |
  1147. 538.88 s [alphal00p-docs-cargo] = note: this error originates in the macro `impl_cmp_primitive` (in Nightly builds, run with -Z macro-backtrace for more info)
  1148. 538.88 s [alphal00p-docs-cargo] help: a struct with a similar name exists
  1149. 538.88 s [alphal00p-docs-cargo] |
  1150. 538.88 s [alphal00p-docs-cargo] 688 - self.0.partial_cmp(&RawMultiPrecisionInteger::from(*other))
  1151. 538.88 s [alphal00p-docs-cargo] 688 + self.0.partial_cmp(&MultiPrecisionInteger::from(*other))
  1152. 538.88 s [alphal00p-docs-cargo] |
  1153. 538.88 s [alphal00p-docs-cargo]
  1154. 538.88 s [alphal00p-docs-cargo] error[E0433]: cannot find type `RawMultiPrecisionInteger` in this scope
  1155. 538.88 s [alphal00p-docs-cargo] --> /nix/store/9rqk4093qnvgswmdk1pbxk9najcrjn7a-vendor-cargo-deps/bc87b2b0f37b9a43ffdd82e8f11f3e864d9447ccd53a9a964250c3414c3656d9/numerica-3.0.0/src/domains/backend/integer.rs:695:25
  1156. 538.88 s [alphal00p-docs-cargo] |
  1157. 538.88 s [alphal00p-docs-cargo] 695 | RawMultiPrecisionInteger::from(*self).partial_cmp(&other.0)
  1158. 538.88 s [alphal00p-docs-cargo] | ^^^^^^^^^^^^^^^^^^^^^^^^ use of undeclared type `RawMultiPrecisionInteger`
  1159. 538.88 s [alphal00p-docs-cargo] ...
  1160. 538.88 s [alphal00p-docs-cargo] 702 | impl_cmp_primitive!(i32, i64, i128, u32, u64, u128);
  1161. 538.88 s [alphal00p-docs-cargo] | --------------------------------------------------- in this macro invocation
  1162. 538.88 s [alphal00p-docs-cargo] |
  1163. 538.88 s [alphal00p-docs-cargo] = note: this error originates in the macro `impl_cmp_primitive` (in Nightly builds, run with -Z macro-backtrace for more info)
  1164. 538.88 s [alphal00p-docs-cargo] help: a struct with a similar name exists
  1165. 538.88 s [alphal00p-docs-cargo] |
  1166. 538.88 s [alphal00p-docs-cargo] 695 - RawMultiPrecisionInteger::from(*self).partial_cmp(&other.0)
  1167. 538.88 s [alphal00p-docs-cargo] 695 + MultiPrecisionInteger::from(*self).partial_cmp(&other.0)
  1168. 538.88 s [alphal00p-docs-cargo] |
  1169. 538.88 s [alphal00p-docs-cargo]
  1170. 538.88 s [alphal00p-docs-cargo] error[E0433]: cannot find type `RawMultiPrecisionInteger` in this scope
  1171. 538.88 s [alphal00p-docs-cargo] --> /nix/store/9rqk4093qnvgswmdk1pbxk9najcrjn7a-vendor-cargo-deps/bc87b2b0f37b9a43ffdd82e8f11f3e864d9447ccd53a9a964250c3414c3656d9/numerica-3.0.0/src/domains/backend/integer.rs:1180:35
  1172. 538.88 s [alphal00p-docs-cargo] |
  1173. 538.88 s [alphal00p-docs-cargo] 1180 | MultiPrecisionInteger(RawMultiPrecisionInteger::from((&self.0) & &rhs.0))
  1174. 538.88 s [alphal00p-docs-cargo] | ^^^^^^^^^^^^^^^^^^^^^^^^ use of undeclared type `RawMultiPrecisionInteger`
  1175. 538.88 s [alphal00p-docs-cargo] |
  1176. 538.88 s [alphal00p-docs-cargo] help: a struct with a similar name exists
  1177. 538.88 s [alphal00p-docs-cargo] |
  1178. 538.88 s [alphal00p-docs-cargo] 1180 - MultiPrecisionInteger(RawMultiPrecisionInteger::from((&self.0) & &rhs.0))
  1179. 538.88 s [alphal00p-docs-cargo] 1180 + MultiPrecisionInteger(MultiPrecisionInteger::from((&self.0) & &rhs.0))
  1180. 538.88 s [alphal00p-docs-cargo] |
  1181. 538.88 s [alphal00p-docs-cargo]
  1182. 538.88 s [alphal00p-docs-cargo] error[E0433]: cannot find type `RawMultiPrecisionInteger` in this scope
  1183. 538.88 s [alphal00p-docs-cargo] --> /nix/store/9rqk4093qnvgswmdk1pbxk9najcrjn7a-vendor-cargo-deps/bc87b2b0f37b9a43ffdd82e8f11f3e864d9447ccd53a9a964250c3414c3656d9/numerica-3.0.0/src/domains/backend/integer.rs:1212:35
  1184. 538.88 s [alphal00p-docs-cargo] |
  1185. 538.88 s [alphal00p-docs-cargo] 1212 | MultiPrecisionInteger(RawMultiPrecisionInteger::from(-&self.0))
  1186. 538.88 s [alphal00p-docs-cargo] | ^^^^^^^^^^^^^^^^^^^^^^^^ use of undeclared type `RawMultiPrecisionInteger`
  1187. 538.88 s [alphal00p-docs-cargo] |
  1188. 538.88 s [alphal00p-docs-cargo] help: a struct with a similar name exists
  1189. 538.88 s [alphal00p-docs-cargo] |
  1190. 538.88 s [alphal00p-docs-cargo] 1212 - MultiPrecisionInteger(RawMultiPrecisionInteger::from(-&self.0))
  1191. 538.88 s [alphal00p-docs-cargo] 1212 + MultiPrecisionInteger(MultiPrecisionInteger::from(-&self.0))
  1192. 538.88 s [alphal00p-docs-cargo] |
  1193. 538.88 s [alphal00p-docs-cargo]
  1194. 538.88 s [alphal00p-docs-cargo] error[E0425]: cannot find function `write_lsf_bytes` in this scope
  1195. 538.88 s [alphal00p-docs-cargo] --> /nix/store/9rqk4093qnvgswmdk1pbxk9najcrjn7a-vendor-cargo-deps/bc87b2b0f37b9a43ffdd82e8f11f3e864d9447ccd53a9a964250c3414c3656d9/numerica-3.0.0/src/domains/backend/integer.rs:1682:5
  1196. 538.88 s [alphal00p-docs-cargo] |
  1197. 538.88 s [alphal00p-docs-cargo] 1682 | write_lsf_bytes(value, &mut bytes);
  1198. 538.88 s [alphal00p-docs-cargo] | ^^^^^^^^^^^^^^^ not found in this scope
  1199. 538.88 s [alphal00p-docs-cargo]
  1200. 538.88 s [alphal00p-docs-cargo] Some errors have detailed explanations: E0425, E0432, E0433.
  1201. 538.88 s [alphal00p-docs-cargo] For more information about an error, try `rustc --explain E0425`.
  1202. 538.91 s [alphal00p-docs-cargo] error: could not compile `numerica` (lib) due to 29 previous errors
  1203. 538.91 s [alphal00p-docs-cargo] warning: build failed, waiting for other jobs to finish...
  1204. 713.72 s Progress: 0 of 1 built (1 failed)
  1205. 713.72 s Failed to build alphal00p-docs-cargo after 11m51s
  1206. 713.79 s Cannot build '/nix/store/25hrbpahaiadf5lrxdqibcnq2kvhmvqg-alphal00p-docs-cargo-0.1.0.drv'.
  1207. 713.79 s Reason: builder failed with exit code 101.
  1208. 713.79 s Output paths:
  1209. 713.79 s /nix/store/7ah507ycwkkrjmpf9j3v9yqh5zq9mnip-alphal00p-docs-cargo-0.1.0
  1210. 713.79 s Last 1200 log lines:
  1211. 713.79 s > cargoArtifacts not set, will not reuse any cargo artifacts
  1212. 713.79 s > Running phase: unpackPhase
  1213. 713.79 s > unpacking source archive /nix/store/jldj3zljswf5fawkzgiqar8jvghjs6cb-source
  1214. 713.79 s > source root is source
  1215. 713.79 s > Running phase: patchPhase
  1216. 713.79 s > Executing configureCargoCommonVars
  1217. 713.79 s > Running phase: updateAutotoolsGnuConfigScriptsPhase
  1218. 713.79 s > Running phase: configurePhase
  1219. 713.79 s > will append /build/source/.cargo-home/config.toml with contents of /nix/store/9rqk4093qnvgswmdk1pbxk9najcrjn7a-vendor-cargo-deps/config.toml
  1220. 713.79 s > default configurePhase, nothing to do
  1221. 713.79 s > Running phase: buildPhase
  1222. 713.79 s > +++ command cargo --version
  1223. 713.79 s > cargo 1.98.1 (797e8a9bc 2026-08-05)
  1224. 713.79 s > +++ command cargo build --profile docs --locked -p alphal00p-docs-catalogs --bin alphal00p-docs-catalogs
  1225. 713.79 s > Compiling proc-macro2 v1.0.106
  1226. 713.79 s > Compiling unicode-ident v1.0.24
  1227. 713.79 s > Compiling quote v1.0.45
  1228. 713.79 s > Compiling serde_core v1.0.228
  1229. 713.79 s > Compiling memchr v2.8.0
  1230. 713.79 s > Compiling zmij v1.0.21
  1231. 713.79 s > Compiling utf8parse v0.2.2
  1232. 713.79 s > Compiling serde v1.0.228
  1233. 713.79 s > Compiling serde_json v1.0.149
  1234. 713.79 s > Compiling thiserror v2.0.18
  1235. 713.79 s > Compiling anstyle-query v1.1.5
  1236. 713.79 s > Compiling colorchoice v1.0.5
  1237. 713.79 s > Compiling is_terminal_polyfill v1.70.2
  1238. 713.79 s > Compiling anstyle v1.0.14
  1239. 713.79 s > Compiling equivalent v1.0.2
  1240. 713.79 s > Compiling hashbrown v0.17.1
  1241. 713.79 s > Compiling anstyle-parse v1.0.0
  1242. 713.79 s > Compiling clap_lex v1.1.0
  1243. 713.79 s > Compiling eyre v0.6.12
  1244. 713.79 s > Compiling heck v0.5.0
  1245. 713.79 s > Compiling itoa v1.0.18
  1246. 713.79 s > Compiling strsim v0.11.1
  1247. 713.79 s > Compiling regex-syntax v0.8.10
  1248. 713.79 s > Compiling anstream v1.0.0
  1249. 713.79 s > Compiling indenter v0.3.4
  1250. 713.79 s > Compiling once_cell v1.21.4
  1251. 713.79 s > Compiling clap_builder v4.6.0
  1252. 713.79 s > Compiling aho-corasick v1.1.4
  1253. 713.79 s > Compiling syn v2.0.117
  1254. 713.79 s > Compiling regex-automata v0.4.14
  1255. 713.79 s > Compiling indexmap v2.14.0
  1256. 713.79 s > Compiling thiserror-impl v2.0.18
  1257. 713.79 s > Compiling serde_derive v1.0.228
  1258. 713.79 s > Compiling clap_derive v4.6.1
  1259. 713.79 s > Compiling alphal00p-docs-macros v0.1.0 (/build/source/crates/alphal00p-docs-macros)
  1260. 713.79 s > Compiling regex v1.12.3
  1261. 713.79 s > Compiling clap v4.6.1
  1262. 713.79 s > Compiling alphal00p-docs-schema v0.1.0 (/build/source/crates/alphal00p-docs-schema)
  1263. 713.79 s > Compiling alphal00p-docs-catalogs v0.1.0 (/build/source/crates/alphal00p-docs-catalogs)
  1264. 713.79 s > Finished `docs` profile [unoptimized] target(s) in 15.19s
  1265. 713.79 s > +++ command cargo build --profile docs --locked -p alphal00p-docs-python-exporter --features gammaloop
  1266. 713.79 s > Compiling serde_core v1.0.228
  1267. 713.79 s > Compiling libc v0.2.186
  1268. 713.79 s > Compiling cfg-if v1.0.4
  1269. 713.79 s > Compiling serde v1.0.228
  1270. 713.79 s > Compiling memchr v2.8.0
  1271. 713.79 s > Compiling autocfg v1.5.0
  1272. 713.79 s > Compiling version_check v0.9.5
  1273. 713.79 s > Compiling libm v0.2.16
  1274. 713.79 s > Compiling either v1.15.0
  1275. 713.79 s > Compiling zerocopy v0.8.48
  1276. 713.79 s > Compiling crossbeam-utils v0.8.21
  1277. 713.79 s > Compiling log v0.4.29
  1278. 713.79 s > Compiling rayon-core v1.13.0
  1279. 713.79 s > Compiling unicode-width v0.2.2
  1280. 713.79 s > Compiling foldhash v0.2.0
  1281. 713.79 s > Compiling syn v2.0.117
  1282. 713.79 s > Compiling syn v3.0.4
  1283. 713.79 s > Compiling serde_json v1.0.149
  1284. 713.79 s > Compiling lazy_static v1.5.0
  1285. 713.79 s > Compiling paste v1.0.15
  1286. 713.79 s > Compiling getrandom v0.3.4
  1287. 713.79 s > Compiling siphasher v1.0.2
  1288. 713.79 s > Compiling anyhow v1.0.102
  1289. 713.79 s > Compiling itertools v0.14.0
  1290. 713.79 s > Compiling num-traits v0.2.19
  1291. 713.79 s > Compiling num-conv v0.2.1
  1292. 713.79 s > Compiling rustix v1.1.4
  1293. 713.79 s > Compiling powerfmt v0.2.0
  1294. 713.79 s > Compiling crunchy v0.2.4
  1295. 713.79 s > Compiling static_assertions v1.1.0
  1296. 713.79 s > Compiling aho-corasick v1.1.4
  1297. 713.79 s > Compiling time-core v0.1.8
  1298. 713.79 s > Compiling deranged v0.5.8
  1299. 713.79 s > Compiling tiny-keccak v2.0.2
  1300. 713.79 s > Compiling linux-raw-sys v0.12.1
  1301. 713.79 s > Compiling time-macros v0.2.27
  1302. 713.79 s > Compiling crossbeam-epoch v0.9.18
  1303. 713.79 s > Compiling allocator-api2 v0.2.21
  1304. 713.79 s > Compiling num_threads v0.1.7
  1305. 713.79 s > Compiling tracing-core v0.1.36
  1306. 713.79 s > Compiling target-lexicon v0.13.5
  1307. 713.79 s > Compiling arrayvec v0.7.6
  1308. 713.79 s > Compiling crossbeam-deque v0.8.6
  1309. 713.79 s > Compiling virtue v0.0.18
  1310. 713.79 s > Compiling hashbrown v0.16.1
  1311. 713.79 s > Compiling unty v0.0.4
  1312. 713.79 s > Compiling gmp-mpfr-sys v1.7.1
  1313. 713.79 s > Compiling winnow v1.0.2
  1314. 713.79 s > Compiling regex-automata v0.4.14
  1315. 713.79 s > Compiling rayon v1.12.0
  1316. 713.79 s > Compiling bincode_derive v2.0.1
  1317. 713.79 s > Compiling nu-ansi-term v0.50.3
  1318. 713.79 s > Compiling pin-project-lite v0.2.17
  1319. 713.79 s > Compiling toml_writer v1.1.1+spec-1.1.0
  1320. 713.79 s > Compiling pyo3-build-config v0.28.3
  1321. 713.79 s > Compiling tracing-log v0.2.0
  1322. 713.79 s > Compiling sharded-slab v0.1.7
  1323. 713.79 s > Compiling thread_local v1.1.9
  1324. 713.79 s > Compiling option-ext v0.2.0
  1325. 713.79 s > Compiling rug v1.30.0
  1326. 713.79 s > Compiling getrandom v0.2.17
  1327. 713.79 s > Compiling time v0.3.47
  1328. 713.79 s > Compiling num-integer v0.1.46
  1329. 713.79 s > Compiling approx v0.5.1
  1330. 713.79 s > Compiling rand_core v0.9.5
  1331. 713.79 s > Compiling rand_core v0.6.4
  1332. 713.79 s > Compiling syn v1.0.109
  1333. 713.79 s > Compiling typenum v1.20.0
  1334. 713.79 s > Compiling dirs-sys v0.5.0
  1335. 713.79 s > Compiling toml_parser v1.1.2+spec-1.1.0
  1336. 713.79 s > Compiling hashbrown v0.17.1
  1337. 713.79 s > Compiling fnv v1.0.7
  1338. 713.79 s > Compiling alloc-no-stdlib v2.0.4
  1339. 713.79 s > Compiling az v1.3.0
  1340. 713.79 s > Compiling dyn-clone v1.0.20
  1341. 713.79 s > Compiling generic-array v0.14.7
  1342. 713.79 s > Compiling bitflags v2.11.1
  1343. 713.79 s > Compiling serde_spanned v1.1.1
  1344. 713.79 s > Compiling toml_datetime v1.1.1+spec-1.1.0
  1345. 713.79 s > Compiling alloc-stdlib v0.2.2
  1346. 713.79 s > Compiling colored v3.1.1
  1347. 713.79 s > Compiling bitflags v1.3.2
  1348. 713.79 s > Compiling num-bigint v0.4.6
  1349. 713.79 s > Compiling errno v0.3.14
  1350. 713.79 s > Compiling bytemuck_derive v1.12.0
  1351. 713.79 s > Compiling matrixmultiply v0.3.10
  1352. 713.79 s > Compiling same-file v1.0.6
  1353. 713.79 s > Compiling ident_case v1.0.1
  1354. 713.79 s > Compiling parking_lot_core v0.9.12
  1355. 713.79 s > Compiling signal-hook v0.3.18
  1356. 713.79 s > Compiling walkdir v2.5.0
  1357. 713.79 s > Compiling signal-hook-registry v1.4.8
  1358. 713.79 s > Compiling region v3.0.2
  1359. 713.79 s > Compiling toml v1.1.2+spec-1.1.0
  1360. 713.79 s > Compiling const-random-macro v0.1.16
  1361. 713.79 s > Compiling num-complex v0.4.6
  1362. 713.79 s > Compiling wasmtime-jit-icache-coherence v34.0.2
  1363. 713.79 s > Compiling indexmap v2.14.0
  1364. 713.79 s > Compiling hugepage-rs v0.1.1
  1365. 713.79 s > Compiling vte v0.14.1
  1366. 713.79 s > Compiling smartstring v1.0.1
  1367. 713.79 s > Compiling ahash v0.8.12
  1368. 713.79 s > Compiling synstructure v0.13.2
  1369. 713.79 s > Compiling spec_math v0.1.6
  1370. 713.79 s > Compiling rawpointer v0.2.1
  1371. 713.79 s > Compiling scopeguard v1.2.0
  1372. 713.79 s > Compiling lock_api v0.4.14
  1373. 713.79 s > Compiling const-random v0.1.18
  1374. 713.79 s > Compiling brotli-decompressor v5.0.0
  1375. 713.79 s > Compiling mio v1.2.0
  1376. 713.79 s > Compiling bytemuck v1.25.0
  1377. 713.79 s > Compiling rustix v0.38.44
  1378. 713.79 s > Compiling unicase v2.9.0
  1379. 713.79 s > Compiling indenter v0.3.4
  1380. 713.79 s > Compiling inventory v0.3.24
  1381. 713.79 s > Compiling minimal-lexical v0.2.1
  1382. 713.79 s > Compiling fastrand v2.4.1
  1383. 713.79 s > Compiling matchers v0.2.0
  1384. 713.79 s > Compiling safe_arch v0.7.4
  1385. 713.79 s > Compiling safe_arch v1.2.0
  1386. 713.79 s > Compiling regex v1.12.3
  1387. 713.79 s > Compiling terminal_size v0.4.4
  1388. 713.79 s > Compiling signal-hook-mio v0.2.5
  1389. 713.79 s > Compiling nom v7.1.3
  1390. 713.79 s > Compiling block-buffer v0.10.4
  1391. 713.79 s > Compiling crypto-common v0.1.7
  1392. 713.79 s > Compiling clap_builder v4.6.0
  1393. 713.79 s > Compiling directories v6.0.0
  1394. 713.79 s > Compiling libloading v0.9.0
  1395. 713.79 s > Compiling iana-time-zone v0.1.65
  1396. 713.79 s > Compiling self_cell v1.2.2
  1397. 713.79 s > Compiling append-only-vec v0.1.8
  1398. 713.79 s > Compiling tinyjson v2.5.1
  1399. 713.79 s > Compiling data-encoding v2.11.1
  1400. 713.79 s > Compiling ed25519-compact v2.4.2
  1401. 713.79 s > Compiling wide v0.7.33
  1402. 713.79 s > Compiling byteorder v1.5.0
  1403. 713.79 s > Compiling bytes v1.11.1
  1404. 713.79 s > Compiling wide v1.7.0
  1405. 713.79 s > Compiling brotli v8.0.2
  1406. 713.79 s > Compiling linux-raw-sys v0.4.15
  1407. 713.79 s > Compiling winnow v0.7.15
  1408. 713.79 s > Compiling unicode-segmentation v1.13.2
  1409. 713.79 s > Compiling digest v0.10.7
  1410. 713.79 s > Compiling bstr v1.12.1
  1411. 713.79 s > Compiling phf_shared v0.13.1
  1412. 713.79 s > Compiling serde_derive v1.0.228
  1413. 713.79 s > Compiling zerocopy-derive v0.8.48
  1414. 713.79 s > Compiling tracing-attributes v0.1.31
  1415. 713.79 s > Compiling thiserror-impl v2.0.18
  1416. 713.79 s > Compiling strum_macros v0.27.2
  1417. 713.79 s > Compiling clap_derive v4.6.1
  1418. 713.79 s > Compiling zerofrom-derive v0.1.7
  1419. 713.79 s > Compiling ansitok v0.3.0
  1420. 713.79 s > Compiling yoke-derive v0.8.2
  1421. 713.79 s > Compiling simba v0.9.1
  1422. 713.79 s > Compiling phf_shared v0.11.3
  1423. 713.79 s > Compiling typeid v1.0.3
  1424. 713.79 s > Compiling cpufeatures v0.2.17
  1425. 713.79 s > Compiling getrandom v0.4.2
  1426. 713.79 s > Compiling thiserror v2.0.18
  1427. 713.79 s > Compiling plotters-backend v0.3.7
  1428. 713.79 s > Compiling stable_deref_trait v1.2.1
  1429. 713.79 s > Compiling ciborium-io v0.2.2
  1430. 713.79 s > Compiling sha2 v0.10.9
  1431. 713.79 s > Compiling tracing v0.1.44
  1432. 713.79 s > Compiling globset v0.4.18
  1433. 713.79 s > Compiling plotters-svg v0.3.7
  1434. 713.79 s > Compiling num-rational v0.4.2
  1435. 713.79 s > Compiling zerovec-derive v0.11.6
  1436. 713.79 s > Compiling console v0.16.3
  1437. 713.79 s > Compiling zerofrom v0.1.8
  1438. 713.79 s > Compiling itertools v0.10.5
  1439. 713.79 s > Compiling toml_write v0.1.2
  1440. 713.79 s > Compiling yoke v0.8.3
  1441. 713.79 s > Compiling ucd-trie v0.1.7
  1442. 713.79 s > Compiling adler2 v2.0.1
  1443. 713.79 s > Compiling cast v0.3.0
  1444. 713.79 s > Compiling simd-adler32 v0.3.10
  1445. 713.79 s > Compiling symbolica v2.2.0 (https://github.com/symbolica-dev/symbolica?rev=4f1323185fe5e0c0f8c864ab89edd1905e7adef1#4f132318)
  1446. 713.79 s > Compiling rustversion v1.0.22
  1447. 713.79 s > Compiling pest v2.8.6
  1448. 713.79 s > Compiling rust-embed-utils v8.11.0
  1449. 713.79 s > Compiling miniz_oxide v0.8.9
  1450. 713.79 s > Compiling strum v0.27.2
  1451. 713.79 s > Compiling clap v4.6.1
  1452. 713.79 s > Compiling plotters v0.3.7
  1453. 713.79 s > Compiling ansi-str v0.9.0
  1454. 713.79 s > Compiling displaydoc v0.2.7
  1455. 713.79 s > Compiling is-terminal v0.4.17
  1456. 713.79 s > Compiling slotmap v1.1.1
  1457. 713.79 s > Compiling bytecount v0.6.9
  1458. 713.79 s > Compiling anes v0.1.6
  1459. 713.79 s > Compiling oorandom v11.1.5
  1460. 713.79 s > Compiling papergrid v0.18.0
  1461. 713.79 s > Compiling tempfile v3.27.0
  1462. 713.79 s > Compiling eyre v0.6.12
  1463. 713.79 s > Compiling criterion-plot v0.5.0
  1464. 713.79 s > Compiling testing_table v0.3.0
  1465. 713.79 s > Compiling tabled_derive v0.12.0
  1466. 713.79 s > Compiling toml_edit v0.25.11+spec-1.1.0
  1467. 713.79 s > Compiling similar v2.7.0
  1468. 713.79 s > Compiling proc-macro2-diagnostics v0.10.1
  1469. 713.79 s > Compiling uncased v0.9.10
  1470. 713.79 s > Compiling proc-macro-error-attr v1.0.4
  1471. 713.79 s > Compiling strsim v0.10.0
  1472. 713.79 s > Compiling slab v0.4.12
  1473. 713.79 s > Compiling pest_meta v2.8.6
  1474. 713.79 s > Compiling radium v0.7.0
  1475. 713.79 s > Compiling darling_core v0.14.4
  1476. 713.79 s > Compiling darling_core v0.23.0
  1477. 713.79 s > Compiling pyo3-ffi v0.28.3
  1478. 713.79 s > Compiling pyo3-macros-backend v0.28.3
  1479. 713.79 s > Compiling proc-macro-error v1.0.4
  1480. 713.79 s > Compiling figment v0.10.19
  1481. 713.79 s > Compiling getopts v0.2.24
  1482. 713.79 s > Compiling ryu v1.0.23
  1483. 713.79 s > Compiling tap v1.0.1
  1484. 713.79 s > Compiling smallvec v1.15.1
  1485. 713.79 s > Compiling bincode v2.0.1
  1486. 713.79 s > Compiling tracing-serde v0.2.0
  1487. 713.79 s > Compiling tracing-subscriber v0.3.23
  1488. 713.79 s > Compiling chrono v0.4.44
  1489. 713.79 s > Compiling toml_datetime v0.6.11
  1490. 713.79 s > Compiling parking_lot v0.12.5
  1491. 713.79 s > Compiling serde_spanned v0.6.9
  1492. 713.79 s > Compiling toml_edit v0.22.27
  1493. 713.79 s > Compiling tinytemplate v1.2.1
  1494. 713.79 s > Compiling zerovec v0.11.8
  1495. 713.79 s > Compiling crossterm v0.28.1
  1496. 713.79 s > Compiling xprec v0.2.2
  1497. 713.79 s > Compiling bincode-trait-derive v0.1.1
  1498. 713.79 s > Compiling ron v0.12.1
  1499. 713.79 s > Compiling tabled v0.22.0
  1500. 713.79 s > Compiling ppv-lite86 v0.2.21
  1501. 713.79 s > Compiling half v2.7.1
  1502. 713.79 s > Compiling pest_generator v2.8.6
  1503. 713.79 s > Compiling tinystr v0.8.4
  1504. 713.79 s > Compiling rand_chacha v0.3.1
  1505. 713.79 s > Compiling rand_chacha v0.9.0
  1506. 713.79 s > Compiling ciborium-ll v0.2.2
  1507. 713.79 s > Compiling rand v0.8.6
  1508. 713.79 s > Compiling rand v0.9.4
  1509. 713.79 s > Compiling ciborium v0.2.2
  1510. 713.79 s > Compiling insta v1.47.2
  1511. 713.79 s > Compiling unic-langid-impl v0.9.6
  1512. 713.79 s > Compiling darling_macro v0.14.4
  1513. 713.79 s > Compiling darling_macro v0.23.0
  1514. 713.79 s > Compiling wyz v0.5.1
  1515. 713.79 s > Compiling toml v0.8.23
  1516. 713.79 s > Compiling pest_derive v2.8.6
  1517. 713.79 s > Compiling symjit v2.25.6
  1518. 713.79 s > Compiling phf_generator v0.11.3
  1519. 713.79 s > Compiling criterion v0.5.1
  1520. 713.79 s > Compiling phf_codegen v0.11.3
  1521. 713.79 s > Compiling unicode_names2_generator v1.3.0
  1522. 713.79 s > Compiling castaway v0.2.4
  1523. 713.79 s > Compiling unic-common v0.9.0
  1524. 713.79 s > Compiling instability v0.3.12
  1525. 713.79 s > Compiling indoc v2.0.7
  1526. 713.79 s > Compiling shlex v1.3.0
  1527. 713.79 s > Compiling funty v2.0.0
  1528. 713.79 s > Compiling find-msvc-tools v0.1.9
  1529. 713.79 s > Compiling unic-char-range v0.9.0
  1530. 713.79 s > Compiling heck v0.4.1
  1531. 713.79 s > Compiling unic-char-property v0.9.0
  1532. 713.79 s > Compiling cc v1.2.61
  1533. 713.79 s > Compiling dot-parser v0.5.1
  1534. 713.79 s > Compiling darling v0.23.0
  1535. 713.79 s > Compiling darling v0.14.4
  1536. 713.79 s > Compiling compact_str v0.9.0
  1537. 713.79 s > Compiling unic-ucd-version v0.9.0
  1538. 713.79 s > Compiling duplicate v2.0.1
  1539. 713.79 s > Compiling unicode_names2 v1.3.0
  1540. 713.79 s > Compiling bitvec v1.0.1
  1541. 713.79 s > Compiling kasuari v0.4.12
  1542. 713.79 s > Compiling convert_case v0.10.0
  1543. 713.79 s > Compiling unicode-truncate v2.0.1
  1544. 713.79 s > Compiling serde_repr v0.1.20
  1545. 713.79 s > Compiling is-macro v0.3.7
  1546. 713.79 s > Compiling env_filter v1.0.1
  1547. 713.79 s > Compiling pyo3 v0.28.3
  1548. 713.79 s > Compiling num-iter v0.1.45
  1549. 713.79 s > Compiling lru v0.16.4
  1550. 713.79 s > Compiling rustpython-parser-vendored v0.4.0
  1551. 713.79 s > Compiling itertools v0.11.0
  1552. 713.79 s > Compiling jiff v0.2.24
  1553. 713.79 s > Compiling ref-ops v0.2.5
  1554. 713.79 s > Compiling convert_case v0.4.0
  1555. 713.79 s > Compiling blake3 v1.8.5
  1556. 713.79 s > Compiling ratatui-core v0.1.0
  1557. 713.79 s > Compiling num v0.4.3
  1558. 713.79 s > Compiling derive_more-impl v2.1.1
  1559. 713.79 s > Compiling duplicate v1.0.0
  1560. 713.79 s > Compiling rustpython-parser-core v0.4.0
  1561. 713.79 s > Compiling derive_more v0.99.20
  1562. 713.79 s > Compiling derive_builder_core v0.11.2
  1563. 713.79 s > Compiling enum-try-as-inner v0.1.1
  1564. 713.79 s > Compiling rustpython-parser v0.4.0
  1565. 713.79 s > Compiling phf v0.11.3
  1566. 713.79 s > Compiling delegate v0.12.0
  1567. 713.79 s > Compiling rand_xoshiro v0.6.0
  1568. 713.79 s > Compiling features v0.10.0
  1569. 713.79 s > Compiling colored v2.2.0
  1570. 713.79 s > Compiling litrs v1.0.0
  1571. 713.79 s > Compiling portable-atomic v1.13.1
  1572. 713.79 s > Compiling object v0.37.3
  1573. 713.79 s > Compiling constcat v0.5.1
  1574. 713.79 s > Compiling owo-colors v4.3.0
  1575. 713.79 s > Compiling thiserror v1.0.69
  1576. 713.79 s > Compiling gat-lending-iterator v0.1.8
  1577. 713.79 s > Compiling cfg_aliases v0.2.1
  1578. 713.79 s > Compiling nix v0.31.2
  1579. 713.79 s > Compiling document-features v0.2.12
  1580. 713.79 s > Compiling derive_builder_macro v0.11.2
  1581. 713.79 s > Compiling derive_more v2.1.1
  1582. 713.79 s > Compiling rustpython-ast v0.4.0
  1583. 713.79 s > Compiling unic-ucd-ident v0.9.0
  1584. 713.79 s > Compiling unic-emoji-char v0.9.0
  1585. 713.79 s > Compiling rand_distr v0.4.3
  1586. 713.79 s > Compiling simba v0.6.0
  1587. 713.79 s > Compiling nalgebra-macros v0.1.0
  1588. 713.79 s > Compiling phf_generator v0.13.1
  1589. 713.79 s > Compiling thiserror-impl v1.0.69
  1590. 713.79 s > Compiling numpy v0.28.0
  1591. 713.79 s > Compiling line-clipping v0.3.7
  1592. 713.79 s > Compiling dirs v6.0.0
  1593. 713.79 s > Compiling vte v0.15.0
  1594. 713.79 s > Compiling color-spantrace v0.3.0
  1595. 713.79 s > Compiling rustc-hash v2.1.2
  1596. 713.79 s > Compiling gimli v0.32.3
  1597. 713.79 s > Compiling joinery v2.1.0
  1598. 713.79 s > Compiling lalrpop-util v0.20.2
  1599. 713.79 s > Compiling ref-cast v1.0.25
  1600. 713.79 s > Compiling cpufeatures v0.3.0
  1601. 713.79 s > Compiling constant_time_eq v0.4.2
  1602. 713.79 s > Compiling rustc-hash v1.1.0
  1603. 713.79 s > Compiling arrayref v0.3.9
  1604. 713.79 s > Compiling clarabel v0.11.1
  1605. 713.79 s > Compiling titlecase v2.2.1
  1606. 713.79 s > Compiling vt100 v0.16.2
  1607. 713.79 s > Compiling derive_builder v0.11.2
  1608. 713.79 s > Compiling ratatui-widgets v0.3.0
  1609. 713.79 s > Compiling crossterm v0.29.0
  1610. 713.79 s > Compiling env_logger v0.11.10
  1611. 713.79 s > Compiling phf_macros v0.13.1
  1612. 713.79 s > Compiling tracing-error v0.2.1
  1613. 713.79 s > Compiling ndarray v0.17.2
  1614. 713.79 s > Compiling pyo3-macros v0.28.3
  1615. 713.79 s > Compiling serde-big-array v0.5.1
  1616. 713.79 s > Compiling enum_dispatch v0.3.13
  1617. 713.79 s > Compiling ref-cast-impl v1.0.25
  1618. 713.79 s > Compiling delegate v0.13.5
  1619. 713.79 s > Compiling serde_derive_internals v0.29.1
  1620. 713.79 s > Compiling toml_datetime v0.7.5+spec-1.1.0
  1621. 713.79 s > Compiling amd v0.2.2
  1622. 713.79 s > Compiling subprocess v0.2.15
  1623. 713.79 s > Compiling rust_lisp v0.18.0
  1624. 713.79 s > Compiling unit-prefix v0.5.2
  1625. 713.79 s > Compiling semver v1.0.28
  1626. 713.79 s > Compiling base64 v0.22.1
  1627. 713.79 s > Compiling vakint v0.1.2 (/build/source/crates/vakint)
  1628. 713.79 s > Compiling rustc-demangle v0.1.27
  1629. 713.79 s > Compiling deprecate-until v1.0.0
  1630. 713.79 s > Compiling string-template-plus v0.4.3
  1631. 713.79 s > Compiling indicatif v0.18.4
  1632. 713.79 s > Compiling addr2line v0.25.1
  1633. 713.79 s > Compiling schemars_derive v1.2.1
  1634. 713.79 s > Compiling toml v0.9.12+spec-1.1.0
  1635. 713.79 s > Compiling phf v0.13.1
  1636. 713.79 s > Compiling ratatui-macros v0.7.0
  1637. 713.79 s > Compiling ratatui-crossterm v0.1.0
  1638. 713.79 s > Compiling shellexpand v3.1.2
  1639. 713.79 s > Compiling xpct v0.5.1
  1640. 713.79 s > Compiling brotli-decompressor v4.0.3
  1641. 713.79 s > Compiling integer-sqrt v0.1.5
  1642. 713.79 s > Compiling crossbeam-channel v0.5.15
  1643. 713.79 s > Compiling itertools v0.12.1
  1644. 713.79 s > Compiling gammaloop-tracing-filter-macros v0.1.0 (/build/source/crates/gammaloop-tracing-filter-macros)
  1645. 713.79 s > Compiling include_dir_macros v0.7.4
  1646. 713.79 s > Compiling version-compare v0.2.1
  1647. 713.79 s > Compiling unsafe-libyaml v0.2.11
  1648. 713.79 s > Compiling maplit v1.0.2
  1649. 713.79 s > Compiling symlink v0.1.0
  1650. 713.79 s > Compiling gammalooprs v0.3.4 (/build/source/crates/gammalooprs)
  1651. 713.79 s > Compiling ctrlc v3.5.2
  1652. 713.79 s > Compiling tracing-appender v0.2.5
  1653. 713.79 s > Compiling pathfinding v4.15.0
  1654. 713.79 s > Compiling include_dir v0.7.4
  1655. 713.79 s > Compiling brotli v7.0.0
  1656. 713.79 s > Compiling tracing-indicatif v0.3.14
  1657. 713.79 s > Compiling nalgebra v0.29.0
  1658. 713.79 s > Compiling serde_yaml v0.9.34+deprecated
  1659. 713.79 s > Compiling rust-embed-impl v8.11.0
  1660. 713.79 s > Compiling ratatui v0.30.0
  1661. 713.79 s > Compiling json5 v0.4.1
  1662. 713.79 s > Compiling typed-index-collections v3.5.0
  1663. 713.79 s > Compiling vectorize v0.2.0
  1664. 713.79 s > Compiling strum_macros v0.26.4
  1665. 713.79 s > Compiling clap_complete v4.6.3
  1666. 713.79 s > Compiling fd-lock v4.0.4
  1667. 713.79 s > Compiling strip-ansi-escapes v0.2.1
  1668. 713.79 s > Compiling backtrace v0.3.76
  1669. 713.79 s > Compiling schemars v1.2.1
  1670. 713.79 s > Compiling gammaloop-api v0.1.0 (/build/source/crates/gammaloop-api)
  1671. 713.79 s > Compiling itertools v0.13.0
  1672. 713.79 s > Compiling strum v0.26.3
  1673. 713.79 s > Compiling base62 v2.2.4
  1674. 713.79 s > Compiling ringbuffer v0.16.0
  1675. 713.79 s > Compiling clap_complete_nushell v4.6.0
  1676. 713.79 s > Compiling sysinfo v0.33.1
  1677. 713.79 s > Compiling color-eyre v0.6.5
  1678. 713.79 s > Compiling rust-embed v8.11.0
  1679. 713.79 s > Compiling pyo3-stub-gen-derive v0.17.2
  1680. 713.79 s > Compiling reedline v0.42.0
  1681. 713.79 s > Compiling pyo3-stub-gen v0.17.2
  1682. 713.79 s > Compiling statrs v0.16.1
  1683. 713.79 s > Compiling momtrop v0.3.0
  1684. 713.79 s > Compiling numerica v3.0.0 (https://github.com/symbolica-dev/symbolica?rev=4f1323185fe5e0c0f8c864ab89edd1905e7adef1#4f132318)
  1685. 713.79 s > Compiling graphica v3.0.0 (https://github.com/symbolica-dev/symbolica?rev=4f1323185fe5e0c0f8c864ab89edd1905e7adef1#4f132318)
  1686. 713.79 s > Compiling symbolica-utils v0.1.0 (/build/source/crates/symbolica-utils)
  1687. 713.79 s > Compiling gammaloop-workspace-hack v0.1.0 (/build/source/crates/gammaloop-workspace-hack)
  1688. 713.79 s > Compiling spenso-macros v0.3.2 (/build/source/crates/spenso-macros)
  1689. 713.79 s > Compiling linnet v0.17.0 (/build/source/crates/linnet)
  1690. 713.79 s > Compiling spenso v0.6.0 (/build/source/crates/spenso)
  1691. 713.79 s > Compiling idenso v0.3.0 (/build/source/crates/idenso)
  1692. 713.79 s > Compiling gammaloop-tracing-filter v0.1.0 (/build/source/crates/gammaloop-tracing-filter)
  1693. 713.79 s > Compiling spenso-hep-lib v0.1.7 (/build/source/crates/spenso-hep-lib)
  1694. 713.79 s > Compiling alphal00p-docs-python-exporter v0.1.0 (/build/source/crates/alphal00p-docs-python-exporter)
  1695. 713.79 s > Finished `docs` profile [unoptimized] target(s) in 4m 10s
  1696. 713.79 s > +++ command cargo build --profile docs --locked -p alphal00p-docs-python-exporter --features linnet
  1697. 713.79 s > Compiling libc v0.2.186
  1698. 713.79 s > Compiling serde_core v1.0.228
  1699. 713.79 s > Compiling zerocopy v0.8.48
  1700. 713.79 s > Compiling log v0.4.29
  1701. 713.79 s > Compiling num-traits v0.2.19
  1702. 713.79 s > Compiling syn v1.0.109
  1703. 713.79 s > Compiling syn v2.0.117
  1704. 713.79 s > Compiling ahash v0.7.8
  1705. 713.79 s > Compiling bytecheck v0.6.12
  1706. 713.79 s > Compiling regex-syntax v0.8.10
  1707. 713.79 s > Compiling simdutf8 v0.1.5
  1708. 713.79 s > Compiling rend v0.4.2
  1709. 713.79 s > Compiling indexmap v2.14.0
  1710. 713.79 s > Compiling figment v0.10.19
  1711. 713.79 s > Compiling ahash v0.8.12
  1712. 713.79 s > Compiling either v1.15.0
  1713. 713.79 s > Compiling rkyv v0.7.46
  1714. 713.79 s > Compiling cgmath v0.18.0
  1715. 713.79 s > Compiling itertools v0.11.0
  1716. 713.79 s > Compiling bincode v2.0.1
  1717. 713.79 s > Compiling pyo3 v0.28.3
  1718. 713.79 s > Compiling venial v0.5.0
  1719. 713.79 s > Compiling arrayvec v0.7.6
  1720. 713.79 s > Compiling rustix v1.1.4
  1721. 713.79 s > Compiling winnow v1.0.2
  1722. 713.79 s > Compiling seahash v4.1.0
  1723. 713.79 s > Compiling polycool v0.4.0
  1724. 713.79 s > Compiling toml_writer v1.1.1+spec-1.1.0
  1725. 713.79 s > Compiling toml_parser v1.1.2+spec-1.1.0
  1726. 713.79 s > Compiling smallvec v1.15.1
  1727. 713.79 s > Compiling bitflags v2.11.1
  1728. 713.79 s > Compiling winnow v0.7.15
  1729. 713.79 s > Compiling linnet-py v0.1.0 (/build/source/crates/linnet-py)
  1730. 713.79 s > Compiling kurbo v0.13.1
  1731. 713.79 s > Compiling num-integer v0.1.46
  1732. 713.79 s > Compiling approx v0.4.0
  1733. 713.79 s > Compiling num-complex v0.4.6
  1734. 713.79 s > Compiling regex-automata v0.4.14
  1735. 713.79 s > Compiling wasm-minimal-protocol v0.2.0
  1736. 713.79 s > Compiling chrono v0.4.44
  1737. 713.79 s > Compiling num-bigint v0.4.6
  1738. 713.79 s > Compiling getrandom v0.2.17
  1739. 713.79 s > Compiling dirs-sys v0.5.0
  1740. 713.79 s > Compiling rand_core v0.6.4
  1741. 713.79 s > Compiling const-random-macro v0.1.16
  1742. 713.79 s > Compiling dirs v6.0.0
  1743. 713.79 s > Compiling pyo3-ffi v0.28.3
  1744. 713.79 s > Compiling hashbrown v0.12.3
  1745. 713.79 s > Compiling shellexpand v3.1.2
  1746. 713.79 s > Compiling getrandom v0.4.2
  1747. 713.79 s > Compiling const-random v0.1.18
  1748. 713.79 s > Compiling tempfile v3.27.0
  1749. 713.79 s > Compiling toml_datetime v0.7.5+spec-1.1.0
  1750. 713.79 s > Compiling serde_spanned v1.1.1
  1751. 713.79 s > Compiling serde_json v1.0.149
  1752. 713.79 s > Compiling toml v0.9.12+spec-1.1.0
  1753. 713.79 s > Compiling ptr_meta_derive v0.1.4
  1754. 713.79 s > Compiling bytecheck_derive v0.6.12
  1755. 713.79 s > Compiling rkyv_derive v0.7.46
  1756. 713.79 s > Compiling pest_generator v2.8.6
  1757. 713.79 s > Compiling pyo3-macros-backend v0.28.3
  1758. 713.79 s > Compiling proc-macro2-diagnostics v0.10.1
  1759. 713.79 s > Compiling globset v0.4.18
  1760. 713.79 s > Compiling rust-embed-utils v8.11.0
  1761. 713.79 s > Compiling ptr_meta v0.1.4
  1762. 713.79 s > Compiling zerocopy-derive v0.8.48
  1763. 713.79 s > Compiling serde_derive v1.0.228
  1764. 713.79 s > Compiling is-macro v0.3.7
  1765. 713.79 s > Compiling thiserror-impl v2.0.18
  1766. 713.79 s > Compiling bincode-trait-derive v0.1.1
  1767. 713.79 s > Compiling serde_repr v0.1.20
  1768. 713.79 s > Compiling duplicate v2.0.1
  1769. 713.79 s > Compiling rust-embed-impl v8.11.0
  1770. 713.79 s > Compiling pest_derive v2.8.6
  1771. 713.79 s > Compiling dot-parser v0.5.1
  1772. 713.79 s > Compiling rustpython-parser-core v0.4.0
  1773. 713.79 s > Compiling rustpython-ast v0.4.0
  1774. 713.79 s > Compiling ppv-lite86 v0.2.21
  1775. 713.79 s > Compiling rust-embed v8.11.0
  1776. 713.79 s > Compiling rand_chacha v0.3.1
  1777. 713.79 s > Compiling thiserror v2.0.18
  1778. 713.79 s > Compiling rand v0.8.6
  1779. 713.79 s > Compiling phf_generator v0.11.3
  1780. 713.79 s > Compiling phf_codegen v0.11.3
  1781. 713.79 s > Compiling unicode_names2_generator v1.3.0
  1782. 713.79 s > Compiling rustpython-parser v0.4.0
  1783. 713.79 s > Compiling pyo3-macros v0.28.3
  1784. 713.79 s > Compiling unicode_names2 v1.3.0
  1785. 713.79 s > Compiling serde v1.0.228
  1786. 713.79 s > Compiling bitvec v1.0.1
  1787. 713.79 s > Compiling half v2.7.1
  1788. 713.79 s > Compiling ciborium-ll v0.2.2
  1789. 713.79 s > Compiling ciborium v0.2.2
  1790. 713.79 s > Compiling kurvst v0.1.0 (/build/source/crates/kurvst)
  1791. 713.79 s > Compiling linnet v0.17.0 (/build/source/crates/linnet)
  1792. 713.79 s > Compiling pyo3-stub-gen-derive v0.17.2
  1793. 713.79 s > Compiling pyo3-stub-gen v0.17.2
  1794. 713.79 s > Compiling linnest v0.1.0 (/build/source/crates/linnest)
  1795. 713.79 s > Compiling alphal00p-docs-python-exporter v0.1.0 (/build/source/crates/alphal00p-docs-python-exporter)
  1796. 713.79 s > Finished `docs` profile [unoptimized] target(s) in 25.41s
  1797. 713.79 s > +++ command cargo build --profile docs --locked -p alphal00p-docs-python-exporter --features spenso
  1798. 713.79 s > Compiling pyo3-build-config v0.28.3
  1799. 713.79 s > Compiling symbolica v2.2.0 (https://github.com/symbolica-dev/symbolica?rev=4f1323185fe5e0c0f8c864ab89edd1905e7adef1#4f132318)
  1800. 713.79 s > Compiling syn v1.0.109
  1801. 713.79 s > Compiling figment v0.10.19
  1802. 713.79 s > Compiling proc-macro-error v1.0.4
  1803. 713.79 s > Compiling duplicate v1.0.0
  1804. 713.79 s > Compiling pyo3-macros-backend v0.28.3
  1805. 713.79 s > Compiling pyo3-ffi v0.28.3
  1806. 713.79 s > Compiling pyo3 v0.28.3
  1807. 713.79 s > Compiling numpy v0.28.0
  1808. 713.79 s > Compiling pyo3-macros v0.28.3
  1809. 713.79 s > Compiling pyo3-stub-gen v0.17.2
  1810. 713.79 s > Compiling numerica v3.0.0 (https://github.com/symbolica-dev/symbolica?rev=4f1323185fe5e0c0f8c864ab89edd1905e7adef1#4f132318)
  1811. 713.79 s > Compiling graphica v3.0.0 (https://github.com/symbolica-dev/symbolica?rev=4f1323185fe5e0c0f8c864ab89edd1905e7adef1#4f132318)
  1812. 713.79 s > Compiling symbolica-utils v0.1.0 (/build/source/crates/symbolica-utils)
  1813. 713.79 s > Compiling gammaloop-workspace-hack v0.1.0 (/build/source/crates/gammaloop-workspace-hack)
  1814. 713.79 s > Compiling tymbolica-atom-payload v0.1.0 (https://github.com/lcnbr/tymbolica?rev=32ae00483b4845161401afac8be755cc336cb2bb#32ae0048)
  1815. 713.79 s > Compiling linnet v0.17.0 (/build/source/crates/linnet)
  1816. 713.79 s > Compiling spenso v0.6.0 (/build/source/crates/spenso)
  1817. 713.79 s > Compiling idenso v0.3.0 (/build/source/crates/idenso)
  1818. 713.79 s > Compiling spenso-hep-lib v0.1.7 (/build/source/crates/spenso-hep-lib)
  1819. 713.79 s > Compiling spynso3 v0.1.2 (/build/source/crates/spynso3)
  1820. 713.79 s > Compiling alphal00p-docs-python-exporter v0.1.0 (/build/source/crates/alphal00p-docs-python-exporter)
  1821. 713.79 s > Finished `docs` profile [unoptimized] target(s) in 1m 24s
  1822. 713.79 s > +++ command cargo build --profile docs --locked -p alphal00p-docs-python-exporter --features idenso
  1823. 713.79 s > Compiling pyo3 v0.28.3
  1824. 713.79 s > Compiling numpy v0.28.0
  1825. 713.79 s > Compiling pyo3-stub-gen v0.17.2
  1826. 713.79 s > Compiling numerica v3.0.0 (https://github.com/symbolica-dev/symbolica?rev=4f1323185fe5e0c0f8c864ab89edd1905e7adef1#4f132318)
  1827. 713.79 s > Compiling graphica v3.0.0 (https://github.com/symbolica-dev/symbolica?rev=4f1323185fe5e0c0f8c864ab89edd1905e7adef1#4f132318)
  1828. 713.79 s > Compiling symbolica v2.2.0 (https://github.com/symbolica-dev/symbolica?rev=4f1323185fe5e0c0f8c864ab89edd1905e7adef1#4f132318)
  1829. 713.79 s > Compiling gammaloop-workspace-hack v0.1.0 (/build/source/crates/gammaloop-workspace-hack)
  1830. 713.79 s > Compiling symbolica-utils v0.1.0 (/build/source/crates/symbolica-utils)
  1831. 713.79 s > Compiling linnet v0.17.0 (/build/source/crates/linnet)
  1832. 713.79 s > Compiling spenso v0.6.0 (/build/source/crates/spenso)
  1833. 713.79 s > Compiling idenso v0.3.0 (/build/source/crates/idenso)
  1834. 713.79 s > Compiling alphal00p-docs-python-exporter v0.1.0 (/build/source/crates/alphal00p-docs-python-exporter)
  1835. 713.79 s > Finished `docs` profile [unoptimized] target(s) in 2m 05s
  1836. 713.79 s > +++ command cargo build --profile docs --locked -p alphal00p-docs-python-exporter --features vakint
  1837. 713.79 s > Compiling libc v0.2.186
  1838. 713.79 s > Compiling tiny-keccak v2.0.2
  1839. 713.79 s > Compiling bytemuck v1.25.0
  1840. 713.79 s > Compiling matrixmultiply v0.3.10
  1841. 713.79 s > Compiling getrandom v0.3.4
  1842. 713.79 s > Compiling num-integer v0.1.46
  1843. 713.79 s > Compiling pyo3 v0.28.3
  1844. 713.79 s > Compiling regex-automata v0.4.14
  1845. 713.79 s > Compiling pyo3-macros-backend v0.28.3
  1846. 713.79 s > Compiling pyo3-ffi v0.28.3
  1847. 713.79 s > Compiling approx v0.5.1
  1848. 713.79 s > Compiling ahash v0.8.12
  1849. 713.79 s > Compiling serde v1.0.228
  1850. 713.79 s > Compiling itertools v0.14.0
  1851. 713.79 s > Compiling gmp-mpfr-sys v1.7.1
  1852. 713.79 s > Compiling smallvec v1.15.1
  1853. 713.79 s > Compiling safe_arch v0.7.4
  1854. 713.79 s > Compiling safe_arch v1.2.0
  1855. 713.79 s > Compiling rand_core v0.9.5
  1856. 713.79 s > Compiling rayon v1.12.0
  1857. 713.79 s > Compiling rand_chacha v0.9.0
  1858. 713.79 s > Compiling smartstring v1.0.1
  1859. 713.79 s > Compiling phf_shared v0.13.1
  1860. 713.79 s > Compiling tracing-attributes v0.1.31
  1861. 713.79 s > Compiling fastrand v2.4.1
  1862. 713.79 s > Compiling wide v0.7.33
  1863. 713.79 s > Compiling rand v0.9.4
  1864. 713.79 s > Compiling rug v1.30.0
  1865. 713.79 s > Compiling phf_generator v0.13.1
  1866. 713.79 s > Compiling wide v1.7.0
  1867. 713.79 s > Compiling symbolica v2.2.0 (https://github.com/symbolica-dev/symbolica?rev=4f1323185fe5e0c0f8c864ab89edd1905e7adef1#4f132318)
  1868. 713.79 s > Compiling phf_macros v0.13.1
  1869. 713.79 s > Compiling directories v6.0.0
  1870. 713.79 s > Compiling ndarray v0.17.2
  1871. 713.79 s > Compiling subprocess v0.2.15
  1872. 713.79 s > Compiling vakint v0.1.2 (/build/source/crates/vakint)
  1873. 713.79 s > Compiling getrandom v0.2.17
  1874. 713.79 s > Compiling rand_core v0.6.4
  1875. 713.79 s > Compiling phf v0.13.1
  1876. 713.79 s > Compiling rand_chacha v0.3.1
  1877. 713.79 s > Compiling rand v0.8.6
  1878. 713.79 s > Compiling tracing v0.1.44
  1879. 713.79 s > Compiling simba v0.9.1
  1880. 713.79 s > Compiling phf_generator v0.11.3
  1881. 713.79 s > Compiling phf_codegen v0.11.3
  1882. 713.79 s > Compiling unicode_names2_generator v1.3.0
  1883. 713.79 s > Compiling rustpython-parser v0.4.0
  1884. 713.79 s > Compiling unicode_names2 v1.3.0
  1885. 713.79 s > Compiling matchers v0.2.0
  1886. 713.79 s > Compiling regex v1.12.3
  1887. 713.79 s > Compiling tracing-subscriber v0.3.23
  1888. 713.79 s > Compiling pyo3-macros v0.28.3
  1889. 713.79 s > Compiling titlecase v2.2.1
  1890. 713.79 s > Compiling string-template-plus v0.4.3
  1891. 713.79 s > Compiling xprec v0.2.2
  1892. 713.79 s > Compiling numpy v0.28.0
  1893. 713.79 s > Compiling pyo3-stub-gen-derive v0.17.2
  1894. 713.79 s > Compiling pyo3-stub-gen v0.17.2
  1895. 713.79 s > Compiling numerica v3.0.0 (https://github.com/symbolica-dev/symbolica?rev=4f1323185fe5e0c0f8c864ab89edd1905e7adef1#4f132318)
  1896. 713.79 s > error: select an integer backend: `integer-gmp` or `integer-malachite`
  1897. 713.79 s > --> /nix/store/9rqk4093qnvgswmdk1pbxk9najcrjn7a-vendor-cargo-deps/bc87b2b0f37b9a43ffdd82e8f11f3e864d9447ccd53a9a964250c3414c3656d9/numerica-3.0.0/src/lib.rs:40:1
  1898. 713.79 s > |
  1899. 713.79 s > 40 | compile_error!("select an integer backend: `integer-gmp` or `integer-malachite`");
  1900. 713.79 s > | ^^^^^^^^^^^^^^^^^^^^^^^^^^^^^^^^^^^^^^^^^^^^^^^^^^^^^^^^^^^^^^^^^^^^^^^^^^^^^^^^^
  1901. 713.79 s >
  1902. 713.79 s > error: select a float backend: `float-mpfr` or `float-astro`
  1903. 713.79 s > --> /nix/store/9rqk4093qnvgswmdk1pbxk9najcrjn7a-vendor-cargo-deps/bc87b2b0f37b9a43ffdd82e8f11f3e864d9447ccd53a9a964250c3414c3656d9/numerica-3.0.0/src/lib.rs:44:1
  1904. 713.79 s > |
  1905. 713.79 s > 44 | compile_error!("select a float backend: `float-mpfr` or `float-astro`");
  1906. 713.79 s > | ^^^^^^^^^^^^^^^^^^^^^^^^^^^^^^^^^^^^^^^^^^^^^^^^^^^^^^^^^^^^^^^^^^^^^^^
  1907. 713.79 s >
  1908. 713.79 s > error[E0432]: unresolved import `implementation::BackendRandState`
  1909. 713.79 s > --> /nix/store/9rqk4093qnvgswmdk1pbxk9najcrjn7a-vendor-cargo-deps/bc87b2b0f37b9a43ffdd82e8f11f3e864d9447ccd53a9a964250c3414c3656d9/numerica-3.0.0/src/domains/backend/integer.rs:1614:33
  1910. 713.79 s > |
  1911. 713.79 s > 1614 | pub(crate) use implementation::{BackendRandState, Complete, RemRounding};
  1912. 713.79 s > | ^^^^^^^^^^^^^^^^ no `BackendRandState` in `domains::backend::integer::implementation`
  1913. 713.79 s > |
  1914. 713.79 s > note: found an item that was configured out
  1915. 713.79 s > --> /nix/store/9rqk4093qnvgswmdk1pbxk9najcrjn7a-vendor-cargo-deps/bc87b2b0f37b9a43ffdd82e8f11f3e864d9447ccd53a9a964250c3414c3656d9/numerica-3.0.0/src/domains/backend/integer.rs:1378:23
  1916. 713.79 s > |
  1917. 713.79 s > 1377 | #[cfg(feature = "integer-malachite")]
  1918. 713.79 s > | ----------------------------- the item is gated behind the `integer-malachite` feature
  1919. 713.79 s > 1378 | pub(crate) struct BackendRandState {
  1920. 713.79 s > | ^^^^^^^^^^^^^^^^
  1921. 713.79 s > note: found an item that was configured out
  1922. 713.79 s > --> /nix/store/9rqk4093qnvgswmdk1pbxk9najcrjn7a-vendor-cargo-deps/bc87b2b0f37b9a43ffdd82e8f11f3e864d9447ccd53a9a964250c3414c3656d9/numerica-3.0.0/src/domains/backend/integer.rs:1413:23
  1923. 713.79 s > |
  1924. 713.79 s > 1412 | #[cfg(feature = "integer-gmp")]
  1925. 713.79 s > | ----------------------- the item is gated behind the `integer-gmp` feature
  1926. 713.79 s > 1413 | pub(crate) struct BackendRandState(rug::rand::RandState<'static>);
  1927. 713.79 s > | ^^^^^^^^^^^^^^^^
  1928. 713.79 s >
  1929. 713.79 s > error[E0432]: unresolved import `implementation::RawMultiPrecisionInteger`
  1930. 713.79 s > --> /nix/store/9rqk4093qnvgswmdk1pbxk9najcrjn7a-vendor-cargo-deps/bc87b2b0f37b9a43ffdd82e8f11f3e864d9447ccd53a9a964250c3414c3656d9/numerica-3.0.0/src/domains/backend/integer.rs:1616:61
  1931. 713.79 s > |
  1932. 713.79 s > 1616 | MultiPrecisionInteger, ParseMultiPrecisionIntegerError, RawMultiPrecisionInteger,
  1933. 713.79 s > | ^^^^^^^^^^^^^^^^^^^^^^^^ no `RawMultiPrecisionInteger` in `domains::backend::integer::implementation`
  1934. 713.79 s > |
  1935. 713.79 s > note: found an item that was configured out
  1936. 713.79 s > --> /nix/store/9rqk4093qnvgswmdk1pbxk9najcrjn7a-vendor-cargo-deps/bc87b2b0f37b9a43ffdd82e8f11f3e864d9447ccd53a9a964250c3414c3656d9/numerica-3.0.0/src/domains/backend/integer.rs:26:14
  1937. 713.79 s > |
  1938. 713.79 s > 25 | #[cfg(feature = "integer-malachite")]
  1939. 713.79 s > | ----------------------------- the item is gated behind the `integer-malachite` feature
  1940. 713.79 s > 26 | pub type RawMultiPrecisionInteger = malachite_nz::integer::Integer;
  1941. 713.79 s > | ^^^^^^^^^^^^^^^^^^^^^^^^
  1942. 713.79 s > note: found an item that was configured out
  1943. 713.79 s > --> /nix/store/9rqk4093qnvgswmdk1pbxk9najcrjn7a-vendor-cargo-deps/bc87b2b0f37b9a43ffdd82e8f11f3e864d9447ccd53a9a964250c3414c3656d9/numerica-3.0.0/src/domains/backend/integer.rs:29:14
  1944. 713.79 s > |
  1945. 713.79 s > 28 | #[cfg(feature = "integer-gmp")]
  1946. 713.79 s > | ----------------------- the item is gated behind the `integer-gmp` feature
  1947. 713.79 s > 29 | pub type RawMultiPrecisionInteger = rug::Integer;
  1948. 713.79 s > | ^^^^^^^^^^^^^^^^^^^^^^^^
  1949. 713.79 s > help: a similar name exists in the module
  1950. 713.79 s > |
  1951. 713.79 s > 1616 - MultiPrecisionInteger, ParseMultiPrecisionIntegerError, RawMultiPrecisionInteger,
  1952. 713.79 s > 1616 + MultiPrecisionInteger, ParseMultiPrecisionIntegerError, MultiPrecisionInteger,
  1953. 713.79 s > |
  1954. 713.79 s >
  1955. 713.79 s > error[E0432]: unresolved imports `implementation::from_be_bytes`, `implementation::to_be_bytes`
  1956. 713.79 s > --> /nix/store/9rqk4093qnvgswmdk1pbxk9najcrjn7a-vendor-cargo-deps/bc87b2b0f37b9a43ffdd82e8f11f3e864d9447ccd53a9a964250c3414c3656d9/numerica-3.0.0/src/domains/backend/integer.rs:1709:33
  1957. 713.79 s > |
  1958. 713.79 s > 1709 | pub(crate) use implementation::{from_be_bytes, to_be_bytes};
  1959. 713.79 s > | ^^^^^^^^^^^^^ ^^^^^^^^^^^ no `to_be_bytes` in `domains::backend::integer::implementation`
  1960. 713.79 s > | |
  1961. 713.79 s > | no `from_be_bytes` in `domains::backend::integer::implementation`
  1962. 713.79 s > |
  1963. 713.79 s > note: found an item that was configured out
  1964. 713.79 s > --> /nix/store/9rqk4093qnvgswmdk1pbxk9najcrjn7a-vendor-cargo-deps/bc87b2b0f37b9a43ffdd82e8f11f3e864d9447ccd53a9a964250c3414c3656d9/numerica-3.0.0/src/domains/backend/integer.rs:1370:19
  1965. 713.79 s > |
  1966. 713.79 s > 1369 | #[cfg(all(feature = "integer-malachite", feature = "bincode"))]
  1967. 713.79 s > | ----------------------------- the item is gated behind the `integer-malachite` feature
  1968. 713.79 s > 1370 | pub(crate) fn from_be_bytes(bytes: &[u8]) -> Result<MultiPrecisionInteger, &'static str> {
  1969. 713.79 s > | ^^^^^^^^^^^^^
  1970. 713.79 s > note: found an item that was configured out
  1971. 713.79 s > --> /nix/store/9rqk4093qnvgswmdk1pbxk9najcrjn7a-vendor-cargo-deps/bc87b2b0f37b9a43ffdd82e8f11f3e864d9447ccd53a9a964250c3414c3656d9/numerica-3.0.0/src/domains/backend/integer.rs:1405:19
  1972. 713.79 s > |
  1973. 713.79 s > 1404 | #[cfg(all(feature = "integer-gmp", feature = "bincode"))]
  1974. 713.79 s > | ----------------------- the item is gated behind the `integer-gmp` feature
  1975. 713.79 s > 1405 | pub(crate) fn from_be_bytes(bytes: &[u8]) -> Result<MultiPrecisionInteger, &'static str> {
  1976. 713.79 s > | ^^^^^^^^^^^^^
  1977. 713.79 s > note: found an item that was configured out
  1978. 713.79 s > --> /nix/store/9rqk4093qnvgswmdk1pbxk9najcrjn7a-vendor-cargo-deps/bc87b2b0f37b9a43ffdd82e8f11f3e864d9447ccd53a9a964250c3414c3656d9/numerica-3.0.0/src/domains/backend/integer.rs:1365:19
  1979. 713.79 s > |
  1980. 713.79 s > 1364 | #[cfg(all(feature = "integer-malachite", feature = "bincode"))]
  1981. 713.79 s > | ----------------------------- the item is gated behind the `integer-malachite` feature
  1982. 713.79 s > 1365 | pub(crate) fn to_be_bytes(value: &MultiPrecisionInteger) -> Vec<u8> {
  1983. 713.79 s > | ^^^^^^^^^^^
  1984. 713.79 s > note: found an item that was configured out
  1985. 713.79 s > --> /nix/store/9rqk4093qnvgswmdk1pbxk9najcrjn7a-vendor-cargo-deps/bc87b2b0f37b9a43ffdd82e8f11f3e864d9447ccd53a9a964250c3414c3656d9/numerica-3.0.0/src/domains/backend/integer.rs:1400:19
  1986. 713.79 s > |
  1987. 713.79 s > 1399 | #[cfg(all(feature = "integer-gmp", feature = "bincode"))]
  1988. 713.79 s > | ----------------------- the item is gated behind the `integer-gmp` feature
  1989. 713.79 s > 1400 | pub(crate) fn to_be_bytes(value: &MultiPrecisionInteger) -> Vec<u8> {
  1990. 713.79 s > | ^^^^^^^^^^^
  1991. 713.79 s >
  1992. 713.79 s > error[E0432]: unresolved imports `crate::domains::backend::float::Assign`, `crate::domains::backend::float::CompleteRound`, `crate::domains::backend::float::Constant`, `crate::domains::backend::float::MultiPrecisionFloat`, `crate::domains::backend::float::Pow`
  1993. 713.79 s > --> /nix/store/9rqk4093qnvgswmdk1pbxk9najcrjn7a-vendor-cargo-deps/bc87b2b0f37b9a43ffdd82e8f11f3e864d9447ccd53a9a964250c3414c3656d9/numerica-3.0.0/src/domains/float/multiprecision.rs:15:9
  1994. 713.79 s > |
  1995. 713.79 s > 15 | Assign, CompleteRound, Constant, MultiPrecisionFloat, MultiPrecisionFloatInteger,
  1996. 713.79 s > | ^^^^^^ ^^^^^^^^^^^^^ ^^^^^^^^ ^^^^^^^^^^^^^^^^^^^ no `MultiPrecisionFloat` in `domains::backend::float`
  1997. 713.79 s > | | | |
  1998. 713.79 s > | | | no `Constant` in `domains::backend::float`
  1999. 713.79 s > | | no `CompleteRound` in `domains::backend::float`
  2000. 713.79 s > | no `Assign` in `domains::backend::float`
  2001. 713.79 s > 16 | MultiPrecisionFloatRational, MultiPrecisionFloatRounding, Pow, RoundingDirection,
  2002. 713.79 s > | ^^^ no `Pow` in `domains::backend::float`
  2003. 713.79 s > |
  2004. 713.79 s > note: found an item that was configured out
  2005. 713.79 s > --> /nix/store/9rqk4093qnvgswmdk1pbxk9najcrjn7a-vendor-cargo-deps/bc87b2b0f37b9a43ffdd82e8f11f3e864d9447ccd53a9a964250c3414c3656d9/numerica-3.0.0/src/domains/backend/float.rs:17:5
  2006. 713.79 s > |
  2007. 713.79 s > 15 | #[cfg(feature = "float-mpfr")]
  2008. 713.79 s > | ---------------------- the item is gated behind the `float-mpfr` feature
  2009. 713.79 s > 16 | pub use rug::{
  2010. 713.79 s > 17 | Assign, Float as MultiPrecisionFloat, Rational as BackendRational,
  2011. 713.79 s > | ^^^^^^
  2012. 713.79 s > note: found an item that was configured out
  2013. 713.79 s > --> /nix/store/9rqk4093qnvgswmdk1pbxk9najcrjn7a-vendor-cargo-deps/bc87b2b0f37b9a43ffdd82e8f11f3e864d9447ccd53a9a964250c3414c3656d9/numerica-3.0.0/src/domains/backend/float.rs:1578:5
  2014. 713.79 s > |
  2015. 713.79 s > 1576 | #[cfg(feature = "float-astro")]
  2016. 713.79 s > | ----------------------- the item is gated behind the `float-astro` feature
  2017. 713.79 s > 1577 | pub use astro::{
  2018. 713.79 s > 1578 | Assign, BackendRational, CompleteRound, Constant, IntoMultiPrecisionFloat, MultiPrecisionFloat,
  2019. 713.79 s > | ^^^^^^
  2020. 713.79 s > note: found an item that was configured out
  2021. 713.79 s > --> /nix/store/9rqk4093qnvgswmdk1pbxk9najcrjn7a-vendor-cargo-deps/bc87b2b0f37b9a43ffdd82e8f11f3e864d9447ccd53a9a964250c3414c3656d9/numerica-3.0.0/src/domains/backend/float.rs:19:11
  2022. 713.79 s > |
  2023. 713.79 s > 15 | #[cfg(feature = "float-mpfr")]
  2024. 713.79 s > | ---------------------- the item is gated behind the `float-mpfr` feature
  2025. 713.79 s > ...
  2026. 713.79 s > 19 | ops::{CompleteRound, Pow},
  2027. 713.79 s > | ^^^^^^^^^^^^^
  2028. 713.79 s > note: found an item that was configured out
  2029. 713.79 s > --> /nix/store/9rqk4093qnvgswmdk1pbxk9najcrjn7a-vendor-cargo-deps/bc87b2b0f37b9a43ffdd82e8f11f3e864d9447ccd53a9a964250c3414c3656d9/numerica-3.0.0/src/domains/backend/float.rs:1578:30
  2030. 713.79 s > |
  2031. 713.79 s > 1576 | #[cfg(feature = "float-astro")]
  2032. 713.79 s > | ----------------------- the item is gated behind the `float-astro` feature
  2033. 713.79 s > 1577 | pub use astro::{
  2034. 713.79 s > 1578 | Assign, BackendRational, CompleteRound, Constant, IntoMultiPrecisionFloat, MultiPrecisionFloat,
  2035. 713.79 s > | ^^^^^^^^^^^^^
  2036. 713.79 s > note: found an item that was configured out
  2037. 713.79 s > --> /nix/store/9rqk4093qnvgswmdk1pbxk9najcrjn7a-vendor-cargo-deps/bc87b2b0f37b9a43ffdd82e8f11f3e864d9447ccd53a9a964250c3414c3656d9/numerica-3.0.0/src/domains/backend/float.rs:18:12
  2038. 713.79 s > |
  2039. 713.79 s > 15 | #[cfg(feature = "float-mpfr")]
  2040. 713.79 s > | ---------------------- the item is gated behind the `float-mpfr` feature
  2041. 713.79 s > ...
  2042. 713.79 s > 18 | float::Constant,
  2043. 713.79 s > | ^^^^^^^^
  2044. 713.79 s > note: found an item that was configured out
  2045. 713.79 s > --> /nix/store/9rqk4093qnvgswmdk1pbxk9najcrjn7a-vendor-cargo-deps/bc87b2b0f37b9a43ffdd82e8f11f3e864d9447ccd53a9a964250c3414c3656d9/numerica-3.0.0/src/domains/backend/float.rs:1578:45
  2046. 713.79 s > |
  2047. 713.79 s > 1576 | #[cfg(feature = "float-astro")]
  2048. 713.79 s > | ----------------------- the item is gated behind the `float-astro` feature
  2049. 713.79 s > 1577 | pub use astro::{
  2050. 713.79 s > 1578 | Assign, BackendRational, CompleteRound, Constant, IntoMultiPrecisionFloat, MultiPrecisionFloat,
  2051. 713.79 s > | ^^^^^^^^
  2052. 713.79 s > note: found an item that was configured out
  2053. 713.79 s > --> /nix/store/9rqk4093qnvgswmdk1pbxk9najcrjn7a-vendor-cargo-deps/bc87b2b0f37b9a43ffdd82e8f11f3e864d9447ccd53a9a964250c3414c3656d9/numerica-3.0.0/src/domains/backend/float.rs:17:22
  2054. 713.79 s > |
  2055. 713.79 s > 15 | #[cfg(feature = "float-mpfr")]
  2056. 713.79 s > | ---------------------- the item is gated behind the `float-mpfr` feature
  2057. 713.79 s > 16 | pub use rug::{
  2058. 713.79 s > 17 | Assign, Float as MultiPrecisionFloat, Rational as BackendRational,
  2059. 713.79 s > | ^^^^^^^^^^^^^^^^^^^
  2060. 713.79 s > note: found an item that was configured out
  2061. 713.79 s > --> /nix/store/9rqk4093qnvgswmdk1pbxk9najcrjn7a-vendor-cargo-deps/bc87b2b0f37b9a43ffdd82e8f11f3e864d9447ccd53a9a964250c3414c3656d9/numerica-3.0.0/src/domains/backend/float.rs:1578:80
  2062. 713.79 s > |
  2063. 713.79 s > 1576 | #[cfg(feature = "float-astro")]
  2064. 713.79 s > | ----------------------- the item is gated behind the `float-astro` feature
  2065. 713.79 s > 1577 | pub use astro::{
  2066. 713.79 s > 1578 | Assign, BackendRational, CompleteRound, Constant, IntoMultiPrecisionFloat, MultiPrecisionFloat,
  2067. 713.79 s > | ^^^^^^^^^^^^^^^^^^^
  2068. 713.79 s > note: found an item that was configured out
  2069. 713.79 s > --> /nix/store/9rqk4093qnvgswmdk1pbxk9najcrjn7a-vendor-cargo-deps/bc87b2b0f37b9a43ffdd82e8f11f3e864d9447ccd53a9a964250c3414c3656d9/numerica-3.0.0/src/domains/backend/float.rs:19:26
  2070. 713.79 s > |
  2071. 713.79 s > 15 | #[cfg(feature = "float-mpfr")]
  2072. 713.79 s > | ---------------------- the item is gated behind the `float-mpfr` feature
  2073. 713.79 s > ...
  2074. 713.79 s > 19 | ops::{CompleteRound, Pow},
  2075. 713.79 s > | ^^^
  2076. 713.79 s > note: found an item that was configured out
  2077. 713.79 s > --> /nix/store/9rqk4093qnvgswmdk1pbxk9najcrjn7a-vendor-cargo-deps/bc87b2b0f37b9a43ffdd82e8f11f3e864d9447ccd53a9a964250c3414c3656d9/numerica-3.0.0/src/domains/backend/float.rs:1579:5
  2078. 713.79 s > |
  2079. 713.79 s > 1576 | #[cfg(feature = "float-astro")]
  2080. 713.79 s > | ----------------------- the item is gated behind the `float-astro` feature
  2081. 713.79 s > ...
  2082. 713.79 s > 1579 | Pow,
  2083. 713.79 s > | ^^^
  2084. 713.79 s >
  2085. 713.79 s > error[E0425]: cannot find type `RawMultiPrecisionInteger` in this scope
  2086. 713.79 s > --> /nix/store/9rqk4093qnvgswmdk1pbxk9najcrjn7a-vendor-cargo-deps/bc87b2b0f37b9a43ffdd82e8f11f3e864d9447ccd53a9a964250c3414c3656d9/numerica-3.0.0/src/domains/backend/integer.rs:52:38
  2087. 713.79 s > |
  2088. 713.79 s > 52 | pub struct MultiPrecisionInteger(RawMultiPrecisionInteger);
  2089. 713.79 s > | ^^^^^^^^^^^^^^^^^^^^^^^^ not found in this scope
  2090. 713.79 s >
  2091. 713.79 s > error[E0425]: cannot find type `RawMultiPrecisionInteger` in this scope
  2092. 713.79 s > --> /nix/store/9rqk4093qnvgswmdk1pbxk9najcrjn7a-vendor-cargo-deps/bc87b2b0f37b9a43ffdd82e8f11f3e864d9447ccd53a9a964250c3414c3656d9/numerica-3.0.0/src/domains/backend/integer.rs:52:38
  2093. 713.79 s > |
  2094. 713.79 s > 52 | pub struct MultiPrecisionInteger(RawMultiPrecisionInteger);
  2095. 713.79 s > | ^^^^^^^^^^^^^^^^^^^^^^^^ not found in this scope
  2096. 713.79 s > |
  2097. 713.79 s > help: you might be missing a type parameter
  2098. 713.79 s > |
  2099. 713.79 s > 52 | pub struct MultiPrecisionInteger<RawMultiPrecisionInteger>(RawMultiPrecisionInteger);
  2100. 713.79 s > | ++++++++++++++++++++++++++
  2101. 713.79 s >
  2102. 713.79 s > error[E0425]: cannot find type `RawMultiPrecisionInteger` in this scope
  2103. 713.79 s > --> /nix/store/9rqk4093qnvgswmdk1pbxk9najcrjn7a-vendor-cargo-deps/bc87b2b0f37b9a43ffdd82e8f11f3e864d9447ccd53a9a964250c3414c3656d9/numerica-3.0.0/src/domains/backend/integer.rs:149:32
  2104. 713.79 s > |
  2105. 713.79 s > 52 | pub struct MultiPrecisionInteger(RawMultiPrecisionInteger);
  2106. 713.79 s > | ----------------------------------------------------------- similarly named struct `MultiPrecisionInteger` defined here
  2107. 713.79 s > ...
  2108. 713.79 s > 149 | pub fn from_raw(value: RawMultiPrecisionInteger) -> Self {
  2109. 713.79 s > | ^^^^^^^^^^^^^^^^^^^^^^^^
  2110. 713.79 s > |
  2111. 713.79 s > help: a struct with a similar name exists
  2112. 713.79 s > |
  2113. 713.79 s > 149 - pub fn from_raw(value: RawMultiPrecisionInteger) -> Self {
  2114. 713.79 s > 149 + pub fn from_raw(value: MultiPrecisionInteger) -> Self {
  2115. 713.79 s > |
  2116. 713.79 s >
  2117. 713.79 s > error[E0425]: cannot find type `RawMultiPrecisionInteger` in this scope
  2118. 713.79 s > --> /nix/store/9rqk4093qnvgswmdk1pbxk9najcrjn7a-vendor-cargo-deps/bc87b2b0f37b9a43ffdd82e8f11f3e864d9447ccd53a9a964250c3414c3656d9/numerica-3.0.0/src/domains/backend/integer.rs:187:34
  2119. 713.79 s > |
  2120. 713.79 s > 52 | pub struct MultiPrecisionInteger(RawMultiPrecisionInteger);
  2121. 713.79 s > | ----------------------------------------------------------- similarly named struct `MultiPrecisionInteger` defined here
  2122. 713.79 s > ...
  2123. 713.79 s > 187 | pub fn as_raw(&self) -> &RawMultiPrecisionInteger {
  2124. 713.79 s > | ^^^^^^^^^^^^^^^^^^^^^^^^
  2125. 713.79 s > |
  2126. 713.79 s > help: a struct with a similar name exists
  2127. 713.79 s > |
  2128. 713.79 s > 187 - pub fn as_raw(&self) -> &RawMultiPrecisionInteger {
  2129. 713.79 s > 187 + pub fn as_raw(&self) -> &MultiPrecisionInteger {
  2130. 713.79 s > |
  2131. 713.79 s >
  2132. 713.79 s > error[E0425]: cannot find type `RawMultiPrecisionInteger` in this scope
  2133. 713.79 s > --> /nix/store/9rqk4093qnvgswmdk1pbxk9najcrjn7a-vendor-cargo-deps/bc87b2b0f37b9a43ffdd82e8f11f3e864d9447ccd53a9a964250c3414c3656d9/numerica-3.0.0/src/domains/backend/integer.rs:193:33
  2134. 713.79 s > |
  2135. 713.79 s > 52 | pub struct MultiPrecisionInteger(RawMultiPrecisionInteger);
  2136. 713.79 s > | ----------------------------------------------------------- similarly named struct `MultiPrecisionInteger` defined here
  2137. 713.79 s > ...
  2138. 713.79 s > 193 | pub fn to_raw(&self) -> RawMultiPrecisionInteger {
  2139. 713.79 s > | ^^^^^^^^^^^^^^^^^^^^^^^^
  2140. 713.79 s > |
  2141. 713.79 s > help: a struct with a similar name exists
  2142. 713.79 s > |
  2143. 713.79 s > 193 - pub fn to_raw(&self) -> RawMultiPrecisionInteger {
  2144. 713.79 s > 193 + pub fn to_raw(&self) -> MultiPrecisionInteger {
  2145. 713.79 s > |
  2146. 713.79 s >
  2147. 713.79 s > error[E0425]: cannot find type `RawMultiPrecisionInteger` in this scope
  2148. 713.79 s > --> /nix/store/9rqk4093qnvgswmdk1pbxk9najcrjn7a-vendor-cargo-deps/bc87b2b0f37b9a43ffdd82e8f11f3e864d9447ccd53a9a964250c3414c3656d9/numerica-3.0.0/src/domains/backend/integer.rs:199:34
  2149. 713.79 s > |
  2150. 713.79 s > 52 | pub struct MultiPrecisionInteger(RawMultiPrecisionInteger);
  2151. 713.79 s > | ----------------------------------------------------------- similarly named struct `MultiPrecisionInteger` defined here
  2152. 713.79 s > ...
  2153. 713.79 s > 199 | pub fn into_raw(self) -> RawMultiPrecisionInteger {
  2154. 713.79 s > | ^^^^^^^^^^^^^^^^^^^^^^^^
  2155. 713.79 s > |
  2156. 713.79 s > help: a struct with a similar name exists
  2157. 713.79 s > |
  2158. 713.79 s > 199 - pub fn into_raw(self) -> RawMultiPrecisionInteger {
  2159. 713.79 s > 199 + pub fn into_raw(self) -> MultiPrecisionInteger {
  2160. 713.79 s > |
  2161. 713.79 s >
  2162. 713.79 s > error[E0425]: cannot find type `RawMultiPrecisionInteger` in this scope
  2163. 713.79 s > --> /nix/store/9rqk4093qnvgswmdk1pbxk9najcrjn7a-vendor-cargo-deps/bc87b2b0f37b9a43ffdd82e8f11f3e864d9447ccd53a9a964250c3414c3656d9/numerica-3.0.0/src/domains/backend/integer.rs:567:27
  2164. 713.79 s > |
  2165. 713.79 s > 52 | pub struct MultiPrecisionInteger(RawMultiPrecisionInteger);
  2166. 713.79 s > | ----------------------------------------------------------- similarly named struct `MultiPrecisionInteger` defined here
  2167. 713.79 s > ...
  2168. 713.79 s > 567 | fn rem_trunc(lhs: RawMultiPrecisionInteger, rhs: RawMultiPrecisionInteger) -> Self {
  2169. 713.79 s > | ^^^^^^^^^^^^^^^^^^^^^^^^
  2170. 713.79 s > |
  2171. 713.79 s > help: a struct with a similar name exists
  2172. 713.79 s > |
  2173. 713.79 s > 567 - fn rem_trunc(lhs: RawMultiPrecisionInteger, rhs: RawMultiPrecisionInteger) -> Self {
  2174. 713.79 s > 567 + fn rem_trunc(lhs: MultiPrecisionInteger, rhs: RawMultiPrecisionInteger) -> Self {
  2175. 713.79 s > |
  2176. 713.79 s >
  2177. 713.79 s > error[E0425]: cannot find type `RawMultiPrecisionInteger` in this scope
  2178. 713.79 s > --> /nix/store/9rqk4093qnvgswmdk1pbxk9najcrjn7a-vendor-cargo-deps/bc87b2b0f37b9a43ffdd82e8f11f3e864d9447ccd53a9a964250c3414c3656d9/numerica-3.0.0/src/domains/backend/integer.rs:567:58
  2179. 713.79 s > |
  2180. 713.79 s > 52 | pub struct MultiPrecisionInteger(RawMultiPrecisionInteger);
  2181. 713.79 s > | ----------------------------------------------------------- similarly named struct `MultiPrecisionInteger` defined here
  2182. 713.79 s > ...
  2183. 713.79 s > 567 | fn rem_trunc(lhs: RawMultiPrecisionInteger, rhs: RawMultiPrecisionInteger) -> Self {
  2184. 713.79 s > | ^^^^^^^^^^^^^^^^^^^^^^^^
  2185. 713.79 s > |
  2186. 713.79 s > help: a struct with a similar name exists
  2187. 713.79 s > |
  2188. 713.79 s > 567 - fn rem_trunc(lhs: RawMultiPrecisionInteger, rhs: RawMultiPrecisionInteger) -> Self {
  2189. 713.79 s > 567 + fn rem_trunc(lhs: RawMultiPrecisionInteger, rhs: MultiPrecisionInteger) -> Self {
  2190. 713.79 s > |
  2191. 713.79 s >
  2192. 713.79 s > error[E0425]: cannot find type `RawMultiPrecisionInteger` in this scope
  2193. 713.79 s > --> /nix/store/9rqk4093qnvgswmdk1pbxk9najcrjn7a-vendor-cargo-deps/bc87b2b0f37b9a43ffdd82e8f11f3e864d9447ccd53a9a964250c3414c3656d9/numerica-3.0.0/src/domains/backend/integer.rs:582:27
  2194. 713.79 s > |
  2195. 713.79 s > 52 | pub struct MultiPrecisionInteger(RawMultiPrecisionInteger);
  2196. 713.79 s > | ----------------------------------------------------------- similarly named struct `MultiPrecisionInteger` defined here
  2197. 713.79 s > ...
  2198. 713.79 s > 582 | fn shl_raw(value: RawMultiPrecisionInteger, rhs: u64) -> RawMultiPrecisionInteger {
  2199. 713.79 s > | ^^^^^^^^^^^^^^^^^^^^^^^^
  2200. 713.79 s > |
  2201. 713.79 s > help: a struct with a similar name exists
  2202. 713.79 s > |
  2203. 713.79 s > 582 - fn shl_raw(value: RawMultiPrecisionInteger, rhs: u64) -> RawMultiPrecisionInteger {
  2204. 713.79 s > 582 + fn shl_raw(value: MultiPrecisionInteger, rhs: u64) -> RawMultiPrecisionInteger {
  2205. 713.79 s > |
  2206. 713.79 s >
  2207. 713.79 s > error[E0425]: cannot find type `RawMultiPrecisionInteger` in this scope
  2208. 713.79 s > --> /nix/store/9rqk4093qnvgswmdk1pbxk9najcrjn7a-vendor-cargo-deps/bc87b2b0f37b9a43ffdd82e8f11f3e864d9447ccd53a9a964250c3414c3656d9/numerica-3.0.0/src/domains/backend/integer.rs:582:66
  2209. 713.79 s > |
  2210. 713.79 s > 52 | pub struct MultiPrecisionInteger(RawMultiPrecisionInteger);
  2211. 713.79 s > | ----------------------------------------------------------- similarly named struct `MultiPrecisionInteger` defined here
  2212. 713.79 s > ...
  2213. 713.79 s > 582 | fn shl_raw(value: RawMultiPrecisionInteger, rhs: u64) -> RawMultiPrecisionInteger {
  2214. 713.79 s > | ^^^^^^^^^^^^^^^^^^^^^^^^
  2215. 713.79 s > |
  2216. 713.79 s > help: a struct with a similar name exists
  2217. 713.79 s > |
  2218. 713.79 s > 582 - fn shl_raw(value: RawMultiPrecisionInteger, rhs: u64) -> RawMultiPrecisionInteger {
  2219. 713.79 s > 582 + fn shl_raw(value: RawMultiPrecisionInteger, rhs: u64) -> MultiPrecisionInteger {
  2220. 713.79 s > |
  2221. 713.79 s >
  2222. 713.79 s > error[E0425]: cannot find type `RawMultiPrecisionInteger` in this scope
  2223. 713.79 s > --> /nix/store/9rqk4093qnvgswmdk1pbxk9najcrjn7a-vendor-cargo-deps/bc87b2b0f37b9a43ffdd82e8f11f3e864d9447ccd53a9a964250c3414c3656d9/numerica-3.0.0/src/domains/backend/integer.rs:590:27
  2224. 713.79 s > |
  2225. 713.79 s > 52 | pub struct MultiPrecisionInteger(RawMultiPrecisionInteger);
  2226. 713.79 s > | ----------------------------------------------------------- similarly named struct `MultiPrecisionInteger` defined here
  2227. 713.79 s > ...
  2228. 713.79 s > 590 | fn shr_raw(value: RawMultiPrecisionInteger, rhs: u64) -> RawMultiPrecisionInteger {
  2229. 713.79 s > | ^^^^^^^^^^^^^^^^^^^^^^^^
  2230. 713.79 s > |
  2231. 713.79 s > help: a struct with a similar name exists
  2232. 713.79 s > |
  2233. 713.79 s > 590 - fn shr_raw(value: RawMultiPrecisionInteger, rhs: u64) -> RawMultiPrecisionInteger {
  2234. 713.79 s > 590 + fn shr_raw(value: MultiPrecisionInteger, rhs: u64) -> RawMultiPrecisionInteger {
  2235. 713.79 s > |
  2236. 713.79 s >
  2237. 713.79 s > error[E0425]: cannot find type `RawMultiPrecisionInteger` in this scope
  2238. 713.79 s > --> /nix/store/9rqk4093qnvgswmdk1pbxk9najcrjn7a-vendor-cargo-deps/bc87b2b0f37b9a43ffdd82e8f11f3e864d9447ccd53a9a964250c3414c3656d9/numerica-3.0.0/src/domains/backend/integer.rs:590:66
  2239. 713.79 s > |
  2240. 713.79 s > 52 | pub struct MultiPrecisionInteger(RawMultiPrecisionInteger);
  2241. 713.79 s > | ----------------------------------------------------------- similarly named struct `MultiPrecisionInteger` defined here
  2242. 713.79 s > ...
  2243. 713.79 s > 590 | fn shr_raw(value: RawMultiPrecisionInteger, rhs: u64) -> RawMultiPrecisionInteger {
  2244. 713.79 s > | ^^^^^^^^^^^^^^^^^^^^^^^^
  2245. 713.79 s > |
  2246. 713.79 s > help: a struct with a similar name exists
  2247. 713.79 s > |
  2248. 713.79 s > 590 - fn shr_raw(value: RawMultiPrecisionInteger, rhs: u64) -> RawMultiPrecisionInteger {
  2249. 713.79 s > 590 + fn shr_raw(value: RawMultiPrecisionInteger, rhs: u64) -> MultiPrecisionInteger {
  2250. 713.79 s > |
  2251. 713.79 s >
  2252. 713.79 s > error[E0425]: cannot find type `RawMultiPrecisionInteger` in this scope
  2253. 713.79 s > --> /nix/store/9rqk4093qnvgswmdk1pbxk9najcrjn7a-vendor-cargo-deps/bc87b2b0f37b9a43ffdd82e8f11f3e864d9447ccd53a9a964250c3414c3656d9/numerica-3.0.0/src/domains/backend/integer.rs:654:15
  2254. 713.79 s > |
  2255. 713.79 s > 52 | pub struct MultiPrecisionInteger(RawMultiPrecisionInteger);
  2256. 713.79 s > | ----------------------------------------------------------- similarly named struct `MultiPrecisionInteger` defined here
  2257. 713.79 s > ...
  2258. 713.79 s > 654 | impl From<RawMultiPrecisionInteger> for MultiPrecisionInteger {
  2259. 713.79 s > | ^^^^^^^^^^^^^^^^^^^^^^^^
  2260. 713.79 s > |
  2261. 713.79 s > help: a struct with a similar name exists
  2262. 713.79 s > |
  2263. 713.79 s > 654 - impl From<RawMultiPrecisionInteger> for MultiPrecisionInteger {
  2264. 713.79 s > 654 + impl From<MultiPrecisionInteger> for MultiPrecisionInteger {
  2265. 713.79 s > |
  2266. 713.79 s > help: you might be missing a type parameter
  2267. 713.79 s > |
  2268. 713.79 s > 654 | impl<RawMultiPrecisionInteger> From<RawMultiPrecisionInteger> for MultiPrecisionInteger {
  2269. 713.79 s > | ++++++++++++++++++++++++++
  2270. 713.79 s >
  2271. 713.79 s > error[E0425]: cannot find type `RawMultiPrecisionInteger` in this scope
  2272. 713.79 s > --> /nix/store/9rqk4093qnvgswmdk1pbxk9najcrjn7a-vendor-cargo-deps/bc87b2b0f37b9a43ffdd82e8f11f3e864d9447ccd53a9a964250c3414c3656d9/numerica-3.0.0/src/domains/backend/integer.rs:656:24
  2273. 713.79 s > |
  2274. 713.79 s > 52 | pub struct MultiPrecisionInteger(RawMultiPrecisionInteger);
  2275. 713.79 s > | ----------------------------------------------------------- similarly named struct `MultiPrecisionInteger` defined here
  2276. 713.79 s > ...
  2277. 713.79 s > 656 | fn from(value: RawMultiPrecisionInteger) -> Self {
  2278. 713.79 s > | ^^^^^^^^^^^^^^^^^^^^^^^^
  2279. 713.79 s > |
  2280. 713.79 s > help: a struct with a similar name exists
  2281. 713.79 s > |
  2282. 713.79 s > 656 - fn from(value: RawMultiPrecisionInteger) -> Self {
  2283. 713.79 s > 656 + fn from(value: MultiPrecisionInteger) -> Self {
  2284. 713.79 s > |
  2285. 713.79 s >
  2286. 713.79 s > error[E0425]: cannot find type `RawMultiPrecisionInteger` in this scope
  2287. 713.79 s > --> /nix/store/9rqk4093qnvgswmdk1pbxk9najcrjn7a-vendor-cargo-deps/bc87b2b0f37b9a43ffdd82e8f11f3e864d9447ccd53a9a964250c3414c3656d9/numerica-3.0.0/src/domains/backend/integer.rs:661:42
  2288. 713.79 s > |
  2289. 713.79 s > 52 | pub struct MultiPrecisionInteger(RawMultiPrecisionInteger);
  2290. 713.79 s > | ----------------------------------------------------------- similarly named struct `MultiPrecisionInteger` defined here
  2291. 713.79 s > ...
  2292. 713.79 s > 661 | impl From<MultiPrecisionInteger> for RawMultiPrecisionInteger {
  2293. 713.79 s > | ^^^^^^^^^^^^^^^^^^^^^^^^
  2294. 713.79 s > |
  2295. 713.79 s > help: a struct with a similar name exists
  2296. 713.79 s > |
  2297. 713.79 s > 661 - impl From<MultiPrecisionInteger> for RawMultiPrecisionInteger {
  2298. 713.79 s > 661 + impl From<MultiPrecisionInteger> for MultiPrecisionInteger {
  2299. 713.79 s > |
  2300. 713.79 s >
  2301. 713.79 s > error[E0433]: cannot find type `RawMultiPrecisionInteger` in this scope
  2302. 713.79 s > --> /nix/store/9rqk4093qnvgswmdk1pbxk9najcrjn7a-vendor-cargo-deps/bc87b2b0f37b9a43ffdd82e8f11f3e864d9447ccd53a9a964250c3414c3656d9/numerica-3.0.0/src/domains/backend/integer.rs:620:13
  2303. 713.79 s > |
  2304. 713.79 s > 620 | RawMultiPrecisionInteger::from_str(s)
  2305. 713.79 s > | ^^^^^^^^^^^^^^^^^^^^^^^^ use of undeclared type `RawMultiPrecisionInteger`
  2306. 713.79 s > |
  2307. 713.79 s > help: a struct with a similar name exists
  2308. 713.79 s > |
  2309. 713.79 s > 620 - RawMultiPrecisionInteger::from_str(s)
  2310. 713.79 s > 620 + MultiPrecisionInteger::from_str(s)
  2311. 713.79 s > |
  2312. 713.79 s >
  2313. 713.79 s > error[E0433]: cannot find type `RawMultiPrecisionInteger` in this scope
  2314. 713.79 s > --> /nix/store/9rqk4093qnvgswmdk1pbxk9najcrjn7a-vendor-cargo-deps/bc87b2b0f37b9a43ffdd82e8f11f3e864d9447ccd53a9a964250c3414c3656d9/numerica-3.0.0/src/domains/backend/integer.rs:674:35
  2315. 713.79 s > |
  2316. 713.79 s > 674 | self.0 == RawMultiPrecisionInteger::from(*other)
  2317. 713.79 s > | ^^^^^^^^^^^^^^^^^^^^^^^^ use of undeclared type `RawMultiPrecisionInteger`
  2318. 713.79 s > ...
  2319. 713.79 s > 702 | impl_cmp_primitive!(i32, i64, i128, u32, u64, u128);
  2320. 713.79 s > | --------------------------------------------------- in this macro invocation
  2321. 713.79 s > |
  2322. 713.79 s > = note: this error originates in the macro `impl_cmp_primitive` (in Nightly builds, run with -Z macro-backtrace for more info)
  2323. 713.79 s > help: a struct with a similar name exists
  2324. 713.79 s > |
  2325. 713.79 s > 674 - self.0 == RawMultiPrecisionInteger::from(*other)
  2326. 713.79 s > 674 + self.0 == MultiPrecisionInteger::from(*other)
  2327. 713.79 s > |
  2328. 713.79 s >
  2329. 713.79 s > error[E0433]: cannot find type `RawMultiPrecisionInteger` in this scope
  2330. 713.79 s > --> /nix/store/9rqk4093qnvgswmdk1pbxk9najcrjn7a-vendor-cargo-deps/bc87b2b0f37b9a43ffdd82e8f11f3e864d9447ccd53a9a964250c3414c3656d9/numerica-3.0.0/src/domains/backend/integer.rs:681:25
  2331. 713.79 s > |
  2332. 713.79 s > 681 | RawMultiPrecisionInteger::from(*self) == other.0
  2333. 713.79 s > | ^^^^^^^^^^^^^^^^^^^^^^^^ use of undeclared type `RawMultiPrecisionInteger`
  2334. 713.79 s > ...
  2335. 713.79 s > 702 | impl_cmp_primitive!(i32, i64, i128, u32, u64, u128);
  2336. 713.79 s > | --------------------------------------------------- in this macro invocation
  2337. 713.79 s > |
  2338. 713.79 s > = note: this error originates in the macro `impl_cmp_primitive` (in Nightly builds, run with -Z macro-backtrace for more info)
  2339. 713.79 s > help: a struct with a similar name exists
  2340. 713.79 s > |
  2341. 713.79 s > 681 - RawMultiPrecisionInteger::from(*self) == other.0
  2342. 713.79 s > 681 + MultiPrecisionInteger::from(*self) == other.0
  2343. 713.79 s > |
  2344. 713.79 s >
  2345. 713.79 s > error[E0433]: cannot find type `RawMultiPrecisionInteger` in this scope
  2346. 713.79 s > --> /nix/store/9rqk4093qnvgswmdk1pbxk9najcrjn7a-vendor-cargo-deps/bc87b2b0f37b9a43ffdd82e8f11f3e864d9447ccd53a9a964250c3414c3656d9/numerica-3.0.0/src/domains/backend/integer.rs:688:45
  2347. 713.79 s > |
  2348. 713.79 s > 688 | self.0.partial_cmp(&RawMultiPrecisionInteger::from(*other))
  2349. 713.79 s > | ^^^^^^^^^^^^^^^^^^^^^^^^ use of undeclared type `RawMultiPrecisionInteger`
  2350. 713.79 s > ...
  2351. 713.79 s > 702 | impl_cmp_primitive!(i32, i64, i128, u32, u64, u128);
  2352. 713.79 s > | --------------------------------------------------- in this macro invocation
  2353. 713.79 s > |
  2354. 713.79 s > = note: this error originates in the macro `impl_cmp_primitive` (in Nightly builds, run with -Z macro-backtrace for more info)
  2355. 713.79 s > help: a struct with a similar name exists
  2356. 713.79 s > |
  2357. 713.79 s > 688 - self.0.partial_cmp(&RawMultiPrecisionInteger::from(*other))
  2358. 713.79 s > 688 + self.0.partial_cmp(&MultiPrecisionInteger::from(*other))
  2359. 713.79 s > |
  2360. 713.79 s >
  2361. 713.79 s > error[E0433]: cannot find type `RawMultiPrecisionInteger` in this scope
  2362. 713.79 s > --> /nix/store/9rqk4093qnvgswmdk1pbxk9najcrjn7a-vendor-cargo-deps/bc87b2b0f37b9a43ffdd82e8f11f3e864d9447ccd53a9a964250c3414c3656d9/numerica-3.0.0/src/domains/backend/integer.rs:695:25
  2363. 713.79 s > |
  2364. 713.79 s > 695 | RawMultiPrecisionInteger::from(*self).partial_cmp(&other.0)
  2365. 713.79 s > | ^^^^^^^^^^^^^^^^^^^^^^^^ use of undeclared type `RawMultiPrecisionInteger`
  2366. 713.79 s > ...
  2367. 713.79 s > 702 | impl_cmp_primitive!(i32, i64, i128, u32, u64, u128);
  2368. 713.79 s > | --------------------------------------------------- in this macro invocation
  2369. 713.79 s > |
  2370. 713.79 s > = note: this error originates in the macro `impl_cmp_primitive` (in Nightly builds, run with -Z macro-backtrace for more info)
  2371. 713.79 s > help: a struct with a similar name exists
  2372. 713.79 s > |
  2373. 713.79 s > 695 - RawMultiPrecisionInteger::from(*self).partial_cmp(&other.0)
  2374. 713.79 s > 695 + MultiPrecisionInteger::from(*self).partial_cmp(&other.0)
  2375. 713.79 s > |
  2376. 713.79 s >
  2377. 713.79 s > error[E0433]: cannot find type `RawMultiPrecisionInteger` in this scope
  2378. 713.79 s > --> /nix/store/9rqk4093qnvgswmdk1pbxk9najcrjn7a-vendor-cargo-deps/bc87b2b0f37b9a43ffdd82e8f11f3e864d9447ccd53a9a964250c3414c3656d9/numerica-3.0.0/src/domains/backend/integer.rs:1180:35
  2379. 713.79 s > |
  2380. 713.79 s > 1180 | MultiPrecisionInteger(RawMultiPrecisionInteger::from((&self.0) & &rhs.0))
  2381. 713.79 s > | ^^^^^^^^^^^^^^^^^^^^^^^^ use of undeclared type `RawMultiPrecisionInteger`
  2382. 713.79 s > |
  2383. 713.79 s > help: a struct with a similar name exists
  2384. 713.79 s > |
  2385. 713.79 s > 1180 - MultiPrecisionInteger(RawMultiPrecisionInteger::from((&self.0) & &rhs.0))
  2386. 713.79 s > 1180 + MultiPrecisionInteger(MultiPrecisionInteger::from((&self.0) & &rhs.0))
  2387. 713.79 s > |
  2388. 713.79 s >
  2389. 713.79 s > error[E0433]: cannot find type `RawMultiPrecisionInteger` in this scope
  2390. 713.79 s > --> /nix/store/9rqk4093qnvgswmdk1pbxk9najcrjn7a-vendor-cargo-deps/bc87b2b0f37b9a43ffdd82e8f11f3e864d9447ccd53a9a964250c3414c3656d9/numerica-3.0.0/src/domains/backend/integer.rs:1212:35
  2391. 713.79 s > |
  2392. 713.79 s > 1212 | MultiPrecisionInteger(RawMultiPrecisionInteger::from(-&self.0))
  2393. 713.79 s > | ^^^^^^^^^^^^^^^^^^^^^^^^ use of undeclared type `RawMultiPrecisionInteger`
  2394. 713.79 s > |
  2395. 713.79 s > help: a struct with a similar name exists
  2396. 713.79 s > |
  2397. 713.79 s > 1212 - MultiPrecisionInteger(RawMultiPrecisionInteger::from(-&self.0))
  2398. 713.79 s > 1212 + MultiPrecisionInteger(MultiPrecisionInteger::from(-&self.0))
  2399. 713.79 s > |
  2400. 713.79 s >
  2401. 713.79 s > error[E0425]: cannot find function `write_lsf_bytes` in this scope
  2402. 713.79 s > --> /nix/store/9rqk4093qnvgswmdk1pbxk9najcrjn7a-vendor-cargo-deps/bc87b2b0f37b9a43ffdd82e8f11f3e864d9447ccd53a9a964250c3414c3656d9/numerica-3.0.0/src/domains/backend/integer.rs:1682:5
  2403. 713.79 s > |
  2404. 713.79 s > 1682 | write_lsf_bytes(value, &mut bytes);
  2405. 713.79 s > | ^^^^^^^^^^^^^^^ not found in this scope
  2406. 713.79 s >
  2407. 713.79 s > Some errors have detailed explanations: E0425, E0432, E0433.
  2408. 713.79 s > For more information about an error, try `rustc --explain E0425`.
  2409. 713.79 s > error: could not compile `numerica` (lib) due to 29 previous errors
  2410. 713.79 s > warning: build failed, waiting for other jobs to finish...
  2411. 713.79 s For full logs, run:
  2412. 713.79 s nix log /nix/store/25hrbpahaiadf5lrxdqibcnq2kvhmvqg-alphal00p-docs-cargo-0.1.0.drv
  2413. 713.86 s Build failed.