0.01 s
$ /nix/store/9ypz3flqsrl5xl495mm8h645gadjsxi1-coreutils-9.11/bin/timeout --kill-after=15s 7200s /nix/store/23zk8sgzamrbmj1fday15szf7f2279s8-nix-2.34.7/bin/nix --extra-experimental-features nix-command --extra-experimental-features flakes flake clone git+https://github.com/alphal00p/gammaloop --dest /tmp/nix-ci-worker/stable-pwd/repo/
0.08 s
Cloning into '/tmp/nix-ci-worker/stable-pwd/repo'...
1.63 s
remote: Enumerating objects: 83696, done.
1.74 s
remote: Counting objects: 0% (1/9851)
remote: Counting objects: 1% (99/9851)
remote: Counting objects: 2% (198/9851)
remote: Counting objects: 3% (296/9851)
remote: Counting objects: 4% (395/9851)
remote: Counting objects: 5% (493/9851)
remote: Counting objects: 6% (592/9851)
remote: Counting objects: 7% (690/9851)
remote: Counting objects: 8% (789/9851)
remote: Counting objects: 9% (887/9851)
remote: Counting objects: 10% (986/9851)
remote: Counting objects: 11% (1084/9851)
remote: Counting objects: 12% (1183/9851)
remote: Counting objects: 13% (1281/9851)
remote: Counting objects: 14% (1380/9851)
remote: Counting objects: 15% (1478/9851)
remote: Counting objects: 16% (1577/9851)
remote: Counting objects: 17% (1675/9851)
remote: Counting objects: 18% (1774/9851)
remote: Counting objects: 19% (1872/9851)
remote: Counting objects: 20% (1971/9851)
remote: Counting objects: 21% (2069/9851)
remote: Counting objects: 22% (2168/9851)
remote: Counting objects: 23% (2266/9851)
remote: Counting objects: 24% (2365/9851)
remote: Counting objects: 25% (2463/9851)
remote: Counting objects: 26% (2562/9851)
remote: Counting objects: 27% (2660/9851)
remote: Counting objects: 28% (2759/9851)
remote: Counting objects: 29% (2857/9851)
remote: Counting objects: 30% (2956/9851)
remote: Counting objects: 31% (3054/9851)
remote: Counting objects: 32% (3153/9851)
remote: Counting objects: 33% (3251/9851)
remote: Counting objects: 34% (3350/9851)
remote: Counting objects: 35% (3448/9851)
remote: Counting objects: 36% (3547/9851)
remote: Counting objects: 37% (3645/9851)
remote: Counting objects: 38% (3744/9851)
remote: Counting objects: 39% (3842/9851)
remote: Counting objects: 40% (3941/9851)
remote: Counting objects: 41% (4039/9851)
remote: Counting objects: 42% (4138/9851)
remote: Counting objects: 43% (4236/9851)
remote: Counting objects: 44% (4335/9851)
remote: Counting objects: 45% (4433/9851)
remote: Counting objects: 46% (4532/9851)
remote: Counting objects: 47% (4630/9851)
remote: Counting objects: 48% (4729/9851)
remote: Counting objects: 49% (4827/9851)
remote: Counting objects: 50% (4926/9851)
remote: Counting objects: 51% (5025/9851)
remote: Counting objects: 52% (5123/9851)
remote: Counting objects: 53% (5222/9851)
remote: Counting objects: 54% (5320/9851)
remote: Counting objects: 55% (5419/9851)
remote: Counting objects: 56% (5517/9851)
remote: Counting objects: 57% (5616/9851)
remote: Counting objects: 58% (5714/9851)
remote: Counting objects: 59% (5813/9851)
remote: Counting objects: 60% (5911/9851)
remote: Counting objects: 61% (6010/9851)
remote: Counting objects: 62% (6108/9851)
remote: Counting objects: 63% (6207/9851)
remote: Counting objects: 64% (6305/9851)
remote: Counting objects: 65% (6404/9851)
remote: Counting objects: 66% (6502/9851)
remote: Counting objects: 67% (6601/9851)
remote: Counting objects: 68% (6699/9851)
remote: Counting objects: 69% (6798/9851)
remote: Counting objects: 70% (6896/9851)
remote: Counting objects: 71% (6995/9851)
remote: Counting objects: 72% (7093/9851)
remote: Counting objects: 73% (7192/9851)
remote: Counting objects: 74% (7290/9851)
remote: Counting objects: 75% (7389/9851)
remote: Counting objects: 76% (7487/9851)
remote: Counting objects: 77% (7586/9851)
remote: Counting objects: 78% (7684/9851)
remote: Counting objects: 79% (7783/9851)
remote: Counting objects: 80% (7881/9851)
remote: Counting objects: 81% (7980/9851)
remote: Counting objects: 82% (8078/9851)
remote: Counting objects: 83% (8177/9851)
remote: Counting objects: 84% (8275/9851)
remote: Counting objects: 85% (8374/9851)
remote: Counting objects: 86% (8472/9851)
remote: Counting objects: 87% (8571/9851)
remote: Counting objects: 88% (8669/9851)
remote: Counting objects: 89% (8768/9851)
remote: Counting objects: 90% (8866/9851)
remote: Counting objects: 91% (8965/9851)
remote: Counting objects: 92% (9063/9851)
remote: Counting objects: 93% (9162/9851)
remote: Counting objects: 94% (9260/9851)
remote: Counting objects: 95% (9359/9851)
remote: Counting objects: 96% (9457/9851)
remote: Counting objects: 97% (9556/9851)
remote: Counting objects: 98% (9654/9851)
remote: Counting objects: 99% (9753/9851)
remote: Counting objects: 100% (9851/9851)
remote: Counting objects: 100% (9851/9851), done.
4.30 s
remote: Compressing objects: 0% (1/2135)
remote: Compressing objects: 1% (22/2135)
remote: Compressing objects: 2% (43/2135)
remote: Compressing objects: 3% (65/2135)
remote: Compressing objects: 4% (86/2135)
remote: Compressing objects: 5% (107/2135)
remote: Compressing objects: 6% (129/2135)
remote: Compressing objects: 7% (150/2135)
remote: Compressing objects: 8% (171/2135)
remote: Compressing objects: 9% (193/2135)
remote: Compressing objects: 10% (214/2135)
remote: Compressing objects: 11% (235/2135)
remote: Compressing objects: 12% (257/2135)
remote: Compressing objects: 13% (278/2135)
remote: Compressing objects: 14% (299/2135)
remote: Compressing objects: 15% (321/2135)
remote: Compressing objects: 15% (334/2135)
remote: Compressing objects: 16% (342/2135)
remote: Compressing objects: 17% (363/2135)
remote: Compressing objects: 18% (385/2135)
remote: Compressing objects: 19% (406/2135)
remote: Compressing objects: 20% (427/2135)
remote: Compressing objects: 21% (449/2135)
remote: Compressing objects: 22% (470/2135)
remote: Compressing objects: 22% (481/2135)
remote: Compressing objects: 23% (492/2135)
remote: Compressing objects: 24% (513/2135)
remote: Compressing objects: 25% (534/2135)
remote: Compressing objects: 26% (556/2135)
remote: Compressing objects: 27% (577/2135)
remote: Compressing objects: 28% (598/2135)
remote: Compressing objects: 29% (620/2135)
remote: Compressing objects: 30% (641/2135)
remote: Compressing objects: 31% (662/2135)
remote: Compressing objects: 32% (684/2135)
remote: Compressing objects: 33% (705/2135)
remote: Compressing objects: 34% (726/2135)
remote: Compressing objects: 35% (748/2135)
remote: Compressing objects: 36% (769/2135)
remote: Compressing objects: 37% (790/2135)
remote: Compressing objects: 38% (812/2135)
remote: Compressing objects: 39% (833/2135)
remote: Compressing objects: 40% (854/2135)
remote: Compressing objects: 41% (876/2135)
remote: Compressing objects: 42% (897/2135)
remote: Compressing objects: 43% (919/2135)
remote: Compressing objects: 44% (940/2135)
remote: Compressing objects: 45% (961/2135)
remote: Compressing objects: 46% (983/2135)
remote: Compressing objects: 47% (1004/2135)
remote: Compressing objects: 48% (1025/2135)
remote: Compressing objects: 49% (1047/2135)
remote: Compressing objects: 50% (1068/2135)
remote: Compressing objects: 51% (1089/2135)
remote: Compressing objects: 52% (1111/2135)
remote: Compressing objects: 53% (1132/2135)
remote: Compressing objects: 54% (1153/2135)
remote: Compressing objects: 55% (1175/2135)
remote: Compressing objects: 56% (1196/2135)
remote: Compressing objects: 57% (1217/2135)
remote: Compressing objects: 58% (1239/2135)
remote: Compressing objects: 59% (1260/2135)
remote: Compressing objects: 60% (1281/2135)
remote: Compressing objects: 61% (1303/2135)
remote: Compressing objects: 62% (1324/2135)
remote: Compressing objects: 63% (1346/2135)
remote: Compressing objects: 64% (1367/2135)
remote: Compressing objects: 65% (1388/2135)
remote: Compressing objects: 66% (1410/2135)
remote: Compressing objects: 67% (1431/2135)
remote: Compressing objects: 68% (1452/2135)
remote: Compressing objects: 69% (1474/2135)
remote: Compressing objects: 70% (1495/2135)
remote: Compressing objects: 71% (1516/2135)
remote: Compressing objects: 72% (1538/2135)
remote: Compressing objects: 73% (1559/2135)
remote: Compressing objects: 74% (1580/2135)
remote: Compressing objects: 75% (1602/2135)
remote: Compressing objects: 76% (1623/2135)
remote: Compressing objects: 77% (1644/2135)
remote: Compressing objects: 78% (1666/2135)
remote: Compressing objects: 79% (1687/2135)
remote: Compressing objects: 80% (1708/2135)
remote: Compressing objects: 81% (1730/2135)
remote: Compressing objects: 82% (1751/2135)
remote: Compressing objects: 83% (1773/2135)
remote: Compressing objects: 84% (1794/2135)
remote: Compressing objects: 85% (1815/2135)
remote: Compressing objects: 86% (1837/2135)
remote: Compressing objects: 87% (1858/2135)
remote: Compressing objects: 88% (1879/2135)
remote: Compressing objects: 89% (1901/2135)
remote: Compressing objects: 90% (1922/2135)
remote: Compressing objects: 91% (1943/2135)
remote: Compressing objects: 92% (1965/2135)
remote: Compressing objects: 93% (1986/2135)
remote: Compressing objects: 94% (2007/2135)
remote: Compressing objects: 95% (2029/2135)
remote: Compressing objects: 96% (2050/2135)
remote: Compressing objects: 97% (2071/2135)
remote: Compressing objects: 98% (2093/2135)
remote: Compressing objects: 99% (2114/2135)
remote: Compressing objects: 100% (2135/2135)
remote: Compressing objects: 100% (2135/2135), done.
8.56 s
Receiving objects: 0% (1/83696)
Receiving objects: 1% (837/83696)
Receiving objects: 2% (1674/83696)
Receiving objects: 3% (2511/83696)
Receiving objects: 4% (3348/83696)
Receiving objects: 5% (4185/83696)
Receiving objects: 6% (5022/83696)
Receiving objects: 7% (5859/83696)
Receiving objects: 8% (6696/83696)
Receiving objects: 9% (7533/83696), 13.69 MiB | 27.31 MiB/s
Receiving objects: 10% (8370/83696), 13.69 MiB | 27.31 MiB/s
Receiving objects: 11% (9207/83696), 13.69 MiB | 27.31 MiB/s
Receiving objects: 12% (10044/83696), 13.69 MiB | 27.31 MiB/s
Receiving objects: 13% (10881/83696), 13.69 MiB | 27.31 MiB/s
Receiving objects: 14% (11718/83696), 13.69 MiB | 27.31 MiB/s
Receiving objects: 15% (12555/83696), 13.69 MiB | 27.31 MiB/s
Receiving objects: 16% (13392/83696), 13.69 MiB | 27.31 MiB/s
Receiving objects: 17% (14229/83696), 13.69 MiB | 27.31 MiB/s
Receiving objects: 18% (15066/83696), 13.69 MiB | 27.31 MiB/s
Receiving objects: 19% (15903/83696), 13.69 MiB | 27.31 MiB/s
Receiving objects: 20% (16740/83696), 13.69 MiB | 27.31 MiB/s
Receiving objects: 21% (17577/83696), 13.69 MiB | 27.31 MiB/s
Receiving objects: 22% (18414/83696), 13.69 MiB | 27.31 MiB/s
Receiving objects: 23% (19251/83696), 13.69 MiB | 27.31 MiB/s
Receiving objects: 24% (20088/83696), 13.69 MiB | 27.31 MiB/s
Receiving objects: 25% (20924/83696), 13.69 MiB | 27.31 MiB/s
Receiving objects: 26% (21761/83696), 13.69 MiB | 27.31 MiB/s
Receiving objects: 27% (22598/83696), 13.69 MiB | 27.31 MiB/s
Receiving objects: 28% (23435/83696), 13.69 MiB | 27.31 MiB/s
Receiving objects: 29% (24272/83696), 13.69 MiB | 27.31 MiB/s
Receiving objects: 30% (25109/83696), 13.69 MiB | 27.31 MiB/s
Receiving objects: 31% (25946/83696), 13.69 MiB | 27.31 MiB/s
Receiving objects: 32% (26783/83696), 13.69 MiB | 27.31 MiB/s
Receiving objects: 33% (27620/83696), 13.69 MiB | 27.31 MiB/s
Receiving objects: 34% (28457/83696), 13.69 MiB | 27.31 MiB/s
Receiving objects: 35% (29294/83696), 13.69 MiB | 27.31 MiB/s
Receiving objects: 36% (30131/83696), 13.69 MiB | 27.31 MiB/s
Receiving objects: 37% (30968/83696), 13.69 MiB | 27.31 MiB/s
Receiving objects: 38% (31805/83696), 13.69 MiB | 27.31 MiB/s
Receiving objects: 39% (32642/83696), 13.69 MiB | 27.31 MiB/s
Receiving objects: 39% (32649/83696), 30.60 MiB | 30.29 MiB/s
Receiving objects: 40% (33479/83696), 30.60 MiB | 30.29 MiB/s
Receiving objects: 41% (34316/83696), 30.60 MiB | 30.29 MiB/s
Receiving objects: 42% (35153/83696), 30.60 MiB | 30.29 MiB/s
Receiving objects: 43% (35990/83696), 30.60 MiB | 30.29 MiB/s
Receiving objects: 44% (36827/83696), 30.60 MiB | 30.29 MiB/s
Receiving objects: 45% (37664/83696), 30.60 MiB | 30.29 MiB/s
Receiving objects: 46% (38501/83696), 30.60 MiB | 30.29 MiB/s
Receiving objects: 47% (39338/83696), 30.60 MiB | 30.29 MiB/s
Receiving objects: 48% (40175/83696), 30.60 MiB | 30.29 MiB/s
Receiving objects: 49% (41012/83696), 47.68 MiB | 31.27 MiB/s
Receiving objects: 50% (41848/83696), 47.68 MiB | 31.27 MiB/s
Receiving objects: 51% (42685/83696), 47.68 MiB | 31.27 MiB/s
Receiving objects: 52% (43522/83696), 47.68 MiB | 31.27 MiB/s
Receiving objects: 53% (44359/83696), 47.68 MiB | 31.27 MiB/s
Receiving objects: 54% (45196/83696), 47.68 MiB | 31.27 MiB/s
Receiving objects: 55% (46033/83696), 47.68 MiB | 31.27 MiB/s
Receiving objects: 56% (46870/83696), 47.68 MiB | 31.27 MiB/s
Receiving objects: 57% (47707/83696), 47.68 MiB | 31.27 MiB/s
Receiving objects: 58% (48544/83696), 47.68 MiB | 31.27 MiB/s
Receiving objects: 58% (48754/83696), 64.35 MiB | 31.72 MiB/s
Receiving objects: 59% (49381/83696), 64.35 MiB | 31.72 MiB/s
Receiving objects: 60% (50218/83696), 64.35 MiB | 31.72 MiB/s
Receiving objects: 61% (51055/83696), 64.35 MiB | 31.72 MiB/s
Receiving objects: 62% (51892/83696), 64.35 MiB | 31.72 MiB/s
Receiving objects: 63% (52729/83696), 64.35 MiB | 31.72 MiB/s
Receiving objects: 64% (53566/83696), 64.35 MiB | 31.72 MiB/s
Receiving objects: 65% (54403/83696), 64.35 MiB | 31.72 MiB/s
Receiving objects: 66% (55240/83696), 64.35 MiB | 31.72 MiB/s
Receiving objects: 67% (56077/83696), 80.91 MiB | 31.96 MiB/s
Receiving objects: 68% (56914/83696), 80.91 MiB | 31.96 MiB/s
Receiving objects: 69% (57751/83696), 80.91 MiB | 31.96 MiB/s
Receiving objects: 70% (58588/83696), 80.91 MiB | 31.96 MiB/s
Receiving objects: 71% (59425/83696), 80.91 MiB | 31.96 MiB/s
Receiving objects: 72% (60262/83696), 80.91 MiB | 31.96 MiB/s
Receiving objects: 73% (61099/83696), 80.91 MiB | 31.96 MiB/s
Receiving objects: 74% (61936/83696), 80.91 MiB | 31.96 MiB/s
Receiving objects: 74% (62717/83696), 98.21 MiB | 32.40 MiB/s
Receiving objects: 75% (62772/83696), 98.21 MiB | 32.40 MiB/s
Receiving objects: 76% (63609/83696), 98.21 MiB | 32.40 MiB/s
Receiving objects: 77% (64446/83696), 98.21 MiB | 32.40 MiB/s
Receiving objects: 78% (65283/83696), 98.21 MiB | 32.40 MiB/s
Receiving objects: 79% (66120/83696), 98.21 MiB | 32.40 MiB/s
Receiving objects: 80% (66957/83696), 98.21 MiB | 32.40 MiB/s
Receiving objects: 81% (67794/83696), 98.21 MiB | 32.40 MiB/s
Receiving objects: 82% (68631/83696), 98.21 MiB | 32.40 MiB/s
Receiving objects: 83% (69468/83696), 98.21 MiB | 32.40 MiB/s
Receiving objects: 84% (70305/83696), 114.86 MiB | 32.44 MiB/s
Receiving objects: 85% (71142/83696), 114.86 MiB | 32.44 MiB/s
Receiving objects: 86% (71979/83696), 114.86 MiB | 32.44 MiB/s
Receiving objects: 87% (72816/83696), 114.86 MiB | 32.44 MiB/s
Receiving objects: 88% (73653/83696), 114.86 MiB | 32.44 MiB/s
Receiving objects: 89% (74490/83696), 114.86 MiB | 32.44 MiB/s
Receiving objects: 90% (75327/83696), 114.86 MiB | 32.44 MiB/s
Receiving objects: 91% (76164/83696), 114.86 MiB | 32.44 MiB/s
Receiving objects: 92% (77001/83696), 114.86 MiB | 32.44 MiB/s
Receiving objects: 93% (77838/83696), 114.86 MiB | 32.44 MiB/s
Receiving objects: 94% (78675/83696), 114.86 MiB | 32.44 MiB/s
Receiving objects: 95% (79512/83696), 114.86 MiB | 32.44 MiB/s
Receiving objects: 96% (80349/83696), 114.86 MiB | 32.44 MiB/s
Receiving objects: 97% (81186/83696), 114.86 MiB | 32.44 MiB/s
Receiving objects: 98% (82023/83696), 114.86 MiB | 32.44 MiB/s
Receiving objects: 98% (82785/83696), 114.86 MiB | 32.44 MiB/s
Receiving objects: 99% (82860/83696), 114.86 MiB | 32.44 MiB/s
remote: Total 83696 (delta 7903), reused 7999 (delta 7183), pack-reused 73845 (from 3)
8.56 s
Receiving objects: 100% (83696/83696), 133.15 MiB | 32.92 MiB/s
Receiving objects: 100% (83696/83696), 139.23 MiB | 32.85 MiB/s, done.
9.64 s
Resolving deltas: 0% (0/56219)
Resolving deltas: 1% (563/56219)
Resolving deltas: 2% (1125/56219)
Resolving deltas: 3% (1687/56219)
Resolving deltas: 4% (2249/56219)
Resolving deltas: 5% (2811/56219)
Resolving deltas: 6% (3375/56219)
Resolving deltas: 7% (3936/56219)
Resolving deltas: 8% (4498/56219)
Resolving deltas: 9% (5062/56219)
Resolving deltas: 10% (5622/56219)
Resolving deltas: 11% (6185/56219)
Resolving deltas: 12% (6747/56219)
Resolving deltas: 13% (7309/56219)
Resolving deltas: 14% (7872/56219)
Resolving deltas: 15% (8433/56219)
Resolving deltas: 16% (8996/56219)
Resolving deltas: 17% (9560/56219)
Resolving deltas: 18% (10120/56219)
Resolving deltas: 19% (10682/56219)
Resolving deltas: 20% (11245/56219)
Resolving deltas: 21% (11806/56219)
Resolving deltas: 22% (12369/56219)
Resolving deltas: 23% (12931/56219)
Resolving deltas: 24% (13496/56219)
Resolving deltas: 25% (14055/56219)
Resolving deltas: 26% (14617/56219)
Resolving deltas: 27% (15180/56219)
Resolving deltas: 28% (15742/56219)
Resolving deltas: 29% (16304/56219)
Resolving deltas: 30% (16866/56219)
Resolving deltas: 31% (17428/56219)
Resolving deltas: 32% (17991/56219)
Resolving deltas: 33% (18553/56219)
Resolving deltas: 34% (19117/56219)
Resolving deltas: 35% (19677/56219)
Resolving deltas: 36% (20239/56219)
Resolving deltas: 37% (20802/56219)
Resolving deltas: 38% (21366/56219)
Resolving deltas: 39% (21927/56219)
Resolving deltas: 40% (22488/56219)
Resolving deltas: 41% (23051/56219)
Resolving deltas: 42% (23612/56219)
Resolving deltas: 43% (24175/56219)
Resolving deltas: 44% (24737/56219)
Resolving deltas: 45% (25300/56219)
Resolving deltas: 46% (25861/56219)
Resolving deltas: 47% (26423/56219)
Resolving deltas: 48% (26986/56219)
Resolving deltas: 49% (27549/56219)
Resolving deltas: 50% (28110/56219)
Resolving deltas: 51% (28672/56219)
Resolving deltas: 52% (29235/56219)
Resolving deltas: 53% (29797/56219)
Resolving deltas: 54% (30359/56219)
Resolving deltas: 55% (30921/56219)
Resolving deltas: 56% (31483/56219)
Resolving deltas: 57% (32045/56219)
Resolving deltas: 58% (32608/56219)
Resolving deltas: 59% (33170/56219)
Resolving deltas: 60% (33732/56219)
Resolving deltas: 61% (34294/56219)
Resolving deltas: 62% (34856/56219)
Resolving deltas: 63% (35418/56219)
Resolving deltas: 64% (35985/56219)
Resolving deltas: 65% (36543/56219)
Resolving deltas: 66% (37105/56219)
Resolving deltas: 67% (37667/56219)
Resolving deltas: 68% (38232/56219)
Resolving deltas: 69% (38792/56219)
Resolving deltas: 70% (39354/56219)
Resolving deltas: 71% (39916/56219)
Resolving deltas: 72% (40478/56219)
Resolving deltas: 73% (41040/56219)
Resolving deltas: 74% (41603/56219)
Resolving deltas: 75% (42165/56219)
Resolving deltas: 76% (42727/56219)
Resolving deltas: 77% (43289/56219)
Resolving deltas: 78% (43851/56219)
Resolving deltas: 79% (44414/56219)
Resolving deltas: 80% (44976/56219)
Resolving deltas: 81% (45539/56219)
Resolving deltas: 82% (46100/56219)
Resolving deltas: 83% (46662/56219)
Resolving deltas: 84% (47225/56219)
Resolving deltas: 85% (47789/56219)
Resolving deltas: 86% (48349/56219)
Resolving deltas: 87% (48911/56219)
Resolving deltas: 88% (49473/56219)
Resolving deltas: 89% (50035/56219)
Resolving deltas: 90% (50598/56219)
Resolving deltas: 91% (51160/56219)
Resolving deltas: 92% (51722/56219)
Resolving deltas: 92% (52162/56219)
Resolving deltas: 93% (52285/56219)
Resolving deltas: 94% (52846/56219)
Resolving deltas: 95% (53409/56219)
Resolving deltas: 96% (53971/56219)
Resolving deltas: 97% (54533/56219)
Resolving deltas: 98% (55096/56219)
Resolving deltas: 99% (55657/56219)
Resolving deltas: 100% (56219/56219)
Resolving deltas: 100% (56219/56219), done.
9.99 s
Fetching commit 5aadd389efabb7b039af74edad02a90d486a1c07 for simplify-spenso-api ...
9.99 s
$ /nix/store/bcnisk3ydfgv26v2gw3zlky24g00yww2-git-2.54.0/bin/git fetch origin 5aadd389efabb7b039af74edad02a90d486a1c07
10.50 s
From https://github.com/alphal00p/gammaloop
10.50 s
* branch 5aadd389efabb7b039af74edad02a90d486a1c07 -> FETCH_HEAD
10.51 s
$ /nix/store/9ypz3flqsrl5xl495mm8h645gadjsxi1-coreutils-9.11/bin/timeout --kill-after=15s 7200s /nix/store/bcnisk3ydfgv26v2gw3zlky24g00yww2-git-2.54.0/bin/git -c advice.detachedHead=false checkout 5aadd389efabb7b039af74edad02a90d486a1c07
10.70 s
HEAD is now at 5aadd389e restore public gamma arguments to storage order
10.70 s
$ /nix/store/9ypz3flqsrl5xl495mm8h645gadjsxi1-coreutils-9.11/bin/timeout --kill-after=15s 7200s /nix/store/23zk8sgzamrbmj1fday15szf7f2279s8-nix-2.34.7/bin/nix --extra-experimental-features nix-command --extra-experimental-features flakes --log-format internal-json run .#packages.x86_64-linux.nix-ci-check-gammaloop-nextest-core --print-build-logs
11.19 s
12.94 s
Downloading cached source from https://cache.nix-ci.com
20.68 s
Downloaded cached source (199.4 MiB) in 7.7s
20.68 s
Progress: 1 of 1 downloaded from cache
27.95 s
fetching Git repository 'https://github.com/symbolica-dev/symbolica'
28.69 s
remote: Enumerating objects: 17195, done.
28.75 s
remote: Counting objects: 0% (1/646)
remote: Counting objects: 1% (7/646)
remote: Counting objects: 2% (13/646)
remote: Counting objects: 3% (20/646)
remote: Counting objects: 4% (26/646)
remote: Counting objects: 5% (33/646)
remote: Counting objects: 6% (39/646)
remote: Counting objects: 7% (46/646)
remote: Counting objects: 8% (52/646)
remote: Counting objects: 9% (59/646)
remote: Counting objects: 10% (65/646)
remote: Counting objects: 11% (72/646)
remote: Counting objects: 12% (78/646)
remote: Counting objects: 13% (84/646)
remote: Counting objects: 14% (91/646)
remote: Counting objects: 15% (97/646)
remote: Counting objects: 16% (104/646)
remote: Counting objects: 17% (110/646)
remote: Counting objects: 18% (117/646)
remote: Counting objects: 19% (123/646)
remote: Counting objects: 20% (130/646)
remote: Counting objects: 21% (136/646)
remote: Counting objects: 22% (143/646)
remote: Counting objects: 23% (149/646)
remote: Counting objects: 24% (156/646)
remote: Counting objects: 25% (162/646)
remote: Counting objects: 26% (168/646)
remote: Counting objects: 27% (175/646)
remote: Counting objects: 28% (181/646)
remote: Counting objects: 29% (188/646)
remote: Counting objects: 30% (194/646)
remote: Counting objects: 31% (201/646)
remote: Counting objects: 32% (207/646)
remote: Counting objects: 33% (214/646)
remote: Counting objects: 34% (220/646)
remote: Counting objects: 35% (227/646)
remote: Counting objects: 36% (233/646)
remote: Counting objects: 37% (240/646)
remote: Counting objects: 38% (246/646)
remote: Counting objects: 39% (252/646)
remote: Counting objects: 40% (259/646)
remote: Counting objects: 41% (265/646)
remote: Counting objects: 42% (272/646)
remote: Counting objects: 43% (278/646)
remote: Counting objects: 44% (285/646)
remote: Counting objects: 45% (291/646)
remote: Counting objects: 46% (298/646)
remote: Counting objects: 47% (304/646)
remote: Counting objects: 48% (311/646)
remote: Counting objects: 49% (317/646)
remote: Counting objects: 50% (323/646)
remote: Counting objects: 51% (330/646)
remote: Counting objects: 52% (336/646)
remote: Counting objects: 53% (343/646)
remote: Counting objects: 54% (349/646)
remote: Counting objects: 55% (356/646)
remote: Counting objects: 56% (362/646)
remote: Counting objects: 57% (369/646)
remote: Counting objects: 58% (375/646)
remote: Counting objects: 59% (382/646)
remote: Counting objects: 60% (388/646)
remote: Counting objects: 61% (395/646)
remote: Counting objects: 62% (401/646)
remote: Counting objects: 63% (407/646)
remote: Counting objects: 64% (414/646)
remote: Counting objects: 65% (420/646)
remote: Counting objects: 66% (427/646)
remote: Counting objects: 67% (433/646)
remote: Counting objects: 68% (440/646)
remote: Counting objects: 69% (446/646)
remote: Counting objects: 70% (453/646)
remote: Counting objects: 71% (459/646)
remote: Counting objects: 72% (466/646)
remote: Counting objects: 73% (472/646)
remote: Counting objects: 74% (479/646)
remote: Counting objects: 75% (485/646)
remote: Counting objects: 76% (491/646)
remote: Counting objects: 77% (498/646)
remote: Counting objects: 78% (504/646)
remote: Counting objects: 79% (511/646)
remote: Counting objects: 80% (517/646)
remote: Counting objects: 81% (524/646)
remote: Counting objects: 82% (530/646)
remote: Counting objects: 83% (537/646)
remote: Counting objects: 84% (543/646)
remote: Counting objects: 85% (550/646)
remote: Counting objects: 86% (556/646)
remote: Counting objects: 87% (563/646)
remote: Counting objects: 88% (569/646)
remote: Counting objects: 89% (575/646)
remote: Counting objects: 90% (582/646)
remote: Counting objects: 91% (588/646)
remote: Counting objects: 92% (595/646)
remote: Counting objects: 93% (601/646)
remote: Counting objects: 94% (608/646)
remote: Counting objects: 95% (614/646)
remote: Counting objects: 96% (621/646)
remote: Counting objects: 97% (627/646)
remote: Counting objects: 98% (634/646)
remote: Counting objects: 99% (640/646)
remote: Counting objects: 100% (646/646)
remote: Counting objects: 100% (646/646), done.
28.75 s
remote: Compressing objects: 1% (1/71)
remote: Compressing objects: 2% (2/71)
remote: Compressing objects: 4% (3/71)
remote: Compressing objects: 5% (4/71)
remote: Compressing objects: 7% (5/71)
remote: Compressing objects: 8% (6/71)
remote: Compressing objects: 9% (7/71)
remote: Compressing objects: 11% (8/71)
remote: Compressing objects: 12% (9/71)
remote: Compressing objects: 14% (10/71)
remote: Compressing objects: 15% (11/71)
remote: Compressing objects: 16% (12/71)
remote: Compressing objects: 18% (13/71)
remote: Compressing objects: 19% (14/71)
remote: Compressing objects: 21% (15/71)
remote: Compressing objects: 22% (16/71)
remote: Compressing objects: 23% (17/71)
remote: Compressing objects: 25% (18/71)
remote: Compressing objects: 26% (19/71)
remote: Compressing objects: 28% (20/71)
remote: Compressing objects: 29% (21/71)
remote: Compressing objects: 30% (22/71)
remote: Compressing objects: 32% (23/71)
remote: Compressing objects: 33% (24/71)
remote: Compressing objects: 35% (25/71)
remote: Compressing objects: 36% (26/71)
remote: Compressing objects: 38% (27/71)
remote: Compressing objects: 39% (28/71)
remote: Compressing objects: 40% (29/71)
remote: Compressing objects: 42% (30/71)
remote: Compressing objects: 43% (31/71)
remote: Compressing objects: 45% (32/71)
remote: Compressing objects: 46% (33/71)
remote: Compressing objects: 47% (34/71)
remote: Compressing objects: 49% (35/71)
remote: Compressing objects: 50% (36/71)
remote: Compressing objects: 52% (37/71)
remote: Compressing objects: 53% (38/71)
remote: Compressing objects: 54% (39/71)
remote: Compressing objects: 56% (40/71)
remote: Compressing objects: 57% (41/71)
remote: Compressing objects: 59% (42/71)
remote: Compressing objects: 60% (43/71)
remote: Compressing objects: 61% (44/71)
remote: Compressing objects: 63% (45/71)
remote: Compressing objects: 64% (46/71)
remote: Compressing objects: 66% (47/71)
remote: Compressing objects: 67% (48/71)
remote: Compressing objects: 69% (49/71)
remote: Compressing objects: 70% (50/71)
remote: Compressing objects: 71% (51/71)
remote: Compressing objects: 73% (52/71)
remote: Compressing objects: 74% (53/71)
remote: Compressing objects: 76% (54/71)
remote: Compressing objects: 77% (55/71)
remote: Compressing objects: 78% (56/71)
remote: Compressing objects: 80% (57/71)
remote: Compressing objects: 81% (58/71)
remote: Compressing objects: 83% (59/71)
remote: Compressing objects: 84% (60/71)
remote: Compressing objects: 85% (61/71)
remote: Compressing objects: 87% (62/71)
remote: Compressing objects: 88% (63/71)
remote: Compressing objects: 90% (64/71)
remote: Compressing objects: 91% (65/71)
remote: Compressing objects: 92% (66/71)
remote: Compressing objects: 94% (67/71)
remote: Compressing objects: 95% (68/71)
remote: Compressing objects: 97% (69/71)
remote: Compressing objects: 98% (70/71)
remote: Compressing objects: 100% (71/71)
remote: Compressing objects: 100% (71/71), done.
30.20 s
Receiving objects: 0% (1/17195)
Receiving objects: 0% (31/17195), 30.28 MiB | 29.78 MiB/s
Receiving objects: 1% (172/17195), 30.28 MiB | 29.78 MiB/s
Receiving objects: 2% (344/17195), 30.28 MiB | 29.78 MiB/s
Receiving objects: 3% (516/17195), 30.28 MiB | 29.78 MiB/s
Receiving objects: 4% (688/17195), 30.28 MiB | 29.78 MiB/s
Receiving objects: 5% (860/17195), 30.28 MiB | 29.78 MiB/s
Receiving objects: 6% (1032/17195), 30.28 MiB | 29.78 MiB/s
Receiving objects: 7% (1204/17195), 30.28 MiB | 29.78 MiB/s
Receiving objects: 8% (1376/17195), 30.28 MiB | 29.78 MiB/s
Receiving objects: 9% (1548/17195), 30.28 MiB | 29.78 MiB/s
Receiving objects: 10% (1720/17195), 30.28 MiB | 29.78 MiB/s
Receiving objects: 11% (1892/17195), 30.28 MiB | 29.78 MiB/s
Receiving objects: 12% (2064/17195), 30.28 MiB | 29.78 MiB/s
Receiving objects: 13% (2236/17195), 30.28 MiB | 29.78 MiB/s
Receiving objects: 14% (2408/17195), 30.28 MiB | 29.78 MiB/s
Receiving objects: 15% (2580/17195), 30.28 MiB | 29.78 MiB/s
Receiving objects: 16% (2752/17195), 30.28 MiB | 29.78 MiB/s
Receiving objects: 17% (2924/17195), 30.28 MiB | 29.78 MiB/s
Receiving objects: 18% (3096/17195), 30.28 MiB | 29.78 MiB/s
Receiving objects: 19% (3268/17195), 30.28 MiB | 29.78 MiB/s
Receiving objects: 20% (3439/17195), 30.28 MiB | 29.78 MiB/s
Receiving objects: 21% (3611/17195), 30.28 MiB | 29.78 MiB/s
Receiving objects: 22% (3783/17195), 30.28 MiB | 29.78 MiB/s
Receiving objects: 23% (3955/17195), 30.28 MiB | 29.78 MiB/s
Receiving objects: 24% (4127/17195), 30.28 MiB | 29.78 MiB/s
Receiving objects: 25% (4299/17195), 30.28 MiB | 29.78 MiB/s
Receiving objects: 26% (4471/17195), 30.28 MiB | 29.78 MiB/s
Receiving objects: 27% (4643/17195), 30.28 MiB | 29.78 MiB/s
Receiving objects: 28% (4815/17195), 30.28 MiB | 29.78 MiB/s
Receiving objects: 29% (4987/17195), 30.28 MiB | 29.78 MiB/s
Receiving objects: 30% (5159/17195), 30.28 MiB | 29.78 MiB/s
Receiving objects: 31% (5331/17195), 30.28 MiB | 29.78 MiB/s
Receiving objects: 32% (5503/17195), 30.28 MiB | 29.78 MiB/s
Receiving objects: 33% (5675/17195), 30.28 MiB | 29.78 MiB/s
Receiving objects: 34% (5847/17195), 30.28 MiB | 29.78 MiB/s
Receiving objects: 35% (6019/17195), 30.28 MiB | 29.78 MiB/s
Receiving objects: 36% (6191/17195), 30.28 MiB | 29.78 MiB/s
Receiving objects: 37% (6363/17195), 30.28 MiB | 29.78 MiB/s
Receiving objects: 38% (6535/17195), 30.28 MiB | 29.78 MiB/s
Receiving objects: 39% (6707/17195), 30.28 MiB | 29.78 MiB/s
Receiving objects: 40% (6878/17195), 30.28 MiB | 29.78 MiB/s
Receiving objects: 41% (7050/17195), 30.28 MiB | 29.78 MiB/s
Receiving objects: 42% (7222/17195), 30.28 MiB | 29.78 MiB/s
Receiving objects: 43% (7394/17195), 30.28 MiB | 29.78 MiB/s
Receiving objects: 44% (7566/17195), 30.28 MiB | 29.78 MiB/s
Receiving objects: 45% (7738/17195), 30.28 MiB | 29.78 MiB/s
Receiving objects: 46% (7910/17195), 30.28 MiB | 29.78 MiB/s
Receiving objects: 47% (8082/17195), 30.28 MiB | 29.78 MiB/s
Receiving objects: 48% (8254/17195), 30.28 MiB | 29.78 MiB/s
Receiving objects: 49% (8426/17195), 30.28 MiB | 29.78 MiB/s
Receiving objects: 50% (8598/17195), 30.28 MiB | 29.78 MiB/s
Receiving objects: 51% (8770/17195), 30.28 MiB | 29.78 MiB/s
Receiving objects: 52% (8942/17195), 30.28 MiB | 29.78 MiB/s
Receiving objects: 53% (9114/17195), 30.28 MiB | 29.78 MiB/s
Receiving objects: 54% (9286/17195), 30.28 MiB | 29.78 MiB/s
Receiving objects: 55% (9458/17195), 30.28 MiB | 29.78 MiB/s
Receiving objects: 56% (9630/17195), 30.28 MiB | 29.78 MiB/s
Receiving objects: 57% (9802/17195), 30.28 MiB | 29.78 MiB/s
Receiving objects: 58% (9974/17195), 30.28 MiB | 29.78 MiB/s
Receiving objects: 59% (10146/17195), 30.28 MiB | 29.78 MiB/s
Receiving objects: 60% (10317/17195), 30.28 MiB | 29.78 MiB/s
Receiving objects: 61% (10489/17195), 30.28 MiB | 29.78 MiB/s
Receiving objects: 62% (10661/17195), 30.28 MiB | 29.78 MiB/s
Receiving objects: 63% (10833/17195), 30.28 MiB | 29.78 MiB/s
Receiving objects: 64% (11005/17195), 30.28 MiB | 29.78 MiB/s
Receiving objects: 65% (11177/17195), 30.28 MiB | 29.78 MiB/s
Receiving objects: 66% (11349/17195), 30.28 MiB | 29.78 MiB/s
Receiving objects: 67% (11521/17195), 30.28 MiB | 29.78 MiB/s
Receiving objects: 68% (11693/17195), 30.28 MiB | 29.78 MiB/s
Receiving objects: 69% (11865/17195), 30.28 MiB | 29.78 MiB/s
Receiving objects: 70% (12037/17195), 30.28 MiB | 29.78 MiB/s
Receiving objects: 71% (12209/17195), 30.28 MiB | 29.78 MiB/s
Receiving objects: 72% (12381/17195), 30.28 MiB | 29.78 MiB/s
Receiving objects: 73% (12553/17195), 30.28 MiB | 29.78 MiB/s
Receiving objects: 74% (12725/17195), 30.28 MiB | 29.78 MiB/s
Receiving objects: 75% (12897/17195), 30.28 MiB | 29.78 MiB/s
Receiving objects: 76% (13069/17195), 30.28 MiB | 29.78 MiB/s
Receiving objects: 77% (13241/17195), 30.28 MiB | 29.78 MiB/s
Receiving objects: 78% (13413/17195), 30.28 MiB | 29.78 MiB/s
Receiving objects: 79% (13585/17195), 30.28 MiB | 29.78 MiB/s
Receiving objects: 80% (13756/17195), 30.28 MiB | 29.78 MiB/s
Receiving objects: 81% (13928/17195), 30.28 MiB | 29.78 MiB/s
Receiving objects: 82% (14100/17195), 30.28 MiB | 29.78 MiB/s
Receiving objects: 83% (14272/17195), 30.28 MiB | 29.78 MiB/s
Receiving objects: 84% (14444/17195), 30.28 MiB | 29.78 MiB/s
Receiving objects: 85% (14616/17195), 30.28 MiB | 29.78 MiB/s
Receiving objects: 86% (14788/17195), 30.28 MiB | 29.78 MiB/s
Receiving objects: 87% (14960/17195), 30.28 MiB | 29.78 MiB/s
Receiving objects: 88% (15132/17195), 30.28 MiB | 29.78 MiB/s
Receiving objects: 89% (15304/17195), 30.28 MiB | 29.78 MiB/s
Receiving objects: 90% (15476/17195), 30.28 MiB | 29.78 MiB/s
Receiving objects: 91% (15648/17195), 30.28 MiB | 29.78 MiB/s
Receiving objects: 92% (15820/17195), 30.28 MiB | 29.78 MiB/s
Receiving objects: 93% (15992/17195), 30.28 MiB | 29.78 MiB/s
Receiving objects: 94% (16164/17195), 30.28 MiB | 29.78 MiB/s
Receiving objects: 95% (16336/17195), 30.28 MiB | 29.78 MiB/s
Receiving objects: 96% (16508/17195), 30.28 MiB | 29.78 MiB/s
Receiving objects: 97% (16680/17195), 30.28 MiB | 29.78 MiB/s
Receiving objects: 98% (16852/17195), 30.28 MiB | 29.78 MiB/s
Receiving objects: 99% (17024/17195), 30.28 MiB | 29.78 MiB/s
remote: Total 17195 (delta 614), reused 575 (delta 575), pack-reused 16549 (from 1)
30.20 s
Receiving objects: 100% (17195/17195), 30.28 MiB | 29.78 MiB/s
Receiving objects: 100% (17195/17195), 43.06 MiB | 30.29 MiB/s, done.
30.42 s
Resolving deltas: 0% (0/13290)
Resolving deltas: 1% (133/13290)
Resolving deltas: 2% (266/13290)
Resolving deltas: 3% (403/13290)
Resolving deltas: 4% (532/13290)
Resolving deltas: 5% (668/13290)
Resolving deltas: 6% (800/13290)
Resolving deltas: 7% (931/13290)
Resolving deltas: 8% (1064/13290)
Resolving deltas: 9% (1197/13290)
Resolving deltas: 10% (1329/13290)
Resolving deltas: 11% (1462/13290)
Resolving deltas: 12% (1595/13290)
Resolving deltas: 13% (1728/13290)
Resolving deltas: 14% (1861/13290)
Resolving deltas: 15% (1994/13290)
Resolving deltas: 16% (2127/13290)
Resolving deltas: 17% (2260/13290)
Resolving deltas: 18% (2393/13290)
Resolving deltas: 19% (2526/13290)
Resolving deltas: 20% (2658/13290)
Resolving deltas: 21% (2791/13290)
Resolving deltas: 22% (2925/13290)
Resolving deltas: 23% (3057/13290)
Resolving deltas: 24% (3190/13290)
Resolving deltas: 25% (3323/13290)
Resolving deltas: 26% (3456/13290)
Resolving deltas: 27% (3590/13290)
Resolving deltas: 28% (3722/13290)
Resolving deltas: 29% (3855/13290)
Resolving deltas: 30% (3987/13290)
Resolving deltas: 31% (4120/13290)
Resolving deltas: 32% (4253/13290)
Resolving deltas: 33% (4387/13290)
Resolving deltas: 34% (4519/13290)
Resolving deltas: 35% (4652/13290)
Resolving deltas: 36% (4786/13290)
Resolving deltas: 37% (4918/13290)
Resolving deltas: 38% (5051/13290)
Resolving deltas: 39% (5184/13290)
Resolving deltas: 40% (5316/13290)
Resolving deltas: 41% (5449/13290)
Resolving deltas: 42% (5582/13290)
Resolving deltas: 43% (5715/13290)
Resolving deltas: 44% (5848/13290)
Resolving deltas: 45% (5981/13290)
Resolving deltas: 46% (6114/13290)
Resolving deltas: 47% (6247/13290)
Resolving deltas: 48% (6380/13290)
Resolving deltas: 49% (6513/13290)
Resolving deltas: 50% (6646/13290)
Resolving deltas: 51% (6778/13290)
Resolving deltas: 52% (6911/13290)
Resolving deltas: 53% (7044/13290)
Resolving deltas: 54% (7177/13290)
Resolving deltas: 55% (7310/13290)
Resolving deltas: 56% (7444/13290)
Resolving deltas: 57% (7576/13290)
Resolving deltas: 58% (7709/13290)
Resolving deltas: 59% (7842/13290)
Resolving deltas: 60% (7974/13290)
Resolving deltas: 61% (8107/13290)
Resolving deltas: 62% (8240/13290)
Resolving deltas: 63% (8373/13290)
Resolving deltas: 64% (8506/13290)
Resolving deltas: 65% (8640/13290)
Resolving deltas: 66% (8772/13290)
Resolving deltas: 67% (8905/13290)
Resolving deltas: 68% (9039/13290)
Resolving deltas: 69% (9171/13290)
Resolving deltas: 70% (9303/13290)
Resolving deltas: 71% (9436/13290)
Resolving deltas: 72% (9570/13290)
Resolving deltas: 73% (9703/13290)
Resolving deltas: 74% (9835/13290)
Resolving deltas: 75% (9968/13290)
Resolving deltas: 76% (10102/13290)
Resolving deltas: 77% (10234/13290)
Resolving deltas: 78% (10368/13290)
Resolving deltas: 79% (10500/13290)
Resolving deltas: 80% (10633/13290)
Resolving deltas: 81% (10765/13290)
Resolving deltas: 82% (10898/13290)
Resolving deltas: 83% (11031/13290)
Resolving deltas: 84% (11164/13290)
Resolving deltas: 85% (11297/13290)
Resolving deltas: 86% (11431/13290)
Resolving deltas: 87% (11563/13290)
Resolving deltas: 88% (11696/13290)
Resolving deltas: 89% (11833/13290)
Resolving deltas: 90% (11961/13290)
Resolving deltas: 91% (12095/13290)
Resolving deltas: 92% (12227/13290)
Resolving deltas: 93% (12360/13290)
Resolving deltas: 94% (12494/13290)
Resolving deltas: 95% (12626/13290)
Resolving deltas: 96% (12759/13290)
Resolving deltas: 97% (12893/13290)
Resolving deltas: 98% (13025/13290)
Resolving deltas: 99% (13158/13290)
Resolving deltas: 100% (13290/13290)
Resolving deltas: 100% (13290/13290), done.
30.56 s
From https://github.com/symbolica-dev/symbolica
30.56 s
* [new branch] algebraic_rational -> algebraic_rational
30.56 s
* [new branch] alias -> alias
30.56 s
* [new branch] arm_asm -> arm_asm
30.56 s
* [new branch] bincode -> bincode
30.56 s
* [new branch] borrowed_atom -> borrowed_atom
30.56 s
* [new branch] branching_evaluate -> branching_evaluate
30.56 s
* [new branch] chi_sq_fix -> chi_sq_fix
30.56 s
* [new branch] coeff -> coeff
30.56 s
* [new branch] coeff_first -> coeff_first
30.56 s
* [new branch] complex_coeff -> complex_coeff
30.56 s
* [new branch] complex_ring -> complex_ring
30.56 s
* [new branch] computational_graph -> computational_graph
30.56 s
* [new branch] conditions -> conditions
30.56 s
* [new branch] delay -> delay
30.56 s
* [new branch] dense_mul -> dense_mul
30.56 s
* [new branch] dev -> dev
30.56 s
* [new branch] dev-cleanup-release-2.0 -> dev-cleanup-release-2.0
30.56 s
* [new branch] dev-cleanup-release-2.0-numerica2-bisectable -> dev-cleanup-release-2.0-numerica2-bisectable
30.56 s
* [new branch] dev_poly -> dev_poly
30.56 s
* [new branch] dual -> dual
30.56 s
* [new branch] error_tracking_coeff -> error_tracking_coeff
30.56 s
* [new branch] evaluate -> evaluate
30.56 s
* [new branch] evaluate_merge -> evaluate_merge
30.56 s
* [new branch] export -> export
30.56 s
* [new branch] export_serde -> export_serde
30.56 s
* [new branch] fac_div -> fac_div
30.56 s
* [new branch] factorint -> factorint
30.56 s
* [new branch] float -> float
30.56 s
* [new branch] floatmerge -> floatmerge
30.56 s
* [new branch] format -> format
30.56 s
* [new branch] function_simplify -> function_simplify
30.56 s
* [new branch] graph_filter -> graph_filter
30.56 s
* [new branch] infinity -> infinity
30.56 s
* [new branch] int_i128 -> int_i128
30.56 s
* [new branch] lib_merge -> lib_merge
30.56 s
* [new branch] logging -> logging
30.56 s
* [new branch] main -> main
30.56 s
* [new branch] merge_evaluator -> merge_evaluator
30.56 s
* [new branch] modules -> modules
30.56 s
* [new branch] name_check -> name_check
30.56 s
* [new branch] nested_evaluate -> nested_evaluate
30.56 s
* [new branch] nested_symmetrize -> nested_symmetrize
30.56 s
* [new branch] newton -> newton
30.56 s
* [new branch] no_namespace -> no_namespace
30.56 s
* [new branch] numer_coeff -> numer_coeff
30.56 s
* [new branch] numpy -> numpy
30.56 s
* [new branch] oem -> oem
30.56 s
* [new branch] optim -> optim
30.56 s
* [new branch] optional_patterns -> optional_patterns
30.56 s
* [new branch] oss_repo_split -> oss_repo_split
30.56 s
* [new branch] oss_split -> oss_split
30.56 s
* [new branch] packed_exp -> packed_exp
30.56 s
* [new branch] prep -> prep
30.56 s
* [new branch] rat_parser -> rat_parser
30.56 s
* [new branch] ratpolyfac -> ratpolyfac
30.56 s
* [new branch] register_symbols -> register_symbols
30.56 s
* [new branch] replace_builder -> replace_builder
30.56 s
* [new branch] rewrite -> rewrite
30.56 s
* [new branch] rug_patch -> rug_patch
30.56 s
* [new branch] series -> series
30.56 s
* [new branch] simd -> simd
30.56 s
* [new branch] simple_stub -> simple_stub
30.56 s
* [new branch] skip-license-scopes -> skip-license-scopes
30.56 s
* [new branch] smaller_poly -> smaller_poly
30.56 s
* [new branch] specialize_pattern -> specialize_pattern
30.56 s
* [new branch] split_asm -> split_asm
30.56 s
* [new branch] sub-evaluators -> sub-evaluators
30.56 s
* [new branch] symbol_data -> symbol_data
30.56 s
* [new branch] symbol_der -> symbol_der
30.56 s
* [new branch] symbol_group -> symbol_group
30.56 s
* [new branch] symjit -> symjit
30.56 s
* [new branch] tmp_merge -> tmp_merge
30.56 s
* [new branch] transformer -> transformer
30.56 s
* [new branch] vector_evaluate -> vector_evaluate
30.56 s
* [new branch] wasm -> wasm
30.56 s
* [new branch] wasm2 -> wasm2
30.56 s
* [new branch] windows -> windows
30.56 s
* [new branch] windows_ci -> windows_ci
30.56 s
* [new branch] zeroflow -> zeroflow
30.56 s
* [new ref] refs/pull/12/head -> refs/pull/12/head
30.56 s
* [new ref] refs/pull/13/head -> refs/pull/13/head
30.56 s
* [new ref] refs/pull/14/head -> refs/pull/14/head
30.56 s
* [new ref] refs/pull/19/head -> refs/pull/19/head
30.56 s
* [new ref] refs/pull/2/head -> refs/pull/2/head
30.56 s
* [new ref] refs/pull/20/head -> refs/pull/20/head
30.56 s
* [new ref] refs/pull/22/head -> refs/pull/22/head
30.56 s
* [new ref] refs/pull/26/head -> refs/pull/26/head
30.56 s
* [new ref] refs/pull/29/head -> refs/pull/29/head
30.56 s
* [new ref] refs/pull/30/head -> refs/pull/30/head
30.56 s
* [new ref] refs/pull/31/head -> refs/pull/31/head
30.56 s
* [new ref] refs/pull/32/head -> refs/pull/32/head
30.56 s
* [new ref] refs/pull/39/head -> refs/pull/39/head
30.56 s
* [new ref] refs/pull/40/head -> refs/pull/40/head
30.56 s
* [new ref] refs/pull/41/head -> refs/pull/41/head
30.56 s
* [new ref] refs/pull/43/head -> refs/pull/43/head
30.56 s
* [new ref] refs/pull/44/head -> refs/pull/44/head
30.56 s
* [new ref] refs/pull/45/head -> refs/pull/45/head
30.56 s
* [new ref] refs/pull/46/head -> refs/pull/46/head
30.56 s
* [new ref] refs/pull/47/head -> refs/pull/47/head
30.56 s
* [new ref] refs/pull/47/merge -> refs/pull/47/merge
30.56 s
* [new ref] refs/pull/48/head -> refs/pull/48/head
30.56 s
* [new ref] refs/pull/48/merge -> refs/pull/48/merge
30.56 s
* [new ref] refs/pull/5/head -> refs/pull/5/head
30.56 s
* [new ref] refs/pull/6/head -> refs/pull/6/head
30.56 s
* [new ref] refs/pull/7/head -> refs/pull/7/head
30.56 s
* [new ref] refs/pull/8/head -> refs/pull/8/head
30.56 s
* [new tag] v0.1.0 -> v0.1.0
30.56 s
* [new tag] v0.1.1 -> v0.1.1
30.56 s
* [new tag] v0.1.2 -> v0.1.2
30.56 s
* [new tag] v0.1.3 -> v0.1.3
30.56 s
* [new tag] v0.1.4 -> v0.1.4
30.56 s
* [new tag] v0.10.0 -> v0.10.0
30.56 s
* [new tag] v0.11.0 -> v0.11.0
30.56 s
* [new tag] v0.12.0 -> v0.12.0
30.56 s
* [new tag] v0.12.1 -> v0.12.1
30.56 s
* [new tag] v0.13.0 -> v0.13.0
30.56 s
* [new tag] v0.14.0 -> v0.14.0
30.56 s
* [new tag] v0.15.0 -> v0.15.0
30.56 s
* [new tag] v0.15.1 -> v0.15.1
30.56 s
* [new tag] v0.16.0 -> v0.16.0
30.56 s
* [new tag] v0.17.0 -> v0.17.0
30.56 s
* [new tag] v0.18.0 -> v0.18.0
30.56 s
* [new tag] v0.19.0 -> v0.19.0
30.56 s
* [new tag] v0.2.0 -> v0.2.0
30.56 s
* [new tag] v0.20.0 -> v0.20.0
30.56 s
* [new tag] v0.3.0 -> v0.3.0
30.56 s
* [new tag] v0.4.0 -> v0.4.0
30.56 s
* [new tag] v0.5.0 -> v0.5.0
30.56 s
* [new tag] v0.6.0 -> v0.6.0
30.56 s
* [new tag] v0.7.0 -> v0.7.0
30.56 s
* [new tag] v0.8.0 -> v0.8.0
30.56 s
* [new tag] v0.8.1 -> v0.8.1
30.56 s
* [new tag] v0.8.2 -> v0.8.2
30.56 s
* [new tag] v0.9.0 -> v0.9.0
30.56 s
* [new tag] v1.0.0 -> v1.0.0
30.56 s
* [new tag] v1.0.1 -> v1.0.1
30.56 s
* [new tag] v1.1.0 -> v1.1.0
30.56 s
* [new tag] v1.2.0 -> v1.2.0
30.56 s
* [new tag] v1.3.0 -> v1.3.0
30.56 s
* [new tag] v1.4.0 -> v1.4.0
30.56 s
* [new tag] v1.5.0 -> v1.5.0
30.56 s
* [new tag] v1.5.1 -> v1.5.1
30.56 s
* [new tag] v2.0.0 -> v2.0.0
30.56 s
* [new tag] v2.1.0 -> v2.1.0
30.56 s
* [new tag] v2.2.0 -> v2.2.0
31.14 s
fetching Git repository 'https://github.com/lcnbr/tymbolica'
31.80 s
remote: Enumerating objects: 1056, done.
37.47 s
Receiving objects: 0% (1/1056)
Receiving objects: 1% (11/1056)
Receiving objects: 2% (22/1056)
Receiving objects: 3% (32/1056)
Receiving objects: 4% (43/1056)
Receiving objects: 5% (53/1056)
Receiving objects: 6% (64/1056)
Receiving objects: 7% (74/1056)
Receiving objects: 8% (85/1056)
Receiving objects: 9% (96/1056)
Receiving objects: 10% (106/1056)
Receiving objects: 11% (117/1056)
Receiving objects: 12% (127/1056)
Receiving objects: 13% (138/1056)
Receiving objects: 14% (148/1056)
Receiving objects: 15% (159/1056)
Receiving objects: 16% (169/1056), 13.66 MiB | 25.99 MiB/s
Receiving objects: 17% (180/1056), 13.66 MiB | 25.99 MiB/s
Receiving objects: 18% (191/1056), 13.66 MiB | 25.99 MiB/s
Receiving objects: 19% (201/1056), 13.66 MiB | 25.99 MiB/s
Receiving objects: 20% (212/1056), 13.66 MiB | 25.99 MiB/s
Receiving objects: 20% (221/1056), 29.98 MiB | 29.23 MiB/s
Receiving objects: 21% (222/1056), 29.98 MiB | 29.23 MiB/s
Receiving objects: 22% (233/1056), 29.98 MiB | 29.23 MiB/s
Receiving objects: 23% (243/1056), 29.98 MiB | 29.23 MiB/s
Receiving objects: 24% (254/1056), 29.98 MiB | 29.23 MiB/s
Receiving objects: 25% (264/1056), 29.98 MiB | 29.23 MiB/s
Receiving objects: 26% (275/1056), 29.98 MiB | 29.23 MiB/s
Receiving objects: 27% (286/1056), 29.98 MiB | 29.23 MiB/s
Receiving objects: 28% (296/1056), 46.13 MiB | 29.71 MiB/s
Receiving objects: 29% (307/1056), 46.13 MiB | 29.71 MiB/s
Receiving objects: 30% (317/1056), 46.13 MiB | 29.71 MiB/s
Receiving objects: 30% (322/1056), 46.13 MiB | 29.71 MiB/s
Receiving objects: 31% (328/1056), 46.13 MiB | 29.71 MiB/s
Receiving objects: 32% (338/1056), 63.00 MiB | 30.69 MiB/s
Receiving objects: 33% (349/1056), 63.00 MiB | 30.69 MiB/s
Receiving objects: 34% (360/1056), 80.41 MiB | 31.16 MiB/s
Receiving objects: 35% (370/1056), 80.41 MiB | 31.16 MiB/s
Receiving objects: 36% (381/1056), 80.41 MiB | 31.16 MiB/s
Receiving objects: 37% (391/1056), 80.41 MiB | 31.16 MiB/s
Receiving objects: 38% (402/1056), 80.41 MiB | 31.16 MiB/s
Receiving objects: 39% (412/1056), 80.41 MiB | 31.16 MiB/s
Receiving objects: 40% (423/1056), 80.41 MiB | 31.16 MiB/s
Receiving objects: 41% (433/1056), 80.41 MiB | 31.16 MiB/s
Receiving objects: 42% (444/1056), 80.41 MiB | 31.16 MiB/s
Receiving objects: 43% (455/1056), 80.41 MiB | 31.16 MiB/s
Receiving objects: 44% (465/1056), 80.41 MiB | 31.16 MiB/s
Receiving objects: 45% (476/1056), 80.41 MiB | 31.16 MiB/s
Receiving objects: 46% (486/1056), 80.41 MiB | 31.16 MiB/s
Receiving objects: 47% (497/1056), 80.41 MiB | 31.16 MiB/s
Receiving objects: 48% (507/1056), 80.41 MiB | 31.16 MiB/s
Receiving objects: 49% (518/1056), 80.41 MiB | 31.16 MiB/s
Receiving objects: 50% (528/1056), 80.41 MiB | 31.16 MiB/s
Receiving objects: 51% (539/1056), 80.41 MiB | 31.16 MiB/s
Receiving objects: 52% (550/1056), 80.41 MiB | 31.16 MiB/s
Receiving objects: 53% (560/1056), 80.41 MiB | 31.16 MiB/s
Receiving objects: 54% (571/1056), 80.41 MiB | 31.16 MiB/s
Receiving objects: 55% (581/1056), 80.41 MiB | 31.16 MiB/s
Receiving objects: 56% (592/1056), 80.41 MiB | 31.16 MiB/s
Receiving objects: 57% (602/1056), 80.41 MiB | 31.16 MiB/s
Receiving objects: 58% (613/1056), 80.41 MiB | 31.16 MiB/s
Receiving objects: 58% (621/1056), 96.18 MiB | 31.22 MiB/s
Receiving objects: 59% (624/1056), 96.18 MiB | 31.22 MiB/s
Receiving objects: 60% (634/1056), 96.18 MiB | 31.22 MiB/s
Receiving objects: 61% (645/1056), 96.18 MiB | 31.22 MiB/s
Receiving objects: 62% (655/1056), 96.18 MiB | 31.22 MiB/s
Receiving objects: 63% (666/1056), 112.40 MiB | 31.21 MiB/s
Receiving objects: 64% (676/1056), 112.40 MiB | 31.21 MiB/s
Receiving objects: 65% (687/1056), 112.40 MiB | 31.21 MiB/s
Receiving objects: 66% (697/1056), 112.40 MiB | 31.21 MiB/s
Receiving objects: 67% (708/1056), 112.40 MiB | 31.21 MiB/s
Receiving objects: 67% (717/1056), 130.04 MiB | 31.67 MiB/s
Receiving objects: 68% (719/1056), 130.04 MiB | 31.67 MiB/s
Receiving objects: 69% (729/1056), 130.04 MiB | 31.67 MiB/s
Receiving objects: 70% (740/1056), 130.04 MiB | 31.67 MiB/s
Receiving objects: 71% (750/1056), 147.41 MiB | 32.00 MiB/s
Receiving objects: 72% (761/1056), 147.41 MiB | 32.00 MiB/s
Receiving objects: 73% (771/1056), 147.41 MiB | 32.00 MiB/s
Receiving objects: 74% (782/1056), 147.41 MiB | 32.00 MiB/s
Receiving objects: 75% (792/1056), 147.41 MiB | 32.00 MiB/s
Receiving objects: 76% (803/1056), 147.41 MiB | 32.00 MiB/s
Receiving objects: 77% (814/1056), 147.41 MiB | 32.00 MiB/s
Receiving objects: 78% (824/1056), 147.41 MiB | 32.00 MiB/s
Receiving objects: 79% (835/1056), 147.41 MiB | 32.00 MiB/s
Receiving objects: 80% (845/1056), 147.41 MiB | 32.00 MiB/s
Receiving objects: 81% (856/1056), 147.41 MiB | 32.00 MiB/s
Receiving objects: 82% (866/1056), 147.41 MiB | 32.00 MiB/s
Receiving objects: 83% (877/1056), 147.41 MiB | 32.00 MiB/s
Receiving objects: 84% (888/1056), 147.41 MiB | 32.00 MiB/s
Receiving objects: 85% (898/1056), 147.41 MiB | 32.00 MiB/s
Receiving objects: 86% (909/1056), 147.41 MiB | 32.00 MiB/s
Receiving objects: 87% (919/1056), 147.41 MiB | 32.00 MiB/s
Receiving objects: 88% (930/1056), 147.41 MiB | 32.00 MiB/s
Receiving objects: 89% (940/1056), 147.41 MiB | 32.00 MiB/s
Receiving objects: 90% (951/1056), 147.41 MiB | 32.00 MiB/s
Receiving objects: 91% (961/1056), 163.61 MiB | 32.71 MiB/s
Receiving objects: 92% (972/1056), 163.61 MiB | 32.71 MiB/s
Receiving objects: 93% (983/1056), 163.61 MiB | 32.71 MiB/s
Receiving objects: 94% (993/1056), 163.61 MiB | 32.71 MiB/s
Receiving objects: 95% (1004/1056), 163.61 MiB | 32.71 MiB/s
Receiving objects: 96% (1014/1056), 163.61 MiB | 32.71 MiB/s
Receiving objects: 97% (1025/1056), 181.13 MiB | 32.97 MiB/s
Receiving objects: 98% (1035/1056), 181.13 MiB | 32.97 MiB/s
Receiving objects: 99% (1046/1056), 181.13 MiB | 32.97 MiB/s
remote: Total 1056 (delta 0), reused 0 (delta 0), pack-reused 1056 (from 1)
37.47 s
Receiving objects: 100% (1056/1056), 181.13 MiB | 32.97 MiB/s
Receiving objects: 100% (1056/1056), 182.85 MiB | 32.25 MiB/s, done.
37.70 s
Resolving deltas: 0% (0/560)
Resolving deltas: 1% (6/560)
Resolving deltas: 2% (12/560)
Resolving deltas: 3% (17/560)
Resolving deltas: 4% (23/560)
Resolving deltas: 5% (29/560)
Resolving deltas: 6% (37/560)
Resolving deltas: 7% (42/560)
Resolving deltas: 8% (45/560)
Resolving deltas: 9% (51/560)
Resolving deltas: 10% (57/560)
Resolving deltas: 11% (64/560)
Resolving deltas: 12% (68/560)
Resolving deltas: 13% (73/560)
Resolving deltas: 14% (79/560)
Resolving deltas: 15% (85/560)
Resolving deltas: 16% (90/560)
Resolving deltas: 17% (98/560)
Resolving deltas: 18% (102/560)
Resolving deltas: 19% (107/560)
Resolving deltas: 20% (112/560)
Resolving deltas: 21% (118/560)
Resolving deltas: 22% (127/560)
Resolving deltas: 23% (129/560)
Resolving deltas: 24% (135/560)
Resolving deltas: 25% (140/560)
Resolving deltas: 26% (146/560)
Resolving deltas: 27% (152/560)
Resolving deltas: 28% (158/560)
Resolving deltas: 29% (163/560)
Resolving deltas: 30% (168/560)
Resolving deltas: 31% (174/560)
Resolving deltas: 32% (180/560)
Resolving deltas: 33% (185/560)
Resolving deltas: 34% (191/560)
Resolving deltas: 35% (198/560)
Resolving deltas: 36% (202/560)
Resolving deltas: 37% (208/560)
Resolving deltas: 38% (213/560)
Resolving deltas: 39% (219/560)
Resolving deltas: 40% (224/560)
Resolving deltas: 41% (233/560)
Resolving deltas: 42% (236/560)
Resolving deltas: 43% (241/560)
Resolving deltas: 44% (247/560)
Resolving deltas: 45% (253/560)
Resolving deltas: 46% (259/560)
Resolving deltas: 47% (264/560)
Resolving deltas: 48% (269/560)
Resolving deltas: 49% (275/560)
Resolving deltas: 50% (280/560)
Resolving deltas: 51% (286/560)
Resolving deltas: 52% (292/560)
Resolving deltas: 53% (297/560)
Resolving deltas: 54% (303/560)
Resolving deltas: 55% (308/560)
Resolving deltas: 56% (314/560)
Resolving deltas: 57% (320/560)
Resolving deltas: 58% (326/560)
Resolving deltas: 59% (332/560)
Resolving deltas: 60% (336/560)
Resolving deltas: 61% (342/560)
Resolving deltas: 62% (348/560)
Resolving deltas: 63% (353/560)
Resolving deltas: 64% (360/560)
Resolving deltas: 65% (364/560)
Resolving deltas: 66% (370/560)
Resolving deltas: 67% (376/560)
Resolving deltas: 68% (381/560)
Resolving deltas: 69% (387/560)
Resolving deltas: 70% (393/560)
Resolving deltas: 71% (398/560)
Resolving deltas: 72% (405/560)
Resolving deltas: 73% (409/560)
Resolving deltas: 74% (415/560)
Resolving deltas: 75% (420/560)
Resolving deltas: 76% (426/560)
Resolving deltas: 77% (432/560)
Resolving deltas: 78% (437/560)
Resolving deltas: 79% (443/560)
Resolving deltas: 80% (448/560)
Resolving deltas: 81% (456/560)
Resolving deltas: 82% (460/560)
Resolving deltas: 83% (467/560)
Resolving deltas: 84% (471/560)
Resolving deltas: 85% (476/560)
Resolving deltas: 86% (482/560)
Resolving deltas: 87% (488/560)
Resolving deltas: 88% (493/560)
Resolving deltas: 89% (499/560)
Resolving deltas: 90% (504/560)
Resolving deltas: 91% (510/560)
Resolving deltas: 92% (516/560)
Resolving deltas: 93% (521/560)
Resolving deltas: 94% (527/560)
Resolving deltas: 95% (532/560)
Resolving deltas: 96% (538/560)
Resolving deltas: 97% (544/560)
Resolving deltas: 98% (549/560)
Resolving deltas: 99% (555/560)
Resolving deltas: 100% (560/560)
Resolving deltas: 100% (560/560), done.
37.84 s
From https://github.com/lcnbr/tymbolica
37.84 s
* [new branch] main -> main
37.84 s
* [new branch] shared-symbolica-interface -> shared-symbolica-interface
40.27 s
40.28 s
Downloading cached gammaloop-nextest-binaries-core-gammaloop-api from https://cache.nix-ci.com
40.28 s
Downloading cached gammaloop-nextest-binaries-core-gammaloop-tracing-filter-macros from https://cache.nix-ci.com
40.28 s
Downloading cached gammaloop-nextest-binaries-core-gammaloop-tracing-filter from https://cache.nix-ci.com
40.28 s
Downloading cached gammaloop-nextest-binaries-core-gammalooprs from https://cache.nix-ci.com
40.28 s
Downloading cached xgcc-15.2.0-libgcc from https://cache.nix-ci.com
40.28 s
Downloading cached busybox from https://cache.nix-ci.com
40.28 s
Downloading cached gcc-15.2.0-libgcc from https://cache.nix-ci.com
40.29 s
Downloading cached libunistring from https://cache.nix-ci.com
40.29 s
Downloading cached publicsuffix-list-0-unstable-2026-05 from https://cache.nix-ci.com
40.44 s
Downloaded cached publicsuffix-list-0-unstable-2026-05 (329 KiB) in 153ms
40.44 s
Progress: 0 of 1 built, 1 of 71 downloaded from cache (8 downloading)
40.44 s
Downloaded cached xgcc-15.2.0-libgcc (193 KiB) in 161ms
40.44 s
Progress: 0 of 1 built, 2 of 71 downloaded from cache (7 downloading)
40.44 s
Downloaded cached gcc-15.2.0-libgcc (193 KiB) in 159ms
40.44 s
Progress: 0 of 1 built, 3 of 71 downloaded from cache (6 downloading)
40.45 s
Downloaded cached busybox (230 KiB) in 162ms
40.45 s
Progress: 0 of 1 built, 4 of 71 downloaded from cache (5 downloading)
40.47 s
Downloaded cached libunistring (2 MiB) in 179ms
40.47 s
Progress: 0 of 1 built, 5 of 71 downloaded from cache (4 downloading)
40.47 s
Downloading cached libidn2 from https://cache.nix-ci.com
40.51 s
Downloaded cached gammaloop-nextest-binaries-core-gammaloop-tracing-filter-macros (1.7 MiB) in 236ms
40.51 s
Progress: 0 of 1 built, 6 of 71 downloaded from cache (4 downloading)
40.57 s
Downloaded cached libidn2 (359 KiB) in 102ms
40.57 s
Progress: 0 of 1 built, 7 of 71 downloaded from cache (3 downloading)
40.57 s
Downloading cached glibc-2.42 from https://cache.nix-ci.com
40.77 s
Downloaded cached gammaloop-nextest-binaries-core-gammaloop-tracing-filter (8 MiB) in 492ms
40.77 s
Progress: 0 of 1 built, 8 of 71 downloaded from cache (3 downloading)
40.96 s
Downloaded cached glibc-2.42 (33.5 MiB) in 386ms
40.96 s
Progress: 0 of 1 built, 9 of 71 downloaded from cache (2 downloading)
40.96 s
Downloading cached attr from https://cache.nix-ci.com
40.96 s
Downloading cached aws-c-common from https://cache.nix-ci.com
40.96 s
Downloading cached bash from https://cache.nix-ci.com
40.96 s
Downloading cached brotli-1.2.0-lib from https://cache.nix-ci.com
40.96 s
Downloading cached bzip2 from https://cache.nix-ci.com
40.96 s
Downloading cached editline-1.17.1-unstable-2025-05 from https://cache.nix-ci.com
40.96 s
Downloading cached gcc-15.2.0-lib from https://cache.nix-ci.com
40.96 s
Downloading cached hwloc-2.14.0-lib from https://cache.nix-ci.com
40.96 s
Downloading cached keyutils-1.6.3-lib from https://cache.nix-ci.com
40.96 s
Downloading cached libcpuid from https://cache.nix-ci.com
40.96 s
Downloading cached libpsl from https://cache.nix-ci.com
40.96 s
Downloading cached libseccomp-2.6.0-lib from https://cache.nix-ci.com
40.96 s
Downloading cached libsodium-1.0.22-unstable-2026-04 from https://cache.nix-ci.com
40.96 s
Downloading cached libxml2 from https://cache.nix-ci.com
41.03 s
Downloaded cached libpsl (114 KiB) in 76ms
41.03 s
Progress: 0 of 1 built, 10 of 71 downloaded from cache (15 downloading)
41.03 s
Downloading cached llhttp from https://cache.nix-ci.com
41.03 s
Downloaded cached attr (90 KiB) in 77ms
41.03 s
Progress: 0 of 1 built, 11 of 71 downloaded from cache (15 downloading)
41.03 s
Downloading cached lowdown-3.0.1-lib from https://cache.nix-ci.com
41.05 s
Downloaded cached aws-c-common (1.1 MiB) in 92ms
41.05 s
Progress: 0 of 1 built, 12 of 71 downloaded from cache (15 downloading)
41.05 s
Downloading cached acl from https://cache.nix-ci.com
41.05 s
Downloaded cached hwloc-2.14.0-lib (459 KiB) in 93ms
41.05 s
Progress: 0 of 1 built, 13 of 71 downloaded from cache (15 downloading)
41.05 s
Downloading cached aws-c-compression from https://cache.nix-ci.com
41.06 s
Downloaded cached keyutils-1.6.3-lib (41 KiB) in 105ms
41.06 s
Progress: 0 of 1 built, 14 of 71 downloaded from cache (15 downloading)
41.06 s
Downloading cached aws-c-sdkutils from https://cache.nix-ci.com
41.07 s
Downloaded cached libseccomp-2.6.0-lib (193 KiB) in 109ms
41.07 s
Progress: 0 of 1 built, 15 of 71 downloaded from cache (15 downloading)
41.07 s
Downloading cached aws-checksums from https://cache.nix-ci.com
41.07 s
Downloaded cached libcpuid (326 KiB) in 113ms
41.07 s
Progress: 0 of 1 built, 16 of 71 downloaded from cache (15 downloading)
41.07 s
Downloading cached nghttp2-1.69.0-lib from https://cache.nix-ci.com
41.07 s
Downloaded cached bash (1.8 MiB) in 114ms
41.07 s
Progress: 0 of 1 built, 17 of 71 downloaded from cache (15 downloading)
41.07 s
Downloading cached nghttp3 from https://cache.nix-ci.com
41.08 s
Downloaded cached editline-1.17.1-unstable-2025-05 (58 KiB) in 123ms
41.08 s
Progress: 0 of 1 built, 18 of 71 downloaded from cache (15 downloading)
41.08 s
Downloading cached openssl from https://cache.nix-ci.com
41.09 s
Downloaded cached bzip2 (86 KiB) in 132ms
41.09 s
Progress: 0 of 1 built, 19 of 71 downloaded from cache (15 downloading)
41.09 s
Downloading cached pcre2 from https://cache.nix-ci.com
41.10 s
Downloaded cached brotli-1.2.0-lib (961 KiB) in 143ms
41.10 s
Progress: 0 of 1 built, 20 of 71 downloaded from cache (15 downloading)
41.10 s
Downloading cached xz from https://cache.nix-ci.com
41.12 s
Downloaded cached libsodium-1.0.22-unstable-2026-04 (666 KiB) in 151ms
41.12 s
Progress: 0 of 1 built, 21 of 71 downloaded from cache (15 downloading)
41.12 s
Downloading cached zlib from https://cache.nix-ci.com
41.12 s
Downloaded cached llhttp (89 KiB) in 86ms
41.12 s
Progress: 0 of 1 built, 22 of 71 downloaded from cache (15 downloading)
41.13 s
Downloaded cached lowdown-3.0.1-lib (341 KiB) in 98ms
41.13 s
Progress: 0 of 1 built, 23 of 71 downloaded from cache (14 downloading)
41.14 s
Downloaded cached libxml2 (1.4 MiB) in 170ms
41.14 s
Progress: 0 of 1 built, 24 of 71 downloaded from cache (13 downloading)
41.14 s
Downloaded cached aws-c-compression (31 KiB) in 85ms
41.14 s
Progress: 0 of 1 built, 25 of 71 downloaded from cache (12 downloading)
41.14 s
Downloaded cached acl (125 KiB) in 90ms
41.14 s
Progress: 0 of 1 built, 26 of 71 downloaded from cache (11 downloading)
41.17 s
Downloaded cached nghttp2-1.69.0-lib (225 KiB) in 95ms
41.17 s
Progress: 0 of 1 built, 27 of 71 downloaded from cache (10 downloading)
41.17 s
Downloaded cached aws-checksums (86 KiB) in 99ms
41.17 s
Progress: 0 of 1 built, 28 of 71 downloaded from cache (9 downloading)
41.17 s
Downloaded cached aws-c-sdkutils (155 KiB) in 103ms
41.17 s
Progress: 0 of 1 built, 29 of 71 downloaded from cache (8 downloading)
41.18 s
Downloaded cached nghttp3 (228 KiB) in 113ms
41.19 s
Progress: 0 of 1 built, 30 of 71 downloaded from cache (7 downloading)
41.22 s
Downloaded cached zlib (129 KiB) in 103ms
41.22 s
Progress: 0 of 1 built, 31 of 71 downloaded from cache (6 downloading)
41.22 s
Downloading cached sqlite from https://cache.nix-ci.com
41.22 s
Downloaded cached xz (837 KiB) in 123ms
41.22 s
Progress: 0 of 1 built, 32 of 71 downloaded from cache (6 downloading)
41.23 s
Downloaded cached gcc-15.2.0-lib (9.8 MiB) in 268ms
41.23 s
Progress: 0 of 1 built, 33 of 71 downloaded from cache (5 downloading)
41.23 s
Downloading cached boehm-gc from https://cache.nix-ci.com
41.23 s
Downloading cached icu4c from https://cache.nix-ci.com
41.23 s
Downloading cached onetbb from https://cache.nix-ci.com
41.23 s
Downloading cached zstd from https://cache.nix-ci.com
41.23 s
Downloaded cached pcre2 (2 MiB) in 142ms
41.23 s
Progress: 0 of 1 built, 34 of 71 downloaded from cache (8 downloading)
41.32 s
Downloaded cached openssl (8.9 MiB) in 239ms
41.32 s
Progress: 0 of 1 built, 35 of 71 downloaded from cache (7 downloading)
41.32 s
Downloading cached aws-c-cal from https://cache.nix-ci.com
41.32 s
Downloading cached krb5-1.22.2-lib from https://cache.nix-ci.com
41.32 s
Downloading cached libssh2 from https://cache.nix-ci.com
41.32 s
Downloading cached ngtcp2 from https://cache.nix-ci.com
41.32 s
Downloading cached s2n-tls from https://cache.nix-ci.com
41.35 s
Downloaded cached boehm-gc (312 KiB) in 122ms
41.35 s
Progress: 0 of 1 built, 36 of 71 downloaded from cache (11 downloading)
41.35 s
Downloaded cached onetbb (626 KiB) in 124ms
41.35 s
Progress: 0 of 1 built, 37 of 71 downloaded from cache (10 downloading)
41.35 s
Downloading cached libblake3 from https://cache.nix-ci.com
41.37 s
Downloaded cached zstd (1.1 MiB) in 146ms
41.37 s
Progress: 0 of 1 built, 38 of 71 downloaded from cache (10 downloading)
41.37 s
Downloading cached libarchive-3.8.8-lib from https://cache.nix-ci.com
41.44 s
Downloaded cached aws-c-cal (158 KiB) in 119ms
41.44 s
Progress: 0 of 1 built, 39 of 71 downloaded from cache (10 downloading)
41.45 s
Downloaded cached libssh2 (330 KiB) in 126ms
41.45 s
Progress: 0 of 1 built, 40 of 71 downloaded from cache (9 downloading)
41.45 s
Downloading cached libgit2-1.9.4-lib from https://cache.nix-ci.com
41.45 s
Downloaded cached libblake3 (117 KiB) in 97ms
41.45 s
Progress: 0 of 1 built, 41 of 71 downloaded from cache (9 downloading)
41.46 s
Downloaded cached ngtcp2 (515 KiB) in 143ms
41.46 s
Progress: 0 of 1 built, 42 of 71 downloaded from cache (8 downloading)
41.49 s
Downloaded cached s2n-tls (1.3 MiB) in 165ms
41.49 s
Progress: 0 of 1 built, 43 of 71 downloaded from cache (7 downloading)
41.49 s
Downloading cached aws-c-io from https://cache.nix-ci.com
41.52 s
Downloaded cached sqlite (5.7 MiB) in 300ms
41.52 s
Progress: 0 of 1 built, 44 of 71 downloaded from cache (7 downloading)
41.52 s
Downloaded cached libarchive-3.8.8-lib (953 KiB) in 150ms
41.52 s
Progress: 0 of 1 built, 45 of 71 downloaded from cache (6 downloading)
41.54 s
Downloaded cached krb5-1.22.2-lib (2.7 MiB) in 218ms
41.54 s
Progress: 0 of 1 built, 46 of 71 downloaded from cache (5 downloading)
41.54 s
Downloading cached curl from https://cache.nix-ci.com
41.58 s
Downloaded cached libgit2-1.9.4-lib (1.6 MiB) in 135ms
41.58 s
Progress: 0 of 1 built, 47 of 71 downloaded from cache (5 downloading)
41.59 s
Downloaded cached aws-c-io (648 KiB) in 107ms
41.59 s
Progress: 0 of 1 built, 48 of 71 downloaded from cache (4 downloading)
41.59 s
Downloading cached aws-c-event-stream from https://cache.nix-ci.com
41.59 s
Downloading cached aws-c-http from https://cache.nix-ci.com
41.67 s
Downloaded cached curl (1.2 MiB) in 133ms
41.67 s
Progress: 0 of 1 built, 49 of 71 downloaded from cache (5 downloading)
41.70 s
Downloaded cached aws-c-event-stream (176 KiB) in 108ms
41.70 s
Progress: 0 of 1 built, 50 of 71 downloaded from cache (4 downloading)
41.71 s
Downloaded cached aws-c-http (641 KiB) in 115ms
41.71 s
Progress: 0 of 1 built, 51 of 71 downloaded from cache (3 downloading)
41.71 s
Downloading cached aws-c-auth from https://cache.nix-ci.com
41.71 s
Downloading cached aws-c-mqtt from https://cache.nix-ci.com
41.82 s
Downloaded cached aws-c-auth (387 KiB) in 105ms
41.82 s
Progress: 0 of 1 built, 52 of 71 downloaded from cache (4 downloading)
41.82 s
Downloading cached aws-c-s3 from https://cache.nix-ci.com
41.82 s
Downloaded cached aws-c-mqtt (557 KiB) in 113ms
41.82 s
Progress: 0 of 1 built, 53 of 71 downloaded from cache (4 downloading)
41.94 s
Downloaded cached aws-c-s3 (384 KiB) in 122ms
41.94 s
Progress: 0 of 1 built, 54 of 71 downloaded from cache (3 downloading)
41.94 s
Downloading cached aws-crt-cpp from https://cache.nix-ci.com
41.96 s
Downloaded cached icu4c (38.2 MiB) in 730ms
41.96 s
Progress: 0 of 1 built, 55 of 71 downloaded from cache (3 downloading)
41.96 s
Downloading cached boost from https://cache.nix-ci.com
42.05 s
Downloaded cached gammaloop-nextest-binaries-core-gammaloop-api (70 MiB) in 1.7s
42.05 s
Progress: 0 of 1 built, 56 of 71 downloaded from cache (3 downloading)
42.06 s
Downloaded cached aws-crt-cpp (979 KiB) in 123ms
42.06 s
Progress: 0 of 1 built, 57 of 71 downloaded from cache (2 downloading)
42.19 s
Downloaded cached boost (14.5 MiB) in 229ms
42.19 s
Progress: 0 of 1 built, 58 of 71 downloaded from cache (1 downloading)
42.19 s
Downloading cached nix-util from https://cache.nix-ci.com
42.29 s
Downloaded cached nix-util (2.4 MiB) in 103ms
42.29 s
Progress: 0 of 1 built, 59 of 71 downloaded from cache (1 downloading)
42.29 s
Downloading cached nix-nswrapper from https://cache.nix-ci.com
42.29 s
Downloading cached nix-store from https://cache.nix-ci.com
42.36 s
Downloaded cached nix-nswrapper (131 KiB) in 72ms
42.36 s
Progress: 0 of 1 built, 60 of 71 downloaded from cache (2 downloading)
42.42 s
Downloaded cached nix-store (5.8 MiB) in 130ms
42.42 s
Progress: 0 of 1 built, 61 of 71 downloaded from cache (1 downloading)
42.42 s
Downloading cached nix-fetchers from https://cache.nix-ci.com
42.42 s
Downloading cached nix-main from https://cache.nix-ci.com
42.49 s
Downloaded cached nix-fetchers (1.5 MiB) in 70ms
42.49 s
Progress: 0 of 1 built, 62 of 71 downloaded from cache (2 downloading)
42.49 s
Downloading cached nix-expr from https://cache.nix-ci.com
42.49 s
Downloaded cached nix-main (393 KiB) in 73ms
42.49 s
Progress: 0 of 1 built, 63 of 71 downloaded from cache (2 downloading)
42.58 s
Downloaded cached nix-expr (3.3 MiB) in 89ms
42.58 s
Progress: 0 of 1 built, 64 of 71 downloaded from cache (1 downloading)
42.58 s
Downloading cached nix-flake from https://cache.nix-ci.com
42.65 s
Downloaded cached nix-flake (956 KiB) in 68ms
42.65 s
Progress: 0 of 1 built, 65 of 71 downloaded from cache (1 downloading)
42.65 s
Downloading cached nix-cmd from https://cache.nix-ci.com
42.72 s
Downloaded cached nix-cmd (1 MiB) in 74ms
42.72 s
Progress: 0 of 1 built, 66 of 71 downloaded from cache (1 downloading)
42.72 s
Downloading cached nix from https://cache.nix-ci.com
42.83 s
Downloaded cached gammaloop-nextest-binaries-core-gammalooprs (84.2 MiB) in 2.5s
42.84 s
Progress: 0 of 1 built, 67 of 71 downloaded from cache (1 downloading)
42.84 s
Downloading cached gammaloop-nextest-binaries-core from https://cache.nix-ci.com
42.84 s
Downloaded cached nix (3.9 MiB) in 117ms
42.84 s
Progress: 0 of 1 built, 68 of 71 downloaded from cache (1 downloading)
42.84 s
Downloading cached nix from https://cache.nix-ci.com
42.87 s
Downloaded cached gammaloop-nextest-binaries-core (1640 B) in 37ms
42.87 s
Progress: 0 of 1 built, 69 of 71 downloaded from cache (1 downloading)
42.89 s
Downloaded cached nix (8848 B) in 47ms
42.89 s
Progress: 0 of 1 built, 70 of 71 downloaded from cache
42.89 s
Downloading cached nix-ci-check-gammaloop-nextest-core from https://cache.nix-ci.com
42.93 s
Downloaded cached nix-ci-check-gammaloop-nextest-core (1016 B) in 39ms
42.93 s
Progress: 0 of 1 built, 71 of 71 downloaded from cache
48.62 s
evaluating derivation 'g
copying '/nix/store/qism
evaluating derivation 'g
copying '/nix/store/qism
evaluating derivation 'g
copying '/nix/store/qism
evaluating derivation 'g
copying '/nix/store/qism
evaluating derivation 'g
copying '/nix/store/qism
evaluating derivation 'g
querying gammaloop-nexte
[0.0 KiB DL] querying ga
[1.5 KiB DL] querying cl
[14.9 KiB DL] querying n
[32.3 KiB DL] querying b
[41.6 KiB DL] querying m
[45.4 KiB DL] querying g
[46.8 KiB DL] querying g
[0 /22 built, 16 /0 /63 cop
[0 /22 built, 16 /2 /63 cop
[0 /21 built, 16 /10 /63 co
[0 /21 built, 16 /14 /63 co
[0 /21 built, 16 /15 /63 co
[0 /19 built, 16 /27 /63 co
[0 /19 built, 16 /28 /63 co
[0 /19 built, 16 /30 /63 co
[0 /18 built, 16 /33 /63 co
[0 /17 built, 16 /36 /63 co
[0 /17 built, 15 /37 /63 co
[0 /17 built, 15 /38 /63 co
[0 /16 built, 11 /43 /63 co
[0 /16 built, 10 /44 /63 co
[0 /16 built, 9 /46 /63 cop
[0 /16 built, 9 /49 /63 cop
[0 /15 built, 8 /50 /63 cop
[1 /0 /15 built, 8 /50 /63 c
[2 /0 /15 built, 7 /51 /63 ccrane-dummy-cargo-target.rs (post)> Uploading to the NixCI cache: /nix/store/hd50hqi25fymr09a2w4xdiy5jmb2cfl5-crane-dummy-cargo-target.rs
48.66 s
crane-dummy-cargo-target.rs (post)> warning: 'warn-short-path-literals' is deprecated, use 'lint-short-path-literals = ignore' instead
48.79 s
crane-dummy-cargo-target.rs (post)> copying 0 paths...
48.85 s
crane-dummy-cargo-target.rs (post)> warning: 'warn-short-path-literals' is deprecated, use 'lint-short-path-literals = ignore' instead
50.16 s
crane-dummy-cargo-target.rs (post)> copying 0 paths...
50.20 s
crane-dummy-proc-macro-cargo-target.rs (post)> Uploading to the NixCI cache: /nix/store/z0b4s6pznqwlbyw5v4bbq7k1kp721g19-crane-dummy-proc-macro-cargo-target.rs
50.25 s
[1 /1 /15 built, 5 /53 /63 ccrane-dummy-proc-macro-cargo-target.rs (post)> warning: 'warn-short-path-literals' is deprecated, use 'lint-short-path-literals = ignore' instead
50.37 s
crane-dummy-proc-macro-cargo-target.rs (post)> copying 0 paths...
50.43 s
crane-dummy-proc-macro-cargo-target.rs (post)> warning: 'warn-short-path-literals' is deprecated, use 'lint-short-path-literals = ignore' instead
50.58 s
crane-dummy-proc-macro-cargo-target.rs (post)> copying 0 paths...
52.55 s
[2 /13 built, 5 /54 /63 cop
[2 /13 built, 5 /56 /63 cop
[2 /12 built, 5 /57 /63 cop
[2 /11 built, 4 /58 /63 cop
[2 /10 built, 3 /59 /63 cop
[2 /9 built, 2 /60 /63 copi
[2 /8 built, 1 /61 /63 copi
[1 /2 /7 built, 1 /62 /63 co
[2 /2 /7 built, 1 /62 /63 co
[2 /2 /6 built, 63 copied rust-stable-with-std (post)> Uploading to the NixCI cache: /nix/store/imnwv6nazijihjlgf2h3l1qm63m7l9wk-rust-stable-with-std-2026-07-09
52.58 s
rust-stable-with-std (post)> warning: 'warn-short-path-literals' is deprecated, use 'lint-short-path-literals = ignore' instead
52.70 s
rust-stable-with-std (post)> copying 0 paths...
52.75 s
rust-stable-with-std (post)> warning: 'warn-short-path-literals' is deprecated, use 'lint-short-path-literals = ignore' instead
53.00 s
rust-stable-with-std (post)> copying 0 paths...
53.18 s
[1 /3 /7 built, 63 copied clippy-stable-with-std (post)> Uploading to the NixCI cache: /nix/store/r4bjy93lvnfma1awpi480n2mz3af0adx-clippy-stable-with-std-2026-07-09
53.22 s
clippy-stable-with-std (post)> warning: 'warn-short-path-literals' is deprecated, use 'lint-short-path-literals = ignore' instead
53.35 s
clippy-stable-with-std (post)> copying 0 paths...
53.40 s
clippy-stable-with-std (post)> warning: 'warn-short-path-literals' is deprecated, use 'lint-short-path-literals = ignore' instead
53.54 s
clippy-stable-with-std (post)> copying 0 paths...
53.63 s
[4 /7 built, 63 copied (1
[1 /4 /6 built, 63 copied rust-stable-with-components> /nix/store/imnwv6nazijihjlgf2h3l1qm63m7l9wk-rust-stable-with-std-2026-07-09/bin:
53.63 s
rust-stable-with-components> rust-gdbgui: Keeping existing link to /nix/store/r4bjy93lvnfma1awpi480n2mz3af0adx-clippy-stable-with-std-2026-07-09/bin/rust-gdbgui
53.63 s
rust-stable-with-components> rust-gdb: Keeping existing link to /nix/store/r4bjy93lvnfma1awpi480n2mz3af0adx-clippy-stable-with-std-2026-07-09/bin/rust-gdb
53.63 s
rust-stable-with-components> rust-lldb: Keeping existing link to /nix/store/r4bjy93lvnfma1awpi480n2mz3af0adx-clippy-stable-with-std-2026-07-09/bin/rust-lldb
53.63 s
rust-stable-with-components> rustc: Keeping existing link to /nix/store/r4bjy93lvnfma1awpi480n2mz3af0adx-clippy-stable-with-std-2026-07-09/bin/rustc
53.63 s
rust-stable-with-components> rustdoc: Keeping existing link to /nix/store/r4bjy93lvnfma1awpi480n2mz3af0adx-clippy-stable-with-std-2026-07-09/bin/rustdoc
53.63 s
rust-stable-with-components> /nix/store/imnwv6nazijihjlgf2h3l1qm63m7l9wk-rust-stable-with-std-2026-07-09/lib:
53.63 s
rust-stable-with-components> librustc_driver-a39fc8bf9e61dbb9.so: Keeping existing link to /nix/store/r4bjy93lvnfma1awpi480n2mz3af0adx-clippy-stable-with-std-2026-07-09/lib/librustc_driver-a39fc8bf9e61dbb9.so
54.14 s
rust-stable-with-components (post)> Uploading to the NixCI cache: /nix/store/9pb4ikjdw4gp766ayxl6gg3b7hqm6ds4-rust-stable-with-components-2026-07-09
54.18 s
rust-stable-with-components (post)> warning: 'warn-short-path-literals' is deprecated, use 'lint-short-path-literals = ignore' instead
54.31 s
rust-stable-with-components (post)> copying 0 paths...
54.36 s
rust-stable-with-components (post)> warning: 'warn-short-path-literals' is deprecated, use 'lint-short-path-literals = ignore' instead
54.51 s
rust-stable-with-components (post)> copying 0 paths...
54.87 s
[5 /7 built, 63 copied (1
[1 /5 /6 built, 63 copied gammaloop-nextest-core> Extracting 3 binaries (including 1 non-test binary), 1 build script output directory, and 2 linked paths to /build/nextest-archive-T97Hxn
55.30 s
gammaloop-nextest-core> Extracted 18 files to /build/nextest-archive-T97Hxn in 0.43s
55.31 s
gammaloop-nextest-core> ------------
55.31 s
gammaloop-nextest-core> Nextest run ID 84d7497c-4164-4421-b925-e33a835f5eab with nextest profile: ci_gammaloop
55.31 s
gammaloop-nextest-core> Starting 339 tests across 2 binaries
55.71 s
gammaloop-nextest-core> ------------
55.71 s
gammaloop-nextest-core> Summary [ 0.402s] 339 tests run: 339 passed , 0 skipped
55.80 s
gammaloop-nextest-core>
55.80 s
gammaloop-nextest-core> ========== nextest test summary ==========
55.80 s
gammaloop-nextest-core> report: target/nextest/ci_gammaloop/junit.xml
55.80 s
gammaloop-nextest-core> tests: 339, failures: 0, errors: 0
55.80 s
gammaloop-nextest-core> No failing testcases found.
55.80 s
gammaloop-nextest-core> =========================================
55.81 s
gammaloop-nextest-core> Extracting 1 binary and 1 linked path to /build/nextest-archive-w7ozfB
55.86 s
gammaloop-nextest-core> Extracted 7 files to /build/nextest-archive-w7ozfB in 0.05s
55.87 s
gammaloop-nextest-core> ------------
55.87 s
gammaloop-nextest-core> Nextest run ID 46631c6b-8997-4ccf-9c3b-0b9da3ce30ea with nextest profile: ci_gammaloop
55.87 s
gammaloop-nextest-core> Starting 19 tests across 1 binary
55.88 s
gammaloop-nextest-core> ------------
55.88 s
gammaloop-nextest-core> Summary [ 0.011s] 19 tests run: 19 passed , 0 skipped
55.91 s
gammaloop-nextest-core>
55.91 s
gammaloop-nextest-core> ========== nextest test summary ==========
55.91 s
gammaloop-nextest-core> report: target/nextest/ci_gammaloop/junit.xml
55.91 s
gammaloop-nextest-core> tests: 19, failures: 0, errors: 0
55.91 s
gammaloop-nextest-core> No failing testcases found.
55.91 s
gammaloop-nextest-core> =========================================
55.93 s
gammaloop-nextest-core> Extracting 1 binary to /build/nextest-archive-IZRk7C
55.95 s
gammaloop-nextest-core> Extracted 4 files to /build/nextest-archive-IZRk7C in 0.03s
55.96 s
gammaloop-nextest-core> ------------
55.96 s
gammaloop-nextest-core> Nextest run ID 58eb0011-5b4e-4cb8-992d-804b4fea4d80 with nextest profile: ci_gammaloop
55.96 s
gammaloop-nextest-core> Starting 0 tests across 1 binary
55.96 s
gammaloop-nextest-core> ------------
55.96 s
gammaloop-nextest-core> Summary [ 0.000s] 0 tests run: 0 passed , 0 skipped
55.99 s
gammaloop-nextest-core>
55.99 s
gammaloop-nextest-core> ========== nextest test summary ==========
55.99 s
gammaloop-nextest-core> report: target/nextest/ci_gammaloop/junit.xml
55.99 s
gammaloop-nextest-core> tests: 0, failures: 0, errors: 0
55.99 s
gammaloop-nextest-core> No failing testcases found.
55.99 s
gammaloop-nextest-core> =========================================
56.00 s
gammaloop-nextest-core> Extracting 4 binaries, 1 build script output directory, and 2 linked paths to /build/nextest-archive-PcSQ2a
56.42 s
gammaloop-nextest-core> Extracted 18 files to /build/nextest-archive-PcSQ2a in 0.42s
56.43 s
gammaloop-nextest-core> ------------
56.43 s
gammaloop-nextest-core> Nextest run ID edcd3ae3-f66f-4f86-8470-001869e64843 with nextest profile: ci_gammaloop
56.43 s
gammaloop-nextest-core> Starting 456 tests across 4 binaries (61 tests skipped , including 60 tests via profile.ci_gammaloop.default-filter )
57.34 s
gammaloop-nextest-core> FAIL [ 0.129s] (441/456) gammalooprs::test_renormalization finit_part_ghlo
57.34 s
gammaloop-nextest-core> stdout ---
57.34 s
gammaloop-nextest-core>
57.34 s
gammaloop-nextest-core> running 1 test
57.34 s
gammaloop-nextest-core> test finit_part_ghlo ... FAILED
57.34 s
gammaloop-nextest-core>
57.34 s
gammaloop-nextest-core> failures:
57.34 s
gammaloop-nextest-core>
57.34 s
gammaloop-nextest-core> failures:
57.34 s
gammaloop-nextest-core> finit_part_ghlo
57.34 s
gammaloop-nextest-core>
57.34 s
gammaloop-nextest-core> test result: FAILED. 0 passed; 1 failed; 0 ignored; 0 measured; 5 filtered out; finished in 0.12s
57.34 s
gammaloop-nextest-core>
57.34 s
gammaloop-nextest-core> stderr ---
57.34 s
gammaloop-nextest-core> The application panicked (crashed).
57.34 s
gammaloop-nextest-core> Message: called `Result::unwrap()` on an `Err` value:
57.34 s
gammaloop-nextest-core> 0: Symbolica could not parse FORM output:
57.34 s
gammaloop-nextest-core> [spenso::{antisymmetric,real,spenso::tensor}::f]([spenso::{spenso::representat\
57.34 s
gammaloop-nextest-core> ion,spenso::self_dual}::coad](8,[gammalooprs::{spenso::index}::hedge](0)
57.34 s
gammaloop-nextest-core> ),[spenso::{spenso::representation,spenso::self_dual}::coad](8,[gammaloo\
57.34 s
gammaloop-nextest-core> prs::{spenso::index}::hedge](3)),[spenso::{spenso::representation,spenso\
57.34 s
gammaloop-nextest-core> ::self_dual}::coad](8,[gammalooprs::{spenso::index}::hedge](5)))*
57.34 s
gammaloop-nextest-core> [spenso::{antisymmetric,real,spenso::tensor}::f]([spenso::{spenso::repre\
57.34 s
gammaloop-nextest-core> sentation,spenso::self_dual}::coad](8,[gammalooprs::{spenso::index}::hed\
57.34 s
gammaloop-nextest-core> ge](1)),[spenso::{spenso::representation,spenso::self_dual}::coad](8,
57.34 s
gammaloop-nextest-core> [gammalooprs::{spenso::index}::hedge](3)),[spenso::{spenso::representati\
57.34 s
gammaloop-nextest-core> on,spenso::self_dual}::coad](8,[gammalooprs::{spenso::index}::hedge](5))
57.34 s
gammaloop-nextest-core> )*dot(p1,p0)*[UFO::{}::GC_10]^2*rat(-1,1)
57.34 s
gammaloop-nextest-core>
57.34 s
gammaloop-nextest-core> Error:Symbol spenso::coad redefined with new attributes:
57.34 s
gammaloop-nextest-core> - new user data specified: List([String("spenso::representation-v2"), String("self-dual"), List([String("symbol"), String("coad")]), List([String("cyclic"), Integer(1), List([List([String("symbol"), String("a")]), List([String("symbol"), String("b")]), List([String("symbol"), String("c")]), List([String("symbol"), String("d")])])]), String("top")]) vs None
57.34 s
gammaloop-nextest-core>
57.34 s
gammaloop-nextest-core>
57.34 s
gammaloop-nextest-core> Location:
57.34 s
gammaloop-nextest-core> crates/gammalooprs/src/uv/approx/integrated.rs :332
57.34 s
gammaloop-nextest-core>
57.34 s
gammaloop-nextest-core> ━━━━━━━━━━━━━━━━━━━━━━━━━━━━━━━━━━ BACKTRACE ━━━━━━━━━━━━━━━━━━━━━━━━━━━━━━━━━━━
57.34 s
gammaloop-nextest-core> 1: <color_eyre[5722b77bc20a64cf]::config::EyreHook>::into_eyre_hook::{closure#0} <unknown>
57.34 s
gammaloop-nextest-core> at <unknown source file> :<unknown line>
57.34 s
gammaloop-nextest-core> 2: eyre[cb2fd339c0c40fca]::capture_handler <unknown>
57.34 s
gammaloop-nextest-core> at <unknown source file> :<unknown line>
57.34 s
gammaloop-nextest-core> 3: <eyre[cb2fd339c0c40fca]::Report>::from_std::<vakint[eb7a1daa8ec05e1f]::VakintError> <unknown>
57.34 s
gammaloop-nextest-core> at <unknown source file> :<unknown line>
57.34 s
gammaloop-nextest-core> 4: <gammalooprs[822fc56666e1de73]::uv::approx::integrated::Integrated>::integrate::<gammalooprs[822fc56666e1de73]::uv::hedge_poset::ForestNode> <unknown>
57.34 s
gammaloop-nextest-core> at <unknown source file> :<unknown line>
57.34 s
gammaloop-nextest-core> 5: <gammalooprs[822fc56666e1de73]::uv::approx::integrated::Integrated>::run::<gammalooprs[822fc56666e1de73]::uv::hedge_poset::ForestNode, gammalooprs[822fc56666e1de73]::uv::hedge_poset::ForestNode> <unknown>
57.34 s
gammaloop-nextest-core> at <unknown source file> :<unknown line>
57.34 s
gammaloop-nextest-core> 6: <gammalooprs[822fc56666e1de73]::uv::hedge_poset::Forests>::integrate <unknown>
57.34 s
gammaloop-nextest-core> at <unknown source file> :<unknown line>
57.34 s
gammaloop-nextest-core> 7: gammalooprs[822fc56666e1de73]::uv::orchestrator::hedge_poset_renormalization_part <unknown>
57.34 s
gammaloop-nextest-core> at <unknown source file> :<unknown line>
57.34 s
gammaloop-nextest-core> 8: <gammalooprs[822fc56666e1de73]::uv::settings::UVOrchestrator>::renormalization_part <unknown>
57.34 s
gammaloop-nextest-core> at <unknown source file> :<unknown line>
57.34 s
gammaloop-nextest-core> 9: <gammalooprs[822fc56666e1de73]::processes::amplitude::AmplitudeGraph>::renormalization_part <unknown>
57.34 s
gammaloop-nextest-core> at <unknown source file> :<unknown line>
57.34 s
gammaloop-nextest-core> 10: <test_renormalization[9f554b029f822e2d]::finit_part_ghlo::{closure#0} as core[940e698046960fd5]::ops::function::FnOnce<()>>::call_once <unknown>
57.34 s
gammaloop-nextest-core> at <unknown source file> :<unknown line>
57.34 s
gammaloop-nextest-core> 11: test[75d6903177b1d7e9]::__rust_begin_short_backtrace::<core[940e698046960fd5]::result::Result<(), alloc[2ea6bcb46fca0c42]::string::String>, fn() -> core[940e698046960fd5]::result::Result<(), alloc[2ea6bcb46fca0c42]::string::String>> <unknown>
57.34 s
gammaloop-nextest-core> at <unknown source file> :<unknown line>
57.34 s
gammaloop-nextest-core> 12: test[75d6903177b1d7e9]::run_test::{closure#0} <unknown>
57.34 s
gammaloop-nextest-core> at <unknown source file> :<unknown line>
57.34 s
gammaloop-nextest-core> 13: std[bcb96dfbba0ab899]::sys::backtrace::__rust_begin_short_backtrace::<test[75d6903177b1d7e9]::run_test::{closure#1}, ()> <unknown>
57.34 s
gammaloop-nextest-core> at <unknown source file> :<unknown line>
57.34 s
gammaloop-nextest-core> 14: <std[bcb96dfbba0ab899]::thread::lifecycle::spawn_unchecked<test[75d6903177b1d7e9]::run_test::{closure#1}, ()>::{closure#1} as core[940e698046960fd5]::ops::function::FnOnce<()>>::call_once::{shim:vtable#0} <unknown>
57.34 s
gammaloop-nextest-core> at <unknown source file> :<unknown line>
57.34 s
gammaloop-nextest-core> 15: <std[bcb96dfbba0ab899]::sys::thread::unix::Thread>::new::thread_start <unknown>
57.34 s
gammaloop-nextest-core> at <unknown source file> :<unknown line>
57.34 s
gammaloop-nextest-core> 16: start_thread <unknown>
57.34 s
gammaloop-nextest-core> at <unknown source file> :<unknown line>
57.34 s
gammaloop-nextest-core> 17: __clone3 <unknown>
57.34 s
gammaloop-nextest-core> at <unknown source file> :<unknown line>
57.34 s
gammaloop-nextest-core>
57.34 s
gammaloop-nextest-core> Run with COLORBT_SHOW_HIDDEN=1 environment variable to disable frame filtering.
57.34 s
gammaloop-nextest-core> Run with RUST_BACKTRACE=full to include source snippets.
57.34 s
gammaloop-nextest-core> Location: crates/gammalooprs/tests/test_renormalization.rs :550
57.34 s
gammaloop-nextest-core>
57.34 s
gammaloop-nextest-core> ━━━━━━━━━━━━━━━━━━━━━━━━━━━━━━━━━━ BACKTRACE ━━━━━━━━━━━━━━━━━━━━━━━━━━━━━━━━━━━
57.34 s
gammaloop-nextest-core> 1: <color_eyre[5722b77bc20a64cf]::config::PanicHook>::panic_report <unknown>
57.34 s
gammaloop-nextest-core> at <unknown source file> :<unknown line>
57.34 s
gammaloop-nextest-core> 2: <color_eyre[5722b77bc20a64cf]::config::PanicHook>::into_panic_hook::{closure#0} <unknown>
57.34 s
gammaloop-nextest-core> at <unknown source file> :<unknown line>
57.34 s
gammaloop-nextest-core> 3: std[bcb96dfbba0ab899]::panicking::panic_with_hook <unknown>
57.34 s
gammaloop-nextest-core> at <unknown source file> :<unknown line>
57.34 s
gammaloop-nextest-core> 4: std[bcb96dfbba0ab899]::panicking::panic_handler::{closure#0} <unknown>
57.34 s
gammaloop-nextest-core> at <unknown source file> :<unknown line>
57.34 s
gammaloop-nextest-core> 5: std[bcb96dfbba0ab899]::sys::backtrace::__rust_end_short_backtrace::<std[bcb96dfbba0ab899]::panicking::panic_handler::{closure#0}, !> <unknown>
57.34 s
gammaloop-nextest-core> at <unknown source file> :<unknown line>
57.34 s
gammaloop-nextest-core> 6: __rustc[6c289b9f9c454d21]::rust_begin_unwind <unknown>
57.34 s
gammaloop-nextest-core> at <unknown source file> :<unknown line>
57.34 s
gammaloop-nextest-core> 7: core[940e698046960fd5]::panicking::panic_fmt <unknown>
57.34 s
gammaloop-nextest-core> at <unknown source file> :<unknown line>
57.34 s
gammaloop-nextest-core> 8: core[940e698046960fd5]::result::unwrap_failed <unknown>
57.34 s
gammaloop-nextest-core> at <unknown source file> :<unknown line>
57.34 s
gammaloop-nextest-core> 9: <test_renormalization[9f554b029f822e2d]::finit_part_ghlo::{closure#0} as core[940e698046960fd5]::ops::function::FnOnce<()>>::call_once <unknown>
57.34 s
gammaloop-nextest-core> at <unknown source file> :<unknown line>
57.34 s
gammaloop-nextest-core> 10: test[75d6903177b1d7e9]::__rust_begin_short_backtrace::<core[940e698046960fd5]::result::Result<(), alloc[2ea6bcb46fca0c42]::string::String>, fn() -> core[940e698046960fd5]::result::Result<(), alloc[2ea6bcb46fca0c42]::string::String>> <unknown>
57.34 s
gammaloop-nextest-core> at <unknown source file> :<unknown line>
57.34 s
gammaloop-nextest-core> 11: test[75d6903177b1d7e9]::run_test::{closure#0} <unknown>
57.34 s
gammaloop-nextest-core> at <unknown source file> :<unknown line>
57.34 s
gammaloop-nextest-core> 12: std[bcb96dfbba0ab899]::sys::backtrace::__rust_begin_short_backtrace::<test[75d6903177b1d7e9]::run_test::{closure#1}, ()> <unknown>
57.34 s
gammaloop-nextest-core> at <unknown source file> :<unknown line>
57.34 s
gammaloop-nextest-core> 13: <std[bcb96dfbba0ab899]::thread::lifecycle::spawn_unchecked<test[75d6903177b1d7e9]::run_test::{closure#1}, ()>::{closure#1} as core[940e698046960fd5]::ops::function::FnOnce<()>>::call_once::{shim:vtable#0} <unknown>
57.34 s
gammaloop-nextest-core> at <unknown source file> :<unknown line>
57.34 s
gammaloop-nextest-core> 14: <std[bcb96dfbba0ab899]::sys::thread::unix::Thread>::new::thread_start <unknown>
57.34 s
gammaloop-nextest-core> at <unknown source file> :<unknown line>
57.34 s
gammaloop-nextest-core> 15: start_thread <unknown>
57.34 s
gammaloop-nextest-core> at <unknown source file> :<unknown line>
57.34 s
gammaloop-nextest-core> 16: __clone3 <unknown>
57.34 s
gammaloop-nextest-core> at <unknown source file> :<unknown line>
57.34 s
gammaloop-nextest-core>
57.34 s
gammaloop-nextest-core> Run with COLORBT_SHOW_HIDDEN=1 environment variable to disable frame filtering.
57.34 s
gammaloop-nextest-core> Run with RUST_BACKTRACE=full to include source snippets.
57.34 s
gammaloop-nextest-core>
57.37 s
gammaloop-nextest-core> FAIL [ 0.119s] (442/456) gammalooprs::test_renormalization finite_part_quark_lo
57.37 s
gammaloop-nextest-core> stdout ---
57.37 s
gammaloop-nextest-core>
57.37 s
gammaloop-nextest-core> running 1 test
57.37 s
gammaloop-nextest-core> test finite_part_quark_lo ... FAILED
57.37 s
gammaloop-nextest-core>
57.37 s
gammaloop-nextest-core> failures:
57.37 s
gammaloop-nextest-core>
57.37 s
gammaloop-nextest-core> failures:
57.37 s
gammaloop-nextest-core> finite_part_quark_lo
57.37 s
gammaloop-nextest-core>
57.37 s
gammaloop-nextest-core> test result: FAILED. 0 passed; 1 failed; 0 ignored; 0 measured; 5 filtered out; finished in 0.11s
57.37 s
gammaloop-nextest-core>
57.37 s
gammaloop-nextest-core> stderr ---
57.37 s
gammaloop-nextest-core> The application panicked (crashed).
57.37 s
gammaloop-nextest-core> Message: called `Result::unwrap()` on an `Err` value: "Symbol spenso::mink redefined with new attributes:\n\t- new user data specified: List([String(\"spenso::representation-v2\"), String(\"inline-metric\"), List([String(\"symbol\"), String(\"mink\")]), List([String(\"cyclic\"), Integer(1), List([List([String(\"symbol\"), String(\"mu\")]), List([String(\"symbol\"), String(\"nu\")]), List([String(\"symbol\"), String(\"rho\")]), List([String(\"symbol\"), String(\"sigma\")])])]), String(\"top\")]) vs None\n"
57.37 s
gammaloop-nextest-core> Location: crates/vakint/src/lib.rs :4766
57.37 s
gammaloop-nextest-core>
57.37 s
gammaloop-nextest-core> ━━━━━━━━━━━━━━━━━━━━━━━━━━━━━━━━━━ BACKTRACE ━━━━━━━━━━━━━━━━━━━━━━━━━━━━━━━━━━━
57.37 s
gammaloop-nextest-core> 1: <color_eyre[5722b77bc20a64cf]::config::PanicHook>::panic_report <unknown>
57.37 s
gammaloop-nextest-core> at <unknown source file> :<unknown line>
57.37 s
gammaloop-nextest-core> 2: <color_eyre[5722b77bc20a64cf]::config::PanicHook>::into_panic_hook::{closure#0} <unknown>
57.37 s
gammaloop-nextest-core> at <unknown source file> :<unknown line>
57.37 s
gammaloop-nextest-core> 3: std[bcb96dfbba0ab899]::panicking::panic_with_hook <unknown>
57.37 s
gammaloop-nextest-core> at <unknown source file> :<unknown line>
57.37 s
gammaloop-nextest-core> 4: std[bcb96dfbba0ab899]::panicking::panic_handler::{closure#0} <unknown>
57.37 s
gammaloop-nextest-core> at <unknown source file> :<unknown line>
57.37 s
gammaloop-nextest-core> 5: std[bcb96dfbba0ab899]::sys::backtrace::__rust_end_short_backtrace::<std[bcb96dfbba0ab899]::panicking::panic_handler::{closure#0}, !> <unknown>
57.37 s
gammaloop-nextest-core> at <unknown source file> :<unknown line>
57.37 s
gammaloop-nextest-core> 6: __rustc[6c289b9f9c454d21]::rust_begin_unwind <unknown>
57.37 s
gammaloop-nextest-core> at <unknown source file> :<unknown line>
57.37 s
gammaloop-nextest-core> 7: core[940e698046960fd5]::panicking::panic_fmt <unknown>
57.37 s
gammaloop-nextest-core> at <unknown source file> :<unknown line>
57.37 s
gammaloop-nextest-core> 8: core[940e698046960fd5]::result::unwrap_failed <unknown>
57.37 s
gammaloop-nextest-core> at <unknown source file> :<unknown line>
57.37 s
gammaloop-nextest-core> 9: <vakint[eb7a1daa8ec05e1f]::Vakint>::sanitize_user_expressions <unknown>
57.37 s
gammaloop-nextest-core> at <unknown source file> :<unknown line>
57.37 s
gammaloop-nextest-core> 10: <vakint[eb7a1daa8ec05e1f]::Vakint>::prepare_expression_for_form <unknown>
57.37 s
gammaloop-nextest-core> at <unknown source file> :<unknown line>
57.37 s
gammaloop-nextest-core> 11: <vakint[eb7a1daa8ec05e1f]::VakintTerm>::tensor_reduce <unknown>
57.37 s
gammaloop-nextest-core> at <unknown source file> :<unknown line>
57.37 s
gammaloop-nextest-core> 12: <vakint[eb7a1daa8ec05e1f]::VakintExpression>::tensor_reduce <unknown>
57.37 s
gammaloop-nextest-core> at <unknown source file> :<unknown line>
57.37 s
gammaloop-nextest-core> 13: <gammalooprs[822fc56666e1de73]::uv::approx::integrated::Integrated>::integrate::<gammalooprs[822fc56666e1de73]::uv::hedge_poset::ForestNode> <unknown>
57.37 s
gammaloop-nextest-core> at <unknown source file> :<unknown line>
57.37 s
gammaloop-nextest-core> 14: <gammalooprs[822fc56666e1de73]::uv::approx::integrated::Integrated>::run::<gammalooprs[822fc56666e1de73]::uv::hedge_poset::ForestNode, gammalooprs[822fc56666e1de73]::uv::hedge_poset::ForestNode> <unknown>
57.37 s
gammaloop-nextest-core> at <unknown source file> :<unknown line>
57.37 s
gammaloop-nextest-core> 15: <gammalooprs[822fc56666e1de73]::uv::hedge_poset::Forests>::integrate <unknown>
57.37 s
gammaloop-nextest-core> at <unknown source file> :<unknown line>
57.37 s
gammaloop-nextest-core> 16: gammalooprs[822fc56666e1de73]::uv::orchestrator::hedge_poset_renormalization_part <unknown>
57.37 s
gammaloop-nextest-core> at <unknown source file> :<unknown line>
57.37 s
gammaloop-nextest-core> 17: <gammalooprs[822fc56666e1de73]::uv::settings::UVOrchestrator>::renormalization_part <unknown>
57.37 s
gammaloop-nextest-core> at <unknown source file> :<unknown line>
57.37 s
gammaloop-nextest-core> 18: <gammalooprs[822fc56666e1de73]::processes::amplitude::AmplitudeGraph>::renormalization_part <unknown>
57.37 s
gammaloop-nextest-core> at <unknown source file> :<unknown line>
57.37 s
gammaloop-nextest-core> 19: <test_renormalization[9f554b029f822e2d]::finite_part_quark_lo::{closure#0} as core[940e698046960fd5]::ops::function::FnOnce<()>>::call_once <unknown>
57.37 s
gammaloop-nextest-core> at <unknown source file> :<unknown line>
57.37 s
gammaloop-nextest-core> 20: test[75d6903177b1d7e9]::__rust_begin_short_backtrace::<core[940e698046960fd5]::result::Result<(), alloc[2ea6bcb46fca0c42]::string::String>, fn() -> core[940e698046960fd5]::result::Result<(), alloc[2ea6bcb46fca0c42]::string::String>> <unknown>
57.37 s
gammaloop-nextest-core> at <unknown source file> :<unknown line>
57.37 s
gammaloop-nextest-core> 21: test[75d6903177b1d7e9]::run_test::{closure#0} <unknown>
57.37 s
gammaloop-nextest-core> at <unknown source file> :<unknown line>
57.37 s
gammaloop-nextest-core> 22: std[bcb96dfbba0ab899]::sys::backtrace::__rust_begin_short_backtrace::<test[75d6903177b1d7e9]::run_test::{closure#1}, ()> <unknown>
57.37 s
gammaloop-nextest-core> at <unknown source file> :<unknown line>
57.37 s
gammaloop-nextest-core> 23: <std[bcb96dfbba0ab899]::thread::lifecycle::spawn_unchecked<test[75d6903177b1d7e9]::run_test::{closure#1}, ()>::{closure#1} as core[940e698046960fd5]::ops::function::FnOnce<()>>::call_once::{shim:vtable#0} <unknown>
57.37 s
gammaloop-nextest-core> at <unknown source file> :<unknown line>
57.37 s
gammaloop-nextest-core> 24: <std[bcb96dfbba0ab899]::sys::thread::unix::Thread>::new::thread_start <unknown>
57.37 s
gammaloop-nextest-core> at <unknown source file> :<unknown line>
57.37 s
gammaloop-nextest-core> 25: start_thread <unknown>
57.37 s
gammaloop-nextest-core> at <unknown source file> :<unknown line>
57.37 s
gammaloop-nextest-core> 26: __clone3 <unknown>
57.37 s
gammaloop-nextest-core> at <unknown source file> :<unknown line>
57.37 s
gammaloop-nextest-core>
57.37 s
gammaloop-nextest-core> Run with COLORBT_SHOW_HIDDEN=1 environment variable to disable frame filtering.
57.37 s
gammaloop-nextest-core> Run with RUST_BACKTRACE=full to include source snippets.
57.37 s
gammaloop-nextest-core>
57.42 s
gammaloop-nextest-core> FAIL [ 0.201s] (445/456) gammalooprs::test_renormalization finite_part_ghost_2loop
57.42 s
gammaloop-nextest-core> stdout ---
57.42 s
gammaloop-nextest-core>
57.42 s
gammaloop-nextest-core> running 1 test
57.42 s
gammaloop-nextest-core> test finite_part_ghost_2loop ... FAILED
57.42 s
gammaloop-nextest-core>
57.42 s
gammaloop-nextest-core> failures:
57.42 s
gammaloop-nextest-core>
57.42 s
gammaloop-nextest-core> failures:
57.42 s
gammaloop-nextest-core> finite_part_ghost_2loop
57.42 s
gammaloop-nextest-core>
57.42 s
gammaloop-nextest-core> test result: FAILED. 0 passed; 1 failed; 0 ignored; 0 measured; 5 filtered out; finished in 0.19s
57.42 s
gammaloop-nextest-core>
57.42 s
gammaloop-nextest-core> stderr ---
57.42 s
gammaloop-nextest-core> The application panicked (crashed).
57.42 s
gammaloop-nextest-core> Message: called `Result::unwrap()` on an `Err` value: "Symbol spenso::mink redefined with new attributes:\n\t- new user data specified: List([String(\"spenso::representation-v2\"), String(\"inline-metric\"), List([String(\"symbol\"), String(\"mink\")]), List([String(\"cyclic\"), Integer(1), List([List([String(\"symbol\"), String(\"mu\")]), List([String(\"symbol\"), String(\"nu\")]), List([String(\"symbol\"), String(\"rho\")]), List([String(\"symbol\"), String(\"sigma\")])])]), String(\"top\")]) vs None\n"
57.42 s
gammaloop-nextest-core> Location: crates/vakint/src/lib.rs :4766
57.42 s
gammaloop-nextest-core>
57.42 s
gammaloop-nextest-core> ━━━━━━━━━━━━━━━━━━━━━━━━━━━━━━━━━━ BACKTRACE ━━━━━━━━━━━━━━━━━━━━━━━━━━━━━━━━━━━
57.42 s
gammaloop-nextest-core> 1: <color_eyre[5722b77bc20a64cf]::config::PanicHook>::panic_report <unknown>
57.42 s
gammaloop-nextest-core> at <unknown source file> :<unknown line>
57.42 s
gammaloop-nextest-core> 2: <color_eyre[5722b77bc20a64cf]::config::PanicHook>::into_panic_hook::{closure#0} <unknown>
57.42 s
gammaloop-nextest-core> at <unknown source file> :<unknown line>
57.42 s
gammaloop-nextest-core> 3: std[bcb96dfbba0ab899]::panicking::panic_with_hook <unknown>
57.42 s
gammaloop-nextest-core> at <unknown source file> :<unknown line>
57.42 s
gammaloop-nextest-core> 4: std[bcb96dfbba0ab899]::panicking::panic_handler::{closure#0} <unknown>
57.42 s
gammaloop-nextest-core> at <unknown source file> :<unknown line>
57.42 s
gammaloop-nextest-core> 5: std[bcb96dfbba0ab899]::sys::backtrace::__rust_end_short_backtrace::<std[bcb96dfbba0ab899]::panicking::panic_handler::{closure#0}, !> <unknown>
57.42 s
gammaloop-nextest-core> at <unknown source file> :<unknown line>
57.42 s
gammaloop-nextest-core> 6: __rustc[6c289b9f9c454d21]::rust_begin_unwind <unknown>
57.42 s
gammaloop-nextest-core> at <unknown source file> :<unknown line>
57.42 s
gammaloop-nextest-core> 7: core[940e698046960fd5]::panicking::panic_fmt <unknown>
57.42 s
gammaloop-nextest-core> at <unknown source file> :<unknown line>
57.42 s
gammaloop-nextest-core> 8: core[940e698046960fd5]::result::unwrap_failed <unknown>
57.42 s
gammaloop-nextest-core> at <unknown source file> :<unknown line>
57.42 s
gammaloop-nextest-core> 9: <vakint[eb7a1daa8ec05e1f]::Vakint>::sanitize_user_expressions <unknown>
57.42 s
gammaloop-nextest-core> at <unknown source file> :<unknown line>
57.42 s
gammaloop-nextest-core> 10: <vakint[eb7a1daa8ec05e1f]::Vakint>::prepare_expression_for_form <unknown>
57.42 s
gammaloop-nextest-core> at <unknown source file> :<unknown line>
57.42 s
gammaloop-nextest-core> 11: <vakint[eb7a1daa8ec05e1f]::VakintTerm>::tensor_reduce <unknown>
57.42 s
gammaloop-nextest-core> at <unknown source file> :<unknown line>
57.42 s
gammaloop-nextest-core> 12: <vakint[eb7a1daa8ec05e1f]::VakintExpression>::tensor_reduce <unknown>
57.42 s
gammaloop-nextest-core> at <unknown source file> :<unknown line>
57.42 s
gammaloop-nextest-core> 13: <gammalooprs[822fc56666e1de73]::uv::approx::integrated::Integrated>::integrate::<gammalooprs[822fc56666e1de73]::uv::approx::Approximation> <unknown>
57.42 s
gammaloop-nextest-core> at <unknown source file> :<unknown line>
57.42 s
gammaloop-nextest-core> 14: <gammalooprs[822fc56666e1de73]::uv::approx::integrated::Integrated>::run::<gammalooprs[822fc56666e1de73]::uv::approx::Approximation, gammalooprs[822fc56666e1de73]::uv::approx::Approximation> <unknown>
57.42 s
gammaloop-nextest-core> at <unknown source file> :<unknown line>
57.42 s
gammaloop-nextest-core> 15: <gammalooprs[822fc56666e1de73]::uv::forest::Forest>::compute <unknown>
57.42 s
gammaloop-nextest-core> at <unknown source file> :<unknown line>
57.42 s
gammaloop-nextest-core> 16: gammalooprs[822fc56666e1de73]::uv::orchestrator::legacy_renormalization_part <unknown>
57.42 s
gammaloop-nextest-core> at <unknown source file> :<unknown line>
57.42 s
gammaloop-nextest-core> 17: <gammalooprs[822fc56666e1de73]::uv::settings::UVOrchestrator>::renormalization_part <unknown>
57.42 s
gammaloop-nextest-core> at <unknown source file> :<unknown line>
57.42 s
gammaloop-nextest-core> 18: <gammalooprs[822fc56666e1de73]::processes::amplitude::AmplitudeGraph>::renormalization_part <unknown>
57.42 s
gammaloop-nextest-core> at <unknown source file> :<unknown line>
57.42 s
gammaloop-nextest-core> 19: test_renormalization[9f554b029f822e2d]::finite_part_ghost_2loop <unknown>
57.42 s
gammaloop-nextest-core> at <unknown source file> :<unknown line>
57.42 s
gammaloop-nextest-core> 20: <test_renormalization[9f554b029f822e2d]::finite_part_ghost_2loop::{closure#0} as core[940e698046960fd5]::ops::function::FnOnce<()>>::call_once <unknown>
57.42 s
gammaloop-nextest-core> at <unknown source file> :<unknown line>
57.42 s
gammaloop-nextest-core> 21: test[75d6903177b1d7e9]::__rust_begin_short_backtrace::<core[940e698046960fd5]::result::Result<(), alloc[2ea6bcb46fca0c42]::string::String>, fn() -> core[940e698046960fd5]::result::Result<(), alloc[2ea6bcb46fca0c42]::string::String>> <unknown>
57.42 s
gammaloop-nextest-core> at <unknown source file> :<unknown line>
57.42 s
gammaloop-nextest-core> 22: test[75d6903177b1d7e9]::run_test::{closure#0} <unknown>
57.42 s
gammaloop-nextest-core> at <unknown source file> :<unknown line>
57.42 s
gammaloop-nextest-core> 23: std[bcb96dfbba0ab899]::sys::backtrace::__rust_begin_short_backtrace::<test[75d6903177b1d7e9]::run_test::{closure#1}, ()> <unknown>
57.42 s
gammaloop-nextest-core> at <unknown source file> :<unknown line>
57.42 s
gammaloop-nextest-core> 24: <std[bcb96dfbba0ab899]::thread::lifecycle::spawn_unchecked<test[75d6903177b1d7e9]::run_test::{closure#1}, ()>::{closure#1} as core[940e698046960fd5]::ops::function::FnOnce<()>>::call_once::{shim:vtable#0} <unknown>
57.42 s
gammaloop-nextest-core> at <unknown source file> :<unknown line>
57.42 s
gammaloop-nextest-core> 25: <std[bcb96dfbba0ab899]::sys::thread::unix::Thread>::new::thread_start <unknown>
57.42 s
gammaloop-nextest-core> at <unknown source file> :<unknown line>
57.42 s
gammaloop-nextest-core> 26: start_thread <unknown>
57.42 s
gammaloop-nextest-core> at <unknown source file> :<unknown line>
57.42 s
gammaloop-nextest-core> 27: __clone3 <unknown>
57.42 s
gammaloop-nextest-core> at <unknown source file> :<unknown line>
57.42 s
gammaloop-nextest-core>
57.42 s
gammaloop-nextest-core> Run with COLORBT_SHOW_HIDDEN=1 environment variable to disable frame filtering.
57.42 s
gammaloop-nextest-core> Run with RUST_BACKTRACE=full to include source snippets.
57.42 s
gammaloop-nextest-core>
64.17 s
gammaloop-nextest-core> ------------
64.17 s
gammaloop-nextest-core> Summary [ 7.733s] 456 tests run: 453 passed , 3 failed , 61 skipped
64.17 s
gammaloop-nextest-core> FAIL [ 0.129s] (441/456) gammalooprs::test_renormalization finit_part_ghlo
64.17 s
gammaloop-nextest-core> stdout ---
64.17 s
gammaloop-nextest-core>
64.17 s
gammaloop-nextest-core> running 1 test
64.17 s
gammaloop-nextest-core> test finit_part_ghlo ... FAILED
64.17 s
gammaloop-nextest-core>
64.17 s
gammaloop-nextest-core> failures:
64.17 s
gammaloop-nextest-core>
64.17 s
gammaloop-nextest-core> failures:
64.17 s
gammaloop-nextest-core> finit_part_ghlo
64.17 s
gammaloop-nextest-core>
64.17 s
gammaloop-nextest-core> test result: FAILED. 0 passed; 1 failed; 0 ignored; 0 measured; 5 filtered out; finished in 0.12s
64.17 s
gammaloop-nextest-core>
64.17 s
gammaloop-nextest-core> stderr ---
64.17 s
gammaloop-nextest-core> The application panicked (crashed).
64.17 s
gammaloop-nextest-core> Message: called `Result::unwrap()` on an `Err` value:
64.17 s
gammaloop-nextest-core> 0: Symbolica could not parse FORM output:
64.17 s
gammaloop-nextest-core> [spenso::{antisymmetric,real,spenso::tensor}::f]([spenso::{spenso::representat\
64.17 s
gammaloop-nextest-core> ion,spenso::self_dual}::coad](8,[gammalooprs::{spenso::index}::hedge](0)
64.17 s
gammaloop-nextest-core> ),[spenso::{spenso::representation,spenso::self_dual}::coad](8,[gammaloo\
64.17 s
gammaloop-nextest-core> prs::{spenso::index}::hedge](3)),[spenso::{spenso::representation,spenso\
64.17 s
gammaloop-nextest-core> ::self_dual}::coad](8,[gammalooprs::{spenso::index}::hedge](5)))*
64.17 s
gammaloop-nextest-core> [spenso::{antisymmetric,real,spenso::tensor}::f]([spenso::{spenso::repre\
64.17 s
gammaloop-nextest-core> sentation,spenso::self_dual}::coad](8,[gammalooprs::{spenso::index}::hed\
64.17 s
gammaloop-nextest-core> ge](1)),[spenso::{spenso::representation,spenso::self_dual}::coad](8,
64.17 s
gammaloop-nextest-core> [gammalooprs::{spenso::index}::hedge](3)),[spenso::{spenso::representati\
64.17 s
gammaloop-nextest-core> on,spenso::self_dual}::coad](8,[gammalooprs::{spenso::index}::hedge](5))
64.17 s
gammaloop-nextest-core> )*dot(p1,p0)*[UFO::{}::GC_10]^2*rat(-1,1)
64.17 s
gammaloop-nextest-core>
64.17 s
gammaloop-nextest-core> Error:Symbol spenso::coad redefined with new attributes:
64.17 s
gammaloop-nextest-core> - new user data specified: List([String("spenso::representation-v2"), String("self-dual"), List([String("symbol"), String("coad")]), List([String("cyclic"), Integer(1), List([List([String("symbol"), String("a")]), List([String("symbol"), String("b")]), List([String("symbol"), String("c")]), List([String("symbol"), String("d")])])]), String("top")]) vs None
64.17 s
gammaloop-nextest-core>
64.17 s
gammaloop-nextest-core>
64.17 s
gammaloop-nextest-core> Location:
64.17 s
gammaloop-nextest-core> crates/gammalooprs/src/uv/approx/integrated.rs :332
64.17 s
gammaloop-nextest-core>
64.17 s
gammaloop-nextest-core> ━━━━━━━━━━━━━━━━━━━━━━━━━━━━━━━━━━ BACKTRACE ━━━━━━━━━━━━━━━━━━━━━━━━━━━━━━━━━━━
64.17 s
gammaloop-nextest-core> 1: <color_eyre[5722b77bc20a64cf]::config::EyreHook>::into_eyre_hook::{closure#0} <unknown>
64.17 s
gammaloop-nextest-core> at <unknown source file> :<unknown line>
64.17 s
gammaloop-nextest-core> 2: eyre[cb2fd339c0c40fca]::capture_handler <unknown>
64.17 s
gammaloop-nextest-core> at <unknown source file> :<unknown line>
64.17 s
gammaloop-nextest-core> 3: <eyre[cb2fd339c0c40fca]::Report>::from_std::<vakint[eb7a1daa8ec05e1f]::VakintError> <unknown>
64.17 s
gammaloop-nextest-core> at <unknown source file> :<unknown line>
64.17 s
gammaloop-nextest-core> 4: <gammalooprs[822fc56666e1de73]::uv::approx::integrated::Integrated>::integrate::<gammalooprs[822fc56666e1de73]::uv::hedge_poset::ForestNode> <unknown>
64.17 s
gammaloop-nextest-core> at <unknown source file> :<unknown line>
64.17 s
gammaloop-nextest-core> 5: <gammalooprs[822fc56666e1de73]::uv::approx::integrated::Integrated>::run::<gammalooprs[822fc56666e1de73]::uv::hedge_poset::ForestNode, gammalooprs[822fc56666e1de73]::uv::hedge_poset::ForestNode> <unknown>
64.17 s
gammaloop-nextest-core> at <unknown source file> :<unknown line>
64.17 s
gammaloop-nextest-core> 6: <gammalooprs[822fc56666e1de73]::uv::hedge_poset::Forests>::integrate <unknown>
64.17 s
gammaloop-nextest-core> at <unknown source file> :<unknown line>
64.17 s
gammaloop-nextest-core> 7: gammalooprs[822fc56666e1de73]::uv::orchestrator::hedge_poset_renormalization_part <unknown>
64.17 s
gammaloop-nextest-core> at <unknown source file> :<unknown line>
64.17 s
gammaloop-nextest-core> 8: <gammalooprs[822fc56666e1de73]::uv::settings::UVOrchestrator>::renormalization_part <unknown>
64.17 s
gammaloop-nextest-core> at <unknown source file> :<unknown line>
64.17 s
gammaloop-nextest-core> 9: <gammalooprs[822fc56666e1de73]::processes::amplitude::AmplitudeGraph>::renormalization_part <unknown>
64.17 s
gammaloop-nextest-core> at <unknown source file> :<unknown line>
64.17 s
gammaloop-nextest-core> 10: <test_renormalization[9f554b029f822e2d]::finit_part_ghlo::{closure#0} as core[940e698046960fd5]::ops::function::FnOnce<()>>::call_once <unknown>
64.17 s
gammaloop-nextest-core> at <unknown source file> :<unknown line>
64.17 s
gammaloop-nextest-core> 11: test[75d6903177b1d7e9]::__rust_begin_short_backtrace::<core[940e698046960fd5]::result::Result<(), alloc[2ea6bcb46fca0c42]::string::String>, fn() -> core[940e698046960fd5]::result::Result<(), alloc[2ea6bcb46fca0c42]::string::String>> <unknown>
64.17 s
gammaloop-nextest-core> at <unknown source file> :<unknown line>
64.17 s
gammaloop-nextest-core> 12: test[75d6903177b1d7e9]::run_test::{closure#0} <unknown>
64.17 s
gammaloop-nextest-core> at <unknown source file> :<unknown line>
64.17 s
gammaloop-nextest-core> 13: std[bcb96dfbba0ab899]::sys::backtrace::__rust_begin_short_backtrace::<test[75d6903177b1d7e9]::run_test::{closure#1}, ()> <unknown>
64.17 s
gammaloop-nextest-core> at <unknown source file> :<unknown line>
64.17 s
gammaloop-nextest-core> 14: <std[bcb96dfbba0ab899]::thread::lifecycle::spawn_unchecked<test[75d6903177b1d7e9]::run_test::{closure#1}, ()>::{closure#1} as core[940e698046960fd5]::ops::function::FnOnce<()>>::call_once::{shim:vtable#0} <unknown>
64.17 s
gammaloop-nextest-core> at <unknown source file> :<unknown line>
64.17 s
gammaloop-nextest-core> 15: <std[bcb96dfbba0ab899]::sys::thread::unix::Thread>::new::thread_start <unknown>
64.17 s
gammaloop-nextest-core> at <unknown source file> :<unknown line>
64.17 s
gammaloop-nextest-core> 16: start_thread <unknown>
64.17 s
gammaloop-nextest-core> at <unknown source file> :<unknown line>
64.17 s
gammaloop-nextest-core> 17: __clone3 <unknown>
64.17 s
gammaloop-nextest-core> at <unknown source file> :<unknown line>
64.17 s
gammaloop-nextest-core>
64.17 s
gammaloop-nextest-core> Run with COLORBT_SHOW_HIDDEN=1 environment variable to disable frame filtering.
64.17 s
gammaloop-nextest-core> Run with RUST_BACKTRACE=full to include source snippets.
64.17 s
gammaloop-nextest-core> Location: crates/gammalooprs/tests/test_renormalization.rs :550
64.17 s
gammaloop-nextest-core>
64.17 s
gammaloop-nextest-core> ━━━━━━━━━━━━━━━━━━━━━━━━━━━━━━━━━━ BACKTRACE ━━━━━━━━━━━━━━━━━━━━━━━━━━━━━━━━━━━
64.17 s
gammaloop-nextest-core> 1: <color_eyre[5722b77bc20a64cf]::config::PanicHook>::panic_report <unknown>
64.17 s
gammaloop-nextest-core> at <unknown source file> :<unknown line>
64.17 s
gammaloop-nextest-core> 2: <color_eyre[5722b77bc20a64cf]::config::PanicHook>::into_panic_hook::{closure#0} <unknown>
64.17 s
gammaloop-nextest-core> at <unknown source file> :<unknown line>
64.17 s
gammaloop-nextest-core> 3: std[bcb96dfbba0ab899]::panicking::panic_with_hook <unknown>
64.17 s
gammaloop-nextest-core> at <unknown source file> :<unknown line>
64.17 s
gammaloop-nextest-core> 4: std[bcb96dfbba0ab899]::panicking::panic_handler::{closure#0} <unknown>
64.17 s
gammaloop-nextest-core> at <unknown source file> :<unknown line>
64.17 s
gammaloop-nextest-core> 5: std[bcb96dfbba0ab899]::sys::backtrace::__rust_end_short_backtrace::<std[bcb96dfbba0ab899]::panicking::panic_handler::{closure#0}, !> <unknown>
64.17 s
gammaloop-nextest-core> at <unknown source file> :<unknown line>
64.17 s
gammaloop-nextest-core> 6: __rustc[6c289b9f9c454d21]::rust_begin_unwind <unknown>
64.17 s
gammaloop-nextest-core> at <unknown source file> :<unknown line>
64.17 s
gammaloop-nextest-core> 7: core[940e698046960fd5]::panicking::panic_fmt <unknown>
64.17 s
gammaloop-nextest-core> at <unknown source file> :<unknown line>
64.17 s
gammaloop-nextest-core> 8: core[940e698046960fd5]::result::unwrap_failed <unknown>
64.17 s
gammaloop-nextest-core> at <unknown source file> :<unknown line>
64.17 s
gammaloop-nextest-core> 9: <test_renormalization[9f554b029f822e2d]::finit_part_ghlo::{closure#0} as core[940e698046960fd5]::ops::function::FnOnce<()>>::call_once <unknown>
64.17 s
gammaloop-nextest-core> at <unknown source file> :<unknown line>
64.17 s
gammaloop-nextest-core> 10: test[75d6903177b1d7e9]::__rust_begin_short_backtrace::<core[940e698046960fd5]::result::Result<(), alloc[2ea6bcb46fca0c42]::string::String>, fn() -> core[940e698046960fd5]::result::Result<(), alloc[2ea6bcb46fca0c42]::string::String>> <unknown>
64.17 s
gammaloop-nextest-core> at <unknown source file> :<unknown line>
64.17 s
gammaloop-nextest-core> 11: test[75d6903177b1d7e9]::run_test::{closure#0} <unknown>
64.17 s
gammaloop-nextest-core> at <unknown source file> :<unknown line>
64.17 s
gammaloop-nextest-core> 12: std[bcb96dfbba0ab899]::sys::backtrace::__rust_begin_short_backtrace::<test[75d6903177b1d7e9]::run_test::{closure#1}, ()> <unknown>
64.17 s
gammaloop-nextest-core> at <unknown source file> :<unknown line>
64.17 s
gammaloop-nextest-core> 13: <std[bcb96dfbba0ab899]::thread::lifecycle::spawn_unchecked<test[75d6903177b1d7e9]::run_test::{closure#1}, ()>::{closure#1} as core[940e698046960fd5]::ops::function::FnOnce<()>>::call_once::{shim:vtable#0} <unknown>
64.17 s
gammaloop-nextest-core> at <unknown source file> :<unknown line>
64.17 s
gammaloop-nextest-core> 14: <std[bcb96dfbba0ab899]::sys::thread::unix::Thread>::new::thread_start <unknown>
64.17 s
gammaloop-nextest-core> at <unknown source file> :<unknown line>
64.17 s
gammaloop-nextest-core> 15: start_thread <unknown>
64.17 s
gammaloop-nextest-core> at <unknown source file> :<unknown line>
64.17 s
gammaloop-nextest-core> 16: __clone3 <unknown>
64.17 s
gammaloop-nextest-core> at <unknown source file> :<unknown line>
64.17 s
gammaloop-nextest-core>
64.17 s
gammaloop-nextest-core> Run with COLORBT_SHOW_HIDDEN=1 environment variable to disable frame filtering.
64.17 s
gammaloop-nextest-core> Run with RUST_BACKTRACE=full to include source snippets.
64.17 s
gammaloop-nextest-core>
64.17 s
gammaloop-nextest-core> FAIL [ 0.119s] (442/456) gammalooprs::test_renormalization finite_part_quark_lo
64.17 s
gammaloop-nextest-core> stdout ---
64.17 s
gammaloop-nextest-core>
64.17 s
gammaloop-nextest-core> running 1 test
64.17 s
gammaloop-nextest-core> test finite_part_quark_lo ... FAILED
64.17 s
gammaloop-nextest-core>
64.17 s
gammaloop-nextest-core> failures:
64.17 s
gammaloop-nextest-core>
64.17 s
gammaloop-nextest-core> failures:
64.17 s
gammaloop-nextest-core> finite_part_quark_lo
64.17 s
gammaloop-nextest-core>
64.17 s
gammaloop-nextest-core> test result: FAILED. 0 passed; 1 failed; 0 ignored; 0 measured; 5 filtered out; finished in 0.11s
64.17 s
gammaloop-nextest-core>
64.17 s
gammaloop-nextest-core> stderr ---
64.17 s
gammaloop-nextest-core> The application panicked (crashed).
64.17 s
gammaloop-nextest-core> Message: called `Result::unwrap()` on an `Err` value: "Symbol spenso::mink redefined with new attributes:\n\t- new user data specified: List([String(\"spenso::representation-v2\"), String(\"inline-metric\"), List([String(\"symbol\"), String(\"mink\")]), List([String(\"cyclic\"), Integer(1), List([List([String(\"symbol\"), String(\"mu\")]), List([String(\"symbol\"), String(\"nu\")]), List([String(\"symbol\"), String(\"rho\")]), List([String(\"symbol\"), String(\"sigma\")])])]), String(\"top\")]) vs None\n"
64.17 s
gammaloop-nextest-core> Location: crates/vakint/src/lib.rs :4766
64.17 s
gammaloop-nextest-core>
64.17 s
gammaloop-nextest-core> ━━━━━━━━━━━━━━━━━━━━━━━━━━━━━━━━━━ BACKTRACE ━━━━━━━━━━━━━━━━━━━━━━━━━━━━━━━━━━━
64.17 s
gammaloop-nextest-core> 1: <color_eyre[5722b77bc20a64cf]::config::PanicHook>::panic_report <unknown>
64.17 s
gammaloop-nextest-core> at <unknown source file> :<unknown line>
64.17 s
gammaloop-nextest-core> 2: <color_eyre[5722b77bc20a64cf]::config::PanicHook>::into_panic_hook::{closure#0} <unknown>
64.17 s
gammaloop-nextest-core> at <unknown source file> :<unknown line>
64.17 s
gammaloop-nextest-core> 3: std[bcb96dfbba0ab899]::panicking::panic_with_hook <unknown>
64.17 s
gammaloop-nextest-core> at <unknown source file> :<unknown line>
64.17 s
gammaloop-nextest-core> 4: std[bcb96dfbba0ab899]::panicking::panic_handler::{closure#0} <unknown>
64.17 s
gammaloop-nextest-core> at <unknown source file> :<unknown line>
64.17 s
gammaloop-nextest-core> 5: std[bcb96dfbba0ab899]::sys::backtrace::__rust_end_short_backtrace::<std[bcb96dfbba0ab899]::panicking::panic_handler::{closure#0}, !> <unknown>
64.17 s
gammaloop-nextest-core> at <unknown source file> :<unknown line>
64.17 s
gammaloop-nextest-core> 6: __rustc[6c289b9f9c454d21]::rust_begin_unwind <unknown>
64.17 s
gammaloop-nextest-core> at <unknown source file> :<unknown line>
64.17 s
gammaloop-nextest-core> 7: core[940e698046960fd5]::panicking::panic_fmt <unknown>
64.17 s
gammaloop-nextest-core> at <unknown source file> :<unknown line>
64.17 s
gammaloop-nextest-core> 8: core[940e698046960fd5]::result::unwrap_failed <unknown>
64.17 s
gammaloop-nextest-core> at <unknown source file> :<unknown line>
64.17 s
gammaloop-nextest-core> 9: <vakint[eb7a1daa8ec05e1f]::Vakint>::sanitize_user_expressions <unknown>
64.17 s
gammaloop-nextest-core> at <unknown source file> :<unknown line>
64.17 s
gammaloop-nextest-core> 10: <vakint[eb7a1daa8ec05e1f]::Vakint>::prepare_expression_for_form <unknown>
64.17 s
gammaloop-nextest-core> at <unknown source file> :<unknown line>
64.17 s
gammaloop-nextest-core> 11: <vakint[eb7a1daa8ec05e1f]::VakintTerm>::tensor_reduce <unknown>
64.17 s
gammaloop-nextest-core> at <unknown source file> :<unknown line>
64.17 s
gammaloop-nextest-core> 12: <vakint[eb7a1daa8ec05e1f]::VakintExpression>::tensor_reduce <unknown>
64.17 s
gammaloop-nextest-core> at <unknown source file> :<unknown line>
64.17 s
gammaloop-nextest-core> 13: <gammalooprs[822fc56666e1de73]::uv::approx::integrated::Integrated>::integrate::<gammalooprs[822fc56666e1de73]::uv::hedge_poset::ForestNode> <unknown>
64.17 s
gammaloop-nextest-core> at <unknown source file> :<unknown line>
64.17 s
gammaloop-nextest-core> 14: <gammalooprs[822fc56666e1de73]::uv::approx::integrated::Integrated>::run::<gammalooprs[822fc56666e1de73]::uv::hedge_poset::ForestNode, gammalooprs[822fc56666e1de73]::uv::hedge_poset::ForestNode> <unknown>
64.17 s
gammaloop-nextest-core> at <unknown source file> :<unknown line>
64.17 s
gammaloop-nextest-core> 15: <gammalooprs[822fc56666e1de73]::uv::hedge_poset::Forests>::integrate <unknown>
64.17 s
gammaloop-nextest-core> at <unknown source file> :<unknown line>
64.17 s
gammaloop-nextest-core> 16: gammalooprs[822fc56666e1de73]::uv::orchestrator::hedge_poset_renormalization_part <unknown>
64.17 s
gammaloop-nextest-core> at <unknown source file> :<unknown line>
64.17 s
gammaloop-nextest-core> 17: <gammalooprs[822fc56666e1de73]::uv::settings::UVOrchestrator>::renormalization_part <unknown>
64.17 s
gammaloop-nextest-core> at <unknown source file> :<unknown line>
64.17 s
gammaloop-nextest-core> 18: <gammalooprs[822fc56666e1de73]::processes::amplitude::AmplitudeGraph>::renormalization_part <unknown>
64.17 s
gammaloop-nextest-core> at <unknown source file> :<unknown line>
64.17 s
gammaloop-nextest-core> 19: <test_renormalization[9f554b029f822e2d]::finite_part_quark_lo::{closure#0} as core[940e698046960fd5]::ops::function::FnOnce<()>>::call_once <unknown>
64.17 s
gammaloop-nextest-core> at <unknown source file> :<unknown line>
64.17 s
gammaloop-nextest-core> 20: test[75d6903177b1d7e9]::__rust_begin_short_backtrace::<core[940e698046960fd5]::result::Result<(), alloc[2ea6bcb46fca0c42]::string::String>, fn() -> core[940e698046960fd5]::result::Result<(), alloc[2ea6bcb46fca0c42]::string::String>> <unknown>
64.17 s
gammaloop-nextest-core> at <unknown source file> :<unknown line>
64.17 s
gammaloop-nextest-core> 21: test[75d6903177b1d7e9]::run_test::{closure#0} <unknown>
64.17 s
gammaloop-nextest-core> at <unknown source file> :<unknown line>
64.17 s
gammaloop-nextest-core> 22: std[bcb96dfbba0ab899]::sys::backtrace::__rust_begin_short_backtrace::<test[75d6903177b1d7e9]::run_test::{closure#1}, ()> <unknown>
64.17 s
gammaloop-nextest-core> at <unknown source file> :<unknown line>
64.17 s
gammaloop-nextest-core> 23: <std[bcb96dfbba0ab899]::thread::lifecycle::spawn_unchecked<test[75d6903177b1d7e9]::run_test::{closure#1}, ()>::{closure#1} as core[940e698046960fd5]::ops::function::FnOnce<()>>::call_once::{shim:vtable#0} <unknown>
64.17 s
gammaloop-nextest-core> at <unknown source file> :<unknown line>
64.17 s
gammaloop-nextest-core> 24: <std[bcb96dfbba0ab899]::sys::thread::unix::Thread>::new::thread_start <unknown>
64.17 s
gammaloop-nextest-core> at <unknown source file> :<unknown line>
64.17 s
gammaloop-nextest-core> 25: start_thread <unknown>
64.17 s
gammaloop-nextest-core> at <unknown source file> :<unknown line>
64.17 s
gammaloop-nextest-core> 26: __clone3 <unknown>
64.17 s
gammaloop-nextest-core> at <unknown source file> :<unknown line>
64.17 s
gammaloop-nextest-core>
64.17 s
gammaloop-nextest-core> Run with COLORBT_SHOW_HIDDEN=1 environment variable to disable frame filtering.
64.17 s
gammaloop-nextest-core> Run with RUST_BACKTRACE=full to include source snippets.
64.17 s
gammaloop-nextest-core>
64.17 s
gammaloop-nextest-core> FAIL [ 0.201s] (445/456) gammalooprs::test_renormalization finite_part_ghost_2loop
64.17 s
gammaloop-nextest-core> stdout ---
64.17 s
gammaloop-nextest-core>
64.17 s
gammaloop-nextest-core> running 1 test
64.17 s
gammaloop-nextest-core> test finite_part_ghost_2loop ... FAILED
64.17 s
gammaloop-nextest-core>
64.17 s
gammaloop-nextest-core> failures:
64.17 s
gammaloop-nextest-core>
64.17 s
gammaloop-nextest-core> failures:
64.17 s
gammaloop-nextest-core> finite_part_ghost_2loop
64.17 s
gammaloop-nextest-core>
64.17 s
gammaloop-nextest-core> test result: FAILED. 0 passed; 1 failed; 0 ignored; 0 measured; 5 filtered out; finished in 0.19s
64.17 s
gammaloop-nextest-core>
64.17 s
gammaloop-nextest-core> stderr ---
64.17 s
gammaloop-nextest-core> The application panicked (crashed).
64.17 s
gammaloop-nextest-core> Message: called `Result::unwrap()` on an `Err` value: "Symbol spenso::mink redefined with new attributes:\n\t- new user data specified: List([String(\"spenso::representation-v2\"), String(\"inline-metric\"), List([String(\"symbol\"), String(\"mink\")]), List([String(\"cyclic\"), Integer(1), List([List([String(\"symbol\"), String(\"mu\")]), List([String(\"symbol\"), String(\"nu\")]), List([String(\"symbol\"), String(\"rho\")]), List([String(\"symbol\"), String(\"sigma\")])])]), String(\"top\")]) vs None\n"
64.17 s
gammaloop-nextest-core> Location: crates/vakint/src/lib.rs :4766
64.17 s
gammaloop-nextest-core>
64.17 s
gammaloop-nextest-core> ━━━━━━━━━━━━━━━━━━━━━━━━━━━━━━━━━━ BACKTRACE ━━━━━━━━━━━━━━━━━━━━━━━━━━━━━━━━━━━
64.17 s
gammaloop-nextest-core> 1: <color_eyre[5722b77bc20a64cf]::config::PanicHook>::panic_report <unknown>
64.17 s
gammaloop-nextest-core> at <unknown source file> :<unknown line>
64.17 s
gammaloop-nextest-core> 2: <color_eyre[5722b77bc20a64cf]::config::PanicHook>::into_panic_hook::{closure#0} <unknown>
64.17 s
gammaloop-nextest-core> at <unknown source file> :<unknown line>
64.17 s
gammaloop-nextest-core> 3: std[bcb96dfbba0ab899]::panicking::panic_with_hook <unknown>
64.17 s
gammaloop-nextest-core> at <unknown source file> :<unknown line>
64.17 s
gammaloop-nextest-core> 4: std[bcb96dfbba0ab899]::panicking::panic_handler::{closure#0} <unknown>
64.17 s
gammaloop-nextest-core> at <unknown source file> :<unknown line>
64.17 s
gammaloop-nextest-core> 5: std[bcb96dfbba0ab899]::sys::backtrace::__rust_end_short_backtrace::<std[bcb96dfbba0ab899]::panicking::panic_handler::{closure#0}, !> <unknown>
64.17 s
gammaloop-nextest-core> at <unknown source file> :<unknown line>
64.17 s
gammaloop-nextest-core> 6: __rustc[6c289b9f9c454d21]::rust_begin_unwind <unknown>
64.17 s
gammaloop-nextest-core> at <unknown source file> :<unknown line>
64.17 s
gammaloop-nextest-core> 7: core[940e698046960fd5]::panicking::panic_fmt <unknown>
64.17 s
gammaloop-nextest-core> at <unknown source file> :<unknown line>
64.17 s
gammaloop-nextest-core> 8: core[940e698046960fd5]::result::unwrap_failed <unknown>
64.17 s
gammaloop-nextest-core> at <unknown source file> :<unknown line>
64.17 s
gammaloop-nextest-core> 9: <vakint[eb7a1daa8ec05e1f]::Vakint>::sanitize_user_expressions <unknown>
64.17 s
gammaloop-nextest-core> at <unknown source file> :<unknown line>
64.17 s
gammaloop-nextest-core> 10: <vakint[eb7a1daa8ec05e1f]::Vakint>::prepare_expression_for_form <unknown>
64.17 s
gammaloop-nextest-core> at <unknown source file> :<unknown line>
64.17 s
gammaloop-nextest-core> 11: <vakint[eb7a1daa8ec05e1f]::VakintTerm>::tensor_reduce <unknown>
64.17 s
gammaloop-nextest-core> at <unknown source file> :<unknown line>
64.17 s
gammaloop-nextest-core> 12: <vakint[eb7a1daa8ec05e1f]::VakintExpression>::tensor_reduce <unknown>
64.17 s
gammaloop-nextest-core> at <unknown source file> :<unknown line>
64.17 s
gammaloop-nextest-core> 13: <gammalooprs[822fc56666e1de73]::uv::approx::integrated::Integrated>::integrate::<gammalooprs[822fc56666e1de73]::uv::approx::Approximation> <unknown>
64.17 s
gammaloop-nextest-core> at <unknown source file> :<unknown line>
64.17 s
gammaloop-nextest-core> 14: <gammalooprs[822fc56666e1de73]::uv::approx::integrated::Integrated>::run::<gammalooprs[822fc56666e1de73]::uv::approx::Approximation, gammalooprs[822fc56666e1de73]::uv::approx::Approximation> <unknown>
64.17 s
gammaloop-nextest-core> at <unknown source file> :<unknown line>
64.17 s
gammaloop-nextest-core> 15: <gammalooprs[822fc56666e1de73]::uv::forest::Forest>::compute <unknown>
64.17 s
gammaloop-nextest-core> at <unknown source file> :<unknown line>
64.17 s
gammaloop-nextest-core> 16: gammalooprs[822fc56666e1de73]::uv::orchestrator::legacy_renormalization_part <unknown>
64.17 s
gammaloop-nextest-core> at <unknown source file> :<unknown line>
64.17 s
gammaloop-nextest-core> 17: <gammalooprs[822fc56666e1de73]::uv::settings::UVOrchestrator>::renormalization_part <unknown>
64.17 s
gammaloop-nextest-core> at <unknown source file> :<unknown line>
64.17 s
gammaloop-nextest-core> 18: <gammalooprs[822fc56666e1de73]::processes::amplitude::AmplitudeGraph>::renormalization_part <unknown>
64.17 s
gammaloop-nextest-core> at <unknown source file> :<unknown line>
64.17 s
gammaloop-nextest-core> 19: test_renormalization[9f554b029f822e2d]::finite_part_ghost_2loop <unknown>
64.17 s
gammaloop-nextest-core> at <unknown source file> :<unknown line>
64.17 s
gammaloop-nextest-core> 20: <test_renormalization[9f554b029f822e2d]::finite_part_ghost_2loop::{closure#0} as core[940e698046960fd5]::ops::function::FnOnce<()>>::call_once <unknown>
64.17 s
gammaloop-nextest-core> at <unknown source file> :<unknown line>
64.17 s
gammaloop-nextest-core> 21: test[75d6903177b1d7e9]::__rust_begin_short_backtrace::<core[940e698046960fd5]::result::Result<(), alloc[2ea6bcb46fca0c42]::string::String>, fn() -> core[940e698046960fd5]::result::Result<(), alloc[2ea6bcb46fca0c42]::string::String>> <unknown>
64.17 s
gammaloop-nextest-core> at <unknown source file> :<unknown line>
64.17 s
gammaloop-nextest-core> 22: test[75d6903177b1d7e9]::run_test::{closure#0} <unknown>
64.17 s
gammaloop-nextest-core> at <unknown source file> :<unknown line>
64.17 s
gammaloop-nextest-core> 23: std[bcb96dfbba0ab899]::sys::backtrace::__rust_begin_short_backtrace::<test[75d6903177b1d7e9]::run_test::{closure#1}, ()> <unknown>
64.17 s
gammaloop-nextest-core> at <unknown source file> :<unknown line>
64.17 s
gammaloop-nextest-core> 24: <std[bcb96dfbba0ab899]::thread::lifecycle::spawn_unchecked<test[75d6903177b1d7e9]::run_test::{closure#1}, ()>::{closure#1} as core[940e698046960fd5]::ops::function::FnOnce<()>>::call_once::{shim:vtable#0} <unknown>
64.17 s
gammaloop-nextest-core> at <unknown source file> :<unknown line>
64.17 s
gammaloop-nextest-core> 25: <std[bcb96dfbba0ab899]::sys::thread::unix::Thread>::new::thread_start <unknown>
64.17 s
gammaloop-nextest-core> at <unknown source file> :<unknown line>
64.17 s
gammaloop-nextest-core> 26: start_thread <unknown>
64.17 s
gammaloop-nextest-core> at <unknown source file> :<unknown line>
64.17 s
gammaloop-nextest-core> 27: __clone3 <unknown>
64.17 s
gammaloop-nextest-core> at <unknown source file> :<unknown line>
64.17 s
gammaloop-nextest-core>
64.17 s
gammaloop-nextest-core> Run with COLORBT_SHOW_HIDDEN=1 environment variable to disable frame filtering.
64.17 s
gammaloop-nextest-core> Run with RUST_BACKTRACE=full to include source snippets.
64.17 s
gammaloop-nextest-core>
64.22 s
gammaloop-nextest-core> error : test run failed
64.24 s
gammaloop-nextest-core>
64.24 s
gammaloop-nextest-core> ========== nextest test summary ==========
64.24 s
gammaloop-nextest-core> report: target/nextest/ci_gammaloop/junit.xml
64.24 s
gammaloop-nextest-core> tests: 456, failures: 3, errors: 0
64.24 s
gammaloop-nextest-core>
64.24 s
gammaloop-nextest-core> 1. gammalooprs::test_renormalization::finit_part_ghlo
64.24 s
gammaloop-nextest-core> failure: test failure with exit code 101
64.24 s
gammaloop-nextest-core> system-out
64.24 s
gammaloop-nextest-core> running 1 test
64.24 s
gammaloop-nextest-core> test finit_part_ghlo ... FAILED
64.24 s
gammaloop-nextest-core>
64.24 s
gammaloop-nextest-core> failures:
64.24 s
gammaloop-nextest-core>
64.24 s
gammaloop-nextest-core> failures:
64.24 s
gammaloop-nextest-core> finit_part_ghlo
64.24 s
gammaloop-nextest-core>
64.24 s
gammaloop-nextest-core> test result: FAILED. 0 passed; 1 failed; 0 ignored; 0 measured; 5 filtered out; finished in 0.12s
64.24 s
gammaloop-nextest-core> system-err
64.24 s
gammaloop-nextest-core> The application panicked (crashed).
64.24 s
gammaloop-nextest-core> Message: called `Result::unwrap()` on an `Err` value:
64.24 s
gammaloop-nextest-core> 0: Symbolica could not parse FORM output:
64.24 s
gammaloop-nextest-core> [spenso::{antisymmetric,real,spenso::tensor}::f]([spenso::{spenso::representat\
64.24 s
gammaloop-nextest-core> ion,spenso::self_dual}::coad](8,[gammalooprs::{spenso::index}::hedge](0)
64.24 s
gammaloop-nextest-core> ),[spenso::{spenso::representation,spenso::self_dual}::coad](8,[gammaloo\
64.24 s
gammaloop-nextest-core> prs::{spenso::index}::hedge](3)),[spenso::{spenso::representation,spenso\
64.24 s
gammaloop-nextest-core> ::self_dual}::coad](8,[gammalooprs::{spenso::index}::hedge](5)))*
64.24 s
gammaloop-nextest-core> [spenso::{antisymmetric,real,spenso::tensor}::f]([spenso::{spenso::repre\
64.24 s
gammaloop-nextest-core> sentation,spenso::self_dual}::coad](8,[gammalooprs::{spenso::index}::hed\
64.24 s
gammaloop-nextest-core> ge](1)),[spenso::{spenso::representation,spenso::self_dual}::coad](8,
64.24 s
gammaloop-nextest-core> [gammalooprs::{spenso::index}::hedge](3)),[spenso::{spenso::representati\
64.24 s
gammaloop-nextest-core> on,spenso::self_dual}::coad](8,[gammalooprs::{spenso::index}::hedge](5))
64.24 s
gammaloop-nextest-core> )*dot(p1,p0)*[UFO::{}::GC_10]^2*rat(-1,1)
64.24 s
gammaloop-nextest-core>
64.24 s
gammaloop-nextest-core> Error:Symbol spenso::coad redefined with new attributes:
64.24 s
gammaloop-nextest-core> - new user data specified: List([String("spenso::representation-v2"), String("self-dual"), List([String("symbol"), String("coad")]), List([String("cyclic"), Integer(1), List([List([String("symbol"), String("a")]), List([String("symbol"), String("b")]), List([String("symbol"), String("c")]), List([String("symbol"), String("d")])])]), String("top")]) vs None
64.24 s
gammaloop-nextest-core>
64.24 s
gammaloop-nextest-core>
64.24 s
gammaloop-nextest-core> Location:
64.24 s
gammaloop-nextest-core> crates/gammalooprs/src/uv/approx/integrated.rs:332
64.24 s
gammaloop-nextest-core>
64.24 s
gammaloop-nextest-core> ━━━━━━━━━━━━━━━━━━━━━━━━━━━━━━━━━━ BACKTRACE ━━━━━━━━━━━━━━━━━━━━━━━━━━━━━━━━━━━
64.24 s
gammaloop-nextest-core> 1: <color_eyre[5722b77bc20a64cf]::config::EyreHook>::into_eyre_hook::{closure#0}<unknown>
64.24 s
gammaloop-nextest-core> at <unknown source file>:<unknown line>
64.24 s
gammaloop-nextest-core> 2: eyre[cb2fd339c0c40fca]::capture_handler<unknown>
64.24 s
gammaloop-nextest-core> at <unknown source file>:<unknown line>
64.24 s
gammaloop-nextest-core> 3: <eyre[cb2fd339c0c40fca]::Report>::from_std::<vakint[eb7a1daa8ec05e1f]::VakintError><unknown>
64.24 s
gammaloop-nextest-core> at <unknown source file>:<unknown line>
64.24 s
gammaloop-nextest-core> 4: <gammalooprs[822fc56666e1de73]::uv::approx::integrated::Integrated>::integrate::<gammalooprs[822fc56666e1de73]::uv::hedge_poset::ForestNode><unknown>
64.24 s
gammaloop-nextest-core> at <unknown source file>:<unknown line>
64.24 s
gammaloop-nextest-core> 5: <gammalooprs[822fc56666e1de73]::uv::approx::integrated::Integrated>::run::<gammalooprs[822fc56666e1de73]::uv::hedge_poset::ForestNode, gammalooprs[822fc56666e1de73]::uv::hedge_poset::ForestNode><unknown>
64.24 s
gammaloop-nextest-core> at <unknown source file>:<unknown line>
64.24 s
gammaloop-nextest-core> 6: <gammalooprs[822fc56666e1de73]::uv::hedge_poset::Forests>::integrate<unknown>
64.24 s
gammaloop-nextest-core> at <unknown source file>:<unknown line>
64.24 s
gammaloop-nextest-core> 7: gammalooprs[822fc56666e1de73]::uv::orchestrator::hedge_poset_renormalization_part<unknown>
64.24 s
gammaloop-nextest-core> at <unknown source file>:<unknown line>
64.24 s
gammaloop-nextest-core> 8: <gammalooprs[822fc56666e1de73]::uv::settings::UVOrchestrator>::renormalization_part<unknown>
64.24 s
gammaloop-nextest-core> at <unknown source file>:<unknown line>
64.24 s
gammaloop-nextest-core> 9: <gammalooprs[822fc56666e1de73]::processes::amplitude::AmplitudeGraph>::renormalization_part<unknown>
64.24 s
gammaloop-nextest-core> at <unknown source file>:<unknown line>
64.24 s
gammaloop-nextest-core> 10: <test_renormalization[9f554b029f822e2d]::finit_part_ghlo::{closure#0} as core[940e698046960fd5]::ops::function::FnOnce<()>>::call_once<unknown>
64.24 s
gammaloop-nextest-core> at <unknown source file>:<unknown line>
64.24 s
gammaloop-nextest-core> 11: test[75d6903177b1d7e9]::__rust_begin_short_backtrace::<core[940e698046960fd5]::result::Result<(), alloc[2ea6bcb46fca0c42]::string::String>, fn() -> core[940e698046960fd5]::result::Result<(), alloc[2ea6bcb46fca0c42]::string::String>><unknown>
64.24 s
gammaloop-nextest-core> at <unknown source file>:<unknown line>
64.24 s
gammaloop-nextest-core> 12: test[75d6903177b1d7e9]::run_test::{closure#0}<unknown>
64.24 s
gammaloop-nextest-core> at <unknown source file>:<unknown line>
64.24 s
gammaloop-nextest-core> 13: std[bcb96dfbba0ab899]::sys::backtrace::__rust_begin_short_backtrace::<test[75d6903177b1d7e9]::run_test::{closure#1}, ()><unknown>
64.24 s
gammaloop-nextest-core> at <unknown source file>:<unknown line>
64.24 s
gammaloop-nextest-core> 14: <std[bcb96dfbba0ab899]::thread::lifecycle::spawn_unchecked<test[75d6903177b1d7e9]::run_test::{closure#1}, ()>::{closure#1} as core[940e698046960fd5]::ops::function::FnOnce<()>>::call_once::{shim:vtable#0}<unknown>
64.24 s
gammaloop-nextest-core> at <unknown source file>:<unknown line>
64.24 s
gammaloop-nextest-core> 15: <std[bcb96dfbba0ab899]::sys::thread::unix::Thread>::new::thread_start<unknown>
64.24 s
gammaloop-nextest-core> at <unknown source file>:<unknown line>
64.24 s
gammaloop-nextest-core> 16: start_thread<unknown>
64.24 s
gammaloop-nextest-core> at <unknown source file>:<unknown line>
64.24 s
gammaloop-nextest-core> 17: __clone3<unknown>
64.24 s
gammaloop-nextest-core> at <unknown source file>:<unknown line>
64.24 s
gammaloop-nextest-core>
64.24 s
gammaloop-nextest-core> Run with COLORBT_SHOW_HIDDEN=1 environment variable to disable frame filtering.
64.24 s
gammaloop-nextest-core> Run with RUST_BACKTRACE=full to include source snippets.
64.24 s
gammaloop-nextest-core> Location: crates/gammalooprs/tests/test_renormalization.rs:550
64.24 s
gammaloop-nextest-core>
64.24 s
gammaloop-nextest-core> ━━━━━━━━━━━━━━━━━━━━━━━━━━━━━━━━━━ BACKTRACE ━━━━━━━━━━━━━━━━━━━━━━━━━━━━━━━━━━━
64.24 s
gammaloop-nextest-core> 1: <color_eyre[5722b77bc20a64cf]::config::PanicHook>::panic_report<unknown>
64.25 s
gammaloop-nextest-core> at <unknown source file>:<unknown line>
64.25 s
gammaloop-nextest-core> 2: <color_eyre[5722b77bc20a64cf]::config::PanicHook>::into_panic_hook::{closure#0}<unknown>
64.25 s
gammaloop-nextest-core> at <unknown source file>:<unknown line>
64.25 s
gammaloop-nextest-core> 3: std[bcb96dfbba0ab899]::panicking::panic_with_hook<unknown>
64.25 s
gammaloop-nextest-core> at <unknown source file>:<unknown line>
64.25 s
gammaloop-nextest-core> 4: std[bcb96dfbba0ab899]::panicking::panic_handler::{closure#0}<unknown>
64.25 s
gammaloop-nextest-core> at <unknown source file>:<unknown line>
64.25 s
gammaloop-nextest-core> 5: std[bcb96dfbba0ab899]::sys::backtrace::__rust_end_short_backtrace::<std[bcb96dfbba0ab899]::panicking::panic_handler::{closure#0}, !><unknown>
64.25 s
gammaloop-nextest-core> at <unknown source file>:<unknown line>
64.25 s
gammaloop-nextest-core> 6: __rustc[6c289b9f9c454d21]::rust_begin_unwind<unknown>
64.25 s
gammaloop-nextest-core> at <unknown source file>:<unknown line>
64.25 s
gammaloop-nextest-core> 7: core[940e698046960fd5]::panicking::panic_fmt<unknown>
64.25 s
gammaloop-nextest-core> at <unknown source file>:<unknown line>
64.25 s
gammaloop-nextest-core> 8: core[940e698046960fd5]::result::unwrap_failed<unknown>
64.25 s
gammaloop-nextest-core> at <unknown source file>:<unknown line>
64.25 s
gammaloop-nextest-core> 9: <test_renormalization[9f554b029f822e2d]::finit_part_ghlo::{closure#0} as core[940e698046960fd5]::ops::function::FnOnce<()>>::call_once<unknown>
64.25 s
gammaloop-nextest-core> at <unknown source file>:<unknown line>
64.25 s
gammaloop-nextest-core> 10: test[75d6903177b1d7e9]::__rust_begin_short_backtrace::<core[940e698046960fd5]::result::Result<(), alloc[2ea6bcb46fca0c42]::string::String>, fn() -> core[940e698046960fd5]::result::Result<(), alloc[2ea6bcb46fca0c42]::string::String>><unknown>
64.25 s
gammaloop-nextest-core> at <unknown source file>:<unknown line>
64.25 s
gammaloop-nextest-core> 11: test[75d6903177b1d7e9]::run_test::{closure#0}<unknown>
64.25 s
gammaloop-nextest-core> at <unknown source file>:<unknown line>
64.25 s
gammaloop-nextest-core> 12: std[bcb96dfbba0ab899]::sys::backtrace::__rust_begin_short_backtrace::<test[75d6903177b1d7e9]::run_test::{closure#1}, ()><unknown>
64.25 s
gammaloop-nextest-core> at <unknown source file>:<unknown line>
64.25 s
gammaloop-nextest-core> 13: <std[bcb96dfbba0ab899]::thread::lifecycle::spawn_unchecked<test[75d6903177b1d7e9]::run_test::{closure#1}, ()>::{closure#1} as core[940e698046960fd5]::ops::function::FnOnce<()>>::call_once::{shim:vtable#0}<unknown>
64.25 s
gammaloop-nextest-core> at <unknown source file>:<unknown line>
64.25 s
gammaloop-nextest-core> 14: <std[bcb96dfbba0ab899]::sys::thread::unix::Thread>::new::thread_start<unknown>
64.25 s
gammaloop-nextest-core> at <unknown source file>:<unknown line>
64.25 s
gammaloop-nextest-core> 15: start_thread<unknown>
64.25 s
gammaloop-nextest-core> at <unknown source file>:<unknown line>
64.25 s
gammaloop-nextest-core> 16: __clone3<unknown>
64.25 s
gammaloop-nextest-core> at <unknown source file>:<unknown line>
64.25 s
gammaloop-nextest-core>
64.25 s
gammaloop-nextest-core> Run with COLORBT_SHOW_HIDDEN=1 environment variable to disable frame filtering.
64.25 s
gammaloop-nextest-core> Run with RUST_BACKTRACE=full to include source snippets.
64.25 s
gammaloop-nextest-core>
64.25 s
gammaloop-nextest-core> 2. gammalooprs::test_renormalization::finite_part_quark_lo
64.25 s
gammaloop-nextest-core> failure: test failure with exit code 101
64.25 s
gammaloop-nextest-core> system-out
64.25 s
gammaloop-nextest-core> running 1 test
64.25 s
gammaloop-nextest-core> test finite_part_quark_lo ... FAILED
64.25 s
gammaloop-nextest-core>
64.25 s
gammaloop-nextest-core> failures:
64.25 s
gammaloop-nextest-core>
64.25 s
gammaloop-nextest-core> failures:
64.25 s
gammaloop-nextest-core> finite_part_quark_lo
64.25 s
gammaloop-nextest-core>
64.25 s
gammaloop-nextest-core> test result: FAILED. 0 passed; 1 failed; 0 ignored; 0 measured; 5 filtered out; finished in 0.11s
64.25 s
gammaloop-nextest-core> system-err
64.25 s
gammaloop-nextest-core> The application panicked (crashed).
64.25 s
gammaloop-nextest-core> Message: called `Result::unwrap()` on an `Err` value: "Symbol spenso::mink redefined with new attributes:\n\t- new user data specified: List([String(\"spenso::representation-v2\"), String(\"inline-metric\"), List([String(\"symbol\"), String(\"mink\")]), List([String(\"cyclic\"), Integer(1), List([List([String(\"symbol\"), String(\"mu\")]), List([String(\"symbol\"), String(\"nu\")]), List([String(\"symbol\"), String(\"rho\")]), List([String(\"symbol\"), String(\"sigma\")])])]), String(\"top\")]) vs None\n"
64.25 s
gammaloop-nextest-core> Location: crates/vakint/src/lib.rs:4766
64.25 s
gammaloop-nextest-core>
64.25 s
gammaloop-nextest-core> ━━━━━━━━━━━━━━━━━━━━━━━━━━━━━━━━━━ BACKTRACE ━━━━━━━━━━━━━━━━━━━━━━━━━━━━━━━━━━━
64.25 s
gammaloop-nextest-core> 1: <color_eyre[5722b77bc20a64cf]::config::PanicHook>::panic_report<unknown>
64.25 s
gammaloop-nextest-core> at <unknown source file>:<unknown line>
64.25 s
gammaloop-nextest-core> 2: <color_eyre[5722b77bc20a64cf]::config::PanicHook>::into_panic_hook::{closure#0}<unknown>
64.25 s
gammaloop-nextest-core> at <unknown source file>:<unknown line>
64.25 s
gammaloop-nextest-core> 3: std[bcb96dfbba0ab899]::panicking::panic_with_hook<unknown>
64.25 s
gammaloop-nextest-core> at <unknown source file>:<unknown line>
64.25 s
gammaloop-nextest-core> 4: std[bcb96dfbba0ab899]::panicking::panic_handler::{closure#0}<unknown>
64.25 s
gammaloop-nextest-core> at <unknown source file>:<unknown line>
64.25 s
gammaloop-nextest-core> 5: std[bcb96dfbba0ab899]::sys::backtrace::__rust_end_short_backtrace::<std[bcb96dfbba0ab899]::panicking::panic_handler::{closure#0}, !><unknown>
64.25 s
gammaloop-nextest-core> at <unknown source file>:<unknown line>
64.25 s
gammaloop-nextest-core> 6: __rustc[6c289b9f9c454d21]::rust_begin_unwind<unknown>
64.25 s
gammaloop-nextest-core> at <unknown source file>:<unknown line>
64.25 s
gammaloop-nextest-core> 7: core[940e698046960fd5]::panicking::panic_fmt<unknown>
64.25 s
gammaloop-nextest-core> at <unknown source file>:<unknown line>
64.25 s
gammaloop-nextest-core> 8: core[940e698046960fd5]::result::unwrap_failed<unknown>
64.25 s
gammaloop-nextest-core> at <unknown source file>:<unknown line>
64.25 s
gammaloop-nextest-core> 9: <vakint[eb7a1daa8ec05e1f]::Vakint>::sanitize_user_expressions<unknown>
64.25 s
gammaloop-nextest-core> at <unknown source file>:<unknown line>
64.25 s
gammaloop-nextest-core> 10: <vakint[eb7a1daa8ec05e1f]::Vakint>::prepare_expression_for_form<unknown>
64.25 s
gammaloop-nextest-core> at <unknown source file>:<unknown line>
64.25 s
gammaloop-nextest-core> 11: <vakint[eb7a1daa8ec05e1f]::VakintTerm>::tensor_reduce<unknown>
64.25 s
gammaloop-nextest-core> at <unknown source file>:<unknown line>
64.25 s
gammaloop-nextest-core> 12: <vakint[eb7a1daa8ec05e1f]::VakintExpression>::tensor_reduce<unknown>
64.25 s
gammaloop-nextest-core> at <unknown source file>:<unknown line>
64.25 s
gammaloop-nextest-core> 13: <gammalooprs[822fc56666e1de73]::uv::approx::integrated::Integrated>::integrate::<gammalooprs[822fc56666e1de73]::uv::hedge_poset::ForestNode><unknown>
64.25 s
gammaloop-nextest-core> at <unknown source file>:<unknown line>
64.25 s
gammaloop-nextest-core> 14: <gammalooprs[822fc56666e1de73]::uv::approx::integrated::Integrated>::run::<gammalooprs[822fc56666e1de73]::uv::hedge_poset::ForestNode, gammalooprs[822fc56666e1de73]::uv::hedge_poset::ForestNode><unknown>
64.25 s
gammaloop-nextest-core> at <unknown source file>:<unknown line>
64.25 s
gammaloop-nextest-core> 15: <gammalooprs[822fc56666e1de73]::uv::hedge_poset::Forests>::integrate<unknown>
64.25 s
gammaloop-nextest-core> at <unknown source file>:<unknown line>
64.25 s
gammaloop-nextest-core> 16: gammalooprs[822fc56666e1de73]::uv::orchestrator::hedge_poset_renormalization_part<unknown>
64.25 s
gammaloop-nextest-core> at <unknown source file>:<unknown line>
64.25 s
gammaloop-nextest-core> 17: <gammalooprs[822fc56666e1de73]::uv::settings::UVOrchestrator>::renormalization_part<unknown>
64.25 s
gammaloop-nextest-core> at <unknown source file>:<unknown line>
64.25 s
gammaloop-nextest-core> 18: <gammalooprs[822fc56666e1de73]::processes::amplitude::AmplitudeGraph>::renormalization_part<unknown>
64.25 s
gammaloop-nextest-core> at <unknown source file>:<unknown line>
64.25 s
gammaloop-nextest-core> 19: <test_renormalization[9f554b029f822e2d]::finite_part_quark_lo::{closure#0} as core[940e698046960fd5]::ops::function::FnOnce<()>>::call_once<unknown>
64.25 s
gammaloop-nextest-core> at <unknown source file>:<unknown line>
64.25 s
gammaloop-nextest-core> 20: test[75d6903177b1d7e9]::__rust_begin_short_backtrace::<core[940e698046960fd5]::result::Result<(), alloc[2ea6bcb46fca0c42]::string::String>, fn() -> core[940e698046960fd5]::result::Result<(), alloc[2ea6bcb46fca0c42]::string::String>><unknown>
64.25 s
gammaloop-nextest-core> at <unknown source file>:<unknown line>
64.25 s
gammaloop-nextest-core> 21: test[75d6903177b1d7e9]::run_test::{closure#0}<unknown>
64.25 s
gammaloop-nextest-core> at <unknown source file>:<unknown line>
64.25 s
gammaloop-nextest-core> 22: std[bcb96dfbba0ab899]::sys::backtrace::__rust_begin_short_backtrace::<test[75d6903177b1d7e9]::run_test::{closure#1}, ()><unknown>
64.25 s
gammaloop-nextest-core> at <unknown source file>:<unknown line>
64.25 s
gammaloop-nextest-core> 23: <std[bcb96dfbba0ab899]::thread::lifecycle::spawn_unchecked<test[75d6903177b1d7e9]::run_test::{closure#1}, ()>::{closure#1} as core[940e698046960fd5]::ops::function::FnOnce<()>>::call_once::{shim:vtable#0}<unknown>
64.25 s
gammaloop-nextest-core> at <unknown source file>:<unknown line>
64.25 s
gammaloop-nextest-core> 24: <std[bcb96dfbba0ab899]::sys::thread::unix::Thread>::new::thread_start<unknown>
64.25 s
gammaloop-nextest-core> at <unknown source file>:<unknown line>
64.25 s
gammaloop-nextest-core> 25: start_thread<unknown>
64.25 s
gammaloop-nextest-core> at <unknown source file>:<unknown line>
64.25 s
gammaloop-nextest-core> 26: __clone3<unknown>
64.25 s
gammaloop-nextest-core> at <unknown source file>:<unknown line>
64.25 s
gammaloop-nextest-core>
64.25 s
gammaloop-nextest-core> Run with COLORBT_SHOW_HIDDEN=1 environment variable to disable frame filtering.
64.25 s
gammaloop-nextest-core> Run with RUST_BACKTRACE=full to include source snippets.
64.25 s
gammaloop-nextest-core>
64.25 s
gammaloop-nextest-core> 3. gammalooprs::test_renormalization::finite_part_ghost_2loop
64.25 s
gammaloop-nextest-core> failure: test failure with exit code 101
64.25 s
gammaloop-nextest-core> system-out
64.25 s
gammaloop-nextest-core> running 1 test
64.25 s
gammaloop-nextest-core> test finite_part_ghost_2loop ... FAILED
64.25 s
gammaloop-nextest-core>
64.25 s
gammaloop-nextest-core> failures:
64.25 s
gammaloop-nextest-core>
64.25 s
gammaloop-nextest-core> failures:
64.25 s
gammaloop-nextest-core> finite_part_ghost_2loop
64.25 s
gammaloop-nextest-core>
64.25 s
gammaloop-nextest-core> test result: FAILED. 0 passed; 1 failed; 0 ignored; 0 measured; 5 filtered out; finished in 0.19s
64.25 s
gammaloop-nextest-core> system-err
64.25 s
gammaloop-nextest-core> The application panicked (crashed).
64.25 s
gammaloop-nextest-core> Message: called `Result::unwrap()` on an `Err` value: "Symbol spenso::mink redefined with new attributes:\n\t- new user data specified: List([String(\"spenso::representation-v2\"), String(\"inline-metric\"), List([String(\"symbol\"), String(\"mink\")]), List([String(\"cyclic\"), Integer(1), List([List([String(\"symbol\"), String(\"mu\")]), List([String(\"symbol\"), String(\"nu\")]), List([String(\"symbol\"), String(\"rho\")]), List([String(\"symbol\"), String(\"sigma\")])])]), String(\"top\")]) vs None\n"
64.25 s
gammaloop-nextest-core> Location: crates/vakint/src/lib.rs:4766
64.25 s
gammaloop-nextest-core>
64.25 s
gammaloop-nextest-core> ━━━━━━━━━━━━━━━━━━━━━━━━━━━━━━━━━━ BACKTRACE ━━━━━━━━━━━━━━━━━━━━━━━━━━━━━━━━━━━
64.25 s
gammaloop-nextest-core> 1: <color_eyre[5722b77bc20a64cf]::config::PanicHook>::panic_report<unknown>
64.25 s
gammaloop-nextest-core> at <unknown source file>:<unknown line>
64.25 s
gammaloop-nextest-core> 2: <color_eyre[5722b77bc20a64cf]::config::PanicHook>::into_panic_hook::{closure#0}<unknown>
64.25 s
gammaloop-nextest-core> at <unknown source file>:<unknown line>
64.25 s
gammaloop-nextest-core> 3: std[bcb96dfbba0ab899]::panicking::panic_with_hook<unknown>
64.25 s
gammaloop-nextest-core> at <unknown source file>:<unknown line>
64.25 s
gammaloop-nextest-core> 4: std[bcb96dfbba0ab899]::panicking::panic_handler::{closure#0}<unknown>
64.25 s
gammaloop-nextest-core> at <unknown source file>:<unknown line>
64.25 s
gammaloop-nextest-core> 5: std[bcb96dfbba0ab899]::sys::backtrace::__rust_end_short_backtrace::<std[bcb96dfbba0ab899]::panicking::panic_handler::{closure#0}, !><unknown>
64.25 s
gammaloop-nextest-core> at <unknown source file>:<unknown line>
64.25 s
gammaloop-nextest-core> 6: __rustc[6c289b9f9c454d21]::rust_begin_unwind<unknown>
64.25 s
gammaloop-nextest-core> at <unknown source file>:<unknown line>
64.25 s
gammaloop-nextest-core> 7: core[940e698046960fd5]::panicking::panic_fmt<unknown>
64.25 s
gammaloop-nextest-core> at <unknown source file>:<unknown line>
64.25 s
gammaloop-nextest-core> 8: core[940e698046960fd5]::result::unwrap_failed<unknown>
64.25 s
gammaloop-nextest-core> at <unknown source file>:<unknown line>
64.25 s
gammaloop-nextest-core> 9: <vakint[eb7a1daa8ec05e1f]::Vakint>::sanitize_user_expressions<unknown>
64.25 s
gammaloop-nextest-core> at <unknown source file>:<unknown line>
64.25 s
gammaloop-nextest-core> 10: <vakint[eb7a1daa8ec05e1f]::Vakint>::prepare_expression_for_form<unknown>
64.25 s
gammaloop-nextest-core> at <unknown source file>:<unknown line>
64.25 s
gammaloop-nextest-core> 11: <vakint[eb7a1daa8ec05e1f]::VakintTerm>::tensor_reduce<unknown>
64.25 s
gammaloop-nextest-core> at <unknown source file>:<unknown line>
64.25 s
gammaloop-nextest-core> 12: <vakint[eb7a1daa8ec05e1f]::VakintExpression>::tensor_reduce<unknown>
64.25 s
gammaloop-nextest-core> at <unknown source file>:<unknown line>
64.25 s
gammaloop-nextest-core> 13: <gammalooprs[822fc56666e1de73]::uv::approx::integrated::Integrated>::integrate::<gammalooprs[822fc56666e1de73]::uv::approx::Approximation><unknown>
64.25 s
gammaloop-nextest-core> at <unknown source file>:<unknown line>
64.25 s
gammaloop-nextest-core> 14: <gammalooprs[822fc56666e1de73]::uv::approx::integrated::Integrated>::run::<gammalooprs[822fc56666e1de73]::uv::approx::Approximation, gammalooprs[822fc56666e1de73]::uv::approx::Approximation><unknown>
64.25 s
gammaloop-nextest-core> at <unknown source file>:<unknown line>
64.25 s
gammaloop-nextest-core> 15: <gammalooprs[822fc56666e1de73]::uv::forest::Forest>::compute<unknown>
64.25 s
gammaloop-nextest-core> at <unknown source file>:<unknown line>
64.25 s
gammaloop-nextest-core> 16: gammalooprs[822fc56666e1de73]::uv::orchestrator::legacy_renormalization_part<unknown>
64.25 s
gammaloop-nextest-core> at <unknown source file>:<unknown line>
64.25 s
gammaloop-nextest-core> 17: <gammalooprs[822fc56666e1de73]::uv::settings::UVOrchestrator>::renormalization_part<unknown>
64.25 s
gammaloop-nextest-core> at <unknown source file>:<unknown line>
64.25 s
gammaloop-nextest-core> 18: <gammalooprs[822fc56666e1de73]::processes::amplitude::AmplitudeGraph>::renormalization_part<unknown>
64.25 s
gammaloop-nextest-core> at <unknown source file>:<unknown line>
64.25 s
gammaloop-nextest-core> 19: test_renormalization[9f554b029f822e2d]::finite_part_ghost_2loop<unknown>
64.25 s
gammaloop-nextest-core> at <unknown source file>:<unknown line>
64.25 s
gammaloop-nextest-core> 20: <test_renormalization[9f554b029f822e2d]::finite_part_ghost_2loop::{closure#0} as core[940e698046960fd5]::ops::function::FnOnce<()>>::call_once<unknown>
64.25 s
gammaloop-nextest-core> at <unknown source file>:<unknown line>
64.25 s
gammaloop-nextest-core> 21: test[75d6903177b1d7e9]::__rust_begin_short_backtrace::<core[940e698046960fd5]::result::Result<(), alloc[2ea6bcb46fca0c42]::string::String>, fn() -> core[940e698046960fd5]::result::Result<(), alloc[2ea6bcb46fca0c42]::string::String>><unknown>
64.25 s
gammaloop-nextest-core> at <unknown source file>:<unknown line>
64.25 s
gammaloop-nextest-core> 22: test[75d6903177b1d7e9]::run_test::{closure#0}<unknown>
64.25 s
gammaloop-nextest-core> at <unknown source file>:<unknown line>
64.25 s
gammaloop-nextest-core> 23: std[bcb96dfbba0ab899]::sys::backtrace::__rust_begin_short_backtrace::<test[75d6903177b1d7e9]::run_test::{closure#1}, ()><unknown>
64.25 s
gammaloop-nextest-core> at <unknown source file>:<unknown line>
64.25 s
gammaloop-nextest-core> 24: <std[bcb96dfbba0ab899]::thread::lifecycle::spawn_unchecked<test[75d6903177b1d7e9]::run_test::{closure#1}, ()>::{closure#1} as core[940e698046960fd5]::ops::function::FnOnce<()>>::call_once::{shim:vtable#0}<unknown>
64.25 s
gammaloop-nextest-core> at <unknown source file>:<unknown line>
64.25 s
gammaloop-nextest-core> 25: <std[bcb96dfbba0ab899]::sys::thread::unix::Thread>::new::thread_start<unknown>
64.25 s
gammaloop-nextest-core> at <unknown source file>:<unknown line>
64.25 s
gammaloop-nextest-core> 26: start_thread<unknown>
64.25 s
gammaloop-nextest-core> at <unknown source file>:<unknown line>
64.25 s
gammaloop-nextest-core> 27: __clone3<unknown>
64.25 s
gammaloop-nextest-core> at <unknown source file>:<unknown line>
64.25 s
gammaloop-nextest-core>
64.25 s
gammaloop-nextest-core> Run with COLORBT_SHOW_HIDDEN=1 environment variable to disable frame filtering.
64.25 s
gammaloop-nextest-core> Run with RUST_BACKTRACE=full to include source snippets.
64.25 s
gammaloop-nextest-core> =========================================
64.28 s
error: Cannot build '/nix/store/zinbrvppkmzalr7ws9scxa6mjscpn55x-gammaloop-nextest-core.drv '.
64.28 s
Reason: builder failed with exit code 100 .
64.28 s
Output paths:
64.28 s
/nix/store/k5v8ghl7chk97jbw3f7b7213dk976a9s-gammaloop-nextest-core
64.28 s
Last 844 log lines:
64.28 s
> Extracting 3 binaries (including 1 non-test binary), 1 build script output directory, and 2 linked paths to /build/nextest-archive-T97Hxn
64.28 s
> Extracted 18 files to /build/nextest-archive-T97Hxn in 0.43s
64.28 s
> ------------
64.28 s
> Nextest run ID 84d7497c-4164-4421-b925-e33a835f5eab with nextest profile: ci_gammaloop
64.28 s
> Starting 339 tests across 2 binaries
64.28 s
> ------------
64.28 s
> Summary [ 0.402s] 339 tests run: 339 passed , 0 skipped
64.28 s
>
64.28 s
> ========== nextest test summary ==========
64.28 s
> report: target/nextest/ci_gammaloop/junit.xml
64.28 s
> tests: 339, failures: 0, errors: 0
64.28 s
> No failing testcases found.
64.28 s
> =========================================
64.28 s
> Extracting 1 binary and 1 linked path to /build/nextest-archive-w7ozfB
64.28 s
> Extracted 7 files to /build/nextest-archive-w7ozfB in 0.05s
64.28 s
> ------------
64.28 s
> Nextest run ID 46631c6b-8997-4ccf-9c3b-0b9da3ce30ea with nextest profile: ci_gammaloop
64.28 s
> Starting 19 tests across 1 binary
64.28 s
> ------------
64.28 s
> Summary [ 0.011s] 19 tests run: 19 passed , 0 skipped
64.28 s
>
64.28 s
> ========== nextest test summary ==========
64.28 s
> report: target/nextest/ci_gammaloop/junit.xml
64.28 s
> tests: 19, failures: 0, errors: 0
64.28 s
> No failing testcases found.
64.28 s
> =========================================
64.28 s
> Extracting 1 binary to /build/nextest-archive-IZRk7C
64.28 s
> Extracted 4 files to /build/nextest-archive-IZRk7C in 0.03s
64.28 s
> ------------
64.28 s
> Nextest run ID 58eb0011-5b4e-4cb8-992d-804b4fea4d80 with nextest profile: ci_gammaloop
64.28 s
> Starting 0 tests across 1 binary
64.28 s
> ------------
64.28 s
> Summary [ 0.000s] 0 tests run: 0 passed , 0 skipped
64.28 s
>
64.28 s
> ========== nextest test summary ==========
64.28 s
> report: target/nextest/ci_gammaloop/junit.xml
64.28 s
> tests: 0, failures: 0, errors: 0
64.28 s
> No failing testcases found.
64.28 s
> =========================================
64.28 s
> Extracting 4 binaries, 1 build script output directory, and 2 linked paths to /build/nextest-archive-PcSQ2a
64.28 s
> Extracted 18 files to /build/nextest-archive-PcSQ2a in 0.42s
64.28 s
> ------------
64.28 s
> Nextest run ID edcd3ae3-f66f-4f86-8470-001869e64843 with nextest profile: ci_gammaloop
64.28 s
> Starting 456 tests across 4 binaries (61 tests skipped , including 60 tests via profile.ci_gammaloop.default-filter )
64.28 s
> FAIL [ 0.129s] (441/456) gammalooprs::test_renormalization finit_part_ghlo
64.28 s
> stdout ---
64.28 s
>
64.28 s
> running 1 test
64.28 s
> test finit_part_ghlo ... FAILED
64.28 s
>
64.28 s
> failures:
64.28 s
>
64.28 s
> failures:
64.28 s
> finit_part_ghlo
64.28 s
>
64.28 s
> test result: FAILED. 0 passed; 1 failed; 0 ignored; 0 measured; 5 filtered out; finished in 0.12s
64.28 s
>
64.28 s
> stderr ---
64.28 s
> The application panicked (crashed).
64.28 s
> Message: called `Result::unwrap()` on an `Err` value:
64.28 s
> 0: Symbolica could not parse FORM output:
64.28 s
> [spenso::{antisymmetric,real,spenso::tensor}::f]([spenso::{spenso::representat\
64.28 s
> ion,spenso::self_dual}::coad](8,[gammalooprs::{spenso::index}::hedge](0)
64.28 s
> ),[spenso::{spenso::representation,spenso::self_dual}::coad](8,[gammaloo\
64.28 s
> prs::{spenso::index}::hedge](3)),[spenso::{spenso::representation,spenso\
64.28 s
> ::self_dual}::coad](8,[gammalooprs::{spenso::index}::hedge](5)))*
64.28 s
> [spenso::{antisymmetric,real,spenso::tensor}::f]([spenso::{spenso::repre\
64.28 s
> sentation,spenso::self_dual}::coad](8,[gammalooprs::{spenso::index}::hed\
64.28 s
> ge](1)),[spenso::{spenso::representation,spenso::self_dual}::coad](8,
64.28 s
> [gammalooprs::{spenso::index}::hedge](3)),[spenso::{spenso::representati\
64.28 s
> on,spenso::self_dual}::coad](8,[gammalooprs::{spenso::index}::hedge](5))
64.28 s
> )*dot(p1,p0)*[UFO::{}::GC_10]^2*rat(-1,1)
64.28 s
>
64.28 s
> Error:Symbol spenso::coad redefined with new attributes:
64.28 s
> - new user data specified: List([String("spenso::representation-v2"), String("self-dual"), List([String("symbol"), String("coad")]), List([String("cyclic"), Integer(1), List([List([String("symbol"), String("a")]), List([String("symbol"), String("b")]), List([String("symbol"), String("c")]), List([String("symbol"), String("d")])])]), String("top")]) vs None
64.28 s
>
64.28 s
>
64.28 s
> Location:
64.28 s
> crates/gammalooprs/src/uv/approx/integrated.rs :332
64.28 s
>
64.28 s
> ━━━━━━━━━━━━━━━━━━━━━━━━━━━━━━━━━━ BACKTRACE ━━━━━━━━━━━━━━━━━━━━━━━━━━━━━━━━━━━
64.28 s
> 1: <color_eyre[5722b77bc20a64cf]::config::EyreHook>::into_eyre_hook::{closure#0} <unknown>
64.28 s
> at <unknown source file> :<unknown line>
64.28 s
> 2: eyre[cb2fd339c0c40fca]::capture_handler <unknown>
64.28 s
> at <unknown source file> :<unknown line>
64.28 s
> 3: <eyre[cb2fd339c0c40fca]::Report>::from_std::<vakint[eb7a1daa8ec05e1f]::VakintError> <unknown>
64.28 s
> at <unknown source file> :<unknown line>
64.28 s
> 4: <gammalooprs[822fc56666e1de73]::uv::approx::integrated::Integrated>::integrate::<gammalooprs[822fc56666e1de73]::uv::hedge_poset::ForestNode> <unknown>
64.28 s
> at <unknown source file> :<unknown line>
64.28 s
> 5: <gammalooprs[822fc56666e1de73]::uv::approx::integrated::Integrated>::run::<gammalooprs[822fc56666e1de73]::uv::hedge_poset::ForestNode, gammalooprs[822fc56666e1de73]::uv::hedge_poset::ForestNode> <unknown>
64.28 s
> at <unknown source file> :<unknown line>
64.28 s
> 6: <gammalooprs[822fc56666e1de73]::uv::hedge_poset::Forests>::integrate <unknown>
64.28 s
> at <unknown source file> :<unknown line>
64.28 s
> 7: gammalooprs[822fc56666e1de73]::uv::orchestrator::hedge_poset_renormalization_part <unknown>
64.28 s
> at <unknown source file> :<unknown line>
64.28 s
> 8: <gammalooprs[822fc56666e1de73]::uv::settings::UVOrchestrator>::renormalization_part <unknown>
64.28 s
> at <unknown source file> :<unknown line>
64.28 s
> 9: <gammalooprs[822fc56666e1de73]::processes::amplitude::AmplitudeGraph>::renormalization_part <unknown>
64.28 s
> at <unknown source file> :<unknown line>
64.28 s
> 10: <test_renormalization[9f554b029f822e2d]::finit_part_ghlo::{closure#0} as core[940e698046960fd5]::ops::function::FnOnce<()>>::call_once <unknown>
64.28 s
> at <unknown source file> :<unknown line>
64.28 s
> 11: test[75d6903177b1d7e9]::__rust_begin_short_backtrace::<core[940e698046960fd5]::result::Result<(), alloc[2ea6bcb46fca0c42]::string::String>, fn() -> core[940e698046960fd5]::result::Result<(), alloc[2ea6bcb46fca0c42]::string::String>> <unknown>
64.28 s
> at <unknown source file> :<unknown line>
64.28 s
> 12: test[75d6903177b1d7e9]::run_test::{closure#0} <unknown>
64.28 s
> at <unknown source file> :<unknown line>
64.28 s
> 13: std[bcb96dfbba0ab899]::sys::backtrace::__rust_begin_short_backtrace::<test[75d6903177b1d7e9]::run_test::{closure#1}, ()> <unknown>
64.28 s
> at <unknown source file> :<unknown line>
64.28 s
> 14: <std[bcb96dfbba0ab899]::thread::lifecycle::spawn_unchecked<test[75d6903177b1d7e9]::run_test::{closure#1}, ()>::{closure#1} as core[940e698046960fd5]::ops::function::FnOnce<()>>::call_once::{shim:vtable#0} <unknown>
64.28 s
> at <unknown source file> :<unknown line>
64.28 s
> 15: <std[bcb96dfbba0ab899]::sys::thread::unix::Thread>::new::thread_start <unknown>
64.28 s
> at <unknown source file> :<unknown line>
64.28 s
> 16: start_thread <unknown>
64.28 s
> at <unknown source file> :<unknown line>
64.28 s
> 17: __clone3 <unknown>
64.28 s
> at <unknown source file> :<unknown line>
64.28 s
>
64.28 s
> Run with COLORBT_SHOW_HIDDEN=1 environment variable to disable frame filtering.
64.28 s
> Run with RUST_BACKTRACE=full to include source snippets.
64.28 s
> Location: crates/gammalooprs/tests/test_renormalization.rs :550
64.28 s
>
64.28 s
> ━━━━━━━━━━━━━━━━━━━━━━━━━━━━━━━━━━ BACKTRACE ━━━━━━━━━━━━━━━━━━━━━━━━━━━━━━━━━━━
64.28 s
> 1: <color_eyre[5722b77bc20a64cf]::config::PanicHook>::panic_report <unknown>
64.28 s
> at <unknown source file> :<unknown line>
64.28 s
> 2: <color_eyre[5722b77bc20a64cf]::config::PanicHook>::into_panic_hook::{closure#0} <unknown>
64.28 s
> at <unknown source file> :<unknown line>
64.28 s
> 3: std[bcb96dfbba0ab899]::panicking::panic_with_hook <unknown>
64.28 s
> at <unknown source file> :<unknown line>
64.28 s
> 4: std[bcb96dfbba0ab899]::panicking::panic_handler::{closure#0} <unknown>
64.28 s
> at <unknown source file> :<unknown line>
64.28 s
> 5: std[bcb96dfbba0ab899]::sys::backtrace::__rust_end_short_backtrace::<std[bcb96dfbba0ab899]::panicking::panic_handler::{closure#0}, !> <unknown>
64.28 s
> at <unknown source file> :<unknown line>
64.28 s
> 6: __rustc[6c289b9f9c454d21]::rust_begin_unwind <unknown>
64.28 s
> at <unknown source file> :<unknown line>
64.28 s
> 7: core[940e698046960fd5]::panicking::panic_fmt <unknown>
64.28 s
> at <unknown source file> :<unknown line>
64.28 s
> 8: core[940e698046960fd5]::result::unwrap_failed <unknown>
64.28 s
> at <unknown source file> :<unknown line>
64.28 s
> 9: <test_renormalization[9f554b029f822e2d]::finit_part_ghlo::{closure#0} as core[940e698046960fd5]::ops::function::FnOnce<()>>::call_once <unknown>
64.28 s
> at <unknown source file> :<unknown line>
64.28 s
> 10: test[75d6903177b1d7e9]::__rust_begin_short_backtrace::<core[940e698046960fd5]::result::Result<(), alloc[2ea6bcb46fca0c42]::string::String>, fn() -> core[940e698046960fd5]::result::Result<(), alloc[2ea6bcb46fca0c42]::string::String>> <unknown>
64.28 s
> at <unknown source file> :<unknown line>
64.28 s
> 11: test[75d6903177b1d7e9]::run_test::{closure#0} <unknown>
64.28 s
> at <unknown source file> :<unknown line>
64.28 s
> 12: std[bcb96dfbba0ab899]::sys::backtrace::__rust_begin_short_backtrace::<test[75d6903177b1d7e9]::run_test::{closure#1}, ()> <unknown>
64.28 s
> at <unknown source file> :<unknown line>
64.28 s
> 13: <std[bcb96dfbba0ab899]::thread::lifecycle::spawn_unchecked<test[75d6903177b1d7e9]::run_test::{closure#1}, ()>::{closure#1} as core[940e698046960fd5]::ops::function::FnOnce<()>>::call_once::{shim:vtable#0} <unknown>
64.28 s
> at <unknown source file> :<unknown line>
64.28 s
> 14: <std[bcb96dfbba0ab899]::sys::thread::unix::Thread>::new::thread_start <unknown>
64.28 s
> at <unknown source file> :<unknown line>
64.28 s
> 15: start_thread <unknown>
64.28 s
> at <unknown source file> :<unknown line>
64.28 s
> 16: __clone3 <unknown>
64.28 s
> at <unknown source file> :<unknown line>
64.28 s
>
64.28 s
> Run with COLORBT_SHOW_HIDDEN=1 environment variable to disable frame filtering.
64.28 s
> Run with RUST_BACKTRACE=full to include source snippets.
64.28 s
>
64.28 s
> FAIL [ 0.119s] (442/456) gammalooprs::test_renormalization finite_part_quark_lo
64.28 s
> stdout ---
64.28 s
>
64.28 s
> running 1 test
64.28 s
> test finite_part_quark_lo ... FAILED
64.28 s
>
64.28 s
> failures:
64.28 s
>
64.28 s
> failures:
64.28 s
> finite_part_quark_lo
64.28 s
>
64.28 s
> test result: FAILED. 0 passed; 1 failed; 0 ignored; 0 measured; 5 filtered out; finished in 0.11s
64.28 s
>
64.28 s
> stderr ---
64.28 s
> The application panicked (crashed).
64.28 s
> Message: called `Result::unwrap()` on an `Err` value: "Symbol spenso::mink redefined with new attributes:\n\t- new user data specified: List([String(\"spenso::representation-v2\"), String(\"inline-metric\"), List([String(\"symbol\"), String(\"mink\")]), List([String(\"cyclic\"), Integer(1), List([List([String(\"symbol\"), String(\"mu\")]), List([String(\"symbol\"), String(\"nu\")]), List([String(\"symbol\"), String(\"rho\")]), List([String(\"symbol\"), String(\"sigma\")])])]), String(\"top\")]) vs None\n"
64.28 s
> Location: crates/vakint/src/lib.rs :4766
64.28 s
>
64.28 s
> ━━━━━━━━━━━━━━━━━━━━━━━━━━━━━━━━━━ BACKTRACE ━━━━━━━━━━━━━━━━━━━━━━━━━━━━━━━━━━━
64.28 s
> 1: <color_eyre[5722b77bc20a64cf]::config::PanicHook>::panic_report <unknown>
64.28 s
> at <unknown source file> :<unknown line>
64.28 s
> 2: <color_eyre[5722b77bc20a64cf]::config::PanicHook>::into_panic_hook::{closure#0} <unknown>
64.28 s
> at <unknown source file> :<unknown line>
64.28 s
> 3: std[bcb96dfbba0ab899]::panicking::panic_with_hook <unknown>
64.28 s
> at <unknown source file> :<unknown line>
64.28 s
> 4: std[bcb96dfbba0ab899]::panicking::panic_handler::{closure#0} <unknown>
64.28 s
> at <unknown source file> :<unknown line>
64.28 s
> 5: std[bcb96dfbba0ab899]::sys::backtrace::__rust_end_short_backtrace::<std[bcb96dfbba0ab899]::panicking::panic_handler::{closure#0}, !> <unknown>
64.28 s
> at <unknown source file> :<unknown line>
64.28 s
> 6: __rustc[6c289b9f9c454d21]::rust_begin_unwind <unknown>
64.28 s
> at <unknown source file> :<unknown line>
64.28 s
> 7: core[940e698046960fd5]::panicking::panic_fmt <unknown>
64.28 s
> at <unknown source file> :<unknown line>
64.28 s
> 8: core[940e698046960fd5]::result::unwrap_failed <unknown>
64.28 s
> at <unknown source file> :<unknown line>
64.28 s
> 9: <vakint[eb7a1daa8ec05e1f]::Vakint>::sanitize_user_expressions <unknown>
64.28 s
> at <unknown source file> :<unknown line>
64.28 s
> 10: <vakint[eb7a1daa8ec05e1f]::Vakint>::prepare_expression_for_form <unknown>
64.28 s
> at <unknown source file> :<unknown line>
64.28 s
> 11: <vakint[eb7a1daa8ec05e1f]::VakintTerm>::tensor_reduce <unknown>
64.28 s
> at <unknown source file> :<unknown line>
64.28 s
> 12: <vakint[eb7a1daa8ec05e1f]::VakintExpression>::tensor_reduce <unknown>
64.28 s
> at <unknown source file> :<unknown line>
64.28 s
> 13: <gammalooprs[822fc56666e1de73]::uv::approx::integrated::Integrated>::integrate::<gammalooprs[822fc56666e1de73]::uv::hedge_poset::ForestNode> <unknown>
64.28 s
> at <unknown source file> :<unknown line>
64.28 s
> 14: <gammalooprs[822fc56666e1de73]::uv::approx::integrated::Integrated>::run::<gammalooprs[822fc56666e1de73]::uv::hedge_poset::ForestNode, gammalooprs[822fc56666e1de73]::uv::hedge_poset::ForestNode> <unknown>
64.28 s
> at <unknown source file> :<unknown line>
64.28 s
> 15: <gammalooprs[822fc56666e1de73]::uv::hedge_poset::Forests>::integrate <unknown>
64.28 s
> at <unknown source file> :<unknown line>
64.28 s
> 16: gammalooprs[822fc56666e1de73]::uv::orchestrator::hedge_poset_renormalization_part <unknown>
64.28 s
> at <unknown source file> :<unknown line>
64.28 s
> 17: <gammalooprs[822fc56666e1de73]::uv::settings::UVOrchestrator>::renormalization_part <unknown>
64.28 s
> at <unknown source file> :<unknown line>
64.28 s
> 18: <gammalooprs[822fc56666e1de73]::processes::amplitude::AmplitudeGraph>::renormalization_part <unknown>
64.28 s
> at <unknown source file> :<unknown line>
64.28 s
> 19: <test_renormalization[9f554b029f822e2d]::finite_part_quark_lo::{closure#0} as core[940e698046960fd5]::ops::function::FnOnce<()>>::call_once <unknown>
64.28 s
> at <unknown source file> :<unknown line>
64.28 s
> 20: test[75d6903177b1d7e9]::__rust_begin_short_backtrace::<core[940e698046960fd5]::result::Result<(), alloc[2ea6bcb46fca0c42]::string::String>, fn() -> core[940e698046960fd5]::result::Result<(), alloc[2ea6bcb46fca0c42]::string::String>> <unknown>
64.28 s
> at <unknown source file> :<unknown line>
64.28 s
> 21: test[75d6903177b1d7e9]::run_test::{closure#0} <unknown>
64.28 s
> at <unknown source file> :<unknown line>
64.28 s
> 22: std[bcb96dfbba0ab899]::sys::backtrace::__rust_begin_short_backtrace::<test[75d6903177b1d7e9]::run_test::{closure#1}, ()> <unknown>
64.28 s
> at <unknown source file> :<unknown line>
64.28 s
> 23: <std[bcb96dfbba0ab899]::thread::lifecycle::spawn_unchecked<test[75d6903177b1d7e9]::run_test::{closure#1}, ()>::{closure#1} as core[940e698046960fd5]::ops::function::FnOnce<()>>::call_once::{shim:vtable#0} <unknown>
64.28 s
> at <unknown source file> :<unknown line>
64.28 s
> 24: <std[bcb96dfbba0ab899]::sys::thread::unix::Thread>::new::thread_start <unknown>
64.28 s
> at <unknown source file> :<unknown line>
64.28 s
> 25: start_thread <unknown>
64.28 s
> at <unknown source file> :<unknown line>
64.28 s
> 26: __clone3 <unknown>
64.28 s
> at <unknown source file> :<unknown line>
64.28 s
>
64.28 s
> Run with COLORBT_SHOW_HIDDEN=1 environment variable to disable frame filtering.
64.28 s
> Run with RUST_BACKTRACE=full to include source snippets.
64.28 s
>
64.28 s
> FAIL [ 0.201s] (445/456) gammalooprs::test_renormalization finite_part_ghost_2loop
64.28 s
> stdout ---
64.28 s
>
64.28 s
> running 1 test
64.28 s
> test finite_part_ghost_2loop ... FAILED
64.28 s
>
64.28 s
> failures:
64.28 s
>
64.28 s
> failures:
64.28 s
> finite_part_ghost_2loop
64.28 s
>
64.28 s
> test result: FAILED. 0 passed; 1 failed; 0 ignored; 0 measured; 5 filtered out; finished in 0.19s
64.28 s
>
64.28 s
> stderr ---
64.28 s
> The application panicked (crashed).
64.28 s
> Message: called `Result::unwrap()` on an `Err` value: "Symbol spenso::mink redefined with new attributes:\n\t- new user data specified: List([String(\"spenso::representation-v2\"), String(\"inline-metric\"), List([String(\"symbol\"), String(\"mink\")]), List([String(\"cyclic\"), Integer(1), List([List([String(\"symbol\"), String(\"mu\")]), List([String(\"symbol\"), String(\"nu\")]), List([String(\"symbol\"), String(\"rho\")]), List([String(\"symbol\"), String(\"sigma\")])])]), String(\"top\")]) vs None\n"
64.28 s
> Location: crates/vakint/src/lib.rs :4766
64.28 s
>
64.28 s
> ━━━━━━━━━━━━━━━━━━━━━━━━━━━━━━━━━━ BACKTRACE ━━━━━━━━━━━━━━━━━━━━━━━━━━━━━━━━━━━
64.28 s
> 1: <color_eyre[5722b77bc20a64cf]::config::PanicHook>::panic_report <unknown>
64.28 s
> at <unknown source file> :<unknown line>
64.28 s
> 2: <color_eyre[5722b77bc20a64cf]::config::PanicHook>::into_panic_hook::{closure#0} <unknown>
64.28 s
> at <unknown source file> :<unknown line>
64.28 s
> 3: std[bcb96dfbba0ab899]::panicking::panic_with_hook <unknown>
64.28 s
> at <unknown source file> :<unknown line>
64.28 s
> 4: std[bcb96dfbba0ab899]::panicking::panic_handler::{closure#0} <unknown>
64.28 s
> at <unknown source file> :<unknown line>
64.28 s
> 5: std[bcb96dfbba0ab899]::sys::backtrace::__rust_end_short_backtrace::<std[bcb96dfbba0ab899]::panicking::panic_handler::{closure#0}, !> <unknown>
64.28 s
> at <unknown source file> :<unknown line>
64.28 s
> 6: __rustc[6c289b9f9c454d21]::rust_begin_unwind <unknown>
64.28 s
> at <unknown source file> :<unknown line>
64.28 s
> 7: core[940e698046960fd5]::panicking::panic_fmt <unknown>
64.28 s
> at <unknown source file> :<unknown line>
64.28 s
> 8: core[940e698046960fd5]::result::unwrap_failed <unknown>
64.28 s
> at <unknown source file> :<unknown line>
64.28 s
> 9: <vakint[eb7a1daa8ec05e1f]::Vakint>::sanitize_user_expressions <unknown>
64.28 s
> at <unknown source file> :<unknown line>
64.28 s
> 10: <vakint[eb7a1daa8ec05e1f]::Vakint>::prepare_expression_for_form <unknown>
64.28 s
> at <unknown source file> :<unknown line>
64.28 s
> 11: <vakint[eb7a1daa8ec05e1f]::VakintTerm>::tensor_reduce <unknown>
64.28 s
> at <unknown source file> :<unknown line>
64.28 s
> 12: <vakint[eb7a1daa8ec05e1f]::VakintExpression>::tensor_reduce <unknown>
64.28 s
> at <unknown source file> :<unknown line>
64.28 s
> 13: <gammalooprs[822fc56666e1de73]::uv::approx::integrated::Integrated>::integrate::<gammalooprs[822fc56666e1de73]::uv::approx::Approximation> <unknown>
64.28 s
> at <unknown source file> :<unknown line>
64.28 s
> 14: <gammalooprs[822fc56666e1de73]::uv::approx::integrated::Integrated>::run::<gammalooprs[822fc56666e1de73]::uv::approx::Approximation, gammalooprs[822fc56666e1de73]::uv::approx::Approximation> <unknown>
64.28 s
> at <unknown source file> :<unknown line>
64.28 s
> 15: <gammalooprs[822fc56666e1de73]::uv::forest::Forest>::compute <unknown>
64.28 s
> at <unknown source file> :<unknown line>
64.28 s
> 16: gammalooprs[822fc56666e1de73]::uv::orchestrator::legacy_renormalization_part <unknown>
64.28 s
> at <unknown source file> :<unknown line>
64.28 s
> 17: <gammalooprs[822fc56666e1de73]::uv::settings::UVOrchestrator>::renormalization_part <unknown>
64.28 s
> at <unknown source file> :<unknown line>
64.28 s
> 18: <gammalooprs[822fc56666e1de73]::processes::amplitude::AmplitudeGraph>::renormalization_part <unknown>
64.28 s
> at <unknown source file> :<unknown line>
64.28 s
> 19: test_renormalization[9f554b029f822e2d]::finite_part_ghost_2loop <unknown>
64.28 s
> at <unknown source file> :<unknown line>
64.28 s
> 20: <test_renormalization[9f554b029f822e2d]::finite_part_ghost_2loop::{closure#0} as core[940e698046960fd5]::ops::function::FnOnce<()>>::call_once <unknown>
64.28 s
> at <unknown source file> :<unknown line>
64.28 s
> 21: test[75d6903177b1d7e9]::__rust_begin_short_backtrace::<core[940e698046960fd5]::result::Result<(), alloc[2ea6bcb46fca0c42]::string::String>, fn() -> core[940e698046960fd5]::result::Result<(), alloc[2ea6bcb46fca0c42]::string::String>> <unknown>
64.28 s
> at <unknown source file> :<unknown line>
64.28 s
> 22: test[75d6903177b1d7e9]::run_test::{closure#0} <unknown>
64.28 s
> at <unknown source file> :<unknown line>
64.28 s
> 23: std[bcb96dfbba0ab899]::sys::backtrace::__rust_begin_short_backtrace::<test[75d6903177b1d7e9]::run_test::{closure#1}, ()> <unknown>
64.28 s
> at <unknown source file> :<unknown line>
64.28 s
> 24: <std[bcb96dfbba0ab899]::thread::lifecycle::spawn_unchecked<test[75d6903177b1d7e9]::run_test::{closure#1}, ()>::{closure#1} as core[940e698046960fd5]::ops::function::FnOnce<()>>::call_once::{shim:vtable#0} <unknown>
64.28 s
> at <unknown source file> :<unknown line>
64.28 s
> 25: <std[bcb96dfbba0ab899]::sys::thread::unix::Thread>::new::thread_start <unknown>
64.28 s
> at <unknown source file> :<unknown line>
64.28 s
> 26: start_thread <unknown>
64.28 s
> at <unknown source file> :<unknown line>
64.28 s
> 27: __clone3 <unknown>
64.28 s
> at <unknown source file> :<unknown line>
64.28 s
>
64.28 s
> Run with COLORBT_SHOW_HIDDEN=1 environment variable to disable frame filtering.
64.28 s
> Run with RUST_BACKTRACE=full to include source snippets.
64.28 s
>
64.28 s
> ------------
64.28 s
> Summary [ 7.733s] 456 tests run: 453 passed , 3 failed , 61 skipped
64.28 s
> FAIL [ 0.129s] (441/456) gammalooprs::test_renormalization finit_part_ghlo
64.28 s
> stdout ---
64.28 s
>
64.28 s
> running 1 test
64.28 s
> test finit_part_ghlo ... FAILED
64.28 s
>
64.28 s
> failures:
64.28 s
>
64.28 s
> failures:
64.28 s
> finit_part_ghlo
64.28 s
>
64.28 s
> test result: FAILED. 0 passed; 1 failed; 0 ignored; 0 measured; 5 filtered out; finished in 0.12s
64.28 s
>
64.28 s
> stderr ---
64.28 s
> The application panicked (crashed).
64.28 s
> Message: called `Result::unwrap()` on an `Err` value:
64.28 s
> 0: Symbolica could not parse FORM output:
64.28 s
> [spenso::{antisymmetric,real,spenso::tensor}::f]([spenso::{spenso::representat\
64.28 s
> ion,spenso::self_dual}::coad](8,[gammalooprs::{spenso::index}::hedge](0)
64.28 s
> ),[spenso::{spenso::representation,spenso::self_dual}::coad](8,[gammaloo\
64.28 s
> prs::{spenso::index}::hedge](3)),[spenso::{spenso::representation,spenso\
64.28 s
> ::self_dual}::coad](8,[gammalooprs::{spenso::index}::hedge](5)))*
64.28 s
> [spenso::{antisymmetric,real,spenso::tensor}::f]([spenso::{spenso::repre\
64.28 s
> sentation,spenso::self_dual}::coad](8,[gammalooprs::{spenso::index}::hed\
64.28 s
> ge](1)),[spenso::{spenso::representation,spenso::self_dual}::coad](8,
64.28 s
> [gammalooprs::{spenso::index}::hedge](3)),[spenso::{spenso::representati\
64.28 s
> on,spenso::self_dual}::coad](8,[gammalooprs::{spenso::index}::hedge](5))
64.28 s
> )*dot(p1,p0)*[UFO::{}::GC_10]^2*rat(-1,1)
64.28 s
>
64.28 s
> Error:Symbol spenso::coad redefined with new attributes:
64.28 s
> - new user data specified: List([String("spenso::representation-v2"), String("self-dual"), List([String("symbol"), String("coad")]), List([String("cyclic"), Integer(1), List([List([String("symbol"), String("a")]), List([String("symbol"), String("b")]), List([String("symbol"), String("c")]), List([String("symbol"), String("d")])])]), String("top")]) vs None
64.28 s
>
64.28 s
>
64.28 s
> Location:
64.28 s
> crates/gammalooprs/src/uv/approx/integrated.rs :332
64.28 s
>
64.28 s
> ━━━━━━━━━━━━━━━━━━━━━━━━━━━━━━━━━━ BACKTRACE ━━━━━━━━━━━━━━━━━━━━━━━━━━━━━━━━━━━
64.28 s
> 1: <color_eyre[5722b77bc20a64cf]::config::EyreHook>::into_eyre_hook::{closure#0} <unknown>
64.28 s
> at <unknown source file> :<unknown line>
64.28 s
> 2: eyre[cb2fd339c0c40fca]::capture_handler <unknown>
64.28 s
> at <unknown source file> :<unknown line>
64.28 s
> 3: <eyre[cb2fd339c0c40fca]::Report>::from_std::<vakint[eb7a1daa8ec05e1f]::VakintError> <unknown>
64.28 s
> at <unknown source file> :<unknown line>
64.28 s
> 4: <gammalooprs[822fc56666e1de73]::uv::approx::integrated::Integrated>::integrate::<gammalooprs[822fc56666e1de73]::uv::hedge_poset::ForestNode> <unknown>
64.28 s
> at <unknown source file> :<unknown line>
64.28 s
> 5: <gammalooprs[822fc56666e1de73]::uv::approx::integrated::Integrated>::run::<gammalooprs[822fc56666e1de73]::uv::hedge_poset::ForestNode, gammalooprs[822fc56666e1de73]::uv::hedge_poset::ForestNode> <unknown>
64.28 s
> at <unknown source file> :<unknown line>
64.28 s
> 6: <gammalooprs[822fc56666e1de73]::uv::hedge_poset::Forests>::integrate <unknown>
64.28 s
> at <unknown source file> :<unknown line>
64.28 s
> 7: gammalooprs[822fc56666e1de73]::uv::orchestrator::hedge_poset_renormalization_part <unknown>
64.28 s
> at <unknown source file> :<unknown line>
64.28 s
> 8: <gammalooprs[822fc56666e1de73]::uv::settings::UVOrchestrator>::renormalization_part <unknown>
64.28 s
> at <unknown source file> :<unknown line>
64.28 s
> 9: <gammalooprs[822fc56666e1de73]::processes::amplitude::AmplitudeGraph>::renormalization_part <unknown>
64.28 s
> at <unknown source file> :<unknown line>
64.28 s
> 10: <test_renormalization[9f554b029f822e2d]::finit_part_ghlo::{closure#0} as core[940e698046960fd5]::ops::function::FnOnce<()>>::call_once <unknown>
64.28 s
> at <unknown source file> :<unknown line>
64.28 s
> 11: test[75d6903177b1d7e9]::__rust_begin_short_backtrace::<core[940e698046960fd5]::result::Result<(), alloc[2ea6bcb46fca0c42]::string::String>, fn() -> core[940e698046960fd5]::result::Result<(), alloc[2ea6bcb46fca0c42]::string::String>> <unknown>
64.28 s
> at <unknown source file> :<unknown line>
64.28 s
> 12: test[75d6903177b1d7e9]::run_test::{closure#0} <unknown>
64.28 s
> at <unknown source file> :<unknown line>
64.28 s
> 13: std[bcb96dfbba0ab899]::sys::backtrace::__rust_begin_short_backtrace::<test[75d6903177b1d7e9]::run_test::{closure#1}, ()> <unknown>
64.28 s
> at <unknown source file> :<unknown line>
64.28 s
> 14: <std[bcb96dfbba0ab899]::thread::lifecycle::spawn_unchecked<test[75d6903177b1d7e9]::run_test::{closure#1}, ()>::{closure#1} as core[940e698046960fd5]::ops::function::FnOnce<()>>::call_once::{shim:vtable#0} <unknown>
64.28 s
> at <unknown source file> :<unknown line>
64.28 s
> 15: <std[bcb96dfbba0ab899]::sys::thread::unix::Thread>::new::thread_start <unknown>
64.28 s
> at <unknown source file> :<unknown line>
64.28 s
> 16: start_thread <unknown>
64.28 s
> at <unknown source file> :<unknown line>
64.28 s
> 17: __clone3 <unknown>
64.28 s
> at <unknown source file> :<unknown line>
64.28 s
>
64.28 s
> Run with COLORBT_SHOW_HIDDEN=1 environment variable to disable frame filtering.
64.28 s
> Run with RUST_BACKTRACE=full to include source snippets.
64.28 s
> Location: crates/gammalooprs/tests/test_renormalization.rs :550
64.28 s
>
64.28 s
> ━━━━━━━━━━━━━━━━━━━━━━━━━━━━━━━━━━ BACKTRACE ━━━━━━━━━━━━━━━━━━━━━━━━━━━━━━━━━━━
64.28 s
> 1: <color_eyre[5722b77bc20a64cf]::config::PanicHook>::panic_report <unknown>
64.28 s
> at <unknown source file> :<unknown line>
64.28 s
> 2: <color_eyre[5722b77bc20a64cf]::config::PanicHook>::into_panic_hook::{closure#0} <unknown>
64.28 s
> at <unknown source file> :<unknown line>
64.28 s
> 3: std[bcb96dfbba0ab899]::panicking::panic_with_hook <unknown>
64.28 s
> at <unknown source file> :<unknown line>
64.28 s
> 4: std[bcb96dfbba0ab899]::panicking::panic_handler::{closure#0} <unknown>
64.28 s
> at <unknown source file> :<unknown line>
64.28 s
> 5: std[bcb96dfbba0ab899]::sys::backtrace::__rust_end_short_backtrace::<std[bcb96dfbba0ab899]::panicking::panic_handler::{closure#0}, !> <unknown>
64.28 s
> at <unknown source file> :<unknown line>
64.28 s
> 6: __rustc[6c289b9f9c454d21]::rust_begin_unwind <unknown>
64.28 s
> at <unknown source file> :<unknown line>
64.28 s
> 7: core[940e698046960fd5]::panicking::panic_fmt <unknown>
64.28 s
> at <unknown source file> :<unknown line>
64.28 s
> 8: core[940e698046960fd5]::result::unwrap_failed <unknown>
64.28 s
> at <unknown source file> :<unknown line>
64.28 s
> 9: <test_renormalization[9f554b029f822e2d]::finit_part_ghlo::{closure#0} as core[940e698046960fd5]::ops::function::FnOnce<()>>::call_once <unknown>
64.28 s
> at <unknown source file> :<unknown line>
64.28 s
> 10: test[75d6903177b1d7e9]::__rust_begin_short_backtrace::<core[940e698046960fd5]::result::Result<(), alloc[2ea6bcb46fca0c42]::string::String>, fn() -> core[940e698046960fd5]::result::Result<(), alloc[2ea6bcb46fca0c42]::string::String>> <unknown>
64.28 s
> at <unknown source file> :<unknown line>
64.28 s
> 11: test[75d6903177b1d7e9]::run_test::{closure#0} <unknown>
64.28 s
> at <unknown source file> :<unknown line>
64.28 s
> 12: std[bcb96dfbba0ab899]::sys::backtrace::__rust_begin_short_backtrace::<test[75d6903177b1d7e9]::run_test::{closure#1}, ()> <unknown>
64.28 s
> at <unknown source file> :<unknown line>
64.28 s
> 13: <std[bcb96dfbba0ab899]::thread::lifecycle::spawn_unchecked<test[75d6903177b1d7e9]::run_test::{closure#1}, ()>::{closure#1} as core[940e698046960fd5]::ops::function::FnOnce<()>>::call_once::{shim:vtable#0} <unknown>
64.28 s
> at <unknown source file> :<unknown line>
64.28 s
> 14: <std[bcb96dfbba0ab899]::sys::thread::unix::Thread>::new::thread_start <unknown>
64.28 s
> at <unknown source file> :<unknown line>
64.28 s
> 15: start_thread <unknown>
64.28 s
> at <unknown source file> :<unknown line>
64.28 s
> 16: __clone3 <unknown>
64.28 s
> at <unknown source file> :<unknown line>
64.28 s
>
64.28 s
> Run with COLORBT_SHOW_HIDDEN=1 environment variable to disable frame filtering.
64.28 s
> Run with RUST_BACKTRACE=full to include source snippets.
64.28 s
>
64.28 s
> FAIL [ 0.119s] (442/456) gammalooprs::test_renormalization finite_part_quark_lo
64.28 s
> stdout ---
64.28 s
>
64.28 s
> running 1 test
64.28 s
> test finite_part_quark_lo ... FAILED
64.28 s
>
64.28 s
> failures:
64.28 s
>
64.28 s
> failures:
64.28 s
> finite_part_quark_lo
64.28 s
>
64.28 s
> test result: FAILED. 0 passed; 1 failed; 0 ignored; 0 measured; 5 filtered out; finished in 0.11s
64.28 s
>
64.28 s
> stderr ---
64.28 s
> The application panicked (crashed).
64.28 s
> Message: called `Result::unwrap()` on an `Err` value: "Symbol spenso::mink redefined with new attributes:\n\t- new user data specified: List([String(\"spenso::representation-v2\"), String(\"inline-metric\"), List([String(\"symbol\"), String(\"mink\")]), List([String(\"cyclic\"), Integer(1), List([List([String(\"symbol\"), String(\"mu\")]), List([String(\"symbol\"), String(\"nu\")]), List([String(\"symbol\"), String(\"rho\")]), List([String(\"symbol\"), String(\"sigma\")])])]), String(\"top\")]) vs None\n"
64.28 s
> Location: crates/vakint/src/lib.rs :4766
64.28 s
>
64.28 s
> ━━━━━━━━━━━━━━━━━━━━━━━━━━━━━━━━━━ BACKTRACE ━━━━━━━━━━━━━━━━━━━━━━━━━━━━━━━━━━━
64.28 s
> 1: <color_eyre[5722b77bc20a64cf]::config::PanicHook>::panic_report <unknown>
64.28 s
> at <unknown source file> :<unknown line>
64.28 s
> 2: <color_eyre[5722b77bc20a64cf]::config::PanicHook>::into_panic_hook::{closure#0} <unknown>
64.28 s
> at <unknown source file> :<unknown line>
64.28 s
> 3: std[bcb96dfbba0ab899]::panicking::panic_with_hook <unknown>
64.28 s
> at <unknown source file> :<unknown line>
64.28 s
> 4: std[bcb96dfbba0ab899]::panicking::panic_handler::{closure#0} <unknown>
64.28 s
> at <unknown source file> :<unknown line>
64.28 s
> 5: std[bcb96dfbba0ab899]::sys::backtrace::__rust_end_short_backtrace::<std[bcb96dfbba0ab899]::panicking::panic_handler::{closure#0}, !> <unknown>
64.28 s
> at <unknown source file> :<unknown line>
64.28 s
> 6: __rustc[6c289b9f9c454d21]::rust_begin_unwind <unknown>
64.28 s
> at <unknown source file> :<unknown line>
64.28 s
> 7: core[940e698046960fd5]::panicking::panic_fmt <unknown>
64.28 s
> at <unknown source file> :<unknown line>
64.28 s
> 8: core[940e698046960fd5]::result::unwrap_failed <unknown>
64.28 s
> at <unknown source file> :<unknown line>
64.28 s
> 9: <vakint[eb7a1daa8ec05e1f]::Vakint>::sanitize_user_expressions <unknown>
64.28 s
> at <unknown source file> :<unknown line>
64.28 s
> 10: <vakint[eb7a1daa8ec05e1f]::Vakint>::prepare_expression_for_form <unknown>
64.28 s
> at <unknown source file> :<unknown line>
64.28 s
> 11: <vakint[eb7a1daa8ec05e1f]::VakintTerm>::tensor_reduce <unknown>
64.28 s
> at <unknown source file> :<unknown line>
64.28 s
> 12: <vakint[eb7a1daa8ec05e1f]::VakintExpression>::tensor_reduce <unknown>
64.28 s
> at <unknown source file> :<unknown line>
64.28 s
> 13: <gammalooprs[822fc56666e1de73]::uv::approx::integrated::Integrated>::integrate::<gammalooprs[822fc56666e1de73]::uv::hedge_poset::ForestNode> <unknown>
64.28 s
> at <unknown source file> :<unknown line>
64.28 s
> 14: <gammalooprs[822fc56666e1de73]::uv::approx::integrated::Integrated>::run::<gammalooprs[822fc56666e1de73]::uv::hedge_poset::ForestNode, gammalooprs[822fc56666e1de73]::uv::hedge_poset::ForestNode> <unknown>
64.28 s
> at <unknown source file> :<unknown line>
64.28 s
> 15: <gammalooprs[822fc56666e1de73]::uv::hedge_poset::Forests>::integrate <unknown>
64.28 s
> at <unknown source file> :<unknown line>
64.28 s
> 16: gammalooprs[822fc56666e1de73]::uv::orchestrator::hedge_poset_renormalization_part <unknown>
64.28 s
> at <unknown source file> :<unknown line>
64.28 s
> 17: <gammalooprs[822fc56666e1de73]::uv::settings::UVOrchestrator>::renormalization_part <unknown>
64.28 s
> at <unknown source file> :<unknown line>
64.28 s
> 18: <gammalooprs[822fc56666e1de73]::processes::amplitude::AmplitudeGraph>::renormalization_part <unknown>
64.28 s
> at <unknown source file> :<unknown line>
64.28 s
> 19: <test_renormalization[9f554b029f822e2d]::finite_part_quark_lo::{closure#0} as core[940e698046960fd5]::ops::function::FnOnce<()>>::call_once <unknown>
64.28 s
> at <unknown source file> :<unknown line>
64.28 s
> 20: test[75d6903177b1d7e9]::__rust_begin_short_backtrace::<core[940e698046960fd5]::result::Result<(), alloc[2ea6bcb46fca0c42]::string::String>, fn() -> core[940e698046960fd5]::result::Result<(), alloc[2ea6bcb46fca0c42]::string::String>> <unknown>
64.28 s
> at <unknown source file> :<unknown line>
64.28 s
> 21: test[75d6903177b1d7e9]::run_test::{closure#0} <unknown>
64.28 s
> at <unknown source file> :<unknown line>
64.28 s
> 22: std[bcb96dfbba0ab899]::sys::backtrace::__rust_begin_short_backtrace::<test[75d6903177b1d7e9]::run_test::{closure#1}, ()> <unknown>
64.28 s
> at <unknown source file> :<unknown line>
64.28 s
> 23: <std[bcb96dfbba0ab899]::thread::lifecycle::spawn_unchecked<test[75d6903177b1d7e9]::run_test::{closure#1}, ()>::{closure#1} as core[940e698046960fd5]::ops::function::FnOnce<()>>::call_once::{shim:vtable#0} <unknown>
64.28 s
> at <unknown source file> :<unknown line>
64.28 s
> 24: <std[bcb96dfbba0ab899]::sys::thread::unix::Thread>::new::thread_start <unknown>
64.28 s
> at <unknown source file> :<unknown line>
64.28 s
> 25: start_thread <unknown>
64.28 s
> at <unknown source file> :<unknown line>
64.28 s
> 26: __clone3 <unknown>
64.28 s
> at <unknown source file> :<unknown line>
64.28 s
>
64.28 s
> Run with COLORBT_SHOW_HIDDEN=1 environment variable to disable frame filtering.
64.28 s
> Run with RUST_BACKTRACE=full to include source snippets.
64.28 s
>
64.28 s
> FAIL [ 0.201s] (445/456) gammalooprs::test_renormalization finite_part_ghost_2loop
64.28 s
> stdout ---
64.28 s
>
64.28 s
> running 1 test
64.28 s
> test finite_part_ghost_2loop ... FAILED
64.28 s
>
64.28 s
> failures:
64.28 s
>
64.28 s
> failures:
64.28 s
> finite_part_ghost_2loop
64.28 s
>
64.28 s
> test result: FAILED. 0 passed; 1 failed; 0 ignored; 0 measured; 5 filtered out; finished in 0.19s
64.28 s
>
64.28 s
> stderr ---
64.28 s
> The application panicked (crashed).
64.28 s
> Message: called `Result::unwrap()` on an `Err` value: "Symbol spenso::mink redefined with new attributes:\n\t- new user data specified: List([String(\"spenso::representation-v2\"), String(\"inline-metric\"), List([String(\"symbol\"), String(\"mink\")]), List([String(\"cyclic\"), Integer(1), List([List([String(\"symbol\"), String(\"mu\")]), List([String(\"symbol\"), String(\"nu\")]), List([String(\"symbol\"), String(\"rho\")]), List([String(\"symbol\"), String(\"sigma\")])])]), String(\"top\")]) vs None\n"
64.28 s
> Location: crates/vakint/src/lib.rs :4766
64.28 s
>
64.28 s
> ━━━━━━━━━━━━━━━━━━━━━━━━━━━━━━━━━━ BACKTRACE ━━━━━━━━━━━━━━━━━━━━━━━━━━━━━━━━━━━
64.28 s
> 1: <color_eyre[5722b77bc20a64cf]::config::PanicHook>::panic_report <unknown>
64.28 s
> at <unknown source file> :<unknown line>
64.28 s
> 2: <color_eyre[5722b77bc20a64cf]::config::PanicHook>::into_panic_hook::{closure#0} <unknown>
64.28 s
> at <unknown source file> :<unknown line>
64.28 s
> 3: std[bcb96dfbba0ab899]::panicking::panic_with_hook <unknown>
64.28 s
> at <unknown source file> :<unknown line>
64.28 s
> 4: std[bcb96dfbba0ab899]::panicking::panic_handler::{closure#0} <unknown>
64.28 s
> at <unknown source file> :<unknown line>
64.28 s
> 5: std[bcb96dfbba0ab899]::sys::backtrace::__rust_end_short_backtrace::<std[bcb96dfbba0ab899]::panicking::panic_handler::{closure#0}, !> <unknown>
64.28 s
> at <unknown source file> :<unknown line>
64.28 s
> 6: __rustc[6c289b9f9c454d21]::rust_begin_unwind <unknown>
64.28 s
> at <unknown source file> :<unknown line>
64.28 s
> 7: core[940e698046960fd5]::panicking::panic_fmt <unknown>
64.28 s
> at <unknown source file> :<unknown line>
64.28 s
> 8: core[940e698046960fd5]::result::unwrap_failed <unknown>
64.28 s
> at <unknown source file> :<unknown line>
64.28 s
> 9: <vakint[eb7a1daa8ec05e1f]::Vakint>::sanitize_user_expressions <unknown>
64.28 s
> at <unknown source file> :<unknown line>
64.28 s
> 10: <vakint[eb7a1daa8ec05e1f]::Vakint>::prepare_expression_for_form <unknown>
64.28 s
> at <unknown source file> :<unknown line>
64.28 s
> 11: <vakint[eb7a1daa8ec05e1f]::VakintTerm>::tensor_reduce <unknown>
64.28 s
> at <unknown source file> :<unknown line>
64.28 s
> 12: <vakint[eb7a1daa8ec05e1f]::VakintExpression>::tensor_reduce <unknown>
64.28 s
> at <unknown source file> :<unknown line>
64.28 s
> 13: <gammalooprs[822fc56666e1de73]::uv::approx::integrated::Integrated>::integrate::<gammalooprs[822fc56666e1de73]::uv::approx::Approximation> <unknown>
64.28 s
> at <unknown source file> :<unknown line>
64.28 s
> 14: <gammalooprs[822fc56666e1de73]::uv::approx::integrated::Integrated>::run::<gammalooprs[822fc56666e1de73]::uv::approx::Approximation, gammalooprs[822fc56666e1de73]::uv::approx::Approximation> <unknown>
64.28 s
> at <unknown source file> :<unknown line>
64.28 s
> 15: <gammalooprs[822fc56666e1de73]::uv::forest::Forest>::compute <unknown>
64.28 s
> at <unknown source file> :<unknown line>
64.28 s
> 16: gammalooprs[822fc56666e1de73]::uv::orchestrator::legacy_renormalization_part <unknown>
64.28 s
> at <unknown source file> :<unknown line>
64.28 s
> 17: <gammalooprs[822fc56666e1de73]::uv::settings::UVOrchestrator>::renormalization_part <unknown>
64.28 s
> at <unknown source file> :<unknown line>
64.28 s
> 18: <gammalooprs[822fc56666e1de73]::processes::amplitude::AmplitudeGraph>::renormalization_part <unknown>
64.28 s
> at <unknown source file> :<unknown line>
64.28 s
> 19: test_renormalization[9f554b029f822e2d]::finite_part_ghost_2loop <unknown>
64.28 s
> at <unknown source file> :<unknown line>
64.28 s
> 20: <test_renormalization[9f554b029f822e2d]::finite_part_ghost_2loop::{closure#0} as core[940e698046960fd5]::ops::function::FnOnce<()>>::call_once <unknown>
64.28 s
> at <unknown source file> :<unknown line>
64.28 s
> 21: test[75d6903177b1d7e9]::__rust_begin_short_backtrace::<core[940e698046960fd5]::result::Result<(), alloc[2ea6bcb46fca0c42]::string::String>, fn() -> core[940e698046960fd5]::result::Result<(), alloc[2ea6bcb46fca0c42]::string::String>> <unknown>
64.28 s
> at <unknown source file> :<unknown line>
64.28 s
> 22: test[75d6903177b1d7e9]::run_test::{closure#0} <unknown>
64.28 s
> at <unknown source file> :<unknown line>
64.28 s
> 23: std[bcb96dfbba0ab899]::sys::backtrace::__rust_begin_short_backtrace::<test[75d6903177b1d7e9]::run_test::{closure#1}, ()> <unknown>
64.28 s
> at <unknown source file> :<unknown line>
64.28 s
> 24: <std[bcb96dfbba0ab899]::thread::lifecycle::spawn_unchecked<test[75d6903177b1d7e9]::run_test::{closure#1}, ()>::{closure#1} as core[940e698046960fd5]::ops::function::FnOnce<()>>::call_once::{shim:vtable#0} <unknown>
64.28 s
> at <unknown source file> :<unknown line>
64.28 s
> 25: <std[bcb96dfbba0ab899]::sys::thread::unix::Thread>::new::thread_start <unknown>
64.28 s
> at <unknown source file> :<unknown line>
64.28 s
> 26: start_thread <unknown>
64.28 s
> at <unknown source file> :<unknown line>
64.28 s
> 27: __clone3 <unknown>
64.28 s
> at <unknown source file> :<unknown line>
64.28 s
>
64.28 s
> Run with COLORBT_SHOW_HIDDEN=1 environment variable to disable frame filtering.
64.28 s
> Run with RUST_BACKTRACE=full to include source snippets.
64.28 s
>
64.28 s
> error : test run failed
64.28 s
>
64.28 s
> ========== nextest test summary ==========
64.28 s
> report: target/nextest/ci_gammaloop/junit.xml
64.28 s
> tests: 456, failures: 3, errors: 0
64.28 s
>
64.28 s
> 1. gammalooprs::test_renormalization::finit_part_ghlo
64.28 s
> failure: test failure with exit code 101
64.28 s
> system-out
64.28 s
> running 1 test
64.28 s
> test finit_part_ghlo ... FAILED
64.28 s
>
64.28 s
> failures:
64.28 s
>
64.28 s
> failures:
64.28 s
> finit_part_ghlo
64.28 s
>
64.28 s
> test result: FAILED. 0 passed; 1 failed; 0 ignored; 0 measured; 5 filtered out; finished in 0.12s
64.28 s
> system-err
64.28 s
> The application panicked (crashed).
64.28 s
> Message: called `Result::unwrap()` on an `Err` value:
64.28 s
> 0: Symbolica could not parse FORM output:
64.28 s
> [spenso::{antisymmetric,real,spenso::tensor}::f]([spenso::{spenso::representat\
64.28 s
> ion,spenso::self_dual}::coad](8,[gammalooprs::{spenso::index}::hedge](0)
64.28 s
> ),[spenso::{spenso::representation,spenso::self_dual}::coad](8,[gammaloo\
64.28 s
> prs::{spenso::index}::hedge](3)),[spenso::{spenso::representation,spenso\
64.28 s
> ::self_dual}::coad](8,[gammalooprs::{spenso::index}::hedge](5)))*
64.28 s
> [spenso::{antisymmetric,real,spenso::tensor}::f]([spenso::{spenso::repre\
64.28 s
> sentation,spenso::self_dual}::coad](8,[gammalooprs::{spenso::index}::hed\
64.28 s
> ge](1)),[spenso::{spenso::representation,spenso::self_dual}::coad](8,
64.28 s
> [gammalooprs::{spenso::index}::hedge](3)),[spenso::{spenso::representati\
64.28 s
> on,spenso::self_dual}::coad](8,[gammalooprs::{spenso::index}::hedge](5))
64.28 s
> )*dot(p1,p0)*[UFO::{}::GC_10]^2*rat(-1,1)
64.28 s
>
64.28 s
> Error:Symbol spenso::coad redefined with new attributes:
64.28 s
> - new user data specified: List([String("spenso::representation-v2"), String("self-dual"), List([String("symbol"), String("coad")]), List([String("cyclic"), Integer(1), List([List([String("symbol"), String("a")]), List([String("symbol"), String("b")]), List([String("symbol"), String("c")]), List([String("symbol"), String("d")])])]), String("top")]) vs None
64.28 s
>
64.28 s
>
64.28 s
> Location:
64.28 s
> crates/gammalooprs/src/uv/approx/integrated.rs:332
64.28 s
>
64.28 s
> ━━━━━━━━━━━━━━━━━━━━━━━━━━━━━━━━━━ BACKTRACE ━━━━━━━━━━━━━━━━━━━━━━━━━━━━━━━━━━━
64.28 s
> 1: <color_eyre[5722b77bc20a64cf]::config::EyreHook>::into_eyre_hook::{closure#0}<unknown>
64.28 s
> at <unknown source file>:<unknown line>
64.28 s
> 2: eyre[cb2fd339c0c40fca]::capture_handler<unknown>
64.28 s
> at <unknown source file>:<unknown line>
64.28 s
> 3: <eyre[cb2fd339c0c40fca]::Report>::from_std::<vakint[eb7a1daa8ec05e1f]::VakintError><unknown>
64.28 s
> at <unknown source file>:<unknown line>
64.28 s
> 4: <gammalooprs[822fc56666e1de73]::uv::approx::integrated::Integrated>::integrate::<gammalooprs[822fc56666e1de73]::uv::hedge_poset::ForestNode><unknown>
64.28 s
> at <unknown source file>:<unknown line>
64.28 s
> 5: <gammalooprs[822fc56666e1de73]::uv::approx::integrated::Integrated>::run::<gammalooprs[822fc56666e1de73]::uv::hedge_poset::ForestNode, gammalooprs[822fc56666e1de73]::uv::hedge_poset::ForestNode><unknown>
64.28 s
> at <unknown source file>:<unknown line>
64.28 s
> 6: <gammalooprs[822fc56666e1de73]::uv::hedge_poset::Forests>::integrate<unknown>
64.28 s
> at <unknown source file>:<unknown line>
64.28 s
> 7: gammalooprs[822fc56666e1de73]::uv::orchestrator::hedge_poset_renormalization_part<unknown>
64.28 s
> at <unknown source file>:<unknown line>
64.28 s
> 8: <gammalooprs[822fc56666e1de73]::uv::settings::UVOrchestrator>::renormalization_part<unknown>
64.28 s
> at <unknown source file>:<unknown line>
64.28 s
> 9: <gammalooprs[822fc56666e1de73]::processes::amplitude::AmplitudeGraph>::renormalization_part<unknown>
64.28 s
> at <unknown source file>:<unknown line>
64.28 s
> 10: <test_renormalization[9f554b029f822e2d]::finit_part_ghlo::{closure#0} as core[940e698046960fd5]::ops::function::FnOnce<()>>::call_once<unknown>
64.28 s
> at <unknown source file>:<unknown line>
64.28 s
> 11: test[75d6903177b1d7e9]::__rust_begin_short_backtrace::<core[940e698046960fd5]::result::Result<(), alloc[2ea6bcb46fca0c42]::string::String>, fn() -> core[940e698046960fd5]::result::Result<(), alloc[2ea6bcb46fca0c42]::string::String>><unknown>
64.28 s
> at <unknown source file>:<unknown line>
64.28 s
> 12: test[75d6903177b1d7e9]::run_test::{closure#0}<unknown>
64.28 s
> at <unknown source file>:<unknown line>
64.28 s
> 13: std[bcb96dfbba0ab899]::sys::backtrace::__rust_begin_short_backtrace::<test[75d6903177b1d7e9]::run_test::{closure#1}, ()><unknown>
64.28 s
> at <unknown source file>:<unknown line>
64.28 s
> 14: <std[bcb96dfbba0ab899]::thread::lifecycle::spawn_unchecked<test[75d6903177b1d7e9]::run_test::{closure#1}, ()>::{closure#1} as core[940e698046960fd5]::ops::function::FnOnce<()>>::call_once::{shim:vtable#0}<unknown>
64.28 s
> at <unknown source file>:<unknown line>
64.28 s
> 15: <std[bcb96dfbba0ab899]::sys::thread::unix::Thread>::new::thread_start<unknown>
64.28 s
> at <unknown source file>:<unknown line>
64.28 s
> 16: start_thread<unknown>
64.28 s
> at <unknown source file>:<unknown line>
64.28 s
> 17: __clone3<unknown>
64.28 s
> at <unknown source file>:<unknown line>
64.28 s
>
64.28 s
> Run with COLORBT_SHOW_HIDDEN=1 environment variable to disable frame filtering.
64.28 s
> Run with RUST_BACKTRACE=full to include source snippets.
64.28 s
> Location: crates/gammalooprs/tests/test_renormalization.rs:550
64.28 s
>
64.28 s
> ━━━━━━━━━━━━━━━━━━━━━━━━━━━━━━━━━━ BACKTRACE ━━━━━━━━━━━━━━━━━━━━━━━━━━━━━━━━━━━
64.28 s
> 1: <color_eyre[5722b77bc20a64cf]::config::PanicHook>::panic_report<unknown>
64.28 s
> at <unknown source file>:<unknown line>
64.28 s
> 2: <color_eyre[5722b77bc20a64cf]::config::PanicHook>::into_panic_hook::{closure#0}<unknown>
64.28 s
> at <unknown source file>:<unknown line>
64.28 s
> 3: std[bcb96dfbba0ab899]::panicking::panic_with_hook<unknown>
64.28 s
> at <unknown source file>:<unknown line>
64.28 s
> 4: std[bcb96dfbba0ab899]::panicking::panic_handler::{closure#0}<unknown>
64.28 s
> at <unknown source file>:<unknown line>
64.28 s
> 5: std[bcb96dfbba0ab899]::sys::backtrace::__rust_end_short_backtrace::<std[bcb96dfbba0ab899]::panicking::panic_handler::{closure#0}, !><unknown>
64.28 s
> at <unknown source file>:<unknown line>
64.28 s
> 6: __rustc[6c289b9f9c454d21]::rust_begin_unwind<unknown>
64.28 s
> at <unknown source file>:<unknown line>
64.28 s
> 7: core[940e698046960fd5]::panicking::panic_fmt<unknown>
64.28 s
> at <unknown source file>:<unknown line>
64.28 s
> 8: core[940e698046960fd5]::result::unwrap_failed<unknown>
64.28 s
> at <unknown source file>:<unknown line>
64.28 s
> 9: <test_renormalization[9f554b029f822e2d]::finit_part_ghlo::{closure#0} as core[940e698046960fd5]::ops::function::FnOnce<()>>::call_once<unknown>
64.28 s
> at <unknown source file>:<unknown line>
64.28 s
> 10: test[75d6903177b1d7e9]::__rust_begin_short_backtrace::<core[940e698046960fd5]::result::Result<(), alloc[2ea6bcb46fca0c42]::string::String>, fn() -> core[940e698046960fd5]::result::Result<(), alloc[2ea6bcb46fca0c42]::string::String>><unknown>
64.28 s
> at <unknown source file>:<unknown line>
64.28 s
> 11: test[75d6903177b1d7e9]::run_test::{closure#0}<unknown>
64.28 s
> at <unknown source file>:<unknown line>
64.28 s
> 12: std[bcb96dfbba0ab899]::sys::backtrace::__rust_begin_short_backtrace::<test[75d6903177b1d7e9]::run_test::{closure#1}, ()><unknown>
64.28 s
> at <unknown source file>:<unknown line>
64.28 s
> 13: <std[bcb96dfbba0ab899]::thread::lifecycle::spawn_unchecked<test[75d6903177b1d7e9]::run_test::{closure#1}, ()>::{closure#1} as core[940e698046960fd5]::ops::function::FnOnce<()>>::call_once::{shim:vtable#0}<unknown>
64.28 s
> at <unknown source file>:<unknown line>
64.28 s
> 14: <std[bcb96dfbba0ab899]::sys::thread::unix::Thread>::new::thread_start<unknown>
64.28 s
> at <unknown source file>:<unknown line>
64.28 s
> 15: start_thread<unknown>
64.28 s
> at <unknown source file>:<unknown line>
64.28 s
> 16: __clone3<unknown>
64.28 s
> at <unknown source file>:<unknown line>
64.28 s
>
64.28 s
> Run with COLORBT_SHOW_HIDDEN=1 environment variable to disable frame filtering.
64.28 s
> Run with RUST_BACKTRACE=full to include source snippets.
64.28 s
>
64.28 s
> 2. gammalooprs::test_renormalization::finite_part_quark_lo
64.28 s
> failure: test failure with exit code 101
64.28 s
> system-out
64.28 s
> running 1 test
64.28 s
> test finite_part_quark_lo ... FAILED
64.28 s
>
64.28 s
> failures:
64.28 s
>
64.28 s
> failures:
64.28 s
> finite_part_quark_lo
64.28 s
>
64.28 s
> test result: FAILED. 0 passed; 1 failed; 0 ignored; 0 measured; 5 filtered out; finished in 0.11s
64.28 s
> system-err
64.28 s
> The application panicked (crashed).
64.28 s
> Message: called `Result::unwrap()` on an `Err` value: "Symbol spenso::mink redefined with new attributes:\n\t- new user data specified: List([String(\"spenso::representation-v2\"), String(\"inline-metric\"), List([String(\"symbol\"), String(\"mink\")]), List([String(\"cyclic\"), Integer(1), List([List([String(\"symbol\"), String(\"mu\")]), List([String(\"symbol\"), String(\"nu\")]), List([String(\"symbol\"), String(\"rho\")]), List([String(\"symbol\"), String(\"sigma\")])])]), String(\"top\")]) vs None\n"
64.28 s
> Location: crates/vakint/src/lib.rs:4766
64.28 s
>
64.28 s
> ━━━━━━━━━━━━━━━━━━━━━━━━━━━━━━━━━━ BACKTRACE ━━━━━━━━━━━━━━━━━━━━━━━━━━━━━━━━━━━
64.28 s
> 1: <color_eyre[5722b77bc20a64cf]::config::PanicHook>::panic_report<unknown>
64.28 s
> at <unknown source file>:<unknown line>
64.28 s
> 2: <color_eyre[5722b77bc20a64cf]::config::PanicHook>::into_panic_hook::{closure#0}<unknown>
64.28 s
> at <unknown source file>:<unknown line>
64.28 s
> 3: std[bcb96dfbba0ab899]::panicking::panic_with_hook<unknown>
64.28 s
> at <unknown source file>:<unknown line>
64.28 s
> 4: std[bcb96dfbba0ab899]::panicking::panic_handler::{closure#0}<unknown>
64.28 s
> at <unknown source file>:<unknown line>
64.28 s
> 5: std[bcb96dfbba0ab899]::sys::backtrace::__rust_end_short_backtrace::<std[bcb96dfbba0ab899]::panicking::panic_handler::{closure#0}, !><unknown>
64.28 s
> at <unknown source file>:<unknown line>
64.28 s
> 6: __rustc[6c289b9f9c454d21]::rust_begin_unwind<unknown>
64.28 s
> at <unknown source file>:<unknown line>
64.28 s
> 7: core[940e698046960fd5]::panicking::panic_fmt<unknown>
64.28 s
> at <unknown source file>:<unknown line>
64.28 s
> 8: core[940e698046960fd5]::result::unwrap_failed<unknown>
64.28 s
> at <unknown source file>:<unknown line>
64.28 s
> 9: <vakint[eb7a1daa8ec05e1f]::Vakint>::sanitize_user_expressions<unknown>
64.28 s
> at <unknown source file>:<unknown line>
64.28 s
> 10: <vakint[eb7a1daa8ec05e1f]::Vakint>::prepare_expression_for_form<unknown>
64.28 s
> at <unknown source file>:<unknown line>
64.28 s
> 11: <vakint[eb7a1daa8ec05e1f]::VakintTerm>::tensor_reduce<unknown>
64.28 s
> at <unknown source file>:<unknown line>
64.28 s
> 12: <vakint[eb7a1daa8ec05e1f]::VakintExpression>::tensor_reduce<unknown>
64.28 s
> at <unknown source file>:<unknown line>
64.28 s
> 13: <gammalooprs[822fc56666e1de73]::uv::approx::integrated::Integrated>::integrate::<gammalooprs[822fc56666e1de73]::uv::hedge_poset::ForestNode><unknown>
64.28 s
> at <unknown source file>:<unknown line>
64.28 s
> 14: <gammalooprs[822fc56666e1de73]::uv::approx::integrated::Integrated>::run::<gammalooprs[822fc56666e1de73]::uv::hedge_poset::ForestNode, gammalooprs[822fc56666e1de73]::uv::hedge_poset::ForestNode><unknown>
64.28 s
> at <unknown source file>:<unknown line>
64.28 s
> 15: <gammalooprs[822fc56666e1de73]::uv::hedge_poset::Forests>::integrate<unknown>
64.28 s
> at <unknown source file>:<unknown line>
64.28 s
> 16: gammalooprs[822fc56666e1de73]::uv::orchestrator::hedge_poset_renormalization_part<unknown>
64.28 s
> at <unknown source file>:<unknown line>
64.28 s
> 17: <gammalooprs[822fc56666e1de73]::uv::settings::UVOrchestrator>::renormalization_part<unknown>
64.28 s
> at <unknown source file>:<unknown line>
64.28 s
> 18: <gammalooprs[822fc56666e1de73]::processes::amplitude::AmplitudeGraph>::renormalization_part<unknown>
64.28 s
> at <unknown source file>:<unknown line>
64.28 s
> 19: <test_renormalization[9f554b029f822e2d]::finite_part_quark_lo::{closure#0} as core[940e698046960fd5]::ops::function::FnOnce<()>>::call_once<unknown>
64.28 s
> at <unknown source file>:<unknown line>
64.28 s
> 20: test[75d6903177b1d7e9]::__rust_begin_short_backtrace::<core[940e698046960fd5]::result::Result<(), alloc[2ea6bcb46fca0c42]::string::String>, fn() -> core[940e698046960fd5]::result::Result<(), alloc[2ea6bcb46fca0c42]::string::String>><unknown>
64.28 s
> at <unknown source file>:<unknown line>
64.28 s
> 21: test[75d6903177b1d7e9]::run_test::{closure#0}<unknown>
64.28 s
> at <unknown source file>:<unknown line>
64.28 s
> 22: std[bcb96dfbba0ab899]::sys::backtrace::__rust_begin_short_backtrace::<test[75d6903177b1d7e9]::run_test::{closure#1}, ()><unknown>
64.28 s
> at <unknown source file>:<unknown line>
64.28 s
> 23: <std[bcb96dfbba0ab899]::thread::lifecycle::spawn_unchecked<test[75d6903177b1d7e9]::run_test::{closure#1}, ()>::{closure#1} as core[940e698046960fd5]::ops::function::FnOnce<()>>::call_once::{shim:vtable#0}<unknown>
64.28 s
> at <unknown source file>:<unknown line>
64.28 s
> 24: <std[bcb96dfbba0ab899]::sys::thread::unix::Thread>::new::thread_start<unknown>
64.28 s
> at <unknown source file>:<unknown line>
64.28 s
> 25: start_thread<unknown>
64.28 s
> at <unknown source file>:<unknown line>
64.28 s
> 26: __clone3<unknown>
64.28 s
> at <unknown source file>:<unknown line>
64.28 s
>
64.28 s
> Run with COLORBT_SHOW_HIDDEN=1 environment variable to disable frame filtering.
64.28 s
> Run with RUST_BACKTRACE=full to include source snippets.
64.28 s
>
64.28 s
> 3. gammalooprs::test_renormalization::finite_part_ghost_2loop
64.28 s
> failure: test failure with exit code 101
64.28 s
> system-out
64.28 s
> running 1 test
64.28 s
> test finite_part_ghost_2loop ... FAILED
64.28 s
>
64.28 s
> failures:
64.28 s
>
64.28 s
> failures:
64.28 s
> finite_part_ghost_2loop
64.28 s
>
64.28 s
> test result: FAILED. 0 passed; 1 failed; 0 ignored; 0 measured; 5 filtered out; finished in 0.19s
64.28 s
> system-err
64.28 s
> The application panicked (crashed).
64.28 s
> Message: called `Result::unwrap()` on an `Err` value: "Symbol spenso::mink redefined with new attributes:\n\t- new user data specified: List([String(\"spenso::representation-v2\"), String(\"inline-metric\"), List([String(\"symbol\"), String(\"mink\")]), List([String(\"cyclic\"), Integer(1), List([List([String(\"symbol\"), String(\"mu\")]), List([String(\"symbol\"), String(\"nu\")]), List([String(\"symbol\"), String(\"rho\")]), List([String(\"symbol\"), String(\"sigma\")])])]), String(\"top\")]) vs None\n"
64.28 s
> Location: crates/vakint/src/lib.rs:4766
64.28 s
>
64.28 s
> ━━━━━━━━━━━━━━━━━━━━━━━━━━━━━━━━━━ BACKTRACE ━━━━━━━━━━━━━━━━━━━━━━━━━━━━━━━━━━━
64.28 s
> 1: <color_eyre[5722b77bc20a64cf]::config::PanicHook>::panic_report<unknown>
64.28 s
> at <unknown source file>:<unknown line>
64.28 s
> 2: <color_eyre[5722b77bc20a64cf]::config::PanicHook>::into_panic_hook::{closure#0}<unknown>
64.28 s
> at <unknown source file>:<unknown line>
64.28 s
> 3: std[bcb96dfbba0ab899]::panicking::panic_with_hook<unknown>
64.28 s
> at <unknown source file>:<unknown line>
64.28 s
> 4: std[bcb96dfbba0ab899]::panicking::panic_handler::{closure#0}<unknown>
64.28 s
> at <unknown source file>:<unknown line>
64.28 s
> 5: std[bcb96dfbba0ab899]::sys::backtrace::__rust_end_short_backtrace::<std[bcb96dfbba0ab899]::panicking::panic_handler::{closure#0}, !><unknown>
64.28 s
> at <unknown source file>:<unknown line>
64.28 s
> 6: __rustc[6c289b9f9c454d21]::rust_begin_unwind<unknown>
64.28 s
> at <unknown source file>:<unknown line>
64.28 s
> 7: core[940e698046960fd5]::panicking::panic_fmt<unknown>
64.28 s
> at <unknown source file>:<unknown line>
64.28 s
> 8: core[940e698046960fd5]::result::unwrap_failed<unknown>
64.28 s
> at <unknown source file>:<unknown line>
64.28 s
> 9: <vakint[eb7a1daa8ec05e1f]::Vakint>::sanitize_user_expressions<unknown>
64.28 s
> at <unknown source file>:<unknown line>
64.28 s
> 10: <vakint[eb7a1daa8ec05e1f]::Vakint>::prepare_expression_for_form<unknown>
64.28 s
> at <unknown source file>:<unknown line>
64.28 s
> 11: <vakint[eb7a1daa8ec05e1f]::VakintTerm>::tensor_reduce<unknown>
64.28 s
> at <unknown source file>:<unknown line>
64.28 s
> 12: <vakint[eb7a1daa8ec05e1f]::VakintExpression>::tensor_reduce<unknown>
64.28 s
> at <unknown source file>:<unknown line>
64.28 s
> 13: <gammalooprs[822fc56666e1de73]::uv::approx::integrated::Integrated>::integrate::<gammalooprs[822fc56666e1de73]::uv::approx::Approximation><unknown>
64.28 s
> at <unknown source file>:<unknown line>
64.28 s
> 14: <gammalooprs[822fc56666e1de73]::uv::approx::integrated::Integrated>::run::<gammalooprs[822fc56666e1de73]::uv::approx::Approximation, gammalooprs[822fc56666e1de73]::uv::approx::Approximation><unknown>
64.28 s
> at <unknown source file>:<unknown line>
64.28 s
> 15: <gammalooprs[822fc56666e1de73]::uv::forest::Forest>::compute<unknown>
64.28 s
> at <unknown source file>:<unknown line>
64.28 s
> 16: gammalooprs[822fc56666e1de73]::uv::orchestrator::legacy_renormalization_part<unknown>
64.28 s
> at <unknown source file>:<unknown line>
64.28 s
> 17: <gammalooprs[822fc56666e1de73]::uv::settings::UVOrchestrator>::renormalization_part<unknown>
64.28 s
> at <unknown source file>:<unknown line>
64.28 s
> 18: <gammalooprs[822fc56666e1de73]::processes::amplitude::AmplitudeGraph>::renormalization_part<unknown>
64.28 s
> at <unknown source file>:<unknown line>
64.28 s
> 19: test_renormalization[9f554b029f822e2d]::finite_part_ghost_2loop<unknown>
64.28 s
> at <unknown source file>:<unknown line>
64.28 s
> 20: <test_renormalization[9f554b029f822e2d]::finite_part_ghost_2loop::{closure#0} as core[940e698046960fd5]::ops::function::FnOnce<()>>::call_once<unknown>
64.28 s
> at <unknown source file>:<unknown line>
64.28 s
> 21: test[75d6903177b1d7e9]::__rust_begin_short_backtrace::<core[940e698046960fd5]::result::Result<(), alloc[2ea6bcb46fca0c42]::string::String>, fn() -> core[940e698046960fd5]::result::Result<(), alloc[2ea6bcb46fca0c42]::string::String>><unknown>
64.28 s
> at <unknown source file>:<unknown line>
64.28 s
> 22: test[75d6903177b1d7e9]::run_test::{closure#0}<unknown>
64.28 s
> at <unknown source file>:<unknown line>
64.28 s
> 23: std[bcb96dfbba0ab899]::sys::backtrace::__rust_begin_short_backtrace::<test[75d6903177b1d7e9]::run_test::{closure#1}, ()><unknown>
64.28 s
> at <unknown source file>:<unknown line>
64.28 s
> 24: <std[bcb96dfbba0ab899]::thread::lifecycle::spawn_unchecked<test[75d6903177b1d7e9]::run_test::{closure#1}, ()>::{closure#1} as core[940e698046960fd5]::ops::function::FnOnce<()>>::call_once::{shim:vtable#0}<unknown>
64.28 s
> at <unknown source file>:<unknown line>
64.28 s
> 25: <std[bcb96dfbba0ab899]::sys::thread::unix::Thread>::new::thread_start<unknown>
64.28 s
> at <unknown source file>:<unknown line>
64.28 s
> 26: start_thread<unknown>
64.28 s
> at <unknown source file>:<unknown line>
64.28 s
> 27: __clone3<unknown>
64.28 s
> at <unknown source file>:<unknown line>
64.28 s
>
64.28 s
> Run with COLORBT_SHOW_HIDDEN=1 environment variable to disable frame filtering.
64.28 s
> Run with RUST_BACKTRACE=full to include source snippets.
64.28 s
> =========================================
64.28 s
For full logs, run:
64.28 s
nix log /nix/store/zinbrvppkmzalr7ws9scxa6mjscpn55x-gammaloop-nextest-core.drv
64.37 s
[5 built (1 failed ), 63 Run failed.