1. 0.00 s $ /nix/store/9ypz3flqsrl5xl495mm8h645gadjsxi1-coreutils-9.11/bin/timeout --kill-after=15s 7200s /nix/store/23zk8sgzamrbmj1fday15szf7f2279s8-nix-2.34.7/bin/nix --extra-experimental-features nix-command --extra-experimental-features flakes flake clone git+https://github.com/alphal00p/gammaloop --dest /tmp/nix-ci-worker/stable-pwd/repo/
  2. 0.34 s Cloning into '/tmp/nix-ci-worker/stable-pwd/repo'...
  3. 1.28 s remote: Enumerating objects: 84275, done.
  4. 1.38 s remote: Counting objects: 0% (1/8592) remote: Counting objects: 1% (86/8592) remote: Counting objects: 2% (172/8592) remote: Counting objects: 3% (258/8592) remote: Counting objects: 4% (344/8592) remote: Counting objects: 5% (430/8592) remote: Counting objects: 6% (516/8592) remote: Counting objects: 7% (602/8592) remote: Counting objects: 8% (688/8592) remote: Counting objects: 9% (774/8592) remote: Counting objects: 10% (860/8592) remote: Counting objects: 11% (946/8592) remote: Counting objects: 12% (1032/8592) remote: Counting objects: 13% (1117/8592) remote: Counting objects: 14% (1203/8592) remote: Counting objects: 15% (1289/8592) remote: Counting objects: 16% (1375/8592) remote: Counting objects: 17% (1461/8592) remote: Counting objects: 18% (1547/8592) remote: Counting objects: 19% (1633/8592) remote: Counting objects: 20% (1719/8592) remote: Counting objects: 21% (1805/8592) remote: Counting objects: 22% (1891/8592) remote: Counting objects: 23% (1977/8592) remote: Counting objects: 24% (2063/8592) remote: Counting objects: 25% (2148/8592) remote: Counting objects: 26% (2234/8592) remote: Counting objects: 27% (2320/8592) remote: Counting objects: 28% (2406/8592) remote: Counting objects: 29% (2492/8592) remote: Counting objects: 30% (2578/8592) remote: Counting objects: 31% (2664/8592) remote: Counting objects: 32% (2750/8592) remote: Counting objects: 33% (2836/8592) remote: Counting objects: 34% (2922/8592) remote: Counting objects: 35% (3008/8592) remote: Counting objects: 36% (3094/8592) remote: Counting objects: 37% (3180/8592) remote: Counting objects: 38% (3265/8592) remote: Counting objects: 39% (3351/8592) remote: Counting objects: 40% (3437/8592) remote: Counting objects: 41% (3523/8592) remote: Counting objects: 42% (3609/8592) remote: Counting objects: 43% (3695/8592) remote: Counting objects: 44% (3781/8592) remote: Counting objects: 45% (3867/8592) remote: Counting objects: 46% (3953/8592) remote: Counting objects: 47% (4039/8592) remote: Counting objects: 48% (4125/8592) remote: Counting objects: 49% (4211/8592) remote: Counting objects: 50% (4296/8592) remote: Counting objects: 51% (4382/8592) remote: Counting objects: 52% (4468/8592) remote: Counting objects: 53% (4554/8592) remote: Counting objects: 54% (4640/8592) remote: Counting objects: 55% (4726/8592) remote: Counting objects: 56% (4812/8592) remote: Counting objects: 57% (4898/8592) remote: Counting objects: 58% (4984/8592) remote: Counting objects: 59% (5070/8592) remote: Counting objects: 60% (5156/8592) remote: Counting objects: 61% (5242/8592) remote: Counting objects: 62% (5328/8592) remote: Counting objects: 63% (5413/8592) remote: Counting objects: 64% (5499/8592) remote: Counting objects: 65% (5585/8592) remote: Counting objects: 66% (5671/8592) remote: Counting objects: 67% (5757/8592) remote: Counting objects: 68% (5843/8592) remote: Counting objects: 69% (5929/8592) remote: Counting objects: 70% (6015/8592) remote: Counting objects: 71% (6101/8592) remote: Counting objects: 72% (6187/8592) remote: Counting objects: 73% (6273/8592) remote: Counting objects: 74% (6359/8592) remote: Counting objects: 75% (6444/8592) remote: Counting objects: 76% (6530/8592) remote: Counting objects: 77% (6616/8592) remote: Counting objects: 78% (6702/8592) remote: Counting objects: 79% (6788/8592) remote: Counting objects: 80% (6874/8592) remote: Counting objects: 81% (6960/8592) remote: Counting objects: 82% (7046/8592) remote: Counting objects: 83% (7132/8592) remote: Counting objects: 84% (7218/8592) remote: Counting objects: 85% (7304/8592) remote: Counting objects: 86% (7390/8592) remote: Counting objects: 87% (7476/8592) remote: Counting objects: 88% (7561/8592) remote: Counting objects: 89% (7647/8592) remote: Counting objects: 90% (7733/8592) remote: Counting objects: 91% (7819/8592) remote: Counting objects: 92% (7905/8592) remote: Counting objects: 93% (7991/8592) remote: Counting objects: 94% (8077/8592) remote: Counting objects: 95% (8163/8592) remote: Counting objects: 96% (8249/8592) remote: Counting objects: 97% (8335/8592) remote: Counting objects: 98% (8421/8592) remote: Counting objects: 99% (8507/8592) remote: Counting objects: 100% (8592/8592) remote: Counting objects: 100% (8592/8592), done.
  5. 3.22 s remote: Compressing objects: 0% (1/1731) remote: Compressing objects: 1% (18/1731) remote: Compressing objects: 2% (35/1731) remote: Compressing objects: 3% (52/1731) remote: Compressing objects: 4% (70/1731) remote: Compressing objects: 5% (87/1731) remote: Compressing objects: 6% (104/1731) remote: Compressing objects: 7% (122/1731) remote: Compressing objects: 8% (139/1731) remote: Compressing objects: 9% (156/1731) remote: Compressing objects: 9% (171/1731) remote: Compressing objects: 10% (174/1731) remote: Compressing objects: 11% (191/1731) remote: Compressing objects: 12% (208/1731) remote: Compressing objects: 13% (226/1731) remote: Compressing objects: 14% (243/1731) remote: Compressing objects: 15% (260/1731) remote: Compressing objects: 16% (277/1731) remote: Compressing objects: 17% (295/1731) remote: Compressing objects: 18% (312/1731) remote: Compressing objects: 19% (329/1731) remote: Compressing objects: 20% (347/1731) remote: Compressing objects: 21% (364/1731) remote: Compressing objects: 22% (381/1731) remote: Compressing objects: 23% (399/1731) remote: Compressing objects: 24% (416/1731) remote: Compressing objects: 25% (433/1731) remote: Compressing objects: 26% (451/1731) remote: Compressing objects: 27% (468/1731) remote: Compressing objects: 28% (485/1731) remote: Compressing objects: 29% (502/1731) remote: Compressing objects: 30% (520/1731) remote: Compressing objects: 31% (537/1731) remote: Compressing objects: 32% (554/1731) remote: Compressing objects: 33% (572/1731) remote: Compressing objects: 34% (589/1731) remote: Compressing objects: 35% (606/1731) remote: Compressing objects: 36% (624/1731) remote: Compressing objects: 37% (641/1731) remote: Compressing objects: 38% (658/1731) remote: Compressing objects: 39% (676/1731) remote: Compressing objects: 40% (693/1731) remote: Compressing objects: 41% (710/1731) remote: Compressing objects: 42% (728/1731) remote: Compressing objects: 43% (745/1731) remote: Compressing objects: 44% (762/1731) remote: Compressing objects: 45% (779/1731) remote: Compressing objects: 46% (797/1731) remote: Compressing objects: 47% (814/1731) remote: Compressing objects: 48% (831/1731) remote: Compressing objects: 49% (849/1731) remote: Compressing objects: 50% (866/1731) remote: Compressing objects: 51% (883/1731) remote: Compressing objects: 52% (901/1731) remote: Compressing objects: 53% (918/1731) remote: Compressing objects: 54% (935/1731) remote: Compressing objects: 55% (953/1731) remote: Compressing objects: 56% (970/1731) remote: Compressing objects: 57% (987/1731) remote: Compressing objects: 58% (1004/1731) remote: Compressing objects: 59% (1022/1731) remote: Compressing objects: 60% (1039/1731) remote: Compressing objects: 61% (1056/1731) remote: Compressing objects: 62% (1074/1731) remote: Compressing objects: 63% (1091/1731) remote: Compressing objects: 64% (1108/1731) remote: Compressing objects: 65% (1126/1731) remote: Compressing objects: 66% (1143/1731) remote: Compressing objects: 67% (1160/1731) remote: Compressing objects: 68% (1178/1731) remote: Compressing objects: 69% (1195/1731) remote: Compressing objects: 70% (1212/1731) remote: Compressing objects: 71% (1230/1731) remote: Compressing objects: 72% (1247/1731) remote: Compressing objects: 73% (1264/1731) remote: Compressing objects: 74% (1281/1731) remote: Compressing objects: 75% (1299/1731) remote: Compressing objects: 76% (1316/1731) remote: Compressing objects: 77% (1333/1731) remote: Compressing objects: 78% (1351/1731) remote: Compressing objects: 79% (1368/1731) remote: Compressing objects: 80% (1385/1731) remote: Compressing objects: 81% (1403/1731) remote: Compressing objects: 82% (1420/1731) remote: Compressing objects: 83% (1437/1731) remote: Compressing objects: 84% (1455/1731) remote: Compressing objects: 85% (1472/1731) remote: Compressing objects: 86% (1489/1731) remote: Compressing objects: 87% (1506/1731) remote: Compressing objects: 88% (1524/1731) remote: Compressing objects: 89% (1541/1731) remote: Compressing objects: 90% (1558/1731) remote: Compressing objects: 91% (1576/1731) remote: Compressing objects: 92% (1593/1731) remote: Compressing objects: 93% (1610/1731) remote: Compressing objects: 94% (1628/1731) remote: Compressing objects: 95% (1645/1731) remote: Compressing objects: 96% (1662/1731) remote: Compressing objects: 97% (1680/1731) remote: Compressing objects: 98% (1697/1731) remote: Compressing objects: 99% (1714/1731) remote: Compressing objects: 100% (1731/1731) remote: Compressing objects: 100% (1731/1731), done.
  6. 7.63 s Receiving objects: 0% (1/84275) Receiving objects: 1% (843/84275) Receiving objects: 2% (1686/84275) Receiving objects: 3% (2529/84275) Receiving objects: 4% (3371/84275) Receiving objects: 5% (4214/84275) Receiving objects: 6% (5057/84275) Receiving objects: 7% (5900/84275) Receiving objects: 8% (6742/84275) Receiving objects: 9% (7585/84275), 13.57 MiB | 27.13 MiB/s Receiving objects: 10% (8428/84275), 13.57 MiB | 27.13 MiB/s Receiving objects: 11% (9271/84275), 13.57 MiB | 27.13 MiB/s Receiving objects: 12% (10113/84275), 13.57 MiB | 27.13 MiB/s Receiving objects: 13% (10956/84275), 13.57 MiB | 27.13 MiB/s Receiving objects: 14% (11799/84275), 13.57 MiB | 27.13 MiB/s Receiving objects: 15% (12642/84275), 13.57 MiB | 27.13 MiB/s Receiving objects: 16% (13484/84275), 13.57 MiB | 27.13 MiB/s Receiving objects: 17% (14327/84275), 13.57 MiB | 27.13 MiB/s Receiving objects: 18% (15170/84275), 13.57 MiB | 27.13 MiB/s Receiving objects: 19% (16013/84275), 13.57 MiB | 27.13 MiB/s Receiving objects: 20% (16855/84275), 13.57 MiB | 27.13 MiB/s Receiving objects: 21% (17698/84275), 13.57 MiB | 27.13 MiB/s Receiving objects: 22% (18541/84275), 13.57 MiB | 27.13 MiB/s Receiving objects: 23% (19384/84275), 13.57 MiB | 27.13 MiB/s Receiving objects: 24% (20226/84275), 13.57 MiB | 27.13 MiB/s Receiving objects: 25% (21069/84275), 13.57 MiB | 27.13 MiB/s Receiving objects: 26% (21912/84275), 13.57 MiB | 27.13 MiB/s Receiving objects: 27% (22755/84275), 13.57 MiB | 27.13 MiB/s Receiving objects: 28% (23597/84275), 13.57 MiB | 27.13 MiB/s Receiving objects: 29% (24440/84275), 13.57 MiB | 27.13 MiB/s Receiving objects: 30% (25283/84275), 13.57 MiB | 27.13 MiB/s Receiving objects: 31% (26126/84275), 13.57 MiB | 27.13 MiB/s Receiving objects: 32% (26968/84275), 13.57 MiB | 27.13 MiB/s Receiving objects: 33% (27811/84275), 13.57 MiB | 27.13 MiB/s Receiving objects: 34% (28654/84275), 13.57 MiB | 27.13 MiB/s Receiving objects: 35% (29497/84275), 13.57 MiB | 27.13 MiB/s Receiving objects: 36% (30339/84275), 13.57 MiB | 27.13 MiB/s Receiving objects: 37% (31182/84275), 13.57 MiB | 27.13 MiB/s Receiving objects: 38% (32025/84275), 13.57 MiB | 27.13 MiB/s Receiving objects: 39% (32868/84275), 13.57 MiB | 27.13 MiB/s Receiving objects: 40% (33710/84275), 13.57 MiB | 27.13 MiB/s Receiving objects: 40% (33842/84275), 32.52 MiB | 32.48 MiB/s Receiving objects: 41% (34553/84275), 32.52 MiB | 32.48 MiB/s Receiving objects: 42% (35396/84275), 32.52 MiB | 32.48 MiB/s Receiving objects: 43% (36239/84275), 32.52 MiB | 32.48 MiB/s Receiving objects: 44% (37081/84275), 32.52 MiB | 32.48 MiB/s Receiving objects: 45% (37924/84275), 32.52 MiB | 32.48 MiB/s Receiving objects: 46% (38767/84275), 32.52 MiB | 32.48 MiB/s Receiving objects: 47% (39610/84275), 32.52 MiB | 32.48 MiB/s Receiving objects: 48% (40452/84275), 32.52 MiB | 32.48 MiB/s Receiving objects: 49% (41295/84275), 32.52 MiB | 32.48 MiB/s Receiving objects: 50% (42138/84275), 32.52 MiB | 32.48 MiB/s Receiving objects: 51% (42981/84275), 50.26 MiB | 33.31 MiB/s Receiving objects: 52% (43823/84275), 50.26 MiB | 33.31 MiB/s Receiving objects: 53% (44666/84275), 50.26 MiB | 33.31 MiB/s Receiving objects: 54% (45509/84275), 50.26 MiB | 33.31 MiB/s Receiving objects: 55% (46352/84275), 50.26 MiB | 33.31 MiB/s Receiving objects: 56% (47194/84275), 50.26 MiB | 33.31 MiB/s Receiving objects: 57% (48037/84275), 50.26 MiB | 33.31 MiB/s Receiving objects: 58% (48880/84275), 50.26 MiB | 33.31 MiB/s Receiving objects: 58% (49017/84275), 50.26 MiB | 33.31 MiB/s Receiving objects: 59% (49723/84275), 67.89 MiB | 33.79 MiB/s Receiving objects: 60% (50565/84275), 67.89 MiB | 33.79 MiB/s Receiving objects: 61% (51408/84275), 67.89 MiB | 33.79 MiB/s Receiving objects: 62% (52251/84275), 67.89 MiB | 33.79 MiB/s Receiving objects: 63% (53094/84275), 67.89 MiB | 33.79 MiB/s Receiving objects: 64% (53936/84275), 67.89 MiB | 33.79 MiB/s Receiving objects: 65% (54779/84275), 67.89 MiB | 33.79 MiB/s Receiving objects: 66% (55622/84275), 67.89 MiB | 33.79 MiB/s Receiving objects: 67% (56465/84275), 67.89 MiB | 33.79 MiB/s Receiving objects: 68% (57307/84275), 67.89 MiB | 33.79 MiB/s Receiving objects: 68% (57342/84275), 103.25 MiB | 34.31 MiB/s Receiving objects: 69% (58150/84275), 103.25 MiB | 34.31 MiB/s Receiving objects: 70% (58993/84275), 103.25 MiB | 34.31 MiB/s Receiving objects: 71% (59836/84275), 103.25 MiB | 34.31 MiB/s Receiving objects: 72% (60678/84275), 103.25 MiB | 34.31 MiB/s Receiving objects: 73% (61521/84275), 103.25 MiB | 34.31 MiB/s Receiving objects: 74% (62364/84275), 103.25 MiB | 34.31 MiB/s Receiving objects: 75% (63207/84275), 103.25 MiB | 34.31 MiB/s Receiving objects: 76% (64049/84275), 122.02 MiB | 34.77 MiB/s Receiving objects: 77% (64892/84275), 122.02 MiB | 34.77 MiB/s Receiving objects: 78% (65735/84275), 122.02 MiB | 34.77 MiB/s Receiving objects: 79% (66578/84275), 122.02 MiB | 34.77 MiB/s Receiving objects: 80% (67420/84275), 122.02 MiB | 34.77 MiB/s Receiving objects: 81% (68263/84275), 122.02 MiB | 34.77 MiB/s Receiving objects: 82% (69106/84275), 122.02 MiB | 34.77 MiB/s Receiving objects: 83% (69949/84275), 122.02 MiB | 34.77 MiB/s Receiving objects: 84% (70791/84275), 122.02 MiB | 34.77 MiB/s Receiving objects: 85% (71634/84275), 122.02 MiB | 34.77 MiB/s Receiving objects: 86% (72477/84275), 122.02 MiB | 34.77 MiB/s Receiving objects: 87% (73320/84275), 122.02 MiB | 34.77 MiB/s Receiving objects: 87% (73395/84275), 122.02 MiB | 34.77 MiB/s Receiving objects: 88% (74162/84275), 139.82 MiB | 34.82 MiB/s Receiving objects: 89% (75005/84275), 139.82 MiB | 34.82 MiB/s Receiving objects: 90% (75848/84275), 139.82 MiB | 34.82 MiB/s Receiving objects: 91% (76691/84275), 139.82 MiB | 34.82 MiB/s Receiving objects: 92% (77533/84275), 139.82 MiB | 34.82 MiB/s Receiving objects: 93% (78376/84275), 139.82 MiB | 34.82 MiB/s Receiving objects: 94% (79219/84275), 139.82 MiB | 34.82 MiB/s Receiving objects: 95% (80062/84275), 139.82 MiB | 34.82 MiB/s Receiving objects: 96% (80904/84275), 139.82 MiB | 34.82 MiB/s Receiving objects: 97% (81747/84275), 139.82 MiB | 34.82 MiB/s Receiving objects: 98% (82590/84275), 139.82 MiB | 34.82 MiB/s Receiving objects: 99% (83433/84275), 139.82 MiB | 34.82 MiB/s remote: Total 84275 (delta 7471), reused 6882 (delta 6859), pack-reused 75683 (from 2)
  7. 7.63 s Receiving objects: 100% (84275/84275), 139.82 MiB | 34.82 MiB/s Receiving objects: 100% (84275/84275), 153.42 MiB | 34.98 MiB/s, done.
  8. 8.82 s Resolving deltas: 0% (0/57012) Resolving deltas: 1% (571/57012) Resolving deltas: 2% (1141/57012) Resolving deltas: 3% (1711/57012) Resolving deltas: 4% (2282/57012) Resolving deltas: 5% (2851/57012) Resolving deltas: 6% (3422/57012) Resolving deltas: 7% (3991/57012) Resolving deltas: 8% (4561/57012) Resolving deltas: 9% (5132/57012) Resolving deltas: 10% (5702/57012) Resolving deltas: 11% (6272/57012) Resolving deltas: 12% (6843/57012) Resolving deltas: 13% (7412/57012) Resolving deltas: 14% (7983/57012) Resolving deltas: 15% (8552/57012) Resolving deltas: 16% (9122/57012) Resolving deltas: 17% (9693/57012) Resolving deltas: 18% (10263/57012) Resolving deltas: 19% (10833/57012) Resolving deltas: 20% (11403/57012) Resolving deltas: 21% (11973/57012) Resolving deltas: 22% (12543/57012) Resolving deltas: 23% (13113/57012) Resolving deltas: 24% (13683/57012) Resolving deltas: 25% (14253/57012) Resolving deltas: 26% (14824/57012) Resolving deltas: 27% (15394/57012) Resolving deltas: 28% (15964/57012) Resolving deltas: 29% (16534/57012) Resolving deltas: 30% (17106/57012) Resolving deltas: 31% (17674/57012) Resolving deltas: 32% (18244/57012) Resolving deltas: 33% (18814/57012) Resolving deltas: 34% (19385/57012) Resolving deltas: 35% (19955/57012) Resolving deltas: 36% (20525/57012) Resolving deltas: 37% (21095/57012) Resolving deltas: 38% (21665/57012) Resolving deltas: 39% (22235/57012) Resolving deltas: 40% (22805/57012) Resolving deltas: 41% (23375/57012) Resolving deltas: 42% (23946/57012) Resolving deltas: 43% (24517/57012) Resolving deltas: 44% (25086/57012) Resolving deltas: 45% (25656/57012) Resolving deltas: 46% (26226/57012) Resolving deltas: 47% (26796/57012) Resolving deltas: 48% (27366/57012) Resolving deltas: 49% (27936/57012) Resolving deltas: 50% (28506/57012) Resolving deltas: 51% (29077/57012) Resolving deltas: 52% (29647/57012) Resolving deltas: 53% (30217/57012) Resolving deltas: 54% (30787/57012) Resolving deltas: 55% (31357/57012) Resolving deltas: 56% (31927/57012) Resolving deltas: 57% (32497/57012) Resolving deltas: 58% (33067/57012) Resolving deltas: 59% (33639/57012) Resolving deltas: 60% (34208/57012) Resolving deltas: 61% (34781/57012) Resolving deltas: 62% (35348/57012) Resolving deltas: 63% (35918/57012) Resolving deltas: 64% (36488/57012) Resolving deltas: 65% (37061/57012) Resolving deltas: 66% (37630/57012) Resolving deltas: 67% (38199/57012) Resolving deltas: 68% (38769/57012) Resolving deltas: 69% (39339/57012) Resolving deltas: 70% (39909/57012) Resolving deltas: 71% (40479/57012) Resolving deltas: 72% (41049/57012) Resolving deltas: 73% (41619/57012) Resolving deltas: 74% (42191/57012) Resolving deltas: 75% (42759/57012) Resolving deltas: 76% (43330/57012) Resolving deltas: 77% (43900/57012) Resolving deltas: 78% (44470/57012) Resolving deltas: 79% (45041/57012) Resolving deltas: 80% (45610/57012) Resolving deltas: 81% (46180/57012) Resolving deltas: 82% (46750/57012) Resolving deltas: 83% (47320/57012) Resolving deltas: 83% (47390/57012) Resolving deltas: 84% (47891/57012) Resolving deltas: 85% (48462/57012) Resolving deltas: 86% (49031/57012) Resolving deltas: 87% (49601/57012) Resolving deltas: 88% (50171/57012) Resolving deltas: 89% (50741/57012) Resolving deltas: 90% (51311/57012) Resolving deltas: 91% (51881/57012) Resolving deltas: 92% (52453/57012) Resolving deltas: 93% (53022/57012) Resolving deltas: 94% (53592/57012) Resolving deltas: 95% (54162/57012) Resolving deltas: 96% (54732/57012) Resolving deltas: 97% (55302/57012) Resolving deltas: 98% (55872/57012) Resolving deltas: 99% (56443/57012) Resolving deltas: 100% (57012/57012) Resolving deltas: 100% (57012/57012), done.
  9. 9.24 s Fetching commit ff11577b1777f94f30ac4c8d99e2f898d5902f7b for simplify-spenso-api ...
  10. 9.24 s $ /nix/store/bcnisk3ydfgv26v2gw3zlky24g00yww2-git-2.54.0/bin/git fetch origin ff11577b1777f94f30ac4c8d99e2f898d5902f7b
  11. 9.74 s From https://github.com/alphal00p/gammaloop
  12. 9.74 s * branch ff11577b1777f94f30ac4c8d99e2f898d5902f7b -> FETCH_HEAD
  13. 9.75 s $ /nix/store/9ypz3flqsrl5xl495mm8h645gadjsxi1-coreutils-9.11/bin/timeout --kill-after=15s 7200s /nix/store/bcnisk3ydfgv26v2gw3zlky24g00yww2-git-2.54.0/bin/git -c advice.detachedHead=false checkout ff11577b1777f94f30ac4c8d99e2f898d5902f7b
  14. 9.95 s HEAD is now at ff11577b1 update Symbolica to 0084bc7c
  15. 9.96 s $ /nix/store/9ypz3flqsrl5xl495mm8h645gadjsxi1-coreutils-9.11/bin/timeout --kill-after=15s 7200s /nix/store/23zk8sgzamrbmj1fday15szf7f2279s8-nix-2.34.7/bin/nix --extra-experimental-features nix-command --extra-experimental-features flakes --log-format internal-json run .#packages.x86_64-linux.nix-ci-check-gammaloop-nextest-spenso --print-build-logs
  16. 14.96 s
  17. 15.12 s Downloading cached gammaloop-nextest-binaries-spenso-idenso from https://cache.nix-ci.com
  18. 15.12 s Downloading cached gammaloop-nextest-binaries-spenso-spenso from https://cache.nix-ci.com
  19. 15.12 s Downloading cached gammaloop-nextest-binaries-spenso-spenso-hep-lib from https://cache.nix-ci.com
  20. 15.12 s Downloading cached gammaloop-nextest-binaries-spenso-spenso-macros from https://cache.nix-ci.com
  21. 15.12 s Downloading cached gammaloop-nextest-binaries-spenso-symbolica-utils from https://cache.nix-ci.com
  22. 15.84 s Downloaded cached gammaloop-nextest-binaries-spenso-spenso-macros (9.4 MiB) in 724ms
  23. 15.84 s Progress: 0 of 1 built, 1 of 7 downloaded from cache (4 downloading)
  24. 15.91 s Downloaded cached gammaloop-nextest-binaries-spenso-spenso (12.6 MiB) in 789ms
  25. 15.91 s Progress: 0 of 1 built, 2 of 7 downloaded from cache (3 downloading)
  26. 16.74 s Downloaded cached gammaloop-nextest-binaries-spenso-spenso-hep-lib (45.7 MiB) in 1.6s
  27. 16.74 s Progress: 0 of 1 built, 3 of 7 downloaded from cache (2 downloading)
  28. 17.24 s Downloaded cached gammaloop-nextest-binaries-spenso-symbolica-utils (9.1 MiB) in 2.1s
  29. 17.24 s Progress: 0 of 1 built, 4 of 7 downloaded from cache (1 downloading)
  30. 17.36 s Downloaded cached gammaloop-nextest-binaries-spenso-idenso (37.7 MiB) in 2.2s
  31. 17.36 s Progress: 0 of 1 built, 5 of 7 downloaded from cache
  32. 17.36 s Downloading cached gammaloop-nextest-binaries-spenso from https://cache.nix-ci.com
  33. 17.40 s Downloaded cached gammaloop-nextest-binaries-spenso (1920 B) in 41ms
  34. 17.40 s Progress: 0 of 1 built, 6 of 7 downloaded from cache
  35. 17.40 s Downloading cached nix-ci-check-gammaloop-nextest-spenso from https://cache.nix-ci.com
  36. 17.45 s Downloaded cached nix-ci-check-gammaloop-nextest-spenso (1016 B) in 41ms
  37. 17.45 s Progress: 0 of 1 built, 7 of 7 downloaded from cache
  38. 22.21 s evaluating derivation 'g copying '/nix/store/zvcs evaluating derivation 'g copying '/nix/store/zvcs evaluating derivation 'g querying gammaloop-nexte [0/1 built, 0.0 KiB DL] [1/0/1 built, 0.0 KiB DLgammaloop-nextest-spenso> Extracting 5 binaries and 2 linked paths to /build/nextest-archive-QE9QBf
  39. 22.42 s gammaloop-nextest-spenso> Extracted 19 files to /build/nextest-archive-QE9QBf in 0.21s
  40. 22.43 s gammaloop-nextest-spenso> ------------
  41. 22.43 s gammaloop-nextest-spenso> Nextest run ID 5cdb0fc4-70d5-4db6-8635-e30feb0a787f with nextest profile: ci_gammaloop
  42. 22.43 s gammaloop-nextest-spenso> Starting 232 tests across 5 binaries (26 tests skipped, including 2 tests via profile.ci_gammaloop.default-filter)
  43. 22.58 s gammaloop-nextest-spenso> FAIL [ 0.014s] ( 91/232) idenso dirac::test::feyncalc_reference::dirac_simplify_id46_d_dim_repeated_gamma_slash_sum
  44. 22.58 s gammaloop-nextest-spenso> stdout ---
  45. 22.58 s gammaloop-nextest-spenso>
  46. 22.58 s gammaloop-nextest-spenso> running 1 test
  47. 22.58 s gammaloop-nextest-spenso> test dirac::test::feyncalc_reference::dirac_simplify_id46_d_dim_repeated_gamma_slash_sum ... FAILED
  48. 22.58 s gammaloop-nextest-spenso>
  49. 22.58 s gammaloop-nextest-spenso> failures:
  50. 22.58 s gammaloop-nextest-spenso>
  51. 22.58 s gammaloop-nextest-spenso> failures:
  52. 22.58 s gammaloop-nextest-spenso> dirac::test::feyncalc_reference::dirac_simplify_id46_d_dim_repeated_gamma_slash_sum
  53. 22.58 s gammaloop-nextest-spenso>
  54. 22.58 s gammaloop-nextest-spenso> test result: FAILED. 0 passed; 1 failed; 0 ignored; 0 measured; 248 filtered out; finished in 0.01s
  55. 22.58 s gammaloop-nextest-spenso>
  56. 22.58 s gammaloop-nextest-spenso> stderr ---
  57. 22.58 s gammaloop-nextest-spenso>
  58. 22.58 s gammaloop-nextest-spenso> thread 'dirac::test::feyncalc_reference::dirac_simplify_id46_d_dim_repeated_gamma_slash_sum' (507) panicked at crates/idenso/src/dirac/mod.rs:360:5:
  59. 22.58 s gammaloop-nextest-spenso> gamma third argument must be a Minkowski slot
  60. 22.58 s gammaloop-nextest-spenso> stack backtrace:
  61. 22.58 s gammaloop-nextest-spenso> 0: __rustc::rust_begin_unwind
  62. 22.58 s gammaloop-nextest-spenso> 1: core::panicking::panic_fmt
  63. 22.58 s gammaloop-nextest-spenso> 2: idenso::dirac::require_gamma_port
  64. 22.58 s gammaloop-nextest-spenso> 3: idenso::dirac::gamma_tensor
  65. 22.58 s gammaloop-nextest-spenso> 4: idenso::dirac::test::feyncalc_reference::dirac_simplify_id46_d_dim_repeated_gamma_slash_sum
  66. 22.58 s gammaloop-nextest-spenso> 5: <idenso::dirac::test::feyncalc_reference::dirac_simplify_id46_d_dim_repeated_gamma_slash_sum::{closure#0} as core::ops::function::FnOnce<()>>::call_once
  67. 22.58 s gammaloop-nextest-spenso> note: Some details are omitted, run with `RUST_BACKTRACE=full` for a verbose backtrace.
  68. 22.58 s gammaloop-nextest-spenso>
  69. 22.58 s gammaloop-nextest-spenso> FAIL [ 0.018s] ( 92/232) idenso dirac::test::feyncalc_reference::dirac_simplify_id40_repeated_gamma_and_two_trace
  70. 22.58 s gammaloop-nextest-spenso> stdout ---
  71. 22.58 s gammaloop-nextest-spenso>
  72. 22.58 s gammaloop-nextest-spenso> running 1 test
  73. 22.58 s gammaloop-nextest-spenso> test dirac::test::feyncalc_reference::dirac_simplify_id40_repeated_gamma_and_two_trace ... FAILED
  74. 22.58 s gammaloop-nextest-spenso>
  75. 22.58 s gammaloop-nextest-spenso> failures:
  76. 22.58 s gammaloop-nextest-spenso>
  77. 22.58 s gammaloop-nextest-spenso> failures:
  78. 22.58 s gammaloop-nextest-spenso> dirac::test::feyncalc_reference::dirac_simplify_id40_repeated_gamma_and_two_trace
  79. 22.58 s gammaloop-nextest-spenso>
  80. 22.58 s gammaloop-nextest-spenso> test result: FAILED. 0 passed; 1 failed; 0 ignored; 0 measured; 248 filtered out; finished in 0.01s
  81. 22.58 s gammaloop-nextest-spenso>
  82. 22.58 s gammaloop-nextest-spenso> stderr ---
  83. 22.58 s gammaloop-nextest-spenso>
  84. 22.58 s gammaloop-nextest-spenso> thread 'dirac::test::feyncalc_reference::dirac_simplify_id40_repeated_gamma_and_two_trace' (506) panicked at crates/idenso/src/dirac/mod.rs:360:5:
  85. 22.58 s gammaloop-nextest-spenso> gamma third argument must be a Minkowski slot
  86. 22.58 s gammaloop-nextest-spenso> stack backtrace:
  87. 22.58 s gammaloop-nextest-spenso> 0: __rustc::rust_begin_unwind
  88. 22.58 s gammaloop-nextest-spenso> 1: core::panicking::panic_fmt
  89. 22.58 s gammaloop-nextest-spenso> 2: idenso::dirac::require_gamma_port
  90. 22.58 s gammaloop-nextest-spenso> 3: idenso::dirac::gamma_tensor
  91. 22.58 s gammaloop-nextest-spenso> 4: idenso::dirac::test::feyncalc_reference::dirac_simplify_id40_repeated_gamma_and_two_trace
  92. 22.58 s gammaloop-nextest-spenso> 5: <idenso::dirac::test::feyncalc_reference::dirac_simplify_id40_repeated_gamma_and_two_trace::{closure#0} as core::ops::function::FnOnce<()>>::call_once
  93. 22.58 s gammaloop-nextest-spenso> note: Some details are omitted, run with `RUST_BACKTRACE=full` for a verbose backtrace.
  94. 22.58 s gammaloop-nextest-spenso>
  95. 22.58 s gammaloop-nextest-spenso> FAIL [ 0.013s] ( 94/232) idenso dirac::test::feyncalc_reference::dirac_simplify_id4_slash_sandwich
  96. 22.58 s gammaloop-nextest-spenso> stdout ---
  97. 22.58 s gammaloop-nextest-spenso>
  98. 22.58 s gammaloop-nextest-spenso> running 1 test
  99. 22.58 s gammaloop-nextest-spenso> test dirac::test::feyncalc_reference::dirac_simplify_id4_slash_sandwich ... FAILED
  100. 22.58 s gammaloop-nextest-spenso>
  101. 22.58 s gammaloop-nextest-spenso> failures:
  102. 22.58 s gammaloop-nextest-spenso>
  103. 22.58 s gammaloop-nextest-spenso> failures:
  104. 22.58 s gammaloop-nextest-spenso> dirac::test::feyncalc_reference::dirac_simplify_id4_slash_sandwich
  105. 22.58 s gammaloop-nextest-spenso>
  106. 22.58 s gammaloop-nextest-spenso> test result: FAILED. 0 passed; 1 failed; 0 ignored; 0 measured; 248 filtered out; finished in 0.01s
  107. 22.58 s gammaloop-nextest-spenso>
  108. 22.58 s gammaloop-nextest-spenso> stderr ---
  109. 22.58 s gammaloop-nextest-spenso>
  110. 22.58 s gammaloop-nextest-spenso> thread 'dirac::test::feyncalc_reference::dirac_simplify_id4_slash_sandwich' (510) panicked at crates/idenso/src/dirac/mod.rs:360:5:
  111. 22.58 s gammaloop-nextest-spenso> gamma third argument must be a Minkowski slot
  112. 22.58 s gammaloop-nextest-spenso> stack backtrace:
  113. 22.58 s gammaloop-nextest-spenso> 0: __rustc::rust_begin_unwind
  114. 22.58 s gammaloop-nextest-spenso> 1: core::panicking::panic_fmt
  115. 22.58 s gammaloop-nextest-spenso> 2: idenso::dirac::require_gamma_port
  116. 22.58 s gammaloop-nextest-spenso> 3: idenso::dirac::gamma_tensor
  117. 22.58 s gammaloop-nextest-spenso> 4: idenso::dirac::test::feyncalc_reference::dirac_simplify_id4_slash_sandwich
  118. 22.58 s gammaloop-nextest-spenso> 5: <idenso::dirac::test::feyncalc_reference::dirac_simplify_id4_slash_sandwich::{closure#0} as core::ops::function::FnOnce<()>>::call_once
  119. 22.58 s gammaloop-nextest-spenso> note: Some details are omitted, run with `RUST_BACKTRACE=full` for a verbose backtrace.
  120. 22.58 s gammaloop-nextest-spenso>
  121. 22.67 s gammaloop-nextest-spenso> FAIL [ 0.016s] (146/232) idenso reference_cases::tests::reference_case_simplification_snapshots
  122. 22.67 s gammaloop-nextest-spenso> stdout ---
  123. 22.67 s gammaloop-nextest-spenso>
  124. 22.67 s gammaloop-nextest-spenso> running 1 test
  125. 22.67 s gammaloop-nextest-spenso> test reference_cases::tests::reference_case_simplification_snapshots ... FAILED
  126. 22.67 s gammaloop-nextest-spenso>
  127. 22.67 s gammaloop-nextest-spenso> failures:
  128. 22.67 s gammaloop-nextest-spenso>
  129. 22.67 s gammaloop-nextest-spenso> failures:
  130. 22.67 s gammaloop-nextest-spenso> reference_cases::tests::reference_case_simplification_snapshots
  131. 22.67 s gammaloop-nextest-spenso>
  132. 22.67 s gammaloop-nextest-spenso> test result: FAILED. 0 passed; 1 failed; 0 ignored; 0 measured; 248 filtered out; finished in 0.01s
  133. 22.67 s gammaloop-nextest-spenso>
  134. 22.67 s gammaloop-nextest-spenso> stderr ---
  135. 22.67 s gammaloop-nextest-spenso>
  136. 22.67 s gammaloop-nextest-spenso> thread 'reference_cases::tests::reference_case_simplification_snapshots' (684) panicked at crates/idenso/src/dirac/mod.rs:360:5:
  137. 22.67 s gammaloop-nextest-spenso> gamma third argument must be a Minkowski slot
  138. 22.67 s gammaloop-nextest-spenso> stack backtrace:
  139. 22.67 s gammaloop-nextest-spenso> 0: __rustc::rust_begin_unwind
  140. 22.67 s gammaloop-nextest-spenso> 1: core::panicking::panic_fmt
  141. 22.67 s gammaloop-nextest-spenso> 2: idenso::dirac::require_gamma_port
  142. 22.67 s gammaloop-nextest-spenso> 3: idenso::dirac::gamma_tensor
  143. 22.67 s gammaloop-nextest-spenso> 4: idenso::reference_cases::dirac_feyncalc_slash_sandwich_id4
  144. 22.67 s gammaloop-nextest-spenso> 5: <idenso::reference_cases::ReferenceCase>::simplified
  145. 22.67 s gammaloop-nextest-spenso> 6: <core::iter::adapters::map::Map<core::slice::iter::Iter<idenso::reference_cases::ReferenceCase>, idenso::reference_cases::tests::reference_case_simplification_snapshots::{closure#0}> as core::iter::traits::iterator::Iterator>::fold::<(), core::iter::traits::iterator::Iterator::for_each::call<alloc::string::String, <alloc::vec::Vec<alloc::string::String>>::extend_trusted<core::iter::adapters::map::Map<core::slice::iter::Iter<idenso::reference_cases::ReferenceCase>, idenso::reference_cases::tests::reference_case_simplification_snapshots::{closure#0}>>::{closure#0}>::{closure#0}>
  146. 22.67 s gammaloop-nextest-spenso> 7: <alloc::vec::Vec<alloc::string::String> as alloc::vec::spec_from_iter_nested::SpecFromIterNested<alloc::string::String, core::iter::adapters::map::Map<core::slice::iter::Iter<idenso::reference_cases::ReferenceCase>, idenso::reference_cases::tests::reference_case_simplification_snapshots::{closure#0}>>>::from_iter
  147. 22.67 s gammaloop-nextest-spenso> 8: idenso::reference_cases::tests::reference_case_simplification_snapshots
  148. 22.67 s gammaloop-nextest-spenso> 9: <idenso::reference_cases::tests::reference_case_simplification_snapshots::{closure#0} as core::ops::function::FnOnce<()>>::call_once
  149. 22.67 s gammaloop-nextest-spenso> note: Some details are omitted, run with `RUST_BACKTRACE=full` for a verbose backtrace.
  150. 22.67 s gammaloop-nextest-spenso>
  151. 22.75 s gammaloop-nextest-spenso> FAIL [ 0.044s] (228/232) idenso tensor::tests::parsing::infinite_execution
  152. 22.75 s gammaloop-nextest-spenso> stdout ---
  153. 22.75 s gammaloop-nextest-spenso>
  154. 22.75 s gammaloop-nextest-spenso> running 1 test
  155. 22.75 s gammaloop-nextest-spenso> ━━━━━━━━━━━━━━━━━━━━━━━━━━━━━━━ Snapshot Summary ━━━━━━━━━━━━━━━━━━━━━━━━━━━━━━━
  156. 22.75 s gammaloop-nextest-spenso> Snapshot: infinite_execution
  157. 22.75 s gammaloop-nextest-spenso> Source: crates/idenso/src/tensor/tests/parsing.rs:905
  158. 22.75 s gammaloop-nextest-spenso> ────────────────────────────────────────────────────────────────────────────────
  159. 22.75 s gammaloop-nextest-spenso> Expression: net_iter.snapshot_dot()
  160. 22.75 s gammaloop-nextest-spenso> ────────────────────────────────────────────────────────────────────────────────
  161. 22.75 s gammaloop-nextest-spenso> -old snapshot
  162. 22.75 s gammaloop-nextest-spenso> +new results
  163. 22.75 s gammaloop-nextest-spenso> ────────────┬───────────────────────────────────────────────────────────────────
  164. 22.75 s gammaloop-nextest-spenso> 8 8 │ 0:0:s -> ext0 [id=0 color="red"];
  165. 22.75 s gammaloop-nextest-spenso> 9 9 │ ext1 [style=invis];
  166. 22.75 s gammaloop-nextest-spenso> 10 10 │ 0:5:s -> ext1 [id=1 dir=none color="red" label="mink4|l_0"];
  167. 22.75 s gammaloop-nextest-spenso> 11 11 │ ext2 [style=invis];
  168. 22.75 s gammaloop-nextest-spenso> 12 │- 0:4:s -> ext2 [id=2 dir=none color="red" label="bis4|l_2"];
  169. 22.75 s gammaloop-nextest-spenso> 12 │+ 0:3:s -> ext2 [id=2 dir=none color="red" label="mink4|l_1"];
  170. 22.75 s gammaloop-nextest-spenso> 13 13 │ ext3 [style=invis];
  171. 22.75 s gammaloop-nextest-spenso> 14 │- 0:3:s -> ext3 [id=3 dir=none color="red" label="bis4|l_3"];
  172. 22.75 s gammaloop-nextest-spenso> 14 │+ 0:1:s -> ext3 [id=3 dir=none color="red" label="bis4|l_2"];
  173. 22.75 s gammaloop-nextest-spenso> 15 15 │ ext4 [style=invis];
  174. 22.75 s gammaloop-nextest-spenso> 16 │- 0:1:s -> ext4 [id=4 dir=none color="red" label="mink4|l_1"];
  175. 22.75 s gammaloop-nextest-spenso> 16 │+ 0:2:s -> ext4 [id=4 dir=none color="red" label="mink4|l_4"];
  176. 22.75 s gammaloop-nextest-spenso> 17 17 │ ext5 [style=invis];
  177. 22.75 s gammaloop-nextest-spenso> 18 │- 0:2:s -> ext5 [id=5 dir=none color="red" label="mink4|l_4"];
  178. 22.75 s gammaloop-nextest-spenso> 18 │+ 0:4:s -> ext5 [id=5 dir=none color="red" label="bis4|l_3"];
  179. 22.75 s gammaloop-nextest-spenso> 19 19 │ }
  180. 22.75 s gammaloop-nextest-spenso> ────────────┴───────────────────────────────────────────────────────────────────
  181. 22.75 s gammaloop-nextest-spenso> To update snapshots run `cargo insta review`
  182. 22.75 s gammaloop-nextest-spenso> Stopped on the first failure. Run `cargo insta test` to run all snapshots.
  183. 22.75 s gammaloop-nextest-spenso> test tensor::tests::parsing::infinite_execution ... FAILED
  184. 22.75 s gammaloop-nextest-spenso>
  185. 22.75 s gammaloop-nextest-spenso> failures:
  186. 22.75 s gammaloop-nextest-spenso>
  187. 22.75 s gammaloop-nextest-spenso> failures:
  188. 22.75 s gammaloop-nextest-spenso> tensor::tests::parsing::infinite_execution
  189. 22.75 s gammaloop-nextest-spenso>
  190. 22.75 s gammaloop-nextest-spenso> test result: FAILED. 0 passed; 1 failed; 0 ignored; 0 measured; 248 filtered out; finished in 0.04s
  191. 22.75 s gammaloop-nextest-spenso>
  192. 22.75 s gammaloop-nextest-spenso> stderr ---
  193. 22.75 s gammaloop-nextest-spenso>
  194. 22.75 s gammaloop-nextest-spenso> thread 'tensor::tests::parsing::infinite_execution' (855) panicked at /nix/store/hg5bizfwiwqlh0nqmr64rssi5zwpdp0k-vendor-cargo-deps/c19b7c6f923b580ac259164a89f2577984ad5ab09ee9d583b888f934adbbe8d0/insta-1.47.2/src/runtime.rs:719:13:
  195. 22.75 s gammaloop-nextest-spenso> snapshot assertion for 'infinite_execution' failed in line 905
  196. 22.75 s gammaloop-nextest-spenso> stack backtrace:
  197. 22.75 s gammaloop-nextest-spenso> 0: __rustc::rust_begin_unwind
  198. 22.75 s gammaloop-nextest-spenso> 1: core::panicking::panic_fmt
  199. 22.75 s gammaloop-nextest-spenso> 2: insta::runtime::assert_snapshot
  200. 22.75 s gammaloop-nextest-spenso> 3: idenso::tensor::tests::parsing::infinite_execution
  201. 22.75 s gammaloop-nextest-spenso> 4: <idenso::tensor::tests::parsing::infinite_execution::{closure#0} as core::ops::function::FnOnce<()>>::call_once
  202. 22.75 s gammaloop-nextest-spenso> note: Some details are omitted, run with `RUST_BACKTRACE=full` for a verbose backtrace.
  203. 22.75 s gammaloop-nextest-spenso>
  204. 24.04 s gammaloop-nextest-spenso> ------------
  205. 24.04 s gammaloop-nextest-spenso> Summary [ 1.601s] 232 tests run: 227 passed, 5 failed, 26 skipped
  206. 24.04 s gammaloop-nextest-spenso> FAIL [ 0.014s] ( 91/232) idenso dirac::test::feyncalc_reference::dirac_simplify_id46_d_dim_repeated_gamma_slash_sum
  207. 24.04 s gammaloop-nextest-spenso> stdout ---
  208. 24.04 s gammaloop-nextest-spenso>
  209. 24.04 s gammaloop-nextest-spenso> running 1 test
  210. 24.04 s gammaloop-nextest-spenso> test dirac::test::feyncalc_reference::dirac_simplify_id46_d_dim_repeated_gamma_slash_sum ... FAILED
  211. 24.04 s gammaloop-nextest-spenso>
  212. 24.04 s gammaloop-nextest-spenso> failures:
  213. 24.04 s gammaloop-nextest-spenso>
  214. 24.04 s gammaloop-nextest-spenso> failures:
  215. 24.04 s gammaloop-nextest-spenso> dirac::test::feyncalc_reference::dirac_simplify_id46_d_dim_repeated_gamma_slash_sum
  216. 24.04 s gammaloop-nextest-spenso>
  217. 24.04 s gammaloop-nextest-spenso> test result: FAILED. 0 passed; 1 failed; 0 ignored; 0 measured; 248 filtered out; finished in 0.01s
  218. 24.04 s gammaloop-nextest-spenso>
  219. 24.04 s gammaloop-nextest-spenso> stderr ---
  220. 24.04 s gammaloop-nextest-spenso>
  221. 24.04 s gammaloop-nextest-spenso> thread 'dirac::test::feyncalc_reference::dirac_simplify_id46_d_dim_repeated_gamma_slash_sum' (507) panicked at crates/idenso/src/dirac/mod.rs:360:5:
  222. 24.04 s gammaloop-nextest-spenso> gamma third argument must be a Minkowski slot
  223. 24.04 s gammaloop-nextest-spenso> stack backtrace:
  224. 24.04 s gammaloop-nextest-spenso> 0: __rustc::rust_begin_unwind
  225. 24.04 s gammaloop-nextest-spenso> 1: core::panicking::panic_fmt
  226. 24.04 s gammaloop-nextest-spenso> 2: idenso::dirac::require_gamma_port
  227. 24.04 s gammaloop-nextest-spenso> 3: idenso::dirac::gamma_tensor
  228. 24.04 s gammaloop-nextest-spenso> 4: idenso::dirac::test::feyncalc_reference::dirac_simplify_id46_d_dim_repeated_gamma_slash_sum
  229. 24.04 s gammaloop-nextest-spenso> 5: <idenso::dirac::test::feyncalc_reference::dirac_simplify_id46_d_dim_repeated_gamma_slash_sum::{closure#0} as core::ops::function::FnOnce<()>>::call_once
  230. 24.04 s gammaloop-nextest-spenso> note: Some details are omitted, run with `RUST_BACKTRACE=full` for a verbose backtrace.
  231. 24.04 s gammaloop-nextest-spenso>
  232. 24.04 s gammaloop-nextest-spenso> FAIL [ 0.018s] ( 92/232) idenso dirac::test::feyncalc_reference::dirac_simplify_id40_repeated_gamma_and_two_trace
  233. 24.04 s gammaloop-nextest-spenso> stdout ---
  234. 24.04 s gammaloop-nextest-spenso>
  235. 24.04 s gammaloop-nextest-spenso> running 1 test
  236. 24.04 s gammaloop-nextest-spenso> test dirac::test::feyncalc_reference::dirac_simplify_id40_repeated_gamma_and_two_trace ... FAILED
  237. 24.04 s gammaloop-nextest-spenso>
  238. 24.04 s gammaloop-nextest-spenso> failures:
  239. 24.04 s gammaloop-nextest-spenso>
  240. 24.04 s gammaloop-nextest-spenso> failures:
  241. 24.04 s gammaloop-nextest-spenso> dirac::test::feyncalc_reference::dirac_simplify_id40_repeated_gamma_and_two_trace
  242. 24.04 s gammaloop-nextest-spenso>
  243. 24.04 s gammaloop-nextest-spenso> test result: FAILED. 0 passed; 1 failed; 0 ignored; 0 measured; 248 filtered out; finished in 0.01s
  244. 24.04 s gammaloop-nextest-spenso>
  245. 24.04 s gammaloop-nextest-spenso> stderr ---
  246. 24.04 s gammaloop-nextest-spenso>
  247. 24.04 s gammaloop-nextest-spenso> thread 'dirac::test::feyncalc_reference::dirac_simplify_id40_repeated_gamma_and_two_trace' (506) panicked at crates/idenso/src/dirac/mod.rs:360:5:
  248. 24.04 s gammaloop-nextest-spenso> gamma third argument must be a Minkowski slot
  249. 24.04 s gammaloop-nextest-spenso> stack backtrace:
  250. 24.04 s gammaloop-nextest-spenso> 0: __rustc::rust_begin_unwind
  251. 24.04 s gammaloop-nextest-spenso> 1: core::panicking::panic_fmt
  252. 24.04 s gammaloop-nextest-spenso> 2: idenso::dirac::require_gamma_port
  253. 24.04 s gammaloop-nextest-spenso> 3: idenso::dirac::gamma_tensor
  254. 24.04 s gammaloop-nextest-spenso> 4: idenso::dirac::test::feyncalc_reference::dirac_simplify_id40_repeated_gamma_and_two_trace
  255. 24.04 s gammaloop-nextest-spenso> 5: <idenso::dirac::test::feyncalc_reference::dirac_simplify_id40_repeated_gamma_and_two_trace::{closure#0} as core::ops::function::FnOnce<()>>::call_once
  256. 24.04 s gammaloop-nextest-spenso> note: Some details are omitted, run with `RUST_BACKTRACE=full` for a verbose backtrace.
  257. 24.04 s gammaloop-nextest-spenso>
  258. 24.04 s gammaloop-nextest-spenso> FAIL [ 0.013s] ( 94/232) idenso dirac::test::feyncalc_reference::dirac_simplify_id4_slash_sandwich
  259. 24.04 s gammaloop-nextest-spenso> stdout ---
  260. 24.04 s gammaloop-nextest-spenso>
  261. 24.04 s gammaloop-nextest-spenso> running 1 test
  262. 24.04 s gammaloop-nextest-spenso> test dirac::test::feyncalc_reference::dirac_simplify_id4_slash_sandwich ... FAILED
  263. 24.04 s gammaloop-nextest-spenso>
  264. 24.04 s gammaloop-nextest-spenso> failures:
  265. 24.04 s gammaloop-nextest-spenso>
  266. 24.04 s gammaloop-nextest-spenso> failures:
  267. 24.04 s gammaloop-nextest-spenso> dirac::test::feyncalc_reference::dirac_simplify_id4_slash_sandwich
  268. 24.04 s gammaloop-nextest-spenso>
  269. 24.04 s gammaloop-nextest-spenso> test result: FAILED. 0 passed; 1 failed; 0 ignored; 0 measured; 248 filtered out; finished in 0.01s
  270. 24.04 s gammaloop-nextest-spenso>
  271. 24.04 s gammaloop-nextest-spenso> stderr ---
  272. 24.04 s gammaloop-nextest-spenso>
  273. 24.04 s gammaloop-nextest-spenso> thread 'dirac::test::feyncalc_reference::dirac_simplify_id4_slash_sandwich' (510) panicked at crates/idenso/src/dirac/mod.rs:360:5:
  274. 24.04 s gammaloop-nextest-spenso> gamma third argument must be a Minkowski slot
  275. 24.04 s gammaloop-nextest-spenso> stack backtrace:
  276. 24.04 s gammaloop-nextest-spenso> 0: __rustc::rust_begin_unwind
  277. 24.04 s gammaloop-nextest-spenso> 1: core::panicking::panic_fmt
  278. 24.04 s gammaloop-nextest-spenso> 2: idenso::dirac::require_gamma_port
  279. 24.04 s gammaloop-nextest-spenso> 3: idenso::dirac::gamma_tensor
  280. 24.04 s gammaloop-nextest-spenso> 4: idenso::dirac::test::feyncalc_reference::dirac_simplify_id4_slash_sandwich
  281. 24.04 s gammaloop-nextest-spenso> 5: <idenso::dirac::test::feyncalc_reference::dirac_simplify_id4_slash_sandwich::{closure#0} as core::ops::function::FnOnce<()>>::call_once
  282. 24.04 s gammaloop-nextest-spenso> note: Some details are omitted, run with `RUST_BACKTRACE=full` for a verbose backtrace.
  283. 24.04 s gammaloop-nextest-spenso>
  284. 24.04 s gammaloop-nextest-spenso> FAIL [ 0.016s] (146/232) idenso reference_cases::tests::reference_case_simplification_snapshots
  285. 24.04 s gammaloop-nextest-spenso> stdout ---
  286. 24.04 s gammaloop-nextest-spenso>
  287. 24.04 s gammaloop-nextest-spenso> running 1 test
  288. 24.04 s gammaloop-nextest-spenso> test reference_cases::tests::reference_case_simplification_snapshots ... FAILED
  289. 24.04 s gammaloop-nextest-spenso>
  290. 24.04 s gammaloop-nextest-spenso> failures:
  291. 24.04 s gammaloop-nextest-spenso>
  292. 24.04 s gammaloop-nextest-spenso> failures:
  293. 24.04 s gammaloop-nextest-spenso> reference_cases::tests::reference_case_simplification_snapshots
  294. 24.04 s gammaloop-nextest-spenso>
  295. 24.04 s gammaloop-nextest-spenso> test result: FAILED. 0 passed; 1 failed; 0 ignored; 0 measured; 248 filtered out; finished in 0.01s
  296. 24.04 s gammaloop-nextest-spenso>
  297. 24.04 s gammaloop-nextest-spenso> stderr ---
  298. 24.04 s gammaloop-nextest-spenso>
  299. 24.04 s gammaloop-nextest-spenso> thread 'reference_cases::tests::reference_case_simplification_snapshots' (684) panicked at crates/idenso/src/dirac/mod.rs:360:5:
  300. 24.04 s gammaloop-nextest-spenso> gamma third argument must be a Minkowski slot
  301. 24.04 s gammaloop-nextest-spenso> stack backtrace:
  302. 24.04 s gammaloop-nextest-spenso> 0: __rustc::rust_begin_unwind
  303. 24.04 s gammaloop-nextest-spenso> 1: core::panicking::panic_fmt
  304. 24.04 s gammaloop-nextest-spenso> 2: idenso::dirac::require_gamma_port
  305. 24.04 s gammaloop-nextest-spenso> 3: idenso::dirac::gamma_tensor
  306. 24.04 s gammaloop-nextest-spenso> 4: idenso::reference_cases::dirac_feyncalc_slash_sandwich_id4
  307. 24.04 s gammaloop-nextest-spenso> 5: <idenso::reference_cases::ReferenceCase>::simplified
  308. 24.04 s gammaloop-nextest-spenso> 6: <core::iter::adapters::map::Map<core::slice::iter::Iter<idenso::reference_cases::ReferenceCase>, idenso::reference_cases::tests::reference_case_simplification_snapshots::{closure#0}> as core::iter::traits::iterator::Iterator>::fold::<(), core::iter::traits::iterator::Iterator::for_each::call<alloc::string::String, <alloc::vec::Vec<alloc::string::String>>::extend_trusted<core::iter::adapters::map::Map<core::slice::iter::Iter<idenso::reference_cases::ReferenceCase>, idenso::reference_cases::tests::reference_case_simplification_snapshots::{closure#0}>>::{closure#0}>::{closure#0}>
  309. 24.04 s gammaloop-nextest-spenso> 7: <alloc::vec::Vec<alloc::string::String> as alloc::vec::spec_from_iter_nested::SpecFromIterNested<alloc::string::String, core::iter::adapters::map::Map<core::slice::iter::Iter<idenso::reference_cases::ReferenceCase>, idenso::reference_cases::tests::reference_case_simplification_snapshots::{closure#0}>>>::from_iter
  310. 24.04 s gammaloop-nextest-spenso> 8: idenso::reference_cases::tests::reference_case_simplification_snapshots
  311. 24.04 s gammaloop-nextest-spenso> 9: <idenso::reference_cases::tests::reference_case_simplification_snapshots::{closure#0} as core::ops::function::FnOnce<()>>::call_once
  312. 24.04 s gammaloop-nextest-spenso> note: Some details are omitted, run with `RUST_BACKTRACE=full` for a verbose backtrace.
  313. 24.04 s gammaloop-nextest-spenso>
  314. 24.04 s gammaloop-nextest-spenso> FAIL [ 0.044s] (228/232) idenso tensor::tests::parsing::infinite_execution
  315. 24.04 s gammaloop-nextest-spenso> stdout ---
  316. 24.04 s gammaloop-nextest-spenso>
  317. 24.04 s gammaloop-nextest-spenso> running 1 test
  318. 24.04 s gammaloop-nextest-spenso> ━━━━━━━━━━━━━━━━━━━━━━━━━━━━━━━ Snapshot Summary ━━━━━━━━━━━━━━━━━━━━━━━━━━━━━━━
  319. 24.04 s gammaloop-nextest-spenso> Snapshot: infinite_execution
  320. 24.04 s gammaloop-nextest-spenso> Source: crates/idenso/src/tensor/tests/parsing.rs:905
  321. 24.04 s gammaloop-nextest-spenso> ────────────────────────────────────────────────────────────────────────────────
  322. 24.04 s gammaloop-nextest-spenso> Expression: net_iter.snapshot_dot()
  323. 24.04 s gammaloop-nextest-spenso> ────────────────────────────────────────────────────────────────────────────────
  324. 24.04 s gammaloop-nextest-spenso> -old snapshot
  325. 24.04 s gammaloop-nextest-spenso> +new results
  326. 24.04 s gammaloop-nextest-spenso> ────────────┬───────────────────────────────────────────────────────────────────
  327. 24.04 s gammaloop-nextest-spenso> 8 8 │ 0:0:s -> ext0 [id=0 color="red"];
  328. 24.04 s gammaloop-nextest-spenso> 9 9 │ ext1 [style=invis];
  329. 24.04 s gammaloop-nextest-spenso> 10 10 │ 0:5:s -> ext1 [id=1 dir=none color="red" label="mink4|l_0"];
  330. 24.04 s gammaloop-nextest-spenso> 11 11 │ ext2 [style=invis];
  331. 24.04 s gammaloop-nextest-spenso> 12 │- 0:4:s -> ext2 [id=2 dir=none color="red" label="bis4|l_2"];
  332. 24.04 s gammaloop-nextest-spenso> 12 │+ 0:3:s -> ext2 [id=2 dir=none color="red" label="mink4|l_1"];
  333. 24.04 s gammaloop-nextest-spenso> 13 13 │ ext3 [style=invis];
  334. 24.04 s gammaloop-nextest-spenso> 14 │- 0:3:s -> ext3 [id=3 dir=none color="red" label="bis4|l_3"];
  335. 24.04 s gammaloop-nextest-spenso> 14 │+ 0:1:s -> ext3 [id=3 dir=none color="red" label="bis4|l_2"];
  336. 24.04 s gammaloop-nextest-spenso> 15 15 │ ext4 [style=invis];
  337. 24.04 s gammaloop-nextest-spenso> 16 │- 0:1:s -> ext4 [id=4 dir=none color="red" label="mink4|l_1"];
  338. 24.04 s gammaloop-nextest-spenso> 16 │+ 0:2:s -> ext4 [id=4 dir=none color="red" label="mink4|l_4"];
  339. 24.04 s gammaloop-nextest-spenso> 17 17 │ ext5 [style=invis];
  340. 24.04 s gammaloop-nextest-spenso> 18 │- 0:2:s -> ext5 [id=5 dir=none color="red" label="mink4|l_4"];
  341. 24.04 s gammaloop-nextest-spenso> 18 │+ 0:4:s -> ext5 [id=5 dir=none color="red" label="bis4|l_3"];
  342. 24.04 s gammaloop-nextest-spenso> 19 19 │ }
  343. 24.04 s gammaloop-nextest-spenso> ────────────┴───────────────────────────────────────────────────────────────────
  344. 24.04 s gammaloop-nextest-spenso> To update snapshots run `cargo insta review`
  345. 24.04 s gammaloop-nextest-spenso> Stopped on the first failure. Run `cargo insta test` to run all snapshots.
  346. 24.04 s gammaloop-nextest-spenso> test tensor::tests::parsing::infinite_execution ... FAILED
  347. 24.04 s gammaloop-nextest-spenso>
  348. 24.04 s gammaloop-nextest-spenso> failures:
  349. 24.04 s gammaloop-nextest-spenso>
  350. 24.04 s gammaloop-nextest-spenso> failures:
  351. 24.04 s gammaloop-nextest-spenso> tensor::tests::parsing::infinite_execution
  352. 24.04 s gammaloop-nextest-spenso>
  353. 24.04 s gammaloop-nextest-spenso> test result: FAILED. 0 passed; 1 failed; 0 ignored; 0 measured; 248 filtered out; finished in 0.04s
  354. 24.04 s gammaloop-nextest-spenso>
  355. 24.04 s gammaloop-nextest-spenso> stderr ---
  356. 24.04 s gammaloop-nextest-spenso>
  357. 24.04 s gammaloop-nextest-spenso> thread 'tensor::tests::parsing::infinite_execution' (855) panicked at /nix/store/hg5bizfwiwqlh0nqmr64rssi5zwpdp0k-vendor-cargo-deps/c19b7c6f923b580ac259164a89f2577984ad5ab09ee9d583b888f934adbbe8d0/insta-1.47.2/src/runtime.rs:719:13:
  358. 24.04 s gammaloop-nextest-spenso> snapshot assertion for 'infinite_execution' failed in line 905
  359. 24.04 s gammaloop-nextest-spenso> stack backtrace:
  360. 24.04 s gammaloop-nextest-spenso> 0: __rustc::rust_begin_unwind
  361. 24.04 s gammaloop-nextest-spenso> 1: core::panicking::panic_fmt
  362. 24.04 s gammaloop-nextest-spenso> 2: insta::runtime::assert_snapshot
  363. 24.04 s gammaloop-nextest-spenso> 3: idenso::tensor::tests::parsing::infinite_execution
  364. 24.04 s gammaloop-nextest-spenso> 4: <idenso::tensor::tests::parsing::infinite_execution::{closure#0} as core::ops::function::FnOnce<()>>::call_once
  365. 24.04 s gammaloop-nextest-spenso> note: Some details are omitted, run with `RUST_BACKTRACE=full` for a verbose backtrace.
  366. 24.04 s gammaloop-nextest-spenso>
  367. 24.07 s gammaloop-nextest-spenso> error: test run failed
  368. 24.10 s gammaloop-nextest-spenso>
  369. 24.10 s gammaloop-nextest-spenso> ========== nextest test summary ==========
  370. 24.10 s gammaloop-nextest-spenso> report: target/nextest/ci_gammaloop/junit.xml
  371. 24.10 s gammaloop-nextest-spenso> tests: 232, failures: 5, errors: 0
  372. 24.10 s gammaloop-nextest-spenso>
  373. 24.10 s gammaloop-nextest-spenso> 1. idenso::dirac::test::feyncalc_reference::dirac_simplify_id46_d_dim_repeated_gamma_slash_sum
  374. 24.10 s gammaloop-nextest-spenso> failure: test failure with exit code 101
  375. 24.10 s gammaloop-nextest-spenso> thread 'dirac::test::feyncalc_reference::dirac_simplify_id46_d_dim_repeated_gamma_slash_sum' (507) panicked at crates/idenso/src/dirac/mod.rs:360:5:
  376. 24.10 s gammaloop-nextest-spenso> gamma third argument must be a Minkowski slot
  377. 24.10 s gammaloop-nextest-spenso> stack backtrace:
  378. 24.10 s gammaloop-nextest-spenso> 0: __rustc::rust_begin_unwind
  379. 24.10 s gammaloop-nextest-spenso> 1: core::panicking::panic_fmt
  380. 24.10 s gammaloop-nextest-spenso> 2: idenso::dirac::require_gamma_port
  381. 24.10 s gammaloop-nextest-spenso> 3: idenso::dirac::gamma_tensor
  382. 24.10 s gammaloop-nextest-spenso> 4: idenso::dirac::test::feyncalc_reference::dirac_simplify_id46_d_dim_repeated_gamma_slash_sum
  383. 24.10 s gammaloop-nextest-spenso> 5: <idenso::dirac::test::feyncalc_reference::dirac_simplify_id46_d_dim_repeated_gamma_slash_sum::{closure#0} as core::ops::function::FnOnce<()>>::call_once
  384. 24.10 s gammaloop-nextest-spenso> note: Some details are omitted, run with `RUST_BACKTRACE=full` for a verbose backtrace.
  385. 24.10 s gammaloop-nextest-spenso> system-out
  386. 24.10 s gammaloop-nextest-spenso> running 1 test
  387. 24.10 s gammaloop-nextest-spenso> test dirac::test::feyncalc_reference::dirac_simplify_id46_d_dim_repeated_gamma_slash_sum ... FAILED
  388. 24.10 s gammaloop-nextest-spenso>
  389. 24.10 s gammaloop-nextest-spenso> failures:
  390. 24.10 s gammaloop-nextest-spenso>
  391. 24.10 s gammaloop-nextest-spenso> failures:
  392. 24.10 s gammaloop-nextest-spenso> dirac::test::feyncalc_reference::dirac_simplify_id46_d_dim_repeated_gamma_slash_sum
  393. 24.10 s gammaloop-nextest-spenso>
  394. 24.10 s gammaloop-nextest-spenso> test result: FAILED. 0 passed; 1 failed; 0 ignored; 0 measured; 248 filtered out; finished in 0.01s
  395. 24.10 s gammaloop-nextest-spenso> system-err
  396. 24.10 s gammaloop-nextest-spenso> thread 'dirac::test::feyncalc_reference::dirac_simplify_id46_d_dim_repeated_gamma_slash_sum' (507) panicked at crates/idenso/src/dirac/mod.rs:360:5:
  397. 24.10 s gammaloop-nextest-spenso> gamma third argument must be a Minkowski slot
  398. 24.10 s gammaloop-nextest-spenso> stack backtrace:
  399. 24.10 s gammaloop-nextest-spenso> 0: __rustc::rust_begin_unwind
  400. 24.10 s gammaloop-nextest-spenso> 1: core::panicking::panic_fmt
  401. 24.10 s gammaloop-nextest-spenso> 2: idenso::dirac::require_gamma_port
  402. 24.10 s gammaloop-nextest-spenso> 3: idenso::dirac::gamma_tensor
  403. 24.10 s gammaloop-nextest-spenso> 4: idenso::dirac::test::feyncalc_reference::dirac_simplify_id46_d_dim_repeated_gamma_slash_sum
  404. 24.10 s gammaloop-nextest-spenso> 5: <idenso::dirac::test::feyncalc_reference::dirac_simplify_id46_d_dim_repeated_gamma_slash_sum::{closure#0} as core::ops::function::FnOnce<()>>::call_once
  405. 24.10 s gammaloop-nextest-spenso> note: Some details are omitted, run with `RUST_BACKTRACE=full` for a verbose backtrace.
  406. 24.10 s gammaloop-nextest-spenso>
  407. 24.10 s gammaloop-nextest-spenso> 2. idenso::dirac::test::feyncalc_reference::dirac_simplify_id40_repeated_gamma_and_two_trace
  408. 24.10 s gammaloop-nextest-spenso> failure: test failure with exit code 101
  409. 24.10 s gammaloop-nextest-spenso> thread 'dirac::test::feyncalc_reference::dirac_simplify_id40_repeated_gamma_and_two_trace' (506) panicked at crates/idenso/src/dirac/mod.rs:360:5:
  410. 24.10 s gammaloop-nextest-spenso> gamma third argument must be a Minkowski slot
  411. 24.10 s gammaloop-nextest-spenso> stack backtrace:
  412. 24.10 s gammaloop-nextest-spenso> 0: __rustc::rust_begin_unwind
  413. 24.10 s gammaloop-nextest-spenso> 1: core::panicking::panic_fmt
  414. 24.10 s gammaloop-nextest-spenso> 2: idenso::dirac::require_gamma_port
  415. 24.10 s gammaloop-nextest-spenso> 3: idenso::dirac::gamma_tensor
  416. 24.10 s gammaloop-nextest-spenso> 4: idenso::dirac::test::feyncalc_reference::dirac_simplify_id40_repeated_gamma_and_two_trace
  417. 24.10 s gammaloop-nextest-spenso> 5: <idenso::dirac::test::feyncalc_reference::dirac_simplify_id40_repeated_gamma_and_two_trace::{closure#0} as core::ops::function::FnOnce<()>>::call_once
  418. 24.10 s gammaloop-nextest-spenso> note: Some details are omitted, run with `RUST_BACKTRACE=full` for a verbose backtrace.
  419. 24.10 s gammaloop-nextest-spenso> system-out
  420. 24.10 s gammaloop-nextest-spenso> running 1 test
  421. 24.10 s gammaloop-nextest-spenso> test dirac::test::feyncalc_reference::dirac_simplify_id40_repeated_gamma_and_two_trace ... FAILED
  422. 24.10 s gammaloop-nextest-spenso>
  423. 24.10 s gammaloop-nextest-spenso> failures:
  424. 24.10 s gammaloop-nextest-spenso>
  425. 24.10 s gammaloop-nextest-spenso> failures:
  426. 24.10 s gammaloop-nextest-spenso> dirac::test::feyncalc_reference::dirac_simplify_id40_repeated_gamma_and_two_trace
  427. 24.10 s gammaloop-nextest-spenso>
  428. 24.10 s gammaloop-nextest-spenso> test result: FAILED. 0 passed; 1 failed; 0 ignored; 0 measured; 248 filtered out; finished in 0.01s
  429. 24.10 s gammaloop-nextest-spenso> system-err
  430. 24.10 s gammaloop-nextest-spenso> thread 'dirac::test::feyncalc_reference::dirac_simplify_id40_repeated_gamma_and_two_trace' (506) panicked at crates/idenso/src/dirac/mod.rs:360:5:
  431. 24.10 s gammaloop-nextest-spenso> gamma third argument must be a Minkowski slot
  432. 24.10 s gammaloop-nextest-spenso> stack backtrace:
  433. 24.10 s gammaloop-nextest-spenso> 0: __rustc::rust_begin_unwind
  434. 24.10 s gammaloop-nextest-spenso> 1: core::panicking::panic_fmt
  435. 24.10 s gammaloop-nextest-spenso> 2: idenso::dirac::require_gamma_port
  436. 24.10 s gammaloop-nextest-spenso> 3: idenso::dirac::gamma_tensor
  437. 24.10 s gammaloop-nextest-spenso> 4: idenso::dirac::test::feyncalc_reference::dirac_simplify_id40_repeated_gamma_and_two_trace
  438. 24.10 s gammaloop-nextest-spenso> 5: <idenso::dirac::test::feyncalc_reference::dirac_simplify_id40_repeated_gamma_and_two_trace::{closure#0} as core::ops::function::FnOnce<()>>::call_once
  439. 24.10 s gammaloop-nextest-spenso> note: Some details are omitted, run with `RUST_BACKTRACE=full` for a verbose backtrace.
  440. 24.10 s gammaloop-nextest-spenso>
  441. 24.10 s gammaloop-nextest-spenso> 3. idenso::dirac::test::feyncalc_reference::dirac_simplify_id4_slash_sandwich
  442. 24.10 s gammaloop-nextest-spenso> failure: test failure with exit code 101
  443. 24.10 s gammaloop-nextest-spenso> thread 'dirac::test::feyncalc_reference::dirac_simplify_id4_slash_sandwich' (510) panicked at crates/idenso/src/dirac/mod.rs:360:5:
  444. 24.10 s gammaloop-nextest-spenso> gamma third argument must be a Minkowski slot
  445. 24.10 s gammaloop-nextest-spenso> stack backtrace:
  446. 24.10 s gammaloop-nextest-spenso> 0: __rustc::rust_begin_unwind
  447. 24.10 s gammaloop-nextest-spenso> 1: core::panicking::panic_fmt
  448. 24.10 s gammaloop-nextest-spenso> 2: idenso::dirac::require_gamma_port
  449. 24.10 s gammaloop-nextest-spenso> 3: idenso::dirac::gamma_tensor
  450. 24.10 s gammaloop-nextest-spenso> 4: idenso::dirac::test::feyncalc_reference::dirac_simplify_id4_slash_sandwich
  451. 24.10 s gammaloop-nextest-spenso> 5: <idenso::dirac::test::feyncalc_reference::dirac_simplify_id4_slash_sandwich::{closure#0} as core::ops::function::FnOnce<()>>::call_once
  452. 24.10 s gammaloop-nextest-spenso> note: Some details are omitted, run with `RUST_BACKTRACE=full` for a verbose backtrace.
  453. 24.10 s gammaloop-nextest-spenso> system-out
  454. 24.10 s gammaloop-nextest-spenso> running 1 test
  455. 24.10 s gammaloop-nextest-spenso> test dirac::test::feyncalc_reference::dirac_simplify_id4_slash_sandwich ... FAILED
  456. 24.10 s gammaloop-nextest-spenso>
  457. 24.10 s gammaloop-nextest-spenso> failures:
  458. 24.10 s gammaloop-nextest-spenso>
  459. 24.10 s gammaloop-nextest-spenso> failures:
  460. 24.10 s gammaloop-nextest-spenso> dirac::test::feyncalc_reference::dirac_simplify_id4_slash_sandwich
  461. 24.10 s gammaloop-nextest-spenso>
  462. 24.10 s gammaloop-nextest-spenso> test result: FAILED. 0 passed; 1 failed; 0 ignored; 0 measured; 248 filtered out; finished in 0.01s
  463. 24.10 s gammaloop-nextest-spenso> system-err
  464. 24.10 s gammaloop-nextest-spenso> thread 'dirac::test::feyncalc_reference::dirac_simplify_id4_slash_sandwich' (510) panicked at crates/idenso/src/dirac/mod.rs:360:5:
  465. 24.10 s gammaloop-nextest-spenso> gamma third argument must be a Minkowski slot
  466. 24.10 s gammaloop-nextest-spenso> stack backtrace:
  467. 24.10 s gammaloop-nextest-spenso> 0: __rustc::rust_begin_unwind
  468. 24.10 s gammaloop-nextest-spenso> 1: core::panicking::panic_fmt
  469. 24.10 s gammaloop-nextest-spenso> 2: idenso::dirac::require_gamma_port
  470. 24.10 s gammaloop-nextest-spenso> 3: idenso::dirac::gamma_tensor
  471. 24.10 s gammaloop-nextest-spenso> 4: idenso::dirac::test::feyncalc_reference::dirac_simplify_id4_slash_sandwich
  472. 24.10 s gammaloop-nextest-spenso> 5: <idenso::dirac::test::feyncalc_reference::dirac_simplify_id4_slash_sandwich::{closure#0} as core::ops::function::FnOnce<()>>::call_once
  473. 24.10 s gammaloop-nextest-spenso> note: Some details are omitted, run with `RUST_BACKTRACE=full` for a verbose backtrace.
  474. 24.10 s gammaloop-nextest-spenso>
  475. 24.10 s gammaloop-nextest-spenso> 4. idenso::reference_cases::tests::reference_case_simplification_snapshots
  476. 24.10 s gammaloop-nextest-spenso> failure: test failure with exit code 101
  477. 24.10 s gammaloop-nextest-spenso> thread 'reference_cases::tests::reference_case_simplification_snapshots' (684) panicked at crates/idenso/src/dirac/mod.rs:360:5:
  478. 24.10 s gammaloop-nextest-spenso> gamma third argument must be a Minkowski slot
  479. 24.10 s gammaloop-nextest-spenso> stack backtrace:
  480. 24.10 s gammaloop-nextest-spenso> 0: __rustc::rust_begin_unwind
  481. 24.10 s gammaloop-nextest-spenso> 1: core::panicking::panic_fmt
  482. 24.10 s gammaloop-nextest-spenso> 2: idenso::dirac::require_gamma_port
  483. 24.10 s gammaloop-nextest-spenso> 3: idenso::dirac::gamma_tensor
  484. 24.10 s gammaloop-nextest-spenso> 4: idenso::reference_cases::dirac_feyncalc_slash_sandwich_id4
  485. 24.10 s gammaloop-nextest-spenso> 5: <idenso::reference_cases::ReferenceCase>::simplified
  486. 24.10 s gammaloop-nextest-spenso> 6: <core::iter::adapters::map::Map<core::slice::iter::Iter<idenso::reference_cases::ReferenceCase>, idenso::reference_cases::tests::reference_case_simplification_snapshots::{closure#0}> as core::iter::traits::iterator::Iterator>::fold::<(), core::iter::traits::iterator::Iterator::for_each::call<alloc::string::String, <alloc::vec::Vec<alloc::string::String>>::extend_trusted<core::iter::adapters::map::Map<core::slice::iter::Iter<idenso::reference_cases::ReferenceCase>, idenso::reference_cases::tests::reference_case_simplification_snapshots::{closure#0}>>::{closure#0}>::{closure#0}>
  487. 24.10 s gammaloop-nextest-spenso> 7: <alloc::vec::Vec<alloc::string::String> as alloc::vec::spec_from_iter_nested::SpecFromIterNested<alloc::string::String, core::iter::adapters::map::Map<core::slice::iter::Iter<idenso::reference_cases::ReferenceCase>, idenso::reference_cases::tests::reference_case_simplification_snapshots::{closure#0}>>>::from_iter
  488. 24.10 s gammaloop-nextest-spenso> 8: idenso::reference_cases::tests::reference_case_simplification_snapshots
  489. 24.10 s gammaloop-nextest-spenso> 9: <idenso::reference_cases::tests::reference_case_simplification_snapshots::{closure#0} as core::ops::function::FnOnce<()>>::call_once
  490. 24.10 s gammaloop-nextest-spenso> note: Some details are omitted, run with `RUST_BACKTRACE=full` for a verbose backtrace.
  491. 24.10 s gammaloop-nextest-spenso> system-out
  492. 24.10 s gammaloop-nextest-spenso> running 1 test
  493. 24.10 s gammaloop-nextest-spenso> test reference_cases::tests::reference_case_simplification_snapshots ... FAILED
  494. 24.10 s gammaloop-nextest-spenso>
  495. 24.10 s gammaloop-nextest-spenso> failures:
  496. 24.10 s gammaloop-nextest-spenso>
  497. 24.10 s gammaloop-nextest-spenso> failures:
  498. 24.10 s gammaloop-nextest-spenso> reference_cases::tests::reference_case_simplification_snapshots
  499. 24.10 s gammaloop-nextest-spenso>
  500. 24.10 s gammaloop-nextest-spenso> test result: FAILED. 0 passed; 1 failed; 0 ignored; 0 measured; 248 filtered out; finished in 0.01s
  501. 24.10 s gammaloop-nextest-spenso> system-err
  502. 24.10 s gammaloop-nextest-spenso> thread 'reference_cases::tests::reference_case_simplification_snapshots' (684) panicked at crates/idenso/src/dirac/mod.rs:360:5:
  503. 24.10 s gammaloop-nextest-spenso> gamma third argument must be a Minkowski slot
  504. 24.10 s gammaloop-nextest-spenso> stack backtrace:
  505. 24.10 s gammaloop-nextest-spenso> 0: __rustc::rust_begin_unwind
  506. 24.10 s gammaloop-nextest-spenso> 1: core::panicking::panic_fmt
  507. 24.10 s gammaloop-nextest-spenso> 2: idenso::dirac::require_gamma_port
  508. 24.10 s gammaloop-nextest-spenso> 3: idenso::dirac::gamma_tensor
  509. 24.10 s gammaloop-nextest-spenso> 4: idenso::reference_cases::dirac_feyncalc_slash_sandwich_id4
  510. 24.10 s gammaloop-nextest-spenso> 5: <idenso::reference_cases::ReferenceCase>::simplified
  511. 24.10 s gammaloop-nextest-spenso> 6: <core::iter::adapters::map::Map<core::slice::iter::Iter<idenso::reference_cases::ReferenceCase>, idenso::reference_cases::tests::reference_case_simplification_snapshots::{closure#0}> as core::iter::traits::iterator::Iterator>::fold::<(), core::iter::traits::iterator::Iterator::for_each::call<alloc::string::String, <alloc::vec::Vec<alloc::string::String>>::extend_trusted<core::iter::adapters::map::Map<core::slice::iter::Iter<idenso::reference_cases::ReferenceCase>, idenso::reference_cases::tests::reference_case_simplification_snapshots::{closure#0}>>::{closure#0}>::{closure#0}>
  512. 24.10 s gammaloop-nextest-spenso> 7: <alloc::vec::Vec<alloc::string::String> as alloc::vec::spec_from_iter_nested::SpecFromIterNested<alloc::string::String, core::iter::adapters::map::Map<core::slice::iter::Iter<idenso::reference_cases::ReferenceCase>, idenso::reference_cases::tests::reference_case_simplification_snapshots::{closure#0}>>>::from_iter
  513. 24.10 s gammaloop-nextest-spenso> 8: idenso::reference_cases::tests::reference_case_simplification_snapshots
  514. 24.10 s gammaloop-nextest-spenso> 9: <idenso::reference_cases::tests::reference_case_simplification_snapshots::{closure#0} as core::ops::function::FnOnce<()>>::call_once
  515. 24.10 s gammaloop-nextest-spenso> note: Some details are omitted, run with `RUST_BACKTRACE=full` for a verbose backtrace.
  516. 24.10 s gammaloop-nextest-spenso>
  517. 24.10 s gammaloop-nextest-spenso> 5. idenso::tensor::tests::parsing::infinite_execution
  518. 24.10 s gammaloop-nextest-spenso> failure: test failure with exit code 101
  519. 24.10 s gammaloop-nextest-spenso> thread 'tensor::tests::parsing::infinite_execution' (855) panicked at /nix/store/hg5bizfwiwqlh0nqmr64rssi5zwpdp0k-vendor-cargo-deps/c19b7c6f923b580ac259164a89f2577984ad5ab09ee9d583b888f934adbbe8d0/insta-1.47.2/src/runtime.rs:719:13:
  520. 24.10 s gammaloop-nextest-spenso> snapshot assertion for 'infinite_execution' failed in line 905
  521. 24.10 s gammaloop-nextest-spenso> stack backtrace:
  522. 24.10 s gammaloop-nextest-spenso> 0: __rustc::rust_begin_unwind
  523. 24.10 s gammaloop-nextest-spenso> 1: core::panicking::panic_fmt
  524. 24.10 s gammaloop-nextest-spenso> 2: insta::runtime::assert_snapshot
  525. 24.10 s gammaloop-nextest-spenso> 3: idenso::tensor::tests::parsing::infinite_execution
  526. 24.10 s gammaloop-nextest-spenso> 4: <idenso::tensor::tests::parsing::infinite_execution::{closure#0} as core::ops::function::FnOnce<()>>::call_once
  527. 24.10 s gammaloop-nextest-spenso> note: Some details are omitted, run with `RUST_BACKTRACE=full` for a verbose backtrace.
  528. 24.10 s gammaloop-nextest-spenso> system-out
  529. 24.10 s gammaloop-nextest-spenso> running 1 test
  530. 24.10 s gammaloop-nextest-spenso> ━━━━━━━━━━━━━━━━━━━━━━━━━━━━━━━ Snapshot Summary ━━━━━━━━━━━━━━━━━━━━━━━━━━━━━━━
  531. 24.10 s gammaloop-nextest-spenso> Snapshot: infinite_execution
  532. 24.10 s gammaloop-nextest-spenso> Source: crates/idenso/src/tensor/tests/parsing.rs:905
  533. 24.10 s gammaloop-nextest-spenso> ────────────────────────────────────────────────────────────────────────────────
  534. 24.10 s gammaloop-nextest-spenso> Expression: net_iter.snapshot_dot()
  535. 24.10 s gammaloop-nextest-spenso> ────────────────────────────────────────────────────────────────────────────────
  536. 24.10 s gammaloop-nextest-spenso> -old snapshot
  537. 24.10 s gammaloop-nextest-spenso> +new results
  538. 24.10 s gammaloop-nextest-spenso> ────────────┬───────────────────────────────────────────────────────────────────
  539. 24.10 s gammaloop-nextest-spenso> 8 8 │ 0:0:s-> ext0 [id=0 color="red"];
  540. 24.10 s gammaloop-nextest-spenso> 9 9 │ ext1 [style=invis];
  541. 24.10 s gammaloop-nextest-spenso> 10 10 │ 0:5:s-> ext1 [id=1 dir=none color="red" label="mink4|l_0"];
  542. 24.10 s gammaloop-nextest-spenso> 11 11 │ ext2 [style=invis];
  543. 24.10 s gammaloop-nextest-spenso> 12 │- 0:4:s-> ext2 [id=2 dir=none color="red" label="bis4|l_2"];
  544. 24.10 s gammaloop-nextest-spenso> 12 │+ 0:3:s-> ext2 [id=2 dir=none color="red" label="mink4|l_1"];
  545. 24.10 s gammaloop-nextest-spenso> 13 13 │ ext3 [style=invis];
  546. 24.10 s gammaloop-nextest-spenso> 14 │- 0:3:s-> ext3 [id=3 dir=none color="red" label="bis4|l_3"];
  547. 24.10 s gammaloop-nextest-spenso> 14 │+ 0:1:s-> ext3 [id=3 dir=none color="red" label="bis4|l_2"];
  548. 24.10 s gammaloop-nextest-spenso> 15 15 │ ext4 [style=invis];
  549. 24.10 s gammaloop-nextest-spenso> 16 │- 0:1:s-> ext4 [id=4 dir=none color="red" label="mink4|l_1"];
  550. 24.10 s gammaloop-nextest-spenso> 16 │+ 0:2:s-> ext4 [id=4 dir=none color="red" label="mink4|l_4"];
  551. 24.10 s gammaloop-nextest-spenso> 17 17 │ ext5 [style=invis];
  552. 24.10 s gammaloop-nextest-spenso> 18 │- 0:2:s-> ext5 [id=5 dir=none color="red" label="mink4|l_4"];
  553. 24.10 s gammaloop-nextest-spenso> 18 │+ 0:4:s-> ext5 [id=5 dir=none color="red" label="bis4|l_3"];
  554. 24.10 s gammaloop-nextest-spenso> 19 19 │ }
  555. 24.10 s gammaloop-nextest-spenso> ────────────┴───────────────────────────────────────────────────────────────────
  556. 24.10 s gammaloop-nextest-spenso> To update snapshots run `cargo insta review`
  557. 24.10 s gammaloop-nextest-spenso> Stopped on the first failure. Run `cargo insta test` to run all snapshots.
  558. 24.10 s gammaloop-nextest-spenso> test tensor::tests::parsing::infinite_execution ... FAILED
  559. 24.10 s gammaloop-nextest-spenso>
  560. 24.10 s gammaloop-nextest-spenso> failures:
  561. 24.10 s gammaloop-nextest-spenso>
  562. 24.10 s gammaloop-nextest-spenso> failures:
  563. 24.10 s gammaloop-nextest-spenso> tensor::tests::parsing::infinite_execution
  564. 24.10 s gammaloop-nextest-spenso>
  565. 24.10 s gammaloop-nextest-spenso> test result: FAILED. 0 passed; 1 failed; 0 ignored; 0 measured; 248 filtered out; finished in 0.04s
  566. 24.10 s gammaloop-nextest-spenso> system-err
  567. 24.10 s gammaloop-nextest-spenso> thread 'tensor::tests::parsing::infinite_execution' (855) panicked at /nix/store/hg5bizfwiwqlh0nqmr64rssi5zwpdp0k-vendor-cargo-deps/c19b7c6f923b580ac259164a89f2577984ad5ab09ee9d583b888f934adbbe8d0/insta-1.47.2/src/runtime.rs:719:13:
  568. 24.10 s gammaloop-nextest-spenso> snapshot assertion for 'infinite_execution' failed in line 905
  569. 24.10 s gammaloop-nextest-spenso> stack backtrace:
  570. 24.10 s gammaloop-nextest-spenso> 0: __rustc::rust_begin_unwind
  571. 24.10 s gammaloop-nextest-spenso> 1: core::panicking::panic_fmt
  572. 24.10 s gammaloop-nextest-spenso> 2: insta::runtime::assert_snapshot
  573. 24.10 s gammaloop-nextest-spenso> 3: idenso::tensor::tests::parsing::infinite_execution
  574. 24.10 s gammaloop-nextest-spenso> 4: <idenso::tensor::tests::parsing::infinite_execution::{closure#0} as core::ops::function::FnOnce<()>>::call_once
  575. 24.10 s gammaloop-nextest-spenso> note: Some details are omitted, run with `RUST_BACKTRACE=full` for a verbose backtrace.
  576. 24.10 s gammaloop-nextest-spenso> =========================================
  577. 24.12 s gammaloop-nextest-spenso> Extracting 2 binaries and 1 linked path to /build/nextest-archive-b9TBbV
  578. 24.20 s gammaloop-nextest-spenso> Extracted 8 files to /build/nextest-archive-b9TBbV in 0.08s
  579. 24.21 s gammaloop-nextest-spenso> ------------
  580. 24.21 s gammaloop-nextest-spenso> Nextest run ID 53bcc29d-31c8-451a-8114-3997ad85fdd7 with nextest profile: ci_gammaloop
  581. 24.21 s gammaloop-nextest-spenso> Starting 195 tests across 2 binaries
  582. 24.33 s gammaloop-nextest-spenso> ------------
  583. 24.33 s gammaloop-nextest-spenso> Summary [ 0.117s] 195 tests run: 195 passed, 0 skipped
  584. 24.37 s gammaloop-nextest-spenso>
  585. 24.37 s gammaloop-nextest-spenso> ========== nextest test summary ==========
  586. 24.37 s gammaloop-nextest-spenso> report: target/nextest/ci_gammaloop/junit.xml
  587. 24.37 s gammaloop-nextest-spenso> tests: 195, failures: 0, errors: 0
  588. 24.37 s gammaloop-nextest-spenso> No failing testcases found.
  589. 24.37 s gammaloop-nextest-spenso> =========================================
  590. 24.38 s gammaloop-nextest-spenso> Extracting 5 binaries and 2 linked paths to /build/nextest-archive-JddKRs
  591. 24.65 s gammaloop-nextest-spenso> Extracted 19 files to /build/nextest-archive-JddKRs in 0.27s
  592. 24.66 s gammaloop-nextest-spenso> ------------
  593. 24.66 s gammaloop-nextest-spenso> Nextest run ID 3a5843dd-7b4f-4354-b662-9c66cab9287c with nextest profile: ci_gammaloop
  594. 24.66 s gammaloop-nextest-spenso> Starting 27 tests across 5 binaries (1 test skipped via profile.ci_gammaloop.default-filter)
  595. 24.75 s gammaloop-nextest-spenso> FAIL [ 0.063s] (24/27) spenso-hep-lib::idenso_validation enabled_idenso_reference_cases_validate_against_explicit_tensors
  596. 24.75 s gammaloop-nextest-spenso> stdout ---
  597. 24.75 s gammaloop-nextest-spenso>
  598. 24.75 s gammaloop-nextest-spenso> running 1 test
  599. 24.75 s gammaloop-nextest-spenso> test enabled_idenso_reference_cases_validate_against_explicit_tensors ... FAILED
  600. 24.75 s gammaloop-nextest-spenso>
  601. 24.75 s gammaloop-nextest-spenso> failures:
  602. 24.75 s gammaloop-nextest-spenso>
  603. 24.75 s gammaloop-nextest-spenso> failures:
  604. 24.75 s gammaloop-nextest-spenso> enabled_idenso_reference_cases_validate_against_explicit_tensors
  605. 24.75 s gammaloop-nextest-spenso>
  606. 24.75 s gammaloop-nextest-spenso> test result: FAILED. 0 passed; 1 failed; 0 ignored; 0 measured; 14 filtered out; finished in 0.06s
  607. 24.75 s gammaloop-nextest-spenso>
  608. 24.75 s gammaloop-nextest-spenso> stderr ---
  609. 24.75 s gammaloop-nextest-spenso>
  610. 24.75 s gammaloop-nextest-spenso> thread 'enabled_idenso_reference_cases_validate_against_explicit_tensors' (1664) panicked at crates/idenso/src/dirac/mod.rs:360:5:
  611. 24.75 s gammaloop-nextest-spenso> gamma third argument must be a Minkowski slot
  612. 24.75 s gammaloop-nextest-spenso> stack backtrace:
  613. 24.75 s gammaloop-nextest-spenso> 0: __rustc::rust_begin_unwind
  614. 24.75 s gammaloop-nextest-spenso> 1: core::panicking::panic_fmt
  615. 24.75 s gammaloop-nextest-spenso> 2: idenso::dirac::require_gamma_port
  616. 24.75 s gammaloop-nextest-spenso> 3: idenso::dirac::gamma_tensor
  617. 24.75 s gammaloop-nextest-spenso> 4: idenso::reference_cases::dirac_feyncalc_slash_sandwich_id4
  618. 24.75 s gammaloop-nextest-spenso> 5: <idenso_validation::enabled_idenso_reference_cases_validate_against_explicit_tensors::{closure#0} as core::ops::function::FnOnce<()>>::call_once
  619. 24.75 s gammaloop-nextest-spenso> note: Some details are omitted, run with `RUST_BACKTRACE=full` for a verbose backtrace.
  620. 24.75 s gammaloop-nextest-spenso>
  621. 24.80 s gammaloop-nextest-spenso> ------------
  622. 24.80 s gammaloop-nextest-spenso> Summary [ 0.137s] 27 tests run: 26 passed, 1 failed, 1 skipped
  623. 24.80 s gammaloop-nextest-spenso> FAIL [ 0.063s] (24/27) spenso-hep-lib::idenso_validation enabled_idenso_reference_cases_validate_against_explicit_tensors
  624. 24.80 s gammaloop-nextest-spenso> stdout ---
  625. 24.80 s gammaloop-nextest-spenso>
  626. 24.80 s gammaloop-nextest-spenso> running 1 test
  627. 24.80 s gammaloop-nextest-spenso> test enabled_idenso_reference_cases_validate_against_explicit_tensors ... FAILED
  628. 24.80 s gammaloop-nextest-spenso>
  629. 24.80 s gammaloop-nextest-spenso> failures:
  630. 24.80 s gammaloop-nextest-spenso>
  631. 24.80 s gammaloop-nextest-spenso> failures:
  632. 24.80 s gammaloop-nextest-spenso> enabled_idenso_reference_cases_validate_against_explicit_tensors
  633. 24.80 s gammaloop-nextest-spenso>
  634. 24.80 s gammaloop-nextest-spenso> test result: FAILED. 0 passed; 1 failed; 0 ignored; 0 measured; 14 filtered out; finished in 0.06s
  635. 24.80 s gammaloop-nextest-spenso>
  636. 24.80 s gammaloop-nextest-spenso> stderr ---
  637. 24.80 s gammaloop-nextest-spenso>
  638. 24.80 s gammaloop-nextest-spenso> thread 'enabled_idenso_reference_cases_validate_against_explicit_tensors' (1664) panicked at crates/idenso/src/dirac/mod.rs:360:5:
  639. 24.80 s gammaloop-nextest-spenso> gamma third argument must be a Minkowski slot
  640. 24.80 s gammaloop-nextest-spenso> stack backtrace:
  641. 24.80 s gammaloop-nextest-spenso> 0: __rustc::rust_begin_unwind
  642. 24.80 s gammaloop-nextest-spenso> 1: core::panicking::panic_fmt
  643. 24.80 s gammaloop-nextest-spenso> 2: idenso::dirac::require_gamma_port
  644. 24.80 s gammaloop-nextest-spenso> 3: idenso::dirac::gamma_tensor
  645. 24.80 s gammaloop-nextest-spenso> 4: idenso::reference_cases::dirac_feyncalc_slash_sandwich_id4
  646. 24.80 s gammaloop-nextest-spenso> 5: <idenso_validation::enabled_idenso_reference_cases_validate_against_explicit_tensors::{closure#0} as core::ops::function::FnOnce<()>>::call_once
  647. 24.80 s gammaloop-nextest-spenso> note: Some details are omitted, run with `RUST_BACKTRACE=full` for a verbose backtrace.
  648. 24.80 s gammaloop-nextest-spenso>
  649. 24.84 s gammaloop-nextest-spenso> error: test run failed
  650. 24.87 s gammaloop-nextest-spenso>
  651. 24.87 s gammaloop-nextest-spenso> ========== nextest test summary ==========
  652. 24.87 s gammaloop-nextest-spenso> report: target/nextest/ci_gammaloop/junit.xml
  653. 24.87 s gammaloop-nextest-spenso> tests: 27, failures: 1, errors: 0
  654. 24.87 s gammaloop-nextest-spenso>
  655. 24.87 s gammaloop-nextest-spenso> 1. spenso-hep-lib::idenso_validation::enabled_idenso_reference_cases_validate_against_explicit_tensors
  656. 24.87 s gammaloop-nextest-spenso> failure: test failure with exit code 101
  657. 24.87 s gammaloop-nextest-spenso> thread 'enabled_idenso_reference_cases_validate_against_explicit_tensors' (1664) panicked at crates/idenso/src/dirac/mod.rs:360:5:
  658. 24.87 s gammaloop-nextest-spenso> gamma third argument must be a Minkowski slot
  659. 24.87 s gammaloop-nextest-spenso> stack backtrace:
  660. 24.87 s gammaloop-nextest-spenso> 0: __rustc::rust_begin_unwind
  661. 24.87 s gammaloop-nextest-spenso> 1: core::panicking::panic_fmt
  662. 24.87 s gammaloop-nextest-spenso> 2: idenso::dirac::require_gamma_port
  663. 24.87 s gammaloop-nextest-spenso> 3: idenso::dirac::gamma_tensor
  664. 24.87 s gammaloop-nextest-spenso> 4: idenso::reference_cases::dirac_feyncalc_slash_sandwich_id4
  665. 24.87 s gammaloop-nextest-spenso> 5: <idenso_validation::enabled_idenso_reference_cases_validate_against_explicit_tensors::{closure#0} as core::ops::function::FnOnce<()>>::call_once
  666. 24.87 s gammaloop-nextest-spenso> note: Some details are omitted, run with `RUST_BACKTRACE=full` for a verbose backtrace.
  667. 24.87 s gammaloop-nextest-spenso> system-out
  668. 24.87 s gammaloop-nextest-spenso> running 1 test
  669. 24.87 s gammaloop-nextest-spenso> test enabled_idenso_reference_cases_validate_against_explicit_tensors ... FAILED
  670. 24.87 s gammaloop-nextest-spenso>
  671. 24.87 s gammaloop-nextest-spenso> failures:
  672. 24.87 s gammaloop-nextest-spenso>
  673. 24.87 s gammaloop-nextest-spenso> failures:
  674. 24.87 s gammaloop-nextest-spenso> enabled_idenso_reference_cases_validate_against_explicit_tensors
  675. 24.87 s gammaloop-nextest-spenso>
  676. 24.87 s gammaloop-nextest-spenso> test result: FAILED. 0 passed; 1 failed; 0 ignored; 0 measured; 14 filtered out; finished in 0.06s
  677. 24.87 s gammaloop-nextest-spenso> system-err
  678. 24.87 s gammaloop-nextest-spenso> thread 'enabled_idenso_reference_cases_validate_against_explicit_tensors' (1664) panicked at crates/idenso/src/dirac/mod.rs:360:5:
  679. 24.87 s gammaloop-nextest-spenso> gamma third argument must be a Minkowski slot
  680. 24.87 s gammaloop-nextest-spenso> stack backtrace:
  681. 24.87 s gammaloop-nextest-spenso> 0: __rustc::rust_begin_unwind
  682. 24.87 s gammaloop-nextest-spenso> 1: core::panicking::panic_fmt
  683. 24.87 s gammaloop-nextest-spenso> 2: idenso::dirac::require_gamma_port
  684. 24.87 s gammaloop-nextest-spenso> 3: idenso::dirac::gamma_tensor
  685. 24.87 s gammaloop-nextest-spenso> 4: idenso::reference_cases::dirac_feyncalc_slash_sandwich_id4
  686. 24.87 s gammaloop-nextest-spenso> 5: <idenso_validation::enabled_idenso_reference_cases_validate_against_explicit_tensors::{closure#0} as core::ops::function::FnOnce<()>>::call_once
  687. 24.87 s gammaloop-nextest-spenso> note: Some details are omitted, run with `RUST_BACKTRACE=full` for a verbose backtrace.
  688. 24.87 s gammaloop-nextest-spenso> =========================================
  689. 24.88 s gammaloop-nextest-spenso> Extracting 2 binaries and 1 linked path to /build/nextest-archive-zjNucb
  690. 24.96 s gammaloop-nextest-spenso> Extracted 8 files to /build/nextest-archive-zjNucb in 0.08s
  691. 24.97 s gammaloop-nextest-spenso> ------------
  692. 24.97 s gammaloop-nextest-spenso> Nextest run ID 5d42492a-d060-4dcd-b48c-7cb4e2cf8623 with nextest profile: ci_gammaloop
  693. 24.97 s gammaloop-nextest-spenso> Starting 1 test across 2 binaries
  694. 24.97 s gammaloop-nextest-spenso> ------------
  695. 24.97 s gammaloop-nextest-spenso> Summary [ 0.005s] 1 test run: 1 passed, 0 skipped
  696. 25.01 s gammaloop-nextest-spenso>
  697. 25.01 s gammaloop-nextest-spenso> ========== nextest test summary ==========
  698. 25.01 s gammaloop-nextest-spenso> report: target/nextest/ci_gammaloop/junit.xml
  699. 25.01 s gammaloop-nextest-spenso> tests: 1, failures: 0, errors: 0
  700. 25.01 s gammaloop-nextest-spenso> No failing testcases found.
  701. 25.01 s gammaloop-nextest-spenso> =========================================
  702. 25.02 s gammaloop-nextest-spenso> Extracting 1 binary and 1 linked path to /build/nextest-archive-U3cce2
  703. 25.09 s gammaloop-nextest-spenso> Extracted 7 files to /build/nextest-archive-U3cce2 in 0.07s
  704. 25.10 s gammaloop-nextest-spenso> ------------
  705. 25.10 s gammaloop-nextest-spenso> Nextest run ID ebcd9ca3-73d0-4a06-8767-7a5add49c784 with nextest profile: ci_gammaloop
  706. 25.10 s gammaloop-nextest-spenso> Starting 0 tests across 1 binary
  707. 25.10 s gammaloop-nextest-spenso> ------------
  708. 25.10 s gammaloop-nextest-spenso> Summary [ 0.000s] 0 tests run: 0 passed, 0 skipped
  709. 25.13 s gammaloop-nextest-spenso>
  710. 25.13 s gammaloop-nextest-spenso> ========== nextest test summary ==========
  711. 25.13 s gammaloop-nextest-spenso> report: target/nextest/ci_gammaloop/junit.xml
  712. 25.13 s gammaloop-nextest-spenso> tests: 0, failures: 0, errors: 0
  713. 25.13 s gammaloop-nextest-spenso> No failing testcases found.
  714. 25.13 s gammaloop-nextest-spenso> =========================================
  715. 25.16 s [0 built (1 failed), 0.0error: Cannot build '/nix/store/9sbgbb6pw8px5w5h52x6id0993hp37qd-gammaloop-nextest-spenso.drv'.
  716. 25.16 s Reason: builder failed with exit code 100.
  717. 25.16 s Output paths:
  718. 25.16 s /nix/store/a97wgffcw6m7xlnmdpkf5n07613sq2jn-gammaloop-nextest-spenso
  719. 25.16 s Last 677 log lines:
  720. 25.16 s > Extracting 5 binaries and 2 linked paths to /build/nextest-archive-QE9QBf
  721. 25.16 s > Extracted 19 files to /build/nextest-archive-QE9QBf in 0.21s
  722. 25.16 s > ------------
  723. 25.16 s > Nextest run ID 5cdb0fc4-70d5-4db6-8635-e30feb0a787f with nextest profile: ci_gammaloop
  724. 25.16 s > Starting 232 tests across 5 binaries (26 tests skipped, including 2 tests via profile.ci_gammaloop.default-filter)
  725. 25.16 s > FAIL [ 0.014s] ( 91/232) idenso dirac::test::feyncalc_reference::dirac_simplify_id46_d_dim_repeated_gamma_slash_sum
  726. 25.16 s > stdout ---
  727. 25.16 s >
  728. 25.16 s > running 1 test
  729. 25.16 s > test dirac::test::feyncalc_reference::dirac_simplify_id46_d_dim_repeated_gamma_slash_sum ... FAILED
  730. 25.16 s >
  731. 25.16 s > failures:
  732. 25.16 s >
  733. 25.16 s > failures:
  734. 25.16 s > dirac::test::feyncalc_reference::dirac_simplify_id46_d_dim_repeated_gamma_slash_sum
  735. 25.16 s >
  736. 25.16 s > test result: FAILED. 0 passed; 1 failed; 0 ignored; 0 measured; 248 filtered out; finished in 0.01s
  737. 25.16 s >
  738. 25.16 s > stderr ---
  739. 25.16 s >
  740. 25.16 s > thread 'dirac::test::feyncalc_reference::dirac_simplify_id46_d_dim_repeated_gamma_slash_sum' (507) panicked at crates/idenso/src/dirac/mod.rs:360:5:
  741. 25.16 s > gamma third argument must be a Minkowski slot
  742. 25.16 s > stack backtrace:
  743. 25.16 s > 0: __rustc::rust_begin_unwind
  744. 25.16 s > 1: core::panicking::panic_fmt
  745. 25.16 s > 2: idenso::dirac::require_gamma_port
  746. 25.16 s > 3: idenso::dirac::gamma_tensor
  747. 25.16 s > 4: idenso::dirac::test::feyncalc_reference::dirac_simplify_id46_d_dim_repeated_gamma_slash_sum
  748. 25.16 s > 5: <idenso::dirac::test::feyncalc_reference::dirac_simplify_id46_d_dim_repeated_gamma_slash_sum::{closure#0} as core::ops::function::FnOnce<()>>::call_once
  749. 25.16 s > note: Some details are omitted, run with `RUST_BACKTRACE=full` for a verbose backtrace.
  750. 25.16 s >
  751. 25.16 s > FAIL [ 0.018s] ( 92/232) idenso dirac::test::feyncalc_reference::dirac_simplify_id40_repeated_gamma_and_two_trace
  752. 25.16 s > stdout ---
  753. 25.16 s >
  754. 25.16 s > running 1 test
  755. 25.16 s > test dirac::test::feyncalc_reference::dirac_simplify_id40_repeated_gamma_and_two_trace ... FAILED
  756. 25.16 s >
  757. 25.16 s > failures:
  758. 25.16 s >
  759. 25.16 s > failures:
  760. 25.16 s > dirac::test::feyncalc_reference::dirac_simplify_id40_repeated_gamma_and_two_trace
  761. 25.16 s >
  762. 25.16 s > test result: FAILED. 0 passed; 1 failed; 0 ignored; 0 measured; 248 filtered out; finished in 0.01s
  763. 25.16 s >
  764. 25.16 s > stderr ---
  765. 25.16 s >
  766. 25.16 s > thread 'dirac::test::feyncalc_reference::dirac_simplify_id40_repeated_gamma_and_two_trace' (506) panicked at crates/idenso/src/dirac/mod.rs:360:5:
  767. 25.16 s > gamma third argument must be a Minkowski slot
  768. 25.16 s > stack backtrace:
  769. 25.16 s > 0: __rustc::rust_begin_unwind
  770. 25.16 s > 1: core::panicking::panic_fmt
  771. 25.16 s > 2: idenso::dirac::require_gamma_port
  772. 25.16 s > 3: idenso::dirac::gamma_tensor
  773. 25.16 s > 4: idenso::dirac::test::feyncalc_reference::dirac_simplify_id40_repeated_gamma_and_two_trace
  774. 25.16 s > 5: <idenso::dirac::test::feyncalc_reference::dirac_simplify_id40_repeated_gamma_and_two_trace::{closure#0} as core::ops::function::FnOnce<()>>::call_once
  775. 25.16 s > note: Some details are omitted, run with `RUST_BACKTRACE=full` for a verbose backtrace.
  776. 25.16 s >
  777. 25.16 s > FAIL [ 0.013s] ( 94/232) idenso dirac::test::feyncalc_reference::dirac_simplify_id4_slash_sandwich
  778. 25.16 s > stdout ---
  779. 25.16 s >
  780. 25.16 s > running 1 test
  781. 25.16 s > test dirac::test::feyncalc_reference::dirac_simplify_id4_slash_sandwich ... FAILED
  782. 25.16 s >
  783. 25.16 s > failures:
  784. 25.16 s >
  785. 25.16 s > failures:
  786. 25.16 s > dirac::test::feyncalc_reference::dirac_simplify_id4_slash_sandwich
  787. 25.16 s >
  788. 25.16 s > test result: FAILED. 0 passed; 1 failed; 0 ignored; 0 measured; 248 filtered out; finished in 0.01s
  789. 25.16 s >
  790. 25.16 s > stderr ---
  791. 25.16 s >
  792. 25.16 s > thread 'dirac::test::feyncalc_reference::dirac_simplify_id4_slash_sandwich' (510) panicked at crates/idenso/src/dirac/mod.rs:360:5:
  793. 25.16 s > gamma third argument must be a Minkowski slot
  794. 25.16 s > stack backtrace:
  795. 25.16 s > 0: __rustc::rust_begin_unwind
  796. 25.16 s > 1: core::panicking::panic_fmt
  797. 25.16 s > 2: idenso::dirac::require_gamma_port
  798. 25.16 s > 3: idenso::dirac::gamma_tensor
  799. 25.16 s > 4: idenso::dirac::test::feyncalc_reference::dirac_simplify_id4_slash_sandwich
  800. 25.16 s > 5: <idenso::dirac::test::feyncalc_reference::dirac_simplify_id4_slash_sandwich::{closure#0} as core::ops::function::FnOnce<()>>::call_once
  801. 25.16 s > note: Some details are omitted, run with `RUST_BACKTRACE=full` for a verbose backtrace.
  802. 25.16 s >
  803. 25.16 s > FAIL [ 0.016s] (146/232) idenso reference_cases::tests::reference_case_simplification_snapshots
  804. 25.16 s > stdout ---
  805. 25.16 s >
  806. 25.16 s > running 1 test
  807. 25.16 s > test reference_cases::tests::reference_case_simplification_snapshots ... FAILED
  808. 25.16 s >
  809. 25.16 s > failures:
  810. 25.16 s >
  811. 25.16 s > failures:
  812. 25.16 s > reference_cases::tests::reference_case_simplification_snapshots
  813. 25.16 s >
  814. 25.16 s > test result: FAILED. 0 passed; 1 failed; 0 ignored; 0 measured; 248 filtered out; finished in 0.01s
  815. 25.16 s >
  816. 25.16 s > stderr ---
  817. 25.16 s >
  818. 25.16 s > thread 'reference_cases::tests::reference_case_simplification_snapshots' (684) panicked at crates/idenso/src/dirac/mod.rs:360:5:
  819. 25.16 s > gamma third argument must be a Minkowski slot
  820. 25.16 s > stack backtrace:
  821. 25.16 s > 0: __rustc::rust_begin_unwind
  822. 25.16 s > 1: core::panicking::panic_fmt
  823. 25.16 s > 2: idenso::dirac::require_gamma_port
  824. 25.16 s > 3: idenso::dirac::gamma_tensor
  825. 25.16 s > 4: idenso::reference_cases::dirac_feyncalc_slash_sandwich_id4
  826. 25.16 s > 5: <idenso::reference_cases::ReferenceCase>::simplified
  827. 25.16 s > 6: <core::iter::adapters::map::Map<core::slice::iter::Iter<idenso::reference_cases::ReferenceCase>, idenso::reference_cases::tests::reference_case_simplification_snapshots::{closure#0}> as core::iter::traits::iterator::Iterator>::fold::<(), core::iter::traits::iterator::Iterator::for_each::call<alloc::string::String, <alloc::vec::Vec<alloc::string::String>>::extend_trusted<core::iter::adapters::map::Map<core::slice::iter::Iter<idenso::reference_cases::ReferenceCase>, idenso::reference_cases::tests::reference_case_simplification_snapshots::{closure#0}>>::{closure#0}>::{closure#0}>
  828. 25.16 s > 7: <alloc::vec::Vec<alloc::string::String> as alloc::vec::spec_from_iter_nested::SpecFromIterNested<alloc::string::String, core::iter::adapters::map::Map<core::slice::iter::Iter<idenso::reference_cases::ReferenceCase>, idenso::reference_cases::tests::reference_case_simplification_snapshots::{closure#0}>>>::from_iter
  829. 25.16 s > 8: idenso::reference_cases::tests::reference_case_simplification_snapshots
  830. 25.16 s > 9: <idenso::reference_cases::tests::reference_case_simplification_snapshots::{closure#0} as core::ops::function::FnOnce<()>>::call_once
  831. 25.16 s > note: Some details are omitted, run with `RUST_BACKTRACE=full` for a verbose backtrace.
  832. 25.16 s >
  833. 25.16 s > FAIL [ 0.044s] (228/232) idenso tensor::tests::parsing::infinite_execution
  834. 25.16 s > stdout ---
  835. 25.16 s >
  836. 25.16 s > running 1 test
  837. 25.16 s > ━━━━━━━━━━━━━━━━━━━━━━━━━━━━━━━ Snapshot Summary ━━━━━━━━━━━━━━━━━━━━━━━━━━━━━━━
  838. 25.16 s > Snapshot: infinite_execution
  839. 25.16 s > Source: crates/idenso/src/tensor/tests/parsing.rs:905
  840. 25.16 s > ────────────────────────────────────────────────────────────────────────────────
  841. 25.16 s > Expression: net_iter.snapshot_dot()
  842. 25.16 s > ────────────────────────────────────────────────────────────────────────────────
  843. 25.16 s > -old snapshot
  844. 25.16 s > +new results
  845. 25.16 s > ────────────┬───────────────────────────────────────────────────────────────────
  846. 25.16 s > 8 8 │ 0:0:s -> ext0 [id=0 color="red"];
  847. 25.16 s > 9 9 │ ext1 [style=invis];
  848. 25.16 s > 10 10 │ 0:5:s -> ext1 [id=1 dir=none color="red" label="mink4|l_0"];
  849. 25.16 s > 11 11 │ ext2 [style=invis];
  850. 25.16 s > 12 │- 0:4:s -> ext2 [id=2 dir=none color="red" label="bis4|l_2"];
  851. 25.16 s > 12 │+ 0:3:s -> ext2 [id=2 dir=none color="red" label="mink4|l_1"];
  852. 25.16 s > 13 13 │ ext3 [style=invis];
  853. 25.16 s > 14 │- 0:3:s -> ext3 [id=3 dir=none color="red" label="bis4|l_3"];
  854. 25.16 s > 14 │+ 0:1:s -> ext3 [id=3 dir=none color="red" label="bis4|l_2"];
  855. 25.16 s > 15 15 │ ext4 [style=invis];
  856. 25.16 s > 16 │- 0:1:s -> ext4 [id=4 dir=none color="red" label="mink4|l_1"];
  857. 25.16 s > 16 │+ 0:2:s -> ext4 [id=4 dir=none color="red" label="mink4|l_4"];
  858. 25.16 s > 17 17 │ ext5 [style=invis];
  859. 25.16 s > 18 │- 0:2:s -> ext5 [id=5 dir=none color="red" label="mink4|l_4"];
  860. 25.16 s > 18 │+ 0:4:s -> ext5 [id=5 dir=none color="red" label="bis4|l_3"];
  861. 25.16 s > 19 19 │ }
  862. 25.16 s > ────────────┴───────────────────────────────────────────────────────────────────
  863. 25.16 s > To update snapshots run `cargo insta review`
  864. 25.16 s > Stopped on the first failure. Run `cargo insta test` to run all snapshots.
  865. 25.16 s > test tensor::tests::parsing::infinite_execution ... FAILED
  866. 25.16 s >
  867. 25.16 s > failures:
  868. 25.16 s >
  869. 25.16 s > failures:
  870. 25.16 s > tensor::tests::parsing::infinite_execution
  871. 25.16 s >
  872. 25.16 s > test result: FAILED. 0 passed; 1 failed; 0 ignored; 0 measured; 248 filtered out; finished in 0.04s
  873. 25.16 s >
  874. 25.16 s > stderr ---
  875. 25.16 s >
  876. 25.16 s > thread 'tensor::tests::parsing::infinite_execution' (855) panicked at /nix/store/hg5bizfwiwqlh0nqmr64rssi5zwpdp0k-vendor-cargo-deps/c19b7c6f923b580ac259164a89f2577984ad5ab09ee9d583b888f934adbbe8d0/insta-1.47.2/src/runtime.rs:719:13:
  877. 25.16 s > snapshot assertion for 'infinite_execution' failed in line 905
  878. 25.16 s > stack backtrace:
  879. 25.16 s > 0: __rustc::rust_begin_unwind
  880. 25.16 s > 1: core::panicking::panic_fmt
  881. 25.16 s > 2: insta::runtime::assert_snapshot
  882. 25.16 s > 3: idenso::tensor::tests::parsing::infinite_execution
  883. 25.16 s > 4: <idenso::tensor::tests::parsing::infinite_execution::{closure#0} as core::ops::function::FnOnce<()>>::call_once
  884. 25.16 s > note: Some details are omitted, run with `RUST_BACKTRACE=full` for a verbose backtrace.
  885. 25.16 s >
  886. 25.16 s > ------------
  887. 25.16 s > Summary [ 1.601s] 232 tests run: 227 passed, 5 failed, 26 skipped
  888. 25.16 s > FAIL [ 0.014s] ( 91/232) idenso dirac::test::feyncalc_reference::dirac_simplify_id46_d_dim_repeated_gamma_slash_sum
  889. 25.16 s > stdout ---
  890. 25.16 s >
  891. 25.16 s > running 1 test
  892. 25.16 s > test dirac::test::feyncalc_reference::dirac_simplify_id46_d_dim_repeated_gamma_slash_sum ... FAILED
  893. 25.16 s >
  894. 25.16 s > failures:
  895. 25.16 s >
  896. 25.16 s > failures:
  897. 25.16 s > dirac::test::feyncalc_reference::dirac_simplify_id46_d_dim_repeated_gamma_slash_sum
  898. 25.16 s >
  899. 25.16 s > test result: FAILED. 0 passed; 1 failed; 0 ignored; 0 measured; 248 filtered out; finished in 0.01s
  900. 25.16 s >
  901. 25.16 s > stderr ---
  902. 25.16 s >
  903. 25.16 s > thread 'dirac::test::feyncalc_reference::dirac_simplify_id46_d_dim_repeated_gamma_slash_sum' (507) panicked at crates/idenso/src/dirac/mod.rs:360:5:
  904. 25.16 s > gamma third argument must be a Minkowski slot
  905. 25.16 s > stack backtrace:
  906. 25.16 s > 0: __rustc::rust_begin_unwind
  907. 25.16 s > 1: core::panicking::panic_fmt
  908. 25.16 s > 2: idenso::dirac::require_gamma_port
  909. 25.16 s > 3: idenso::dirac::gamma_tensor
  910. 25.16 s > 4: idenso::dirac::test::feyncalc_reference::dirac_simplify_id46_d_dim_repeated_gamma_slash_sum
  911. 25.16 s > 5: <idenso::dirac::test::feyncalc_reference::dirac_simplify_id46_d_dim_repeated_gamma_slash_sum::{closure#0} as core::ops::function::FnOnce<()>>::call_once
  912. 25.16 s > note: Some details are omitted, run with `RUST_BACKTRACE=full` for a verbose backtrace.
  913. 25.16 s >
  914. 25.16 s > FAIL [ 0.018s] ( 92/232) idenso dirac::test::feyncalc_reference::dirac_simplify_id40_repeated_gamma_and_two_trace
  915. 25.16 s > stdout ---
  916. 25.16 s >
  917. 25.16 s > running 1 test
  918. 25.16 s > test dirac::test::feyncalc_reference::dirac_simplify_id40_repeated_gamma_and_two_trace ... FAILED
  919. 25.16 s >
  920. 25.16 s > failures:
  921. 25.16 s >
  922. 25.16 s > failures:
  923. 25.16 s > dirac::test::feyncalc_reference::dirac_simplify_id40_repeated_gamma_and_two_trace
  924. 25.16 s >
  925. 25.16 s > test result: FAILED. 0 passed; 1 failed; 0 ignored; 0 measured; 248 filtered out; finished in 0.01s
  926. 25.16 s >
  927. 25.16 s > stderr ---
  928. 25.16 s >
  929. 25.16 s > thread 'dirac::test::feyncalc_reference::dirac_simplify_id40_repeated_gamma_and_two_trace' (506) panicked at crates/idenso/src/dirac/mod.rs:360:5:
  930. 25.16 s > gamma third argument must be a Minkowski slot
  931. 25.16 s > stack backtrace:
  932. 25.16 s > 0: __rustc::rust_begin_unwind
  933. 25.16 s > 1: core::panicking::panic_fmt
  934. 25.16 s > 2: idenso::dirac::require_gamma_port
  935. 25.16 s > 3: idenso::dirac::gamma_tensor
  936. 25.16 s > 4: idenso::dirac::test::feyncalc_reference::dirac_simplify_id40_repeated_gamma_and_two_trace
  937. 25.16 s > 5: <idenso::dirac::test::feyncalc_reference::dirac_simplify_id40_repeated_gamma_and_two_trace::{closure#0} as core::ops::function::FnOnce<()>>::call_once
  938. 25.16 s > note: Some details are omitted, run with `RUST_BACKTRACE=full` for a verbose backtrace.
  939. 25.16 s >
  940. 25.16 s > FAIL [ 0.013s] ( 94/232) idenso dirac::test::feyncalc_reference::dirac_simplify_id4_slash_sandwich
  941. 25.16 s > stdout ---
  942. 25.16 s >
  943. 25.16 s > running 1 test
  944. 25.16 s > test dirac::test::feyncalc_reference::dirac_simplify_id4_slash_sandwich ... FAILED
  945. 25.16 s >
  946. 25.16 s > failures:
  947. 25.16 s >
  948. 25.16 s > failures:
  949. 25.16 s > dirac::test::feyncalc_reference::dirac_simplify_id4_slash_sandwich
  950. 25.16 s >
  951. 25.16 s > test result: FAILED. 0 passed; 1 failed; 0 ignored; 0 measured; 248 filtered out; finished in 0.01s
  952. 25.16 s >
  953. 25.16 s > stderr ---
  954. 25.16 s >
  955. 25.16 s > thread 'dirac::test::feyncalc_reference::dirac_simplify_id4_slash_sandwich' (510) panicked at crates/idenso/src/dirac/mod.rs:360:5:
  956. 25.16 s > gamma third argument must be a Minkowski slot
  957. 25.16 s > stack backtrace:
  958. 25.16 s > 0: __rustc::rust_begin_unwind
  959. 25.16 s > 1: core::panicking::panic_fmt
  960. 25.16 s > 2: idenso::dirac::require_gamma_port
  961. 25.16 s > 3: idenso::dirac::gamma_tensor
  962. 25.16 s > 4: idenso::dirac::test::feyncalc_reference::dirac_simplify_id4_slash_sandwich
  963. 25.16 s > 5: <idenso::dirac::test::feyncalc_reference::dirac_simplify_id4_slash_sandwich::{closure#0} as core::ops::function::FnOnce<()>>::call_once
  964. 25.16 s > note: Some details are omitted, run with `RUST_BACKTRACE=full` for a verbose backtrace.
  965. 25.16 s >
  966. 25.16 s > FAIL [ 0.016s] (146/232) idenso reference_cases::tests::reference_case_simplification_snapshots
  967. 25.16 s > stdout ---
  968. 25.16 s >
  969. 25.16 s > running 1 test
  970. 25.16 s > test reference_cases::tests::reference_case_simplification_snapshots ... FAILED
  971. 25.16 s >
  972. 25.16 s > failures:
  973. 25.16 s >
  974. 25.16 s > failures:
  975. 25.16 s > reference_cases::tests::reference_case_simplification_snapshots
  976. 25.16 s >
  977. 25.16 s > test result: FAILED. 0 passed; 1 failed; 0 ignored; 0 measured; 248 filtered out; finished in 0.01s
  978. 25.16 s >
  979. 25.16 s > stderr ---
  980. 25.16 s >
  981. 25.16 s > thread 'reference_cases::tests::reference_case_simplification_snapshots' (684) panicked at crates/idenso/src/dirac/mod.rs:360:5:
  982. 25.16 s > gamma third argument must be a Minkowski slot
  983. 25.16 s > stack backtrace:
  984. 25.16 s > 0: __rustc::rust_begin_unwind
  985. 25.16 s > 1: core::panicking::panic_fmt
  986. 25.16 s > 2: idenso::dirac::require_gamma_port
  987. 25.16 s > 3: idenso::dirac::gamma_tensor
  988. 25.16 s > 4: idenso::reference_cases::dirac_feyncalc_slash_sandwich_id4
  989. 25.16 s > 5: <idenso::reference_cases::ReferenceCase>::simplified
  990. 25.16 s > 6: <core::iter::adapters::map::Map<core::slice::iter::Iter<idenso::reference_cases::ReferenceCase>, idenso::reference_cases::tests::reference_case_simplification_snapshots::{closure#0}> as core::iter::traits::iterator::Iterator>::fold::<(), core::iter::traits::iterator::Iterator::for_each::call<alloc::string::String, <alloc::vec::Vec<alloc::string::String>>::extend_trusted<core::iter::adapters::map::Map<core::slice::iter::Iter<idenso::reference_cases::ReferenceCase>, idenso::reference_cases::tests::reference_case_simplification_snapshots::{closure#0}>>::{closure#0}>::{closure#0}>
  991. 25.16 s > 7: <alloc::vec::Vec<alloc::string::String> as alloc::vec::spec_from_iter_nested::SpecFromIterNested<alloc::string::String, core::iter::adapters::map::Map<core::slice::iter::Iter<idenso::reference_cases::ReferenceCase>, idenso::reference_cases::tests::reference_case_simplification_snapshots::{closure#0}>>>::from_iter
  992. 25.16 s > 8: idenso::reference_cases::tests::reference_case_simplification_snapshots
  993. 25.16 s > 9: <idenso::reference_cases::tests::reference_case_simplification_snapshots::{closure#0} as core::ops::function::FnOnce<()>>::call_once
  994. 25.16 s > note: Some details are omitted, run with `RUST_BACKTRACE=full` for a verbose backtrace.
  995. 25.16 s >
  996. 25.16 s > FAIL [ 0.044s] (228/232) idenso tensor::tests::parsing::infinite_execution
  997. 25.16 s > stdout ---
  998. 25.16 s >
  999. 25.16 s > running 1 test
  1000. 25.16 s > ━━━━━━━━━━━━━━━━━━━━━━━━━━━━━━━ Snapshot Summary ━━━━━━━━━━━━━━━━━━━━━━━━━━━━━━━
  1001. 25.16 s > Snapshot: infinite_execution
  1002. 25.16 s > Source: crates/idenso/src/tensor/tests/parsing.rs:905
  1003. 25.16 s > ────────────────────────────────────────────────────────────────────────────────
  1004. 25.16 s > Expression: net_iter.snapshot_dot()
  1005. 25.16 s > ────────────────────────────────────────────────────────────────────────────────
  1006. 25.16 s > -old snapshot
  1007. 25.16 s > +new results
  1008. 25.16 s > ────────────┬───────────────────────────────────────────────────────────────────
  1009. 25.16 s > 8 8 │ 0:0:s -> ext0 [id=0 color="red"];
  1010. 25.16 s > 9 9 │ ext1 [style=invis];
  1011. 25.16 s > 10 10 │ 0:5:s -> ext1 [id=1 dir=none color="red" label="mink4|l_0"];
  1012. 25.16 s > 11 11 │ ext2 [style=invis];
  1013. 25.16 s > 12 │- 0:4:s -> ext2 [id=2 dir=none color="red" label="bis4|l_2"];
  1014. 25.16 s > 12 │+ 0:3:s -> ext2 [id=2 dir=none color="red" label="mink4|l_1"];
  1015. 25.16 s > 13 13 │ ext3 [style=invis];
  1016. 25.16 s > 14 │- 0:3:s -> ext3 [id=3 dir=none color="red" label="bis4|l_3"];
  1017. 25.16 s > 14 │+ 0:1:s -> ext3 [id=3 dir=none color="red" label="bis4|l_2"];
  1018. 25.16 s > 15 15 │ ext4 [style=invis];
  1019. 25.16 s > 16 │- 0:1:s -> ext4 [id=4 dir=none color="red" label="mink4|l_1"];
  1020. 25.16 s > 16 │+ 0:2:s -> ext4 [id=4 dir=none color="red" label="mink4|l_4"];
  1021. 25.16 s > 17 17 │ ext5 [style=invis];
  1022. 25.16 s > 18 │- 0:2:s -> ext5 [id=5 dir=none color="red" label="mink4|l_4"];
  1023. 25.16 s > 18 │+ 0:4:s -> ext5 [id=5 dir=none color="red" label="bis4|l_3"];
  1024. 25.16 s > 19 19 │ }
  1025. 25.16 s > ────────────┴───────────────────────────────────────────────────────────────────
  1026. 25.16 s > To update snapshots run `cargo insta review`
  1027. 25.16 s > Stopped on the first failure. Run `cargo insta test` to run all snapshots.
  1028. 25.16 s > test tensor::tests::parsing::infinite_execution ... FAILED
  1029. 25.16 s >
  1030. 25.16 s > failures:
  1031. 25.16 s >
  1032. 25.16 s > failures:
  1033. 25.16 s > tensor::tests::parsing::infinite_execution
  1034. 25.16 s >
  1035. 25.16 s > test result: FAILED. 0 passed; 1 failed; 0 ignored; 0 measured; 248 filtered out; finished in 0.04s
  1036. 25.16 s >
  1037. 25.16 s > stderr ---
  1038. 25.16 s >
  1039. 25.16 s > thread 'tensor::tests::parsing::infinite_execution' (855) panicked at /nix/store/hg5bizfwiwqlh0nqmr64rssi5zwpdp0k-vendor-cargo-deps/c19b7c6f923b580ac259164a89f2577984ad5ab09ee9d583b888f934adbbe8d0/insta-1.47.2/src/runtime.rs:719:13:
  1040. 25.16 s > snapshot assertion for 'infinite_execution' failed in line 905
  1041. 25.16 s > stack backtrace:
  1042. 25.16 s > 0: __rustc::rust_begin_unwind
  1043. 25.16 s > 1: core::panicking::panic_fmt
  1044. 25.16 s > 2: insta::runtime::assert_snapshot
  1045. 25.16 s > 3: idenso::tensor::tests::parsing::infinite_execution
  1046. 25.16 s > 4: <idenso::tensor::tests::parsing::infinite_execution::{closure#0} as core::ops::function::FnOnce<()>>::call_once
  1047. 25.16 s > note: Some details are omitted, run with `RUST_BACKTRACE=full` for a verbose backtrace.
  1048. 25.16 s >
  1049. 25.16 s > error: test run failed
  1050. 25.16 s >
  1051. 25.16 s > ========== nextest test summary ==========
  1052. 25.16 s > report: target/nextest/ci_gammaloop/junit.xml
  1053. 25.16 s > tests: 232, failures: 5, errors: 0
  1054. 25.16 s >
  1055. 25.16 s > 1. idenso::dirac::test::feyncalc_reference::dirac_simplify_id46_d_dim_repeated_gamma_slash_sum
  1056. 25.16 s > failure: test failure with exit code 101
  1057. 25.16 s > thread 'dirac::test::feyncalc_reference::dirac_simplify_id46_d_dim_repeated_gamma_slash_sum' (507) panicked at crates/idenso/src/dirac/mod.rs:360:5:
  1058. 25.16 s > gamma third argument must be a Minkowski slot
  1059. 25.16 s > stack backtrace:
  1060. 25.16 s > 0: __rustc::rust_begin_unwind
  1061. 25.16 s > 1: core::panicking::panic_fmt
  1062. 25.16 s > 2: idenso::dirac::require_gamma_port
  1063. 25.16 s > 3: idenso::dirac::gamma_tensor
  1064. 25.16 s > 4: idenso::dirac::test::feyncalc_reference::dirac_simplify_id46_d_dim_repeated_gamma_slash_sum
  1065. 25.16 s > 5: <idenso::dirac::test::feyncalc_reference::dirac_simplify_id46_d_dim_repeated_gamma_slash_sum::{closure#0} as core::ops::function::FnOnce<()>>::call_once
  1066. 25.16 s > note: Some details are omitted, run with `RUST_BACKTRACE=full` for a verbose backtrace.
  1067. 25.16 s > system-out
  1068. 25.16 s > running 1 test
  1069. 25.16 s > test dirac::test::feyncalc_reference::dirac_simplify_id46_d_dim_repeated_gamma_slash_sum ... FAILED
  1070. 25.16 s >
  1071. 25.16 s > failures:
  1072. 25.16 s >
  1073. 25.16 s > failures:
  1074. 25.16 s > dirac::test::feyncalc_reference::dirac_simplify_id46_d_dim_repeated_gamma_slash_sum
  1075. 25.16 s >
  1076. 25.16 s > test result: FAILED. 0 passed; 1 failed; 0 ignored; 0 measured; 248 filtered out; finished in 0.01s
  1077. 25.16 s > system-err
  1078. 25.16 s > thread 'dirac::test::feyncalc_reference::dirac_simplify_id46_d_dim_repeated_gamma_slash_sum' (507) panicked at crates/idenso/src/dirac/mod.rs:360:5:
  1079. 25.16 s > gamma third argument must be a Minkowski slot
  1080. 25.16 s > stack backtrace:
  1081. 25.16 s > 0: __rustc::rust_begin_unwind
  1082. 25.16 s > 1: core::panicking::panic_fmt
  1083. 25.16 s > 2: idenso::dirac::require_gamma_port
  1084. 25.16 s > 3: idenso::dirac::gamma_tensor
  1085. 25.16 s > 4: idenso::dirac::test::feyncalc_reference::dirac_simplify_id46_d_dim_repeated_gamma_slash_sum
  1086. 25.16 s > 5: <idenso::dirac::test::feyncalc_reference::dirac_simplify_id46_d_dim_repeated_gamma_slash_sum::{closure#0} as core::ops::function::FnOnce<()>>::call_once
  1087. 25.16 s > note: Some details are omitted, run with `RUST_BACKTRACE=full` for a verbose backtrace.
  1088. 25.16 s >
  1089. 25.16 s > 2. idenso::dirac::test::feyncalc_reference::dirac_simplify_id40_repeated_gamma_and_two_trace
  1090. 25.16 s > failure: test failure with exit code 101
  1091. 25.16 s > thread 'dirac::test::feyncalc_reference::dirac_simplify_id40_repeated_gamma_and_two_trace' (506) panicked at crates/idenso/src/dirac/mod.rs:360:5:
  1092. 25.16 s > gamma third argument must be a Minkowski slot
  1093. 25.16 s > stack backtrace:
  1094. 25.16 s > 0: __rustc::rust_begin_unwind
  1095. 25.16 s > 1: core::panicking::panic_fmt
  1096. 25.16 s > 2: idenso::dirac::require_gamma_port
  1097. 25.16 s > 3: idenso::dirac::gamma_tensor
  1098. 25.16 s > 4: idenso::dirac::test::feyncalc_reference::dirac_simplify_id40_repeated_gamma_and_two_trace
  1099. 25.16 s > 5: <idenso::dirac::test::feyncalc_reference::dirac_simplify_id40_repeated_gamma_and_two_trace::{closure#0} as core::ops::function::FnOnce<()>>::call_once
  1100. 25.16 s > note: Some details are omitted, run with `RUST_BACKTRACE=full` for a verbose backtrace.
  1101. 25.16 s > system-out
  1102. 25.16 s > running 1 test
  1103. 25.16 s > test dirac::test::feyncalc_reference::dirac_simplify_id40_repeated_gamma_and_two_trace ... FAILED
  1104. 25.16 s >
  1105. 25.16 s > failures:
  1106. 25.16 s >
  1107. 25.16 s > failures:
  1108. 25.16 s > dirac::test::feyncalc_reference::dirac_simplify_id40_repeated_gamma_and_two_trace
  1109. 25.16 s >
  1110. 25.16 s > test result: FAILED. 0 passed; 1 failed; 0 ignored; 0 measured; 248 filtered out; finished in 0.01s
  1111. 25.16 s > system-err
  1112. 25.16 s > thread 'dirac::test::feyncalc_reference::dirac_simplify_id40_repeated_gamma_and_two_trace' (506) panicked at crates/idenso/src/dirac/mod.rs:360:5:
  1113. 25.16 s > gamma third argument must be a Minkowski slot
  1114. 25.16 s > stack backtrace:
  1115. 25.16 s > 0: __rustc::rust_begin_unwind
  1116. 25.16 s > 1: core::panicking::panic_fmt
  1117. 25.16 s > 2: idenso::dirac::require_gamma_port
  1118. 25.16 s > 3: idenso::dirac::gamma_tensor
  1119. 25.16 s > 4: idenso::dirac::test::feyncalc_reference::dirac_simplify_id40_repeated_gamma_and_two_trace
  1120. 25.16 s > 5: <idenso::dirac::test::feyncalc_reference::dirac_simplify_id40_repeated_gamma_and_two_trace::{closure#0} as core::ops::function::FnOnce<()>>::call_once
  1121. 25.16 s > note: Some details are omitted, run with `RUST_BACKTRACE=full` for a verbose backtrace.
  1122. 25.16 s >
  1123. 25.16 s > 3. idenso::dirac::test::feyncalc_reference::dirac_simplify_id4_slash_sandwich
  1124. 25.16 s > failure: test failure with exit code 101
  1125. 25.16 s > thread 'dirac::test::feyncalc_reference::dirac_simplify_id4_slash_sandwich' (510) panicked at crates/idenso/src/dirac/mod.rs:360:5:
  1126. 25.16 s > gamma third argument must be a Minkowski slot
  1127. 25.16 s > stack backtrace:
  1128. 25.16 s > 0: __rustc::rust_begin_unwind
  1129. 25.16 s > 1: core::panicking::panic_fmt
  1130. 25.16 s > 2: idenso::dirac::require_gamma_port
  1131. 25.16 s > 3: idenso::dirac::gamma_tensor
  1132. 25.16 s > 4: idenso::dirac::test::feyncalc_reference::dirac_simplify_id4_slash_sandwich
  1133. 25.16 s > 5: <idenso::dirac::test::feyncalc_reference::dirac_simplify_id4_slash_sandwich::{closure#0} as core::ops::function::FnOnce<()>>::call_once
  1134. 25.16 s > note: Some details are omitted, run with `RUST_BACKTRACE=full` for a verbose backtrace.
  1135. 25.16 s > system-out
  1136. 25.16 s > running 1 test
  1137. 25.16 s > test dirac::test::feyncalc_reference::dirac_simplify_id4_slash_sandwich ... FAILED
  1138. 25.16 s >
  1139. 25.16 s > failures:
  1140. 25.16 s >
  1141. 25.16 s > failures:
  1142. 25.16 s > dirac::test::feyncalc_reference::dirac_simplify_id4_slash_sandwich
  1143. 25.16 s >
  1144. 25.16 s > test result: FAILED. 0 passed; 1 failed; 0 ignored; 0 measured; 248 filtered out; finished in 0.01s
  1145. 25.16 s > system-err
  1146. 25.16 s > thread 'dirac::test::feyncalc_reference::dirac_simplify_id4_slash_sandwich' (510) panicked at crates/idenso/src/dirac/mod.rs:360:5:
  1147. 25.16 s > gamma third argument must be a Minkowski slot
  1148. 25.16 s > stack backtrace:
  1149. 25.16 s > 0: __rustc::rust_begin_unwind
  1150. 25.16 s > 1: core::panicking::panic_fmt
  1151. 25.16 s > 2: idenso::dirac::require_gamma_port
  1152. 25.16 s > 3: idenso::dirac::gamma_tensor
  1153. 25.16 s > 4: idenso::dirac::test::feyncalc_reference::dirac_simplify_id4_slash_sandwich
  1154. 25.16 s > 5: <idenso::dirac::test::feyncalc_reference::dirac_simplify_id4_slash_sandwich::{closure#0} as core::ops::function::FnOnce<()>>::call_once
  1155. 25.16 s > note: Some details are omitted, run with `RUST_BACKTRACE=full` for a verbose backtrace.
  1156. 25.16 s >
  1157. 25.16 s > 4. idenso::reference_cases::tests::reference_case_simplification_snapshots
  1158. 25.16 s > failure: test failure with exit code 101
  1159. 25.16 s > thread 'reference_cases::tests::reference_case_simplification_snapshots' (684) panicked at crates/idenso/src/dirac/mod.rs:360:5:
  1160. 25.16 s > gamma third argument must be a Minkowski slot
  1161. 25.16 s > stack backtrace:
  1162. 25.16 s > 0: __rustc::rust_begin_unwind
  1163. 25.16 s > 1: core::panicking::panic_fmt
  1164. 25.16 s > 2: idenso::dirac::require_gamma_port
  1165. 25.16 s > 3: idenso::dirac::gamma_tensor
  1166. 25.16 s > 4: idenso::reference_cases::dirac_feyncalc_slash_sandwich_id4
  1167. 25.16 s > 5: <idenso::reference_cases::ReferenceCase>::simplified
  1168. 25.16 s > 6: <core::iter::adapters::map::Map<core::slice::iter::Iter<idenso::reference_cases::ReferenceCase>, idenso::reference_cases::tests::reference_case_simplification_snapshots::{closure#0}> as core::iter::traits::iterator::Iterator>::fold::<(), core::iter::traits::iterator::Iterator::for_each::call<alloc::string::String, <alloc::vec::Vec<alloc::string::String>>::extend_trusted<core::iter::adapters::map::Map<core::slice::iter::Iter<idenso::reference_cases::ReferenceCase>, idenso::reference_cases::tests::reference_case_simplification_snapshots::{closure#0}>>::{closure#0}>::{closure#0}>
  1169. 25.16 s > 7: <alloc::vec::Vec<alloc::string::String> as alloc::vec::spec_from_iter_nested::SpecFromIterNested<alloc::string::String, core::iter::adapters::map::Map<core::slice::iter::Iter<idenso::reference_cases::ReferenceCase>, idenso::reference_cases::tests::reference_case_simplification_snapshots::{closure#0}>>>::from_iter
  1170. 25.16 s > 8: idenso::reference_cases::tests::reference_case_simplification_snapshots
  1171. 25.16 s > 9: <idenso::reference_cases::tests::reference_case_simplification_snapshots::{closure#0} as core::ops::function::FnOnce<()>>::call_once
  1172. 25.16 s > note: Some details are omitted, run with `RUST_BACKTRACE=full` for a verbose backtrace.
  1173. 25.16 s > system-out
  1174. 25.16 s > running 1 test
  1175. 25.16 s > test reference_cases::tests::reference_case_simplification_snapshots ... FAILED
  1176. 25.16 s >
  1177. 25.16 s > failures:
  1178. 25.16 s >
  1179. 25.16 s > failures:
  1180. 25.16 s > reference_cases::tests::reference_case_simplification_snapshots
  1181. 25.16 s >
  1182. 25.16 s > test result: FAILED. 0 passed; 1 failed; 0 ignored; 0 measured; 248 filtered out; finished in 0.01s
  1183. 25.16 s > system-err
  1184. 25.16 s > thread 'reference_cases::tests::reference_case_simplification_snapshots' (684) panicked at crates/idenso/src/dirac/mod.rs:360:5:
  1185. 25.16 s > gamma third argument must be a Minkowski slot
  1186. 25.16 s > stack backtrace:
  1187. 25.16 s > 0: __rustc::rust_begin_unwind
  1188. 25.16 s > 1: core::panicking::panic_fmt
  1189. 25.16 s > 2: idenso::dirac::require_gamma_port
  1190. 25.16 s > 3: idenso::dirac::gamma_tensor
  1191. 25.16 s > 4: idenso::reference_cases::dirac_feyncalc_slash_sandwich_id4
  1192. 25.16 s > 5: <idenso::reference_cases::ReferenceCase>::simplified
  1193. 25.16 s > 6: <core::iter::adapters::map::Map<core::slice::iter::Iter<idenso::reference_cases::ReferenceCase>, idenso::reference_cases::tests::reference_case_simplification_snapshots::{closure#0}> as core::iter::traits::iterator::Iterator>::fold::<(), core::iter::traits::iterator::Iterator::for_each::call<alloc::string::String, <alloc::vec::Vec<alloc::string::String>>::extend_trusted<core::iter::adapters::map::Map<core::slice::iter::Iter<idenso::reference_cases::ReferenceCase>, idenso::reference_cases::tests::reference_case_simplification_snapshots::{closure#0}>>::{closure#0}>::{closure#0}>
  1194. 25.16 s > 7: <alloc::vec::Vec<alloc::string::String> as alloc::vec::spec_from_iter_nested::SpecFromIterNested<alloc::string::String, core::iter::adapters::map::Map<core::slice::iter::Iter<idenso::reference_cases::ReferenceCase>, idenso::reference_cases::tests::reference_case_simplification_snapshots::{closure#0}>>>::from_iter
  1195. 25.16 s > 8: idenso::reference_cases::tests::reference_case_simplification_snapshots
  1196. 25.16 s > 9: <idenso::reference_cases::tests::reference_case_simplification_snapshots::{closure#0} as core::ops::function::FnOnce<()>>::call_once
  1197. 25.16 s > note: Some details are omitted, run with `RUST_BACKTRACE=full` for a verbose backtrace.
  1198. 25.16 s >
  1199. 25.16 s > 5. idenso::tensor::tests::parsing::infinite_execution
  1200. 25.16 s > failure: test failure with exit code 101
  1201. 25.16 s > thread 'tensor::tests::parsing::infinite_execution' (855) panicked at /nix/store/hg5bizfwiwqlh0nqmr64rssi5zwpdp0k-vendor-cargo-deps/c19b7c6f923b580ac259164a89f2577984ad5ab09ee9d583b888f934adbbe8d0/insta-1.47.2/src/runtime.rs:719:13:
  1202. 25.16 s > snapshot assertion for 'infinite_execution' failed in line 905
  1203. 25.16 s > stack backtrace:
  1204. 25.16 s > 0: __rustc::rust_begin_unwind
  1205. 25.16 s > 1: core::panicking::panic_fmt
  1206. 25.16 s > 2: insta::runtime::assert_snapshot
  1207. 25.16 s > 3: idenso::tensor::tests::parsing::infinite_execution
  1208. 25.16 s > 4: <idenso::tensor::tests::parsing::infinite_execution::{closure#0} as core::ops::function::FnOnce<()>>::call_once
  1209. 25.16 s > note: Some details are omitted, run with `RUST_BACKTRACE=full` for a verbose backtrace.
  1210. 25.16 s > system-out
  1211. 25.16 s > running 1 test
  1212. 25.16 s > ━━━━━━━━━━━━━━━━━━━━━━━━━━━━━━━ Snapshot Summary ━━━━━━━━━━━━━━━━━━━━━━━━━━━━━━━
  1213. 25.16 s > Snapshot: infinite_execution
  1214. 25.16 s > Source: crates/idenso/src/tensor/tests/parsing.rs:905
  1215. 25.16 s > ────────────────────────────────────────────────────────────────────────────────
  1216. 25.16 s > Expression: net_iter.snapshot_dot()
  1217. 25.16 s > ────────────────────────────────────────────────────────────────────────────────
  1218. 25.16 s > -old snapshot
  1219. 25.16 s > +new results
  1220. 25.16 s > ────────────┬───────────────────────────────────────────────────────────────────
  1221. 25.16 s > 8 8 │ 0:0:s-> ext0 [id=0 color="red"];
  1222. 25.16 s > 9 9 │ ext1 [style=invis];
  1223. 25.16 s > 10 10 │ 0:5:s-> ext1 [id=1 dir=none color="red" label="mink4|l_0"];
  1224. 25.16 s > 11 11 │ ext2 [style=invis];
  1225. 25.16 s > 12 │- 0:4:s-> ext2 [id=2 dir=none color="red" label="bis4|l_2"];
  1226. 25.16 s > 12 │+ 0:3:s-> ext2 [id=2 dir=none color="red" label="mink4|l_1"];
  1227. 25.16 s > 13 13 │ ext3 [style=invis];
  1228. 25.16 s > 14 │- 0:3:s-> ext3 [id=3 dir=none color="red" label="bis4|l_3"];
  1229. 25.16 s > 14 │+ 0:1:s-> ext3 [id=3 dir=none color="red" label="bis4|l_2"];
  1230. 25.16 s > 15 15 │ ext4 [style=invis];
  1231. 25.16 s > 16 │- 0:1:s-> ext4 [id=4 dir=none color="red" label="mink4|l_1"];
  1232. 25.16 s > 16 │+ 0:2:s-> ext4 [id=4 dir=none color="red" label="mink4|l_4"];
  1233. 25.16 s > 17 17 │ ext5 [style=invis];
  1234. 25.16 s > 18 │- 0:2:s-> ext5 [id=5 dir=none color="red" label="mink4|l_4"];
  1235. 25.16 s > 18 │+ 0:4:s-> ext5 [id=5 dir=none color="red" label="bis4|l_3"];
  1236. 25.16 s > 19 19 │ }
  1237. 25.16 s > ────────────┴───────────────────────────────────────────────────────────────────
  1238. 25.16 s > To update snapshots run `cargo insta review`
  1239. 25.16 s > Stopped on the first failure. Run `cargo insta test` to run all snapshots.
  1240. 25.16 s > test tensor::tests::parsing::infinite_execution ... FAILED
  1241. 25.16 s >
  1242. 25.16 s > failures:
  1243. 25.16 s >
  1244. 25.16 s > failures:
  1245. 25.16 s > tensor::tests::parsing::infinite_execution
  1246. 25.16 s >
  1247. 25.16 s > test result: FAILED. 0 passed; 1 failed; 0 ignored; 0 measured; 248 filtered out; finished in 0.04s
  1248. 25.16 s > system-err
  1249. 25.16 s > thread 'tensor::tests::parsing::infinite_execution' (855) panicked at /nix/store/hg5bizfwiwqlh0nqmr64rssi5zwpdp0k-vendor-cargo-deps/c19b7c6f923b580ac259164a89f2577984ad5ab09ee9d583b888f934adbbe8d0/insta-1.47.2/src/runtime.rs:719:13:
  1250. 25.16 s > snapshot assertion for 'infinite_execution' failed in line 905
  1251. 25.16 s > stack backtrace:
  1252. 25.16 s > 0: __rustc::rust_begin_unwind
  1253. 25.16 s > 1: core::panicking::panic_fmt
  1254. 25.16 s > 2: insta::runtime::assert_snapshot
  1255. 25.16 s > 3: idenso::tensor::tests::parsing::infinite_execution
  1256. 25.16 s > 4: <idenso::tensor::tests::parsing::infinite_execution::{closure#0} as core::ops::function::FnOnce<()>>::call_once
  1257. 25.16 s > note: Some details are omitted, run with `RUST_BACKTRACE=full` for a verbose backtrace.
  1258. 25.16 s > =========================================
  1259. 25.16 s > Extracting 2 binaries and 1 linked path to /build/nextest-archive-b9TBbV
  1260. 25.16 s > Extracted 8 files to /build/nextest-archive-b9TBbV in 0.08s
  1261. 25.16 s > ------------
  1262. 25.16 s > Nextest run ID 53bcc29d-31c8-451a-8114-3997ad85fdd7 with nextest profile: ci_gammaloop
  1263. 25.16 s > Starting 195 tests across 2 binaries
  1264. 25.16 s > ------------
  1265. 25.16 s > Summary [ 0.117s] 195 tests run: 195 passed, 0 skipped
  1266. 25.16 s >
  1267. 25.16 s > ========== nextest test summary ==========
  1268. 25.16 s > report: target/nextest/ci_gammaloop/junit.xml
  1269. 25.16 s > tests: 195, failures: 0, errors: 0
  1270. 25.16 s > No failing testcases found.
  1271. 25.16 s > =========================================
  1272. 25.16 s > Extracting 5 binaries and 2 linked paths to /build/nextest-archive-JddKRs
  1273. 25.16 s > Extracted 19 files to /build/nextest-archive-JddKRs in 0.27s
  1274. 25.16 s > ------------
  1275. 25.16 s > Nextest run ID 3a5843dd-7b4f-4354-b662-9c66cab9287c with nextest profile: ci_gammaloop
  1276. 25.16 s > Starting 27 tests across 5 binaries (1 test skipped via profile.ci_gammaloop.default-filter)
  1277. 25.16 s > FAIL [ 0.063s] (24/27) spenso-hep-lib::idenso_validation enabled_idenso_reference_cases_validate_against_explicit_tensors
  1278. 25.16 s > stdout ---
  1279. 25.16 s >
  1280. 25.16 s > running 1 test
  1281. 25.16 s > test enabled_idenso_reference_cases_validate_against_explicit_tensors ... FAILED
  1282. 25.16 s >
  1283. 25.16 s > failures:
  1284. 25.16 s >
  1285. 25.16 s > failures:
  1286. 25.16 s > enabled_idenso_reference_cases_validate_against_explicit_tensors
  1287. 25.16 s >
  1288. 25.16 s > test result: FAILED. 0 passed; 1 failed; 0 ignored; 0 measured; 14 filtered out; finished in 0.06s
  1289. 25.16 s >
  1290. 25.16 s > stderr ---
  1291. 25.16 s >
  1292. 25.16 s > thread 'enabled_idenso_reference_cases_validate_against_explicit_tensors' (1664) panicked at crates/idenso/src/dirac/mod.rs:360:5:
  1293. 25.16 s > gamma third argument must be a Minkowski slot
  1294. 25.16 s > stack backtrace:
  1295. 25.16 s > 0: __rustc::rust_begin_unwind
  1296. 25.16 s > 1: core::panicking::panic_fmt
  1297. 25.16 s > 2: idenso::dirac::require_gamma_port
  1298. 25.16 s > 3: idenso::dirac::gamma_tensor
  1299. 25.16 s > 4: idenso::reference_cases::dirac_feyncalc_slash_sandwich_id4
  1300. 25.16 s > 5: <idenso_validation::enabled_idenso_reference_cases_validate_against_explicit_tensors::{closure#0} as core::ops::function::FnOnce<()>>::call_once
  1301. 25.16 s > note: Some details are omitted, run with `RUST_BACKTRACE=full` for a verbose backtrace.
  1302. 25.16 s >
  1303. 25.16 s > ------------
  1304. 25.16 s > Summary [ 0.137s] 27 tests run: 26 passed, 1 failed, 1 skipped
  1305. 25.16 s > FAIL [ 0.063s] (24/27) spenso-hep-lib::idenso_validation enabled_idenso_reference_cases_validate_against_explicit_tensors
  1306. 25.16 s > stdout ---
  1307. 25.16 s >
  1308. 25.16 s > running 1 test
  1309. 25.16 s > test enabled_idenso_reference_cases_validate_against_explicit_tensors ... FAILED
  1310. 25.16 s >
  1311. 25.16 s > failures:
  1312. 25.16 s >
  1313. 25.16 s > failures:
  1314. 25.16 s > enabled_idenso_reference_cases_validate_against_explicit_tensors
  1315. 25.16 s >
  1316. 25.16 s > test result: FAILED. 0 passed; 1 failed; 0 ignored; 0 measured; 14 filtered out; finished in 0.06s
  1317. 25.16 s >
  1318. 25.17 s > stderr ---
  1319. 25.17 s >
  1320. 25.17 s > thread 'enabled_idenso_reference_cases_validate_against_explicit_tensors' (1664) panicked at crates/idenso/src/dirac/mod.rs:360:5:
  1321. 25.17 s > gamma third argument must be a Minkowski slot
  1322. 25.17 s > stack backtrace:
  1323. 25.17 s > 0: __rustc::rust_begin_unwind
  1324. 25.17 s > 1: core::panicking::panic_fmt
  1325. 25.17 s > 2: idenso::dirac::require_gamma_port
  1326. 25.17 s > 3: idenso::dirac::gamma_tensor
  1327. 25.17 s > 4: idenso::reference_cases::dirac_feyncalc_slash_sandwich_id4
  1328. 25.17 s > 5: <idenso_validation::enabled_idenso_reference_cases_validate_against_explicit_tensors::{closure#0} as core::ops::function::FnOnce<()>>::call_once
  1329. 25.17 s > note: Some details are omitted, run with `RUST_BACKTRACE=full` for a verbose backtrace.
  1330. 25.17 s >
  1331. 25.17 s > error: test run failed
  1332. 25.17 s >
  1333. 25.17 s > ========== nextest test summary ==========
  1334. 25.17 s > report: target/nextest/ci_gammaloop/junit.xml
  1335. 25.17 s > tests: 27, failures: 1, errors: 0
  1336. 25.17 s >
  1337. 25.17 s > 1. spenso-hep-lib::idenso_validation::enabled_idenso_reference_cases_validate_against_explicit_tensors
  1338. 25.17 s > failure: test failure with exit code 101
  1339. 25.17 s > thread 'enabled_idenso_reference_cases_validate_against_explicit_tensors' (1664) panicked at crates/idenso/src/dirac/mod.rs:360:5:
  1340. 25.17 s > gamma third argument must be a Minkowski slot
  1341. 25.17 s > stack backtrace:
  1342. 25.17 s > 0: __rustc::rust_begin_unwind
  1343. 25.17 s > 1: core::panicking::panic_fmt
  1344. 25.17 s > 2: idenso::dirac::require_gamma_port
  1345. 25.17 s > 3: idenso::dirac::gamma_tensor
  1346. 25.17 s > 4: idenso::reference_cases::dirac_feyncalc_slash_sandwich_id4
  1347. 25.17 s > 5: <idenso_validation::enabled_idenso_reference_cases_validate_against_explicit_tensors::{closure#0} as core::ops::function::FnOnce<()>>::call_once
  1348. 25.17 s > note: Some details are omitted, run with `RUST_BACKTRACE=full` for a verbose backtrace.
  1349. 25.17 s > system-out
  1350. 25.17 s > running 1 test
  1351. 25.17 s > test enabled_idenso_reference_cases_validate_against_explicit_tensors ... FAILED
  1352. 25.17 s >
  1353. 25.17 s > failures:
  1354. 25.17 s >
  1355. 25.17 s > failures:
  1356. 25.17 s > enabled_idenso_reference_cases_validate_against_explicit_tensors
  1357. 25.17 s >
  1358. 25.17 s > test result: FAILED. 0 passed; 1 failed; 0 ignored; 0 measured; 14 filtered out; finished in 0.06s
  1359. 25.17 s > system-err
  1360. 25.17 s > thread 'enabled_idenso_reference_cases_validate_against_explicit_tensors' (1664) panicked at crates/idenso/src/dirac/mod.rs:360:5:
  1361. 25.17 s > gamma third argument must be a Minkowski slot
  1362. 25.17 s > stack backtrace:
  1363. 25.17 s > 0: __rustc::rust_begin_unwind
  1364. 25.17 s > 1: core::panicking::panic_fmt
  1365. 25.17 s > 2: idenso::dirac::require_gamma_port
  1366. 25.17 s > 3: idenso::dirac::gamma_tensor
  1367. 25.17 s > 4: idenso::reference_cases::dirac_feyncalc_slash_sandwich_id4
  1368. 25.17 s > 5: <idenso_validation::enabled_idenso_reference_cases_validate_against_explicit_tensors::{closure#0} as core::ops::function::FnOnce<()>>::call_once
  1369. 25.17 s > note: Some details are omitted, run with `RUST_BACKTRACE=full` for a verbose backtrace.
  1370. 25.17 s > =========================================
  1371. 25.17 s > Extracting 2 binaries and 1 linked path to /build/nextest-archive-zjNucb
  1372. 25.17 s > Extracted 8 files to /build/nextest-archive-zjNucb in 0.08s
  1373. 25.17 s > ------------
  1374. 25.17 s > Nextest run ID 5d42492a-d060-4dcd-b48c-7cb4e2cf8623 with nextest profile: ci_gammaloop
  1375. 25.17 s > Starting 1 test across 2 binaries
  1376. 25.17 s > ------------
  1377. 25.17 s > Summary [ 0.005s] 1 test run: 1 passed, 0 skipped
  1378. 25.17 s >
  1379. 25.17 s > ========== nextest test summary ==========
  1380. 25.17 s > report: target/nextest/ci_gammaloop/junit.xml
  1381. 25.17 s > tests: 1, failures: 0, errors: 0
  1382. 25.17 s > No failing testcases found.
  1383. 25.17 s > =========================================
  1384. 25.17 s > Extracting 1 binary and 1 linked path to /build/nextest-archive-U3cce2
  1385. 25.17 s > Extracted 7 files to /build/nextest-archive-U3cce2 in 0.07s
  1386. 25.17 s > ------------
  1387. 25.17 s > Nextest run ID ebcd9ca3-73d0-4a06-8767-7a5add49c784 with nextest profile: ci_gammaloop
  1388. 25.17 s > Starting 0 tests across 1 binary
  1389. 25.17 s > ------------
  1390. 25.17 s > Summary [ 0.000s] 0 tests run: 0 passed, 0 skipped
  1391. 25.17 s >
  1392. 25.17 s > ========== nextest test summary ==========
  1393. 25.17 s > report: target/nextest/ci_gammaloop/junit.xml
  1394. 25.17 s > tests: 0, failures: 0, errors: 0
  1395. 25.17 s > No failing testcases found.
  1396. 25.17 s > =========================================
  1397. 25.17 s For full logs, run:
  1398. 25.17 s nix log /nix/store/9sbgbb6pw8px5w5h52x6id0993hp37qd-gammaloop-nextest-spenso.drv
  1399. 25.26 s Run failed.